##TITLE=31Pdec_LR-675-Me3SiO
 CDCl3, 124 sc
 28.5.2019
##JCAMPDX= 6.0         $$ Bruker NMR JCAMP-DX V2.0
##DATA TYPE= NMR SPECTRUM
##DATA CLASS= NTUPLES
##ORIGIN= UXNMR, Bruker Analytische Messtechnik GmbH
##OWNER= root
$$ XWIN-NMR		Version 3.5
$$ Tue May 28 13:58:56 2019 Russian Standard Time (UT+4h)  she@DPX200
##.OBSERVE FREQUENCY= 81.013821
##.OBSERVE NUCLEUS= ^31P
##.ACQUISITION MODE= SIMULTANEOUS
##.ACQUISITION SCHEME= undefined
##.AVERAGES= 24
##.DIGITISER RES= 17
##SPECTROMETER/DATA SYSTEM= spect
##.PULSE SEQUENCE= zgpg30
##.SOLVENT NAME= DMSO
##.SHIFT REFERENCE= (INTERNAL, DMSO, 0, 182.463)
##AUDIT TRAIL= $$ (NUMBER, WHEN, WHO, WHERE, WHAT)
$$ ##TITLE= Audit trail, XWIN-NMR		Version 3.5
$$ ##JCAMPDX= 5.01
$$ ##ORIGIN= Bruker BioSpin GmbH
$$ ##OWNER= she
$$ F:/spectra/data/she/nmr/P31/1/pdata/1/auditp.txt
$$ ##AUDIT TRAIL=  $$ (NUMBER, WHEN, WHO, WHERE, WHAT)
(   1,<2019-05-28 13:57:59.51 +0400>,<she>,<DPX200>,
      <created by zg, POWCHK disabled, PULCHK disabled
       configuration hash MD5:
       00 E9 B6 7A A2 85 ED C7 34 08 36 98 17 FE 4E 26
       data hash MD5: 32K
       35 E9 9D 6B AC 8F 09 14 D3 0F 8F 04 0A 9B 24 BD>)
(   2,<2019-05-28 13:58:01.82 +0400>,<she>,<DPX200>,
      <Start of raw data processing
       efp BC_mod = 2 LB = 1 FT_mod = 6 PKNL = 1 PHC0 = -1810.46 PHC1 = 74.39899 SI = 64K 
       data hash MD5: 64K
       B9 50 EF 3D 80 CC 7E FB CA 4A 44 5A D4 EC BB 6B>)
(   3,<2019-05-28 13:58:25.23 +0400>,<she>,<DPX200>,
      <pk PHC0 = -0.2236542 PHC1 = 0 
       data hash MD5: 64K
       3B 97 3D 76 93 C9 DB 0D D0 3B 80 65 0D DC 9D 38>)
$$ ##END=
$$ 
$$ hash MD5
$$ 1C 39 4A 0B 67 94 66 4A 06 26 E8 48 06 F4 95 99
##$RELAX= 
##$RELAX= 
##$RELAX= 
##$RELAX= 
##$RELAX= 
##$RELAX= 
##$RELAX= 
##$RELAX= 
$$ Bruker specific parameters
$$ --------------------------
##$DU= <F:/spectra>
##$EXPNO= 1
##$NAME= <P31>
##$PROCNO= 1
##$TYPE= <nmr>
##$USER= <she>
##$AMP= (0..31)
100 100 100 100 100 100 100 100 100 100 100 100 100 100 100 100 100 100 
100 100 100 100 100 100 100 100 100 100 100 100 100 100 
##$AQSEQ= 0
##$AQ_mod= 1
##$AUNM= <au_zg>
##$AUTOPOS= <>
##$BF1= 81.014009
##$BF2= 200.13
##$BF3= 200.13
##$BF4= 200.13
##$BF5= 200.13
##$BF6= 200.13
##$BF7= 200.13
##$BF8= 200.13
##$BYTORDA= 1
##$CFDGTYP= 0
##$CFRGTYP= 5
##$CHEMSTR= <none>
##$CNST= (0..31)
1 1 145 1 1 1 1 1 1 1 1 1 1 1 1 1 1 1 1 1 1 1 1 1 1 1 1 1 1 1 1 1 
##$CPDPRG= <waltz16>
##$CPDPRG1= <>
##$CPDPRG2= <waltz16>
##$CPDPRG3= <>
##$CPDPRG4= <mlev>
##$CPDPRG5= <mlev>
##$CPDPRG6= <mlev>
##$CPDPRG7= <mlev>
##$CPDPRG8= <mlev>
##$CPDPRGB= <>
##$CPDPRGT= <>
##$D= (0..31)
0 1 0 0 0 0 0 0 0 0 0 0.03 2e-05 3e-06 0 0 0 0 0 0 0 0 0 0 0 0 0 0 0 0 
0 0 
##$DATE= 1559037478
##$DBL= (0..7)
120 120 120 11 120 120 24 19 
##$DBP= (0..7)
150 150 150 150 150 150 150 150 
##$DBP07= 0
##$DBPNAM0= <>
##$DBPNAM1= <>
##$DBPNAM2= <>
##$DBPNAM3= <>
##$DBPNAM4= <>
##$DBPNAM5= <>
##$DBPNAM6= <>
##$DBPNAM7= <>
##$DBPOAL= (0..7)
0.5 0.5 0.5 0.5 0.5 0.5 0.5 0.5 
##$DBPOFFS= (0..7)
$$ [...]
##$SUBNAM2= <"">
##$SUBNAM3= <"">
##$SUBNAM4= <"">
##$SUBNAM5= <"">
##$SUBNAM6= <"">
##$SUBNAM7= <"">
##$SUBNAM8= <"">
##$SUBNAM9= <"">
##$SW= 369.568048894756
##$SWIBOX= (0..15)
0 1 3 0 0 0 0 0 0 0 0 0 0 0 0 0 
##$SW_h= 29940.119760479
##$TD= 32768
##$TD0= 1
##$TE= 0
##$TE2= 300
##$TE3= 300
##$TEG= 300
##$TL= (0..7)
0 120 53 12 22 120 120 120 
##$TP= (0..7)
150 150 150 150 150 150 150 150 
##$TP07= 0
##$TPNAME0= <>
##$TPNAME1= <>
##$TPNAME2= <>
##$TPNAME3= <>
##$TPNAME4= <>
##$TPNAME5= <>
##$TPNAME6= <>
##$TPNAME7= <>
##$TPOAL= (0..7)
0.5 0.5 0.5 0.5 0.5 0.5 0.5 0.5 
##$TPOFFS= (0..7)
0 0 0 0 0 0 0 0 
##$TUNHIN= 0
##$TUNHOUT= 0
##$TUNXOUT= 0
##$USERA1= <user>
##$USERA2= <user>
##$USERA3= <user>
##$USERA4= <user>
##$USERA5= <user>
##$V9= 5
##$VALIST= <valist>
##$VCLIST= <CCCCCCCCCCCCCCC>
##$VD= 0
##$VDLIST= <DDDDDDDDDDDDDDD>
##$VPLIST= <PPPPPPPPPPPPPPP>
##$VTLIST= <TTTTTTTTTTTTTTT>
##$WBST= 1024
##$WBSW= 4
##$XGAIN= (0..3)
0 0 0 0 
##$XL= 0
##$YL= 0
##$YMAX_a= 5988
##$YMIN_a= -10666
##$ZGOPTNS= <>
##$ZL1= 120
##$ZL2= 120
##$ZL3= 120
##$ZL4= 120
##$ABSF1= 0
##$ABSF2= 0
##$ABSG= 0
##$ABSL= 0
##$ALPHA= 0
##$AQORDER= 0
##$ASSFAC= 0
##$ASSFACI= 0
##$ASSFACX= 0
##$ASSWID= 0
##$AUNMP= <proc_1d>
##$AZFE= 0.1
##$AZFW= 0.5
##$BCFW= 0
##$BC_mod= 2
##$BYTORDP= 0
##$COROFFS= 0
##$CY= -3
##$DATMOD= 1
##$DC= 0
##$DFILT= <>
##$DTYPP= 0
##$F1P= 0
##$F2P= 0
##$FCOR= 1
##$FTSIZE= 65536
##$FT_mod= 6
##$GAMMA= 0
##$GB= 0
##$INTBC= 1
##$INTSCL= 5.30512e-09
##$ISEN= 30
##$LB= 1
##$LEV0= 0
##$LPBIN= 0
##$MAXI= 10000
##$MC2= 0
##$MEAN= 0
##$ME_mod= 0
##$MI= 50
##$NCOEF= 0
##$NC_proc= -10
##$NLEV= 6
##$NOISF1= 182.463
##$NOISF2= 159.3651
##$NSP= 0
##$NTH_PI= 0
##$NZP= 0
##$OFFSET= 182.463
##$PC= 4
##$PHC0= -1810.684
##$PHC1= 74.39899
##$PH_mod= 1
##$PKNL= yes
##$PPARMOD= 0
##$PSCAL= 0
##$PSIGN= 0
##$REVERSE= no
##$SF= 81.0140089999434
##$SI= 65536
##$SIGF1= 159.3651
##$SIGF2= -187.1042
##$SINO= 113.3802
##$SIOLD= 16384
##$SREGLST= <1H.CDCl3>
##$SSB= 0
##$STSI= 65536
##$STSR= 0
##$SW_p= 29940.119760479
##$SYMM= 0
##$S_DEV= 0
##$TDeff= 32768
##$TDoff= 0
##$TI= <>
##$TILT= no
##$TM1= 0
##$TM2= 0
##$TOPLEV= 0
##$USERP1= <user>
##$USERP2= <user>
##$USERP3= <user>
##$USERP4= <user>
##$USERP5= <user>
##$WDW= 1
##$XDIM= 65536
##$YMAX_p= 512615714
##$YMIN_p= -373149516
$$ End of Bruker specific parameters
$$ ---------------------------------
##NTUPLES= NMR SPECTRUM
##VAR_NAME=  FREQUENCY,     SPECTRUM/REAL,   SPECTRUM/IMAG
##SYMBOL=    X,             R,               I
##VAR_TYPE=  INDEPENDENT,   DEPENDENT,       DEPENDENT
##VAR_FORM=  AFFN,          ASDF,            ASDF
##VAR_DIM=   65536,         65536,           65536
##UNITS=     HZ,            ARBITRARY UNITS, ARBITRARY UNITS
##FACTOR=    0.456856943014862, 1,           1
##FIRST=     14782.0589164792, 0,            0
##LAST=      -15158.0608439998, 0,           0
##MIN=       -15158.0608439998, -373149516,  0
##MAX=       14782.0589164792, 512615714,    0
$$ Real data points
##PAGE= N=1
##DATA TABLE= (X++(R..R)), XYDATA
$$ [...]
40494C3589697j9014963m852239J6334661K2494141N181547k0603291k8978091
40487D151462j2239233Q530694R628260o662349k0206850k0887679j3528367j697023
40479e2911085J4699407K6749343K0460263j611926j7513979j1952861N756985
40472a6323853J6671670J5050223P742797l84064q429721j1217026k981409Q524152
40464H652769M521072j9196467l7947414k4246712J3316005L4694116J8711398
40457a495233q158111q602213J3504371K1744238K681750j6021886r911993O194701
40449f4376L453474j7718056l0392651j8319930P825843K7152895K6941371P442026
40441F320596j8666633l2741270k5883651p080685R968914K2029607L0904558
$$ plain form
40494 33589697 14574734 9722495 26057156 48551297 53732844 33129553 4151462
40487 4151462 -8087771 442923 10071183 3408834 -16798016 -37685695 -51214062 -52911085
40479 -52911085 -38211678 -11462335 8997928 7386002 -10127977 -22080838 -16323853
40472 -16323853 347817 15398040 23140837 22756773 14327052 3110026 128617 8652769
40464 8652769 13173841 -6022626 -43970040 -68216752 -54900747 -20206631 -1495233
40457 -1495233 -9653344 -18255557 -4751186 16993052 19674802 3652916 -6259077 -64376
40449 -64376 3389098 -14328958 -44721609 -63041539 -55215696 -28062801 -1121430 6320596
40441 6320596 -12346037 -45087307 -70970958 -78051643 -68082729 -46053122 -15148564
40434a5148564L1747533J9264657R3308j3397974j7780967j6276396p974218O646244
40426a2826377J4383054J272820k3188115l0309746o758877K6659375L8088098
40419G320232J9685823o964895j7351911r875844k604734o334876r605817J229013
40411b4503009J5245408R606652j1454103j6066020O387579K2652767L715414
40404E584688k7199677k6065369O682223K8628214J8789580J322371O69365P757541
40396A6168936M790383m308539o477101k374517P75356L778718P678260N229509
40388B5261005n535722j2595314r225299q146988j9153477k5590789o086091K6643488
40380c4429187L4356447M608646k8117541k4736846Q581339K9472742J4497862
$$ plain form
40434 -15148564 16598969 35863626 35956934 22558960 4777993 -11498403 -19472621 -12826377
40426 -12826377 1556677 2829497 -20358618 -50668364 -57427241 -30767866 7320232
40419 7320232 27006055 20041160 2689249 -7186595 -9791329 -16126205 -25732022 -24503009
40411 -24503009 -9257601 349051 -11105052 -27171072 -20783493 1869274 5584688
40404 5584688 -21614989 -47680358 -40998135 -12369921 6419659 7742030 8411395 16168936
40396 16168936 20959319 16650780 10173679 7799162 8574518 12353236 20031496 25261005
40388 25261005 19725283 7129969 -2095330 -10242318 -29395795 -54986584 -61072675 -34429187
40380 -34429187 -72740 4535906 -23581635 -48318481 -39737142 -10264400 4233462
40373D233462j2418491j4445888Q103862K0184788K718958k0935675k0317895
40366c2876879j110019Q180358J964949K587152J9489797L0673175J5497694j4443181
40358B9963046l1743621k6939057j1948286K88194N720072M522202j126296o064568
40350c7328314o206674k197434L778847J0083415J2383748N959786m705807o648056
40342b4880489N289937J9280570K0026309O936311p120854j2513451j2679128
40335e660795j5867274j9171930p241894K4586552N0066626L5053102j2069915
40328D9694472l7313033q597558L6096285L9278571M532556j6059011o186269
40321F1446013m485796l1968302n3961746l8687925p881623M664375P125192K2216115
$$ plain form
40373 4233462 -8185029 -22630917 -14527055 5657733 8376691 -12558984 -32876879
40366 -32876879 -33986898 -25806540 -23841591 -21254439 -1764642 28908533 44406227 29963046
40358 29963046 -1780575 -28719632 -40667918 -40379724 -34659652 -30137450 -31263746 -37328314
40350 -37328314 -43534988 -45732422 -41953575 -31870160 -19486412 -13526626 -18232433 -24880489
40342 -24880489 -19590552 -309982 19716327 26652638 19531784 7018333 -5660795
40335 -5660795 -21528069 -40699999 -47941893 -23355341 26711285 61764387 49694472
40328 49694472 12381439 3783881 39880166 79158737 83691293 67632282 61446013
40321 61446013 56960217 24991915 -28969831 -67657756 -75539379 -70875004 -63749812 -41533697
40313d1533697L5885218J9642442j3799399k3226627k28848K2229555K0133781
40306A9102425K410344j4312734k2696506j6333741N496228K3846083J8706932
40299A6219031R62755k644877N922815K36933k0303458k2866332M673328K8011521
40291A0211716J5194785j7090778l0277359j6869000j252651L91663l669502j834089
40283d5195215K827499O00871q090173j0758838R93562J6623802J6780128J163461
40275b5054903p108110N147965J9192007J3562387j95072K526697J5080672R033499
40267C2185142j5479009k5963639r632450O744129J512762j0351641q200274O91734
40259b8493246K64740m684447r08899Q517830J2474705J0776495P957421K692571
$$ plain form
40313 -41533697 -5648479 13993963 194564 -23032063 -23260911 -1031356 19102425
40306 19102425 21512769 7200035 -15496471 -31830212 -26333984 -2487901 16219031
40299 16219031 17181786 14536909 20459724 20696657 393199 -22473133 -17799805 10211716
40291 10211716 25406501 8315723 -21961636 -38830636 -40083287 -39691624 -43361126 -45195215
40283 -45195215 -42367716 -41766845 -49857018 -60615856 -59622294 -42998492 -26218364 -25054903
40275 -25054903 -32163013 -27015048 -7823041 5739346 5544274 8070971 23151643 32185142
40267 32185142 16706133 -9257506 -18889956 -12145827 -10633065 -20984706 -29184980 -28493246
40259 -28493246 -28228506 -32912953 -33821852 -25304022 -12829317 -2052822 5904599 8597170
40251H597170j558585P506405K8004721L5194371J5229473r937503j3144959j388649
40243F8502444l76689j3375587k2149157j9988550j7138641j7375948j2921188
40236c4823316j511150J0441098J9307461K2708153J2821534j0306689k5619563
40229f982472j2875242J6045553K9205810J6626677m10823k424639N774800Q921768
40221E3881432J472683j0039202j4042830l500784J2810980J4605161l303732
40214E1883708j8846873j2764548J354142j170549j5360963j5362974K385523
40207g882534J5311913J2377394M501661l393498j7060403k5139219m329090L4732369
40199I118593M4305478M742185l9451702l7312304R15649K6081401J9450201L338696
$$ plain form
40251 8597170 7038585 14544990 42549711 77744082 92973555 83036052 69891093 68502444
40243 68502444 68125755 54750168 32601011 12612461 -4526180 -21902128 -34823316
40236 -34823316 -36334466 -25893368 -6585907 16122246 28943780 18637091 -6982472
40229 -6982472 -19857714 -3812161 25393649 42020326 41609503 39184864 44959664 53881432
40221 53881432 55354115 45314913 31272083 27771299 40582279 55187440 51883708
40214 51883708 33036835 20272287 21626429 20455880 5094917 -10268057 -7882534
40207 -7882534 7429379 19806773 24308434 20914936 3854533 -21284686 -25613776 9118593
40199 9118593 53424071 58166256 18714554 -18597750 -17682101 8399300 27849501 31188197
40191C1188197m237237o318828k303420J4993900L2471175K1774360j6628982
40184G0939165m3961933l4182534r164165k458355j0179931n376895J3439670
40177b0944978K0745119P521802n346827k961562K392409k068488o415032J065869
40169f011688J0308038Q173700L562318R067137J2608219k321711j9485754r917769
40161E982490J5584540J6524513j0288224k0213334O727042K9883258J3443510
40154E7643795j5343862j4211038L742973j381300k2464594j8012830J2769521
40147B742665K6497930Q234606q327266l341867p38744j6919642k7156200j0083650
40139b9092168J3121416J4380481L111908M422753J6396785J8508286N825867
$$ plain form
40191 31188197 26950960 20632132 18328712 33322612 65793787 87568147 70939165
40184 70939165 26977232 -7205302 -16369467 -18827822 -29007753 -34384648 -20944978
40177 -20944978 -199859 7321943 1975116 -986446 1405963 -662525 -7077557 -6011688
40169 -6011688 4296350 12470050 16032368 25099505 37707724 35386013 15900259 5982490
40161 5982490 21567030 38091543 27803319 7589985 14317027 44200285 57643795
40154 57643795 42299933 28088895 31831868 30450568 7985974 -10026856 2742665
40147 2742665 29240595 37475201 29147935 25806068 25067324 8147682 -19008518 -29092168
40139 -29092168 -15970752 -1590271 1521637 5944390 22341175 40849461 46675328
40132D6675328r877987j9363138j7397596p45432J8885531J8414510l702461j9009757
40124A3878998j0578209J496677k870572q295180N622175K2350823J2383698j7060602
40116A6927808l2483364k4216612j1639706m935699M423627J6938591K0160610
40109a4824745J2525486O253437M985473J320077l552876j44782R259270J1395877
40101B7217217K762992p988332j4724700j3912805J042957K4307659K7911966
40094D6616954m187948m0931006l6146073P188270L8669328K8126001j992300
40087C7343226j7464786j3068066k419913M688555L186322o350815j0339554J838531
40079b586500J2385429n223796l7568506l8751708J491283L5035555K2293904
$$ plain form
40132 46675328 36797341 17434203 36607 -708825 18176706 36591216 32888755 13878998
40124 13878998 3300789 4797466 1926894 -6368286 -746111 21604712 33988410 16927808
40116 16927808 -15555556 -39772168 -51411874 -56347573 -51923946 -34985355 -14824745
40109 -14824745 -2299259 3954178 8939651 10259728 6706852 6562070 15821340 27217217
40101 27217217 29980209 21991877 7267177 -6645628 -5602671 18704988 46616954
40094 46616954 42429006 1498000 -34648073 -27459803 11209525 39335526 37343226
40087 37343226 19878440 6810374 4390461 9079016 12265338 5914523 -4425031 -2586500
40079 -2586500 9798929 4575133 -32993373 -71745081 -70253798 -35218243 -12924339
40072a2924339j2136565k0050383J080585J4192596J805285j5831497j6862147
40065f0726465l490246J0443992J7817857J9996635K0739294K0248029J3038886
40058C8067982k589876j3382828l837447J6562782J7948264q655580l3686899
40051A0426398k6974888K644589K1788547J4025285q846197k6713251k7476274
40044d1125791j1356127Q804668J7682618J4659388J1688920J1620160N623740
40037A7597576l559103N89592J7022520J9772606j099321j7388954n244094J4093772
40029D1784594O329484k1362497l2534749j7666999k451823k437889l469579O810889
40021b4998569J6243059R026440q715039j6310920l188799K0273242L3307033
$$ plain form
40072 -12924339 -25060904 -45111287 -44030702 -29838106 -28032821 -43864318 -60726465
40065 -60726465 -64216711 -53772719 -35954862 -15958227 4781067 25029096 38067982
40058 38067982 35478106 22095278 18257831 34820613 52768877 44113297 10426398
40051 10426398 -16548490 -13903901 7884646 21909931 13063734 -13649517 -41125791
40044 -41125791 -52481918 -43677250 -25994632 -11335244 353676 11973836 17597576
40037 17597576 14038473 14628065 31650585 51423191 50323870 32934916 27690822 41784594
40029 41784594 48114078 26751581 -5783168 -23450167 -25901990 -28339879 -31809458 -24998569
40021 -24998569 -8755510 270930 -8444109 -24755029 -27943828 -7670586 25636447
40014B5636447K6133742J1541438Q344452J3135045L702937k4729251m7104334
40007A6660476m3358622k4122559o786514J0022423K7357384K7060414J537423
40000H370425j9160581n203170K3982415K5732556k954079k7645688l2280572
39993b9158694l0115229k3460169J100691L2944494L8024329J1523751r614762
39986h755589j712881J4138964J2207735n55131p217995r894570j3666131q507225
39978b3962823Q945931J8529481N573691j2324459j0897386M811031J2861962
39971C537428Q952942N962917R351539J3781094J6624403J6828516P328210j4264853
39963F8102196l2592013k8433580m420052J5022442J0299778j2497334k7429414
$$ plain form
40014 25636447 51770189 63311627 71656079 84791124 88494061 63764810 16660476
40007 16660476 -26698146 -50820705 -57607219 -47584796 -20227412 6833002 8370425
40000 8370425 -10790156 -15993326 7989089 33721645 30767566 3121878 -29158694
39993 -29158694 -59273923 -82734092 -81633401 -48688907 -10664578 859173 -8755589
39986 -8755589 -10468470 3670494 15878229 15323098 8105103 -1789467 -15455598 -23962823
39978 -23962823 -15016892 3512589 9086280 -3238179 -14135565 -9324534 3537428
39971 3537428 12490370 18453287 27804826 41585920 58210323 75038839 82367049 68102196
39963 68102196 35510183 7076603 2656551 17678993 27978771 15481437 -11947977
39956a1947977j5776509R800735J4970315j2254125l7637128k1762848K2601823
39949e2005714M4150458K3931860k461443k638254R391366P447850k380505p1849
39941B5363769R789989R087304j18675k378230J884056J207158j549955M654200
39933D7939616J3225154O394324j3522043k2533935p788850J5579627K4578047
39926F3871940J3262448n587725j6041994j4442151j1242291j4886837j6911335
39919a977945m748043J2560978J1066999j1517882k7984314j9437753R69178J3315490
39911b7753292J6589515J5090239M046213j2950065j6431113j751819O970131
39904a6190191l898737j1183474M583251K0755128J0406154p525162K90795K0437022
$$ plain form
39956 -11947977 -27724486 -17923751 -2953436 -15207561 -52844689 -74607537 -52005714
39949 -52005714 -7855256 16076604 13615161 10976907 20368273 27816123 25435618 25363769
39941 25363769 35153758 44241062 44122387 41744157 43628213 44835371 43285416 47939616
39933 47939616 61164770 67559094 54037051 31503116 23714266 39293893 63871940
39926 63871940 77134388 71546663 55504669 41062518 29820227 14933390 -1977945
39919 -1977945 -6725988 5834990 16901989 5384107 -22600207 -42037960 -41068782 -27753292
39911 -27753292 -11163777 3926462 7972675 -4977390 -21408503 -23160322 -16190191
39904 -16190191 -20088928 -31272402 -26689151 -5934023 4472131 -3053031 -2762236 17674786
39896A7674786J3763871j4059540j7629465J3048523L6132940K5844137P029855
39889H1805107N231517P253878m733736j7316301j1949968J496103M428013K23087
39881F6437700k85419m522079k2471570l9080749k9641816K538778K6117172J9570675
39873A8662692n880218k2645245j6709345P97532Q623158R05073o119514K510141
39865a9855726J7622588J8492737L035622j0892548j2524129q817967p265157
39858b0204580n935063l751046l997932l839071M004588J5889215J9342784J3498695
39850A5007590J1087760J6626424J9162772J0802750l283207j6435206k6048692
39843B6920191k5973014j1823525L825415J841611j3931587j8626534l269759
$$ plain form
39896 17674786 31438657 17379117 -250348 12798175 48931115 74775252 81805107
39889 81805107 87036624 94290502 89556766 72240465 60290497 61786600 66214613 66437700
39881 66437700 66152281 61630202 39158632 77883 -29563933 -27025155 -907983 18662692
39873 18662692 12782474 -9862771 -26572116 -25774584 -17151426 -16246353 -22365867 -19855726
39865 -19855726 -2233138 16259599 19295221 8402673 -4121456 -12939423 -20204580
39858 -20204580 -26139643 -29890689 -33888621 -37727692 -33723104 -17833889 1508895 15007590
39850 15007590 26095350 42721774 61884546 72687296 69404089 52968883 26920191
39843 26920191 947177 -10876348 -7050933 -5209322 -19140909 -37767443 -41037202
39836d1037202J2090725R764321k693265j0523474j1952937r173951J394304J7073606
39828c5057873K3954538J6494524P889635J0549931J9715031K4428187K0572100
39821H8546073P327458j2676920k5165729j6396859J287111R3193j9381940k2944226
39813F88161M816145L1680107K2795544r577509k7042924j7825558j590682O385773
39805A0329057R021037J0368832P611260R87441l112840p34227N122645P623165
39797D7216370K071983o768050o610102L761403N976080j0637956k4224775j0766888
39789A8065J0219861j15922l2513918l5017731N154824L7477889K6393782J659643
39781A3276493L0870P133758j979563j0542436K382775J1817445j0177310l4325819
$$ plain form
39836 -41037202 -28946477 -19182156 -21875421 -32398895 -44351832 -53525783 -52131479 -35057873
39828 -35057873 -11103335 5391189 13280824 23830755 43545786 67973973 88546073
39821 88546073 95873531 83196611 58030882 41634023 42921134 43014327 23632387 688161
39813 688161 5504306 37184413 59979957 50402448 23359524 5533966 3943284 10329057
39805 10329057 19350094 29718926 37330186 38317627 35204787 34470560 39593205 47216370
39797 47216370 49288353 42520303 35910201 39671604 45647684 35009728 10784953 18065
39789 18065 10237926 10122004 -22391914 -57409645 -52254821 -14776932 11616850 13276493
39781 13276493 13307363 20441121 18461558 7919122 10301897 22119342 11942032 -22383787
39773b2383787j7280853K0741890K5624684j524872j1915289M650015J0526498
39766H438286l943416n778150J0295023N780423k7064413l8688248r57992M2241771
39758i676716M0119539O607714j2284763p802676m724931j2708813j9119763j6275197
39750c5865606o618779Q605354K4515959K8294685J6671309M240664N75435m186113
39742C6232908j7125835k5151187j6326384r34555N689660N355910O294593O355876
39734C90986K690397K527576Q650979R397227j566617j0980400o976277J581844
39726E715715L266774N328146J7214139K6808102J5649144r855037k3348136j2609266
39718B8169581O591302J0690217o815366k9788218l4655789j4552518J1921473
$$ plain form
39773 -22383787 -39664640 -18922750 6701934 5177062 -6738227 -2088212 8438286
39766 8438286 4494870 -1283280 9011743 14792166 -12272247 -50960495 -51918487 -9676716
39758 -9676716 30442823 37050537 24765774 16963098 12238167 -470646 -19590409 -35865606
39750 -35865606 -42484385 -33879031 -9363072 18931613 35602922 39843586 40419021 36232908
39742 36232908 19107073 -6044114 -22370498 -23305053 -17615393 -12259483 -5964890 390986
39734 390986 3081383 5608959 14259938 23657165 22090548 11110148 4133871 5715715
39726 5715715 8982489 14310635 31524774 58332876 73982020 64126983 40778847 28169581
39718 28169581 34760883 45451100 38635734 8847516 -25808273 -40360791 -28439318
39711b8439318K2762514J8773478J4950990J2804819K787736j0104680j1067661
39704B2467878n721681j3580276k7674710j8172058J3293857K4491052j908803
39697f804741k4951535p556912K5355846K8867749O560514p104282q101164j7065530
39689a0800055k7746795j3517156J8428651K8385596M506344k0441713k0398143
39682d1583271n673417P943189K1871648L2431233K1424706j0493662l0094349
39675d173923j4609856J3755752J9660119K734863j0833857j0987197j0302945
39668a4757044j3384653p846697Q935098J6972221J464522k0391231j8860713
39661d7868497O154192K2460263J0764331p036331j143603J9741942K1740860
$$ plain form
39711 -28439318 -5676804 13096674 28047664 40852483 43640219 33535539 22467878
39704 22467878 16746197 3165921 -24508789 -42680847 -29386990 -4895938 -6804741
39697 -6804741 -31756276 -39313188 -13957342 14910407 21470921 14366639 6265475 -10800055
39689 -10800055 -38546850 -52064006 -33635355 -5249759 -743415 -21185128 -41583271
39682 -41583271 -47256688 -39313499 -17441851 14989382 36414088 25920426 -4173923
39675 -4173923 -18783779 -5028027 14632092 17366955 6533098 -4454099 -14757044
39668 -14757044 -28141697 -35988394 -27053296 -10081075 -8616553 -29007784 -47868497
39661 -47868497 -41714305 -19254042 -8489711 -15526042 -16669645 3072297 24813157
39654B4813157m68449j5337170m810326R812559O597846l550793l740116k581608
39646A0735100j0457688j0414165J1337639K7281083M747428l2795430k9936964
39639b9502997J6803758M9528524L2776854j186371j0262715j972561n451758
39632E0732734j8858064k1154949j3570513j2458726j4347783l206924J4086243
39625a8777982J3085745o942361j7290811k269508J7732558J7281746Q18950q250895
39617d612558r25832J0715717J4186204R026265q16496j3740781k4928692k3946296
39609c5042469o805533J3993839K0851824J1879705J837598J416648M907450K286131
39601A5325193n334339r160848n433548K373674R716901J3337749J1338966N747708
$$ plain form
39654 24813157 24344708 9007538 4197212 14009771 20607617 17056824 13316708 10735100
39646 10735100 277412 -10136753 1200886 28481969 33229397 433967 -29502997
39639 -29502997 -12699239 36829285 69606139 68419768 58157053 56184492 50732734
39632 50732734 31874670 10719721 -2850792 -15309518 -29657301 -32864225 -18777982
39625 -18777982 -5692237 -12634598 -29925409 -32194917 -14462359 2819387 3638337 -4612558
39617 -4612558 -5538390 5177327 19363531 28389796 27573300 13832519 -11096173 -35042469
39609 -35042469 -41848002 -27854163 -7002339 4877366 6714964 8131612 13039062 15325193
39601 15325193 9990854 830006 -4603542 -2229868 7487033 20824782 32163748 37911456
39593C7911456R52028l179450r864040j4846330q299419P250863J3609858P74908
39585B4309874j7507500k2477089j3209327j10811J1111577J6682712J1419084
39578A0218520L090446J1943627L6407297M0432731L083367l9678798m0493909
39571B5003281j2196756o928675l0848075l5341089j324319K5304807P841536
39564b8489290k1796289j5506210J7715534L4729707K6991495J9585551J8441271
39557E1671769O321999j3581050j4424581Q816391K6682648J7281359p239872
39550G5528663k4796991k8782771k0641108j052884J9811239K3483928P258856
39543E0808932r340430j2783070j3053415k0798914k5237365j3021984M848199
$$ plain form
39593 37911456 38863484 35684034 25819994 10973664 2674245 9925108 23534966 24309874
39585 24309874 6802374 -15674715 -28884042 -28994853 -17883276 -1200564 10218520
39578 10218520 13308966 25252593 61659890 102092621 105175988 65497190 25003281
39571 25003281 12806525 5877850 -24970225 -60311314 -61635633 -36330826 -28489290
39564 -28489290 -50285579 -65791789 -48076255 -13346548 13644947 33230498 51671769
39557 51671769 57993768 44412718 29988137 38804528 65487176 82768535 75528663
39550 75528663 50731672 21948901 1307793 254909 20066148 43550076 50808932
39543 50808932 41468502 28685432 15632017 -5166897 -30404262 -43426246 -38578047
39536c8578047P052993m546200p992981M203463J5989667J6231339J3926320J5952290
39528B2238844J1116707o689024j7044653M19200K7751747K7051384k897405k0747967
39520D1198833m077137J5456987J736995k7736494k8241936K669849K2389986
39513B3397083Q261320j4063777j6336135o357353l668820n968532k252084K992807
39505a3995491K689575O419294K1959369L2474392J9186148m190943q860422L534669
39497E9216591L927548j5673474k8603917j6894241M01742j713888j6115939j6462359
39489c1917937M311047K6841156L0522944J2129731j5351304l0953234j9250844
39482b3668441J1586971L0939225J8950046o419751j2328624K530063O948515
$$ plain form
39536 -38578047 -31525054 -36071254 -44064235 -39860772 -23871105 -7639766 6286554 22238844
39528 22238844 33355551 26666527 9621874 10041074 37792821 64844205 61946800 41198833
39520 41198833 37121696 52578683 54315678 26579184 -1662752 1007097 23397083
39513 23397083 31658403 17594626 1258491 -5098862 -8767682 -14736214 -16988298 -13995491
39505 -13995491 -11305916 -4886622 17072747 49547139 68733287 64542344 55681922 59216591
39497 59216591 63144139 47470665 18866748 1972507 2374249 660361 -15455578 -31917937
39489 -31917937 -27606890 -765734 29757210 41886941 26535637 -4417597 -23668441
39482 -23668441 -12081470 18857755 37807801 31388050 19059426 21589489 28538004
39475B8538004j3692923l2795105k2070712N591915J6867739Q213161N682437
39468c665484J8315201K3915403Q915069p187841m310091M632127m065668k4315112
39460A2233604k8115910q332253J0390529N582766j5074040k4200525m491292
39453e2007121L2369010N2381698L1568422j3201531l7947651k4147613k90563
39446a1275349K053407q661499p578777J796606o60976j1001971r890577j387256
39438d6606392k829200m287583J6083350M0574559K8974721r073404j7595652
39431E240399J4888581L0106705n458115m1557259k4067528J8706480K6000087
39424B3859350O05510q326412Q099760J4436906L63410p857653k499699m856965
$$ plain form
39475 28538004 14845081 -17950024 -40020736 -34428821 -17561082 -9347921 -3665484
39468 -3665484 14649717 38565120 47480189 40292348 35982257 40614384 36548716 12233604
39460 12233604 -15882306 -24214559 -13824030 -8241264 -23315304 -47515829 -52007121
39453 -52007121 -19638111 32743587 64312009 51110478 13162827 -10984786 -11275349
39446 -11275349 -9221942 -17883441 -25462218 -23665612 -24326588 -35328559 -45219136 -46606392
39438 -46606392 -49435592 -53723175 -37639825 2934734 31909455 22836051 5240399
39431 5240399 20128980 50235685 44777570 3220311 -20847217 -2140737 23859350
39424 23859350 24464860 16138448 24238208 38675114 39038524 31180871 28681172 23824207
39416B3824207j7730947j7848600j669019O834703P01678o53193P246226O427562
39408G132617k381133M267075K4403759K3603974p767235l3447941k7625405j1647253
39400b3461542j0875192j3629283j420210J4164171J5823101J2621973J6726945
39393I949963J4947641l943922j8257142n762697J3160351L520442k6742461l6608727
39385d9736552j3128782J4674396K3200519K1260707K2816348K1427007N442131
39378D5955774j8706347l1936913k5166679r597064m200564j2385951j5424969
39371g1462713R56914J9370044J2652760q038107j817905L3587765M3794190k083787
39363B6959161n1859129l7671443K3731724N4550236K7098783r068750j2282381
$$ plain form
39416 23824207 6093260 -11755340 -13424359 -6589656 -5887978 -6541171 705055 7132617
39408 7132617 4751484 9018559 33422318 57026292 49259057 15811116 -11814289 -23461542
39400 -23461542 -34336734 -47966017 -49386227 -35222056 -19398955 -6776982 9949963
39393 9949963 24897604 20953682 2696540 -3066157 10094194 13614636 -13127825 -49736552
39385 -49736552 -62865334 -48190938 -24990419 -3729712 19086636 40513643 45955774
39378 45955774 27249427 -4687486 -29854165 -39451229 -43651793 -56037744 -71462713
39371 -71462713 -70505799 -51135755 -38482995 -46521102 -48339007 -14751242 29042948 26959161
39363 26959161 -24899968 -62571411 -38839687 15710549 42809332 33740582 21458201
39356B1458201R1796J011232k188061K3144q226329k9827546l0827915N188201
39348d3297277L4720017J2907020l3051100m0955925o165745J9159213J2733943
39341d3949854Q480521K7298889L8551221J6108769j3098895j1866232Q446639
39334B9971058J0393380r418695k1709561j4574971m335329O40968J1463881K8933176
39326C1363907L3040970J4079546r092572j5734561j0589965j0435254j7149550
39319A5482521j9789832j4988459j0175267r486948q523011m047903j144779o965404
39311e9639082j8617423k0645057o95275L0310827M3677773K7493350N035186
39304F920299L416981J4264816R108357j2246065j9779235k457388J3764424Q180970
$$ plain form
39356 21458201 21549997 22561229 20373168 20396312 12169983 -17657563 -48485478 -43297277
39348 -43297277 -8577260 4329760 -28721340 -69677265 -75843010 -56683797 -43949854
39341 -43949854 -35469333 -8170444 30380777 46489546 33390651 21524419 29971058
39334 29971058 40364438 30945743 9236182 -5338789 -9674118 -9033150 2430731 31363907
39326 31363907 64404877 78484423 69391851 53657290 43067325 32632071 15482521
39319 15482521 -4307311 -19295770 -29471037 -38957985 -47480996 -51528899 -52673678 -59639082
39311 -59639082 -78256505 -98901562 -99596837 -69286010 -25608237 1885113 6920299
39304 6920299 10337280 24602096 33710453 21464388 1685153 -772235 12992189 21173159
39296B1173159o378731j3637041j9801397k7088578j4400794K3805612M8561612
39289A2233842K6151246j5334385k3334761J798258J5330680L708530k553551
39282A7999859Q347680R670378q927734j8670064m638557M885137j1392198k8777776
39274c1503275j8470833N804594J5431137J1944979J1392092R416585l225927
39267G89352j1448968K401381K3367874K3543492L877705j3632414k1791582k6564342
39259a9457502k4051115j0200596K26952m264126o072051J1761469K8096641J6789660
39251g170668k55407J5825952M7353818L7822771j4439537m3851670j6463168
39244A8822091J9181856J1072509j9922249k5110706o185395K305043j494223
$$ plain form
39296 21173159 14794428 1157387 -18644010 -45732588 -60133382 -36327770 12233842
39289 12233842 38385088 23050703 -284058 1514200 16844880 20553410 17999859
39282 17999859 26347539 36017917 27090183 8420119 3781562 8666699 -2725499 -31503275
39274 -31503275 -49974108 -44169514 -28738377 -16793398 -5401306 4015279 789352
39267 789352 -10659616 -8258235 15109639 38653131 42530836 28898422 7106840 -19457502
39259 -19457502 -43508617 -53709213 -53482261 -57746387 -63818438 -52056969 -23960328 -7170668
39251 -7170668 -7426075 8399877 55753695 93576466 79136929 35285259 18822091
39244 18822091 38003947 49076456 29154207 4043501 -2141894 163149 -1331074
39237a331074O702386K1741423J4071520j3591865k4256953o435085Q556265Q84219
39229F340836o991926O047152K0170197P778868j7394452j8230792Q979859K8111344
39221C4811086J4853831j2179767k1428126r666660J374774j622583r992723j0343034
39213a4193202j933844O365666Q504561O355892N740212R220116J1308845L022438
39205C4390684j4631637k5530603j5454019P336125J9353999J0673631n303465
39198A0834715j3379797j4001067j3140753r207326l04910P543990J0643541J4829974
39190f181633K1532264K0387250R413162O153241J8946158K3537866l873363m2007959
39182D7906986m6567186j2775832J9178175K2631436J1979622N032946l403530
$$ plain form
39237 -1331074 5371312 27112735 41184255 27592390 3335437 -3099648 5456617 6340836
39229 6340836 -651090 5396062 25566259 33345127 15950675 -2280117 6699742 34811086
39221 34811086 49664917 37485150 16057024 6390364 7765138 6142555 -3850168 -14193202
39213 -14193202 -16127046 -9761380 -1256819 5099073 10839285 20059401 31368246 34390684
39205 34390684 19759047 -5771556 -21225575 -13889450 5464549 16138180 10834715
39198 10834715 -2545082 -16546149 -29686902 -38894228 -39199138 -31655148 -21011607 -6181633
39190 -6181633 15350631 35737881 45151043 51304284 70250442 93788308 89914945 47906986
39182 47906986 1339800 -11436032 7742143 30373579 42353201 47386147 43982617
39175D3982617j5013318j2422183O537911J2455603q873846k3618285M99966L7286744
39167D0835209L7596913M328023j6111504r406939q392796k7792003l6115062
39160a5058159j2292723J4776603J3228338j024213L056917J5418843M370030
39153B2475636k3096924k7077120k9206J7960882J352468k0939867j0197240K4768263
39145a4783108M2858740K7756272K238804p875520L2119J3501791J8790965O254891
39137H8774954j9583902l4760652j9868916Q825683J4046185j0921624k9429587
39130b917859j3191369J6629188K1573341J032409j2924696o502039J166921m487918
39122C77978j0202859O9384J7751524K1911078O978045j3832966k5045646j9978055
$$ plain form
39175 43982617 28969299 16547116 23085027 35540630 26666784 3048499 3548465 40835209
39167 40835209 78432122 82760145 66648641 57241702 48848906 21056903 -15058159
39160 -15058159 -27350882 -12574279 654059 -370154 2686763 18105606 22475636
39153 22475636 -621288 -27698408 -27727614 -9766732 -8414264 -29354131 -39551371 -14783108
39145 -14783108 28075632 55831904 58070708 50195188 50227307 63729098 82520063 88774954
39137 88774954 69191052 34430400 14561484 23387167 37433352 26511728 -2917859
39130 -2917859 -16109228 519960 22093301 23125710 10201014 3698975 4865896 377978
39122 377978 -9824881 -9755497 7996027 29907105 36885150 23052184 -1993462 -21971517
39114b1971517k124781J6357277K2273720J3936215L226691J851444Q588581J1365240
39106E3502870p86954k5238210m0811057k3235337K2804235N5228032L7698633
39099G9162212j2046664m0494982k6265375k055803o76478j0479838m739961J1896849
39091e700040J6378617Q604775O239577Q180256j904616j8738045j8156025q35467
39083e930968K956410j5262823k1740410N337685L2353954J6244574k5744465
39076a1786043l5462046J239667L3827492K2868377n313671p263297P810409p3197
39068E847691k6926262k4549575J9156282N0170963K5090118k1677576k7750477
39061f38836N686189K1453294l278245k6911126j3895637J2012839J0993165j0817059
$$ plain form
39114 -21971517 -24096298 -7739021 14534699 28470914 31697605 33549049 42137630 53502870
39106 53502870 52715916 27477706 -13333351 -36568688 -13764453 41463579 79162212
39099 79162212 67115548 26620566 355191 -1700612 -2377090 -12856928 -17596889 -5700040
39091 -5700040 10678577 19283352 25522929 33703185 31798569 13060524 -5095501 -5930968
39083 -5930968 -2974558 -18237381 -39977791 -34640106 -2286152 13958422 -11786043
39076 -11786043 -47248089 -46008422 -12180930 10687447 5373776 -1889521 5920888 5847691
39068 5847691 -21078571 -45628146 -26471864 23699099 48789217 27111641 -638836
39061 -638836 5047353 26500647 23222402 -3688724 -17584361 -5571522 5421643 -5395416
39053e395416j6406426M514849K5811772K4414739L270207k0448258k9200773
39046a3439306j2957095J6939406K8661895O169998k2120680j6050551J8897055
39039F100722L6367516J4147806j6611715j9302278j016433P180946j080497n231273
39031B0554794M915564J5909290J5317645P880657R25601q463648k0750070k2305081
39023A3984752l137607K0242354J9378992o368908k3780775r894595J4377930
39016B4802143J2909781j4372095l2911723k3242507k942644O351314Q127549
39009b1278182J4089236J9614528J4303965K011943p334885j3833928j9448156
39002a1875479j6645102k581102Q345653N237570P21988Q722237J6489735N774290
$$ plain form
39053 -5395416 -21801842 -17286993 8524779 32939518 36209725 15761467 -13439306
39046 -13439306 -26396401 -9456995 19204900 25374898 3254218 -12796333 6100722
39039 6100722 42468238 56616044 40004329 20702051 19685618 26866564 25786067 20554794
39031 20554794 25470358 41379648 56697293 64577950 65503551 57039903 36289833 13984752
39023 13984752 10847145 31089499 50468491 44099583 20318808 10424213 24802143
39016 24802143 37711924 23339829 -9571894 -32814401 -35757045 -29405731 -21278182
39009 -21278182 -7188946 12425582 26729547 28741490 21406605 7572677 -11875479
39002 -11875479 -28520581 -31101683 -22756030 -17518460 -16796472 -8074235 8415500 14189790
38994A4189790j0502801n684465J3586879J4585689p208459j9076108l893877
38987d003352J4501285J3002639L301891M762711J0962534N914860p634649j7760248
38979B3047671k3412583k5163566j3345916J3617285L4295696K9176750Q486364
38972D6701701m094831l405568k2408J379515J137469n180675j5333854j2691827
38964H489522P666346J9618365Q8773k9694570k9219185J732390K3068351J3590021
38956A5340013m640929p368417l54115K468391M408056J1507381J4167023K611633
38948C8139036j3850228j9647437j3905945n244649L245230J0797802J1242779
38941A0776588K146229o697751o732965m740816r978250j4135183o01702K7287974
$$ plain form
38994 14189790 3686989 -1997476 11589403 26175092 18966633 -109475 -4003352
38987 -4003352 10497933 23500572 26802463 31565174 42527708 48442568 40807919 23047671
38979 23047671 -364912 -25528478 -38874394 -25257109 9038587 38215337 46701701
38972 46701701 42606870 39201302 39178894 40558409 41695878 36515203 21181349 8489522
38964 8489522 16155868 35774233 35863006 6168436 -23050749 -21318359 1749992 15340013
38956 15340013 10699084 3330667 2976552 5444943 9852999 21360380 35527403 38139036
38948 38139036 24288808 4641371 -9264574 -14509223 -11263993 -466191 10776588
38941 10776588 12922817 6225066 -507899 -5248715 -15226965 -29362148 -29963850 -2675876
38933b675876M2522164K4668380j3990707l9084194k9666399N39204J9559301
38926A871873J3233821j633241l090940P036202J1354699O008539K868600M028176
38918D1677729l883374k3046735l2493441j6282760J1326016K4235891J7265543
38911A8798869N153573k617218r094303j5861213j7347530j0018843K221892J1537325
38903a7227448J0147092l361063j5718427p053001K2098328M2539864L0559031
38896F1984376J521701r993065J711404Q131631r474886l3808251l7775240j8991243
38888c6693573L735606J5472447J4053717K737926j2450417k0831974j3600924
38881d7577192N391787K0459650J8831536M409477n381299L43714J1148405R136206
$$ plain form
38933 -2675876 39846288 64514668 50523961 11439767 -18226632 -17687428 1871873
38926 1871873 15105694 13472453 10381513 17417715 28772414 34780953 37649553 41677729
38918 41677729 37794355 14747620 -17745821 -34028581 -22702565 1533326 18798869
38911 18798869 23952442 21335224 12240921 -3620292 -20967822 -30986665 -28764773 -17227448
38903 -17227448 -7080356 -10441419 -26159846 -33212847 -11114519 31425345 61984376
38896 61984376 63506077 53513012 55224416 63356047 53881161 20072910 -17702330 -36693573
38888 -36693573 -32957967 -17485520 -3431803 -693877 -13144294 -33976268 -47577192
38881 -47577192 -42185405 -21725755 -2894219 1515258 -3866041 -3522327 7626078 16762284
38873A6762284k540787j186170J7448401K3165773n949696m1915305l9810428
38866c4025928m204619J5631959q69660j8793168q490292R050561N553316k675264
38858c8823095J3023948L5282657K3817672j3790453k5506159O825577L9452674
38851D0282821L2562560L817926q394440k902124m529051j5434111j4043090K984460
38843C4344951J0553961n988560k5012842j6057922J7593242L8868124K0719809
38836G5020763j9295599l7105331j4231966J9586760K4232653n34207j9652935
38829B8020138j3133290J341186J560845p070782q024642m086912r270139j9947527
38821c0611123j7794795m90771J1595226M517926r497829r604561P027653K4659111
$$ plain form
38873 16762284 14221497 13035327 30483728 53649501 47699805 5784500 -34025928
38866 -34025928 -38230547 -22598588 -23468248 -42261416 -50751708 -41701147 -36147831 -38823095
38858 -38823095 -25799147 9483510 33301182 19510729 -5995430 830147 40282821
38851 40282821 72845381 76663307 68268867 65366743 60837692 45403581 31360491 34344951
38843 34344951 44898912 38910352 13897510 -2160412 15432830 54300954 75020763
38836 75020763 55725164 18619833 4387867 23974627 48207280 47673073 28020138
38829 28020138 14886848 16228034 17788879 10718097 2693455 -1393457 -10663596 -30611123
38821 -30611123 -48405918 -48896689 -37301463 -32783537 -42281366 -51885927 -44858274 -20199163
38813b0199163K8761404J8855759M676333m635214p756145r975753j4676551j7093674
38805b2043004j0204192L116275R716826K158766r026027o641318R232129J7442808
38797f247737K467840k1782983k6971782p325604J3984177J9256101J8393190
38790h226798K4491224K6257477P773283j6833009j8531561L18939P008068j0262598
38782A1995025k5404946j9874895j1010755j4788271j2777673J2822613L6924682
38775b2114220K3751640j3280724k6153773k982864J7504389Q302182q269556
38768b3242926k126028J6896245J7644370m879900k5348289k3321841l259812
38761d7638181J8101232K9951153L1429803K5765137J4572803j271784j5492685
$$ plain form
38813 -20199163 8562241 27418000 32094333 27459119 19702974 9727221 -4949330 -22043004
38805 -22043004 -32247196 -29130921 -19414095 -17255329 -26281356 -32922674 -23690545 -6247737
38797 -6247737 -3779897 -25562880 -52534662 -59860266 -45876089 -26619988 -8226798
38790 -8226798 16264426 42521903 50295186 33462177 14930616 15249555 22257623 11995025
38782 11995025 -13409921 -33284816 -44295571 -59083842 -71861515 -59038902 -22114220
38775 -22114220 1637420 -11643304 -37797077 -40779941 -23275552 -14973370 -23242926
38768 -23242926 -25368954 -8472709 9171661 4291761 -21056528 -44378369 -47638181
38761 -47638181 -29536949 414204 31844007 57609144 72181947 70910163 55417478
38754E5417478j7585235o679330K158296l593408j4340102j1250597N074246J5572009
38746B4773357J1111224J581075m782299j1772863k0150705k0970719j1876826
38739c2087756m083159m782158o556252j586953P067001J4343820J9113256J6647524
38731H075323K076310j3479058j0103657J0102854K1300941J2991816O112114
38724C7076643J4993178J9603681q10263k8822895l2914356j4886373k481373
38717h241758n139584q601394p671715j1866503j8236395r882336J1929202K1426215
38709c6284268N214235j5609320j3150054J1790004L3362701L1154182R475004
38702B5952484q959041o758094P587826R028915q052058j7560234j505929J4731564
$$ plain form
38754 55417478 37832243 31152913 33311209 29717801 15377699 4127102 9201348 24773357
38746 24773357 35884581 37465656 32683357 20910494 759789 -20210930 -32087756
38739 -32087756 -36170915 -40953073 -47509325 -49096278 -42029277 -27685457 -8572201 8075323
38731 8075323 10151633 -3327425 -13431082 -3328228 17972713 30964529 37076643
38724 37076643 52069821 71673502 70863239 42040344 9125988 -5760385 -8241758
38717 -8241758 -13381342 -21982736 -29654451 -41520954 -59757349 -69639685 -57710483 -36284268
38709 -36284268 -31070033 -46679353 -59829407 -48039403 -14676702 16477480 25952484
38702 25952484 16993443 10235349 17823175 26852090 18800032 1239798 -266131 14465433
38694A4465433l521196m0768522m4746811k210315L8513042L5191358N936591
38687B859580p035370K604896J1337762R588463O278428K570882o990502j3711723
38679G502416m400361J1337038J1114536l446003p348522P368864J9006328J1728400
38671E2862696j707135n213053m701494j0736940j3918994L06625K2237255K6059646
38663F5188606N790957j5821311j7756889n890955j337086j2505839k6122322
38656h454839k3478297j662027K1893301K6901125J2454391k382756k392721O231716
38648B9109893Q348083K323365j873466k996220j1181403k7633039l6359408k4364193
38640f4626388k34888J6156913J5770142M840247o205772j0373009o024578J310207
$$ plain form
38694 14465433 10944237 -29824285 -74571096 -76781411 -38268369 -3077011 2859580
38687 2859580 -4175790 -1570894 9766868 19355331 25633759 28204641 21214139 7502416
38679 7502416 3102055 14439093 25553629 22107626 14759104 22127968 41134296 52862696
38671 52862696 51155561 45942508 41241014 30504074 16585080 16891705 39128960 65188606
38663 65188606 70979563 55158252 37401363 31510408 30173322 17667483 -8454839
38656 -8454839 -31933136 -33595163 -11701862 15199263 27653654 25270898 22878177 29109893
38648 29109893 37457976 39781341 37907875 34911655 23730252 -3902787 -40262195 -64626388
38640 -64626388 -64861276 -48704363 -32934221 -28093974 -34299746 -44672755 -50697333 -49387126
38632d9387126L550708J837122O336214J7993164K1263225O467753j0722540q153908
38624a0815388J1169408K4117184K0010646Q846808j247026j2788964k2026012
38617A7266656j5840967M810708J7099378N031229j7427891k4680591j1101444
38610b4842922O934668J2996638N200503n351742m964312P693416J5782426M182125
38602A7630800j5115050j4938910O542189J9334470N436389j3576400r478588
38595d165100J1223730J9691042N186654j7272948l0252716k7285108j1500873
38588e4375319M340039O323506q1946P189465L0701293M1455319K1830767l707461
38580E3675663p450988l184618j6385253l1796977j6641565J7058150K4629687
$$ plain form
38632 -49387126 -45836418 -43999296 -37663082 -19669918 1593307 8061060 -2661480 -10815388
38624 -10815388 354020 24471204 44481850 53328658 52081632 39292668 17266656
38617 17266656 1425689 6236397 23335775 28367004 10939113 -13741478 -24842922
38610 -24842922 -17908254 -4911616 288887 -5062855 -10027167 -2333751 13448675 17630800
38602 17630800 2515750 -12423160 -5880971 13453499 18889888 5313488 -4165100
38595 -4165100 7058630 26749672 31936326 14663378 -15589338 -42874446 -54375319
38588 -54375319 -50035280 -43711774 -43793720 -36604255 -5902962 35552357 57383124 53675663
38580 53675663 46224675 43040057 26654804 -5142173 -21783738 -4725588 19904099
38573A9904099K18130j5830037n711285K577910o093759n106603J9751554L5251815
38565D4961824J3503743j9377384k5260793j2932181j3846300k3258750j0678080
38558d6887921K3058758M1714799K5611911n363647k2768461j8424626j061025
38551d120212J5044735J7232781N923625l508523k224968j628880j0590725j3252676
38543B875157P375020L4744486L5503823O477911k1642370k6375881j3980038
38536B4978108K173741J6985024K2358566O380309k4498909m1678398k6745720
38529b0047279M048793J9070832P903442r729002q163905J5123045L3987860K0690250
38521F2884036j8192377m2307709k4222847J4307860K9252648J0375629j0729906
$$ plain form
38573 19904099 20122229 4292192 -1419093 1158817 -4934942 -10041545 9710009 44961824
38565 44961824 58465567 39088183 13827390 895209 -12951091 -36209841 -46887921
38558 -46887921 -23829163 17885636 43497547 38133900 15365439 -3059187 -4120212
38551 -4120212 10924523 28157304 34080929 30572406 28347438 26718558 16127833 2875157
38543 2875157 10250177 44994663 80498486 86976397 65334027 38958146 24978108
38536 24978108 27151849 44136873 66495439 72875748 48376839 6698441 -20047279
38529 -20047279 -15998486 3072346 10975788 1246786 -6917119 8205926 42193786 62884036
38521 62884036 44691659 2383950 -21838897 -7531037 21721611 32097240 21367334
38514B1367334o973526J2688190K3178546J5280598j044364j1004155n091030
38507D8401593J3041604K3675385R574294j7512806k5169041l164019K0007829
38500F8854839J6849155o70350l675159N675194j342749k8717991m1446353j6739670
38492a213084J7063717J8490756o801554j7075503m46301R689681m977991j2800996
38484A928725J4083175M4801140L2096923j0430777k5633884j746246J2860425
38477F7959481o668372k1903774k030472J9469907K628269k6949223j8809855
38470A3695961J6929209K5155005m941599k6161647j1695557P930871J379937
38463B2292180j5938127j3987568N766014K0937731K2377110J6509677Q495692
$$ plain form
38514 21367334 14393808 27081998 50260544 65541142 64496778 53492623 48401593
38507 48401593 61443197 85118582 94692876 77180070 52011029 48847010 68854839
38500 68854839 85703994 85033644 81358485 87033679 85690930 56972939 15526586 -1213084
38492 -1213084 15850633 34341389 27539835 10464332 10018031 19707712 14729721 1928725
38484 1928725 16011900 60813040 92909963 82479186 56845302 55099056 67959481
38477 67959481 61291109 39387335 37356863 56826770 59455039 32505816 13695961
38470 13695961 30625170 55780175 50838576 24676929 12981372 20912243 22292180
38463 22292180 6354053 -7633515 -1867501 19070230 41447340 57957017 66452709
38456F6452709q56039j0543746j9475333k2998161j1131682J5578297L4134450
38449E1160495K3951747j746974j4205999j1880876j3341391j4259572O126184
38442B5803614L4259944K7349250j6773253m3780345k1391797J1780120R161664
38435B6409197j3145300j1200962J3494883K4176982J2134545J535756J369290
38428E4774391k395477j0295404o134051Q372614J1970252P95452n314569J663154
38420E3436362O273971K08437l580609L017769P733736L62043q871829n439303
38412E3140577R148965K2136325K3434027J0002340j1447129k2778638r226228
38405G4410239J9167539L3277381J7745509j1644822k7875245k1465972n376790
$$ plain form
38456 66452709 65596670 55052924 35577591 12579430 1447748 17026045 51160495
38449 51160495 75112242 73365268 59159269 47278393 33937002 19677430 25803614
38442 25803614 60063558 87412808 70639555 26859210 5467413 17247533 26409197
38435 26409197 13263897 2062935 15557818 39734800 51869345 53405101 54774391
38428 54774391 52378914 42083510 35949459 44322073 56292325 57087777 51773208 53436362
38420 53436362 59710333 59918770 56338161 59355930 67089666 67451709 58579880 53140577
38412 53140577 62289542 84425867 107859894 117862234 106415105 83636467 74410239
38405 74410239 93577778 126855159 144600668 132955846 105080601 83614629 78237839
38398G8237839K309603l241274j0885980r505082m125929o523738j0998484J170354
38390C6437309K6597239L3557550P329860k2419356k3586069p640920k203292
38383D8072321K4463K2110481M7169694L3075736j7838324n3900329m6746442
38376C1967600k1598246l611033J5965310L9746712M0287208Q053409j9162763
38369I1648197j1754588L967616n566546j9577157Q9017L6608589L9726279O860427
38361A42001834j4095983j581016J3408969N153399j1269869j6244114j4919017
38354A02454203j2770797L52805K1745940K5624719L755455j4941268r647483
38347A16573574j825711j4569306k6642203o041688L0505131L6545423P152223
$$ plain form
38398 78237839 80547442 77306168 66420188 56915106 52789177 46265439 35266955 36437309
38390 36437309 63034548 96592098 103921958 81502602 57916533 50275613 48072321
38383 48072321 48096784 70207265 117376959 150452695 132614371 78714042 31967600
38376 31967600 10369354 6758321 22723631 62470343 102757551 110810960 91648197
38369 91648197 79893609 83861225 78294679 58717522 58806539 95415128 135141407 142001834
38361 142001834 127905851 126324835 139733804 144887203 133617334 117373220 102454203
38354 102454203 89683406 90036211 111782151 137406870 141162325 126221057 116573574
38347 116573574 114747863 100178557 73536354 67494666 97999797 134545220 141697443
38340A41697443j3885879k536134J2489750J719182j6531436q095599J9966985
38333A34824312K8767828O383686j5695037j0569276O564924N084734j4410228
38326A40950943k3112520q186921J0357123J2726082P631870J2470977K1815952
38319A74653506J8456822O887772Q057581K0905993J9179422m161132j9317337
38312B24662627n780282J0289985n921783m0516574m7133892j3908332K1560714
38305A43252463K6872321J2060898L530261R127008K1455840L1797247K7940654
38298B76036692J261399l0366120l1052457M116425L2655648J9662818j3354006
38291B58960399k2318398l300530J2707220J3463816J4188354J7758810Q381056
$$ plain form
38340 141697443 127811564 125275430 137765180 139484362 122952926 114857327 134824312
38333 134824312 163592140 169975826 154280789 143711513 150276437 155361171 140950943
38326 140950943 117838423 109651502 120008625 132734707 140366577 152837554 174653506
38319 174653506 193110328 199998100 208055681 228961674 248141096 243979964 224662627
38312 224662627 218882345 229172330 223250547 182733973 135600081 121691749 143252463
38305 143252463 170124784 182185682 185715943 194842951 216298791 248096038 276036692
38298 276036692 277298091 246931971 215879514 219995939 252651587 272314405 258960399
38291 258960399 236642001 233341471 246048691 259512507 273700861 291459671 299840727
38284B99840727r172554m122650L0247641N4472024L4371970r220836k8205820
38277C68210502r869091J3536264J1192874j2407315l0413612k4899195j225071
38270C14125356K0927855K6925414J8426306O168080l573360r699777r317369
38263C63982505r29205R197658J5538743K2707936L2240656K9222517M164189
38256D76124999k0038659j3227833J3426107J9948220L06131r643824L842207
38249D70737348Q893476j0209756j8581520N990894K2864461p881438n0034198
38242D21779267m0761627J0000899L6353354J9089970J891305O824172N722639
38235D60899979j1612069j0661569J9377010L2610548l98192l8058606k9881760
$$ plain form
38284 299840727 290668173 286545523 316793164 371265188 405637158 396416322 368210502
38277 368210502 358341411 371877675 383070549 370663234 340249622 315350427 314125356
38270 314125356 335053211 361978625 380404931 386573011 382999651 373299874 363982505
38263 363982505 363053300 372250958 387789701 410497637 442738293 471960810 476124999
38256 476124999 456086340 442858507 456284614 476232834 476538965 466895141 470737348
38249 470737348 479630824 469421068 450839548 456830442 479694903 471813465 421779267
38242 421779267 381017640 391018539 427371893 446461863 448353168 455177340 460899979
38235 460899979 449287910 438626341 458003351 490613899 490215707 452157101 422275341
38228D22275341Q136218K6442317J7547456J0651196J4232348J1867971J462867
38221E12615714m126264o500528j4501070j7224342j068363J5098082O98747l4840443
38213D50151533m9444142k7921050J187327J0923574N015846k189860l458757
38206C84264471P819727L0588481L8659850M943028m8831400o3684976k0514222
38199C33244959K9174771L1960838O89041j5397107m055215L060130j3833503
38192C64843914l5288212l4209934j0562899J3079362J7146161O22695k1657443
38185B93973644l3733435l1829084k1976344q235700O637214J1606624l170720
38178B13272199k3713365k0720952R259189L3296417K7561684R962608N772415
$$ plain form
38228 422275341 430411559 456853876 474401332 485052528 499284876 511152847 512615714
38221 512615714 508489450 501988922 487487852 470263510 469195147 484293229 484991976 450151533
38213 450151533 400707391 372786341 373973668 384897242 389913088 387723228 384264471
38206 384264471 392084198 422672679 461332529 466275557 417444157 353759181 333244959
38199 333244959 362419730 394380568 395069609 379672502 375617287 378677417 364843914
38192 364843914 329555702 295345768 284782869 297862231 315008392 315631087 293973644
38185 293973644 260240209 228411125 206434781 198199081 204836295 216442919 213272199
38178 213272199 189558834 168837882 178097071 211393488 238955172 248917780 254690195
38171B54690195M664954j5295702l8476426k8683300R082072K7200514L457803
38164B16640110k8410631l1175749j2429014N15850L831861Q425636J1073729
38157A68471792L713079m417157j843870J500670o248173r487008J1486343L7619175
38149B00794851L0803661n252273k5543110j2294983k14292j5416383l0146222
38142A42731249r347472K9285540M0624443J7902357o801936j6931392k5180347
38135A72282442l4507373k5983361M734323L1742781L4185529K1692733J0437765
38128B14584839k474201k3136071l9001357l3668944j1844225P519872J4222392
38121A26202305J0150487L75791o252118N96346J5939867J7670087k514108k0185880
$$ plain form
38171 254690195 259355149 244059447 205583021 176899721 185981793 213182307 216640110
38164 216640110 188229479 157053730 144624716 145140566 148972427 157398063 168471792
38157 168471792 172184871 167767714 165923844 167424514 161176341 151689333 163175676 200794851
38149 200794851 231598512 226346239 200803129 188508146 188293854 172877471 142731249
38142 142731249 133383777 162669317 203293760 221196117 214394181 197462789 172282442
38135 172282442 137775069 111791708 116526031 148268812 182454341 204147074 214584839
38128 214584839 212110638 188974567 149973210 116304266 104460041 111979913 126202305
38121 126202305 136352792 136728583 130476465 131072811 147012678 164682765 162168657 141982777
38113A41982777j0951573J0328135R836376j2738928k3220717o335892J1062527
38106A19962705J888978k1622189k8484291j2235061N785566P617705l304546
38099F9608867j1501055n439094J2761070K6385526J8498006o221352k2222154
38092H1869814j4012204L336969O508975k554357k489778J2824243K5128867J9574064
38084A30186593L917445o967715j1083672j3625642j2514262k745581J0074678
38077I7241844J2830409J302419j4130918j8896078n915760J9224370L8544702
38070A30200988L2495382Q14635l0489090l5098663j8334403r189143j9109213
38063E1290493k6304295r681993J8167627K7860224J2894812n648931r568701
$$ plain form
38113 141982777 131031204 141359339 151195715 138456787 115236070 108900178 119962705
38106 119962705 121851683 100229494 71745203 59510142 65295708 72913413 69608867
38099 69608867 58107812 52668718 65429788 91815314 110313320 104091968 81869814
38092 81869814 67857610 71194579 77703554 75149197 72659419 85483662 110612529 130186593
38084 130186593 134104038 127136323 116052651 102427009 89912747 87167166 97241844
38077 97241844 110072253 111374672 97243754 78347676 72431916 91656286 130200988
38070 130200988 162696370 163511005 133021915 97923252 79588849 70399706 51290493
38063 51290493 24986198 15304205 33471832 61332056 74226868 68577937 59009236
38056E9009236j095076R307678J5909174J5476957O224749o211720j2381249j1610766
38048G4628983j0975794j1081475n732617L005042M757151j071328m007386l704707
38040D5817869j2446682k8404984k9199639o828828J3234078Q583173m677028
38033a3922041N98884J7069023J7977761O227703R173305K6381599K4601243n417978
38025H2689499k6849840j1880607J4391814J3002239j0924328k1861286r990609
38018B8576882P47227m740833j4230899j5212472j2890839j2371141m774854J5495691
38010a9401238L4016188L1430143Q812690j3240981j8400579r730352j751129
38003A1734742k963401q064745o221262M613518J4478174J4161552P512302N950628
$$ plain form
38056 59009236 57914160 67221838 83131012 98607969 104832718 98620998 86239749 74628983
38048 74628983 63653189 52571714 46839097 49844139 54601290 53529962 49522576 45817869
38040 45817869 33371187 4966203 -24233436 -31062264 -17828186 -9245013 -13922041
38033 -13922041 -13323157 3745866 21723627 27951330 37124635 63506234 88107477 82689499
38025 82689499 55839659 43959052 58350866 71353105 60428777 38567491 28576882
38018 28576882 29324109 24583276 10352377 -4860095 -17750934 -30122075 -34896929 -19401238
38010 -19401238 14614950 46045093 54857783 41616802 23216223 13485871 11734742
38003 11734742 8771341 706596 -5514666 -901148 13577026 27738578 35250880 41201508
37995D1201508J2299657J6390328Q313074q537774k0741196j9479490r228283
37988B0217824q48788K785213R926364K4959309L5036771K2673490o819684k3791242
37980H4139257r672978J5802239J7386116r546099l2307908k3742654L276328
37973D5334301J4721063j30940j7742810j3940231N222147J5340941Q575157J101024
37965E8480652L936950M145827j1280446k6717079j7117947Q644984J3656412
37958C3749353j0699823k5764729k566770L0794149L0362353L825641m930679
37951E4769495J0805781J1437434j8098369l7066205j2183352K7345936L2026518
37944F9037238J748067k3917598k6150765j8381182q907114O412483J6534029
$$ plain form
37995 41201508 53501165 69891493 78204567 69666793 48925597 29446107 20217824
37988 20217824 19369036 22154249 32080613 57039922 92076693 114750183 107930499 84139257
37980 84139257 74466279 90268518 107654634 98108535 65800627 42057973 45334301
37973 45334301 60055364 59924424 42181614 28241383 33463530 48804471 57379628 58480652
37965 58480652 62417602 66563429 55282983 28565904 11447957 20092941 33749353
37958 33749353 23049530 -2715199 -5281969 25512180 55874533 59700174 54769495
37951 54769495 65575276 77012710 58914341 21848136 9664784 37010720 69037238
37944 69037238 70785305 46867707 20716942 2335760 -6571354 -158871 16375158
37937A6375158J521668k7045221k9989648J928772K8777483J8590966p001772
37930C157406r272889J0699416K2200070J5136017P011860O726986K724983j1051842
37922D7332007k2386475j9566719n515284J0131416J8510336J1248542j0875728
37915B8878095k9153346k4959092p232697j622226r941189n397210K2376306M3406749
37907A6355390K7856900q932850k6678697j4380365K109803L418109O70910R417801
37899I837001K1307619J6939636l697266j8948550j1998837J0685053K8764437
37892E2889093K8470029J0570615j5143038l5087648l4391080p262810K8561644
37885B8606805L8826573Q291245l5171125m7576004j9707791J4983653K5097883
$$ plain form
37937 16375158 17896826 -9148395 -39138043 -37209271 -8431788 10159178 3157406
37930 3157406 -6115483 4583933 26784003 41920020 48931880 55658866 58383849 47332007
37922 47332007 24945532 5378813 -136471 9994945 28505281 39753823 28878095
37915 28878095 -275251 -25234343 -32467040 -34089266 -44030455 -49427665 -27051359 16355390
37907 16355390 44212290 35279440 8600743 -5779622 -3669819 -251710 419200 9837001
37899 9837001 31144620 48084256 44386990 25438440 13439603 24124656 52889093
37892 52889093 81359122 91929737 76786699 41699051 7307971 45161 28606805
37885 28606805 67433378 75724623 40553498 -7022506 -26730297 -11746644 13351239
37878A3351239J4423667K751833n355106j5459786k2173140j5154103J001875
37871b6613521J3183619K1666496L5079332M5640297L2626997m589425l7653132
37864G9340663m2994593k8480081j5704853j0074515k746413P605606J1833911
37857a220275O804660J160691K465547P532737Q722849M199575j541239m395260
37849B3729285m481947l467185p34065M982732J0300116P969126l523150j4448237
37841B0326675j3646385k664649N996390M975448j29671j326485m38784n078610
37833H013929j4669062j7054760k621244K0608465L1980501K1135677P40604r838640
37825C8295470q586765p669575r360107k302612J4087677K0454865N113737j4613565
$$ plain form
37878 13351239 27774906 30526739 25171633 9711847 -12461293 -27615396 -26613521
37871 -26613521 -13429902 8236594 43315926 88956223 121583220 116993795 79340663
37864 79340663 36346070 7865989 -7838864 -17913379 -20659792 -13054186 -1220275
37857 -1220275 5584385 6745076 9210623 16743360 25466209 29665784 28124545 23729285
37849 23729285 19247338 15780153 15046088 20028820 30328936 38298062 34774912 20326675
37841 20326675 6680290 4015641 10012031 14987479 14857808 13531323 13092539 8013929
37833 8013929 -6655133 -23709893 -26331137 -5722672 26257829 47393506 48134110 38295470
37825 38295470 29708705 22039130 12679023 10376411 24464088 44918953 50032690 35419125
37817C5419125j5447064q86395Q055507N620352K899713K353560m720976j5406460
37809A7887362j4226679K04938R573084M233643k993180o26608L170911j365563
37801A5857908n718118L303580K0870641K9360932K0110821K44479j6223068j7753700
37793E0053475l862276J0139960O556913j1453680k1428805j1713301L582895
37786B1875181O918484j14526o052344o788242k522351P879471J7056179R032626
37778D7284478j5897711l1318304j8301887M703910P509828p328846j1470842
37771b4819374L245446J3503401J863228j8685127k5643777j4477902M223128
37764f0790977K1416293L2781791L3370640J9576503l974600k3592209k4848050
$$ plain form
37817 35419125 19972061 19085666 27141173 32761525 35661238 38014798 33293822 17887362
37809 17887362 3660683 3865621 13438705 17672348 14679168 14052560 17223471 15857908
37801 15857908 10139790 13443370 34314011 63674943 83785764 84030243 67807175 50053475
37793 50053475 46191199 56331159 62888072 51434392 30005587 18292286 21875181
37786 21875181 28793665 28679139 22626795 15838553 13316202 21195673 38251852 47284478
37778 47284478 31386767 68463 -18233424 -13529514 -6019686 -13348532 -24819374
37771 -24819374 -21573928 -8070527 -6207299 -24892426 -50536203 -65014105 -60790977
37764 -60790977 -39374684 -6592893 26777747 46354250 42379650 18787441 -6060609
37757f060609n346042J9437285K8386231J5860779m630328j8451100k1649509
37750G546707j3942580L678354J8188596J0779730j3882543k4124149l796572
37743a5552457K1258566K0865982M684258J33835M113110o081681k4377483k1230356
37735a6186226L351793J5136248J589220r150031M17651P370650p226721k0650666
37727b5348082o763369J6377425J4140507p581900j1763964J0602993K7733924
37720A7397534J6389386o854480j3913843k521404Q235156O159481l849615j2360700
37712H681515j7055316k0062306j9162674q018965J2239441K7325011K4093897
37705H040603Q131829l334060m693756m694966n805799J166520J5871179K0221565
$$ plain form
37757 -6060609 -11406651 8030634 36416865 52277644 47647316 29196216 7546707
37750 7546707 -6395873 -2717519 15471077 26250807 12368264 -11755885 -15552457
37743 -15552457 5706109 26572091 31256349 31390184 35503294 29421613 5044130 -16186226
37735 -16186226 -12834433 2301815 3891035 -5258996 -4841345 2529305 -4697416 -25348082
37727 -25348082 -32111451 -15734026 -1593519 -9175419 -20939383 -10336390 17397534
37720 17397534 33786920 26932440 13018597 10497193 18732349 24891830 21042215 8681515
37712 8681515 -8373801 -28436107 -47598781 -55617746 -43378305 -16053294 8040603
37705 8040603 16172432 12838372 8144616 3449650 -2356149 -1189629 14681550 34903115
37697C4903115L114086k1089758l1123186k3239199n993084J4218516K8383679
37690h25831K2058086l526731k1564657j2666911N065693M156605o547508K484548
37682a1366706K6297460K6391413o270388k9635916j2350825J6711418J1454738
37675B1231194k2196359l6807779j2855541J9109376K6722145J3444004j106620
37668G540420j0491155j5421178r785164P437265J9868544J2956557l014993o956424
37660B133872L167906J2752602J6229770J9161868J8882991P720337m247644L081033
37652G8882735K3544516K4676787m116550l1809438l2038428k0876648k3244204
37645A5018770k8247582j2469734J2193222J4796791j521750n241924Q468142
$$ plain form
37697 34903115 38017201 16927443 -14195743 -37434942 -43428026 -29209510 -825831
37690 -825831 21232255 17705524 -3859133 -16526044 -11460351 -7303746 -13851254 -11366706
37682 -11366706 14930754 41322167 35051779 5415863 -6934962 9776456 21231194
37675 21231194 -965165 -37772944 -50628485 -31519109 -4796964 8647040 7540420
37668 7540420 -2950735 -18371913 -28157077 -20719812 -851268 12105289 9090296 2133872
37660 2133872 5301778 18054380 34284150 53446018 72329009 80049346 75801702 78882735
37652 78882735 102427251 127104038 122987488 91178050 59139622 38262974 15018770
37645 15018770 -13228812 -25698546 -13505324 1291467 -230283 -5472207 2995935
37638B995935J1715801m210192j4251242o378857j161670r721563j2205361K208367
37630c1008782J2136689M759982K898983K2199294L5751401J6646225j3459973
37623D9923819j7119480J296306J0493988M251893k725423j2326926l1407991
37616B386186l7946795q495563L0204408L0347173K36852n417977K2465742K7963372
37608F1743398j5935060n4310333l0431326K7542427M8599346J7698823j7520185
37601C7387090k2748588j0977805k911269L534726J4203040K0286292J4151744
37594E2925230M793333L407346M589665n070908k3827816l2230245j8309005J967955
37586a1754445J846829j7474509k2772977M104881L3248120K5747081p294195
$$ plain form
37638 2995935 14711736 10501544 -3749698 -10128555 -11290225 -21011788 -33217149 -31008782
37630 -31008782 -18872093 -14112111 -11213128 10986166 46737567 63383792 49923819
37623 49923819 32804339 34100645 44594633 48846526 46121103 33794177 2386186
37616 2386186 -35560609 -44056172 -13851764 16495409 16732261 11314284 33780026 61743398
37608 61743398 45808338 -8501995 -38933321 -11390894 37208452 54907275 37387090
37601 37387090 14638502 3660697 749428 4284154 18487194 38773486 52925230
37594 52925230 57718563 61125909 65715574 60644666 36816850 4586605 -13722400 -11754445
37586 -11754445 -9907616 -27382125 -50155102 -46050221 -12802101 12944980 5650785
37579E650785j9995482j561232J1956751L017130J919228K7416885M3169328J2877879
37571H4451272l4765564m3867648j3216163R014909J275460j0649591o956731
37564a4714056Q65511M389657J2716242K0912959P027604k2295281k4887449J3505140
37556b479673M6212985K8148514j8567042l7822639j6267018J1678435K0816764
37549C1720326J7291611J0155601m37126n354374Q338321K8380207K4625242o124188
37541A08595620l1623505l1092643k1185537j9877744j4793144P321389K4826438
37534B2170874R824580k0733159k1105333J5703529M2392494K1643868k2813399
37527D7083454m0324423j9863052K977277j063688j9663115k2146591j256861
$$ plain form
37579 5650785 -14344697 -15905929 -3949178 -932048 987180 28404065 71573393 84451272
37571 84451272 49685708 5818060 -7398103 1616806 2892266 -7757325 -14714056
37564 -14714056 -13848545 -9458888 3257354 24170313 31197917 8902636 -15984813 -2479673
37556 -2479673 43733312 71881826 53314784 15492145 -774873 10903562 31720326
37549 31720326 49011937 59167538 58730412 53376038 61714359 90094566 114719808 108595620
37541 108595620 76972115 45879472 24693935 4816191 -9976953 -2655564 22170874
37534 22170874 31995454 11262295 -9843038 5860491 48252985 69896853 47083454
37527 47083454 6759031 -13104021 -10126744 -11190432 -30853547 -53000138 -54256999
37520e4256999K0453642K0890145M846956l231427J0004577K8929350K6905643
37513E4541887M66956k4067688k3498795p780131m407127j7645752k2222944k782326
37505d7395920J9445475J5451783q448636j9203015n748879O655591j473339j2402773
37497e3119713j125871K1693284K4891769P174959R2466J6407197K7269305P603333
37489E0886729k1430455k1633156N621951K2049160P829159j4654470j8113950
37482A0554968o767280j942286p786957q716574M800175K2042118K5017352R028005
37474D6229521j1929588j9220071q753360N512592Q452701l0722r160042j1518414
37466d17383o547145L597430J2394682R804724l454982r270318N060294K3148249
$$ plain form
37520 -54256999 -33803357 -12913212 -8066256 -11297683 -1293106 27636244 54541887
37513 54541887 55008843 30941155 7442360 -337771 -4744898 -22390650 -44613594 -47395920
37505 -47395920 -27950445 -12498662 -20947298 -40150313 -45899192 -39243601 -40716940 -53119713
37497 -53119713 -54245584 -32552300 -7660531 -485572 -393106 16014091 43283396 50886729
37489 50886729 29456274 7823118 13445069 35494229 43323388 28668918 10554968
37482 10554968 3787688 1845402 -5941555 -14658129 -9857954 12184164 37201516 46229521
37474 46229521 34299933 15079862 6326502 11839094 20291795 20261073 11101031 -417383
37466 -417383 -6964528 -3367098 9027584 18832308 15377326 6107008 11167302 34315551
37458C4315551J7414094j2102357l6990630l7852054k1398853l59690J9231762
37451c7742177K7581567J4651097q101514j4875450l012688L193892n117455p112636
37443c0535364N845581J0337030m375051q534319J8513914M4005125K8246636
37436F3503552j0690478k4873079r606494Q30520l033067K47245J0964036N480206
37428C2822441j1333788n829225K1259635K5231827r572376l8044989k3448708
37421h915183P119912J1327520k917850k209456J0740507O312441j5828692k3475624
37413a7846425l369718J8640581J5283257p082926j9639498o666411J5579946
37406e101194J5990923j1834936l3929766j6099842K6001220M4183307K4834754
$$ plain form
37458 34315551 51729645 39627288 2636658 -35215396 -56614249 -56973939 -37742177
37451 -37742177 -10160610 4490487 -3611027 -18486477 -21499165 -18305273 -23422728 -30535364
37443 -30535364 -24689783 -14352753 -18727804 -27262123 -8748209 35256916 63503552
37436 63503552 52813074 27939995 18333501 19164021 16130954 16378199 27342235 32822441
37428 32822441 21488653 15659428 36919063 62150890 52578514 14533525 -8915183
37421 -8915183 -1795271 9532249 6614399 4404943 15145450 21457891 5629199 -17846425
37413 -17846425 -21216143 -2575562 12707695 5624769 -14014729 -20681140 -5101194
37406 -5101194 10889729 -945207 -34874973 -50974815 -24973595 19209712 44044466
37399D4044466K999505J542944p16901j8928007k4938638K611339K8012619P415562
37391D2042889l6033483m0085465L879950L9432726K8413189k959740j3532991
37384B1157075k584338L679270o637136k2895034k9473214j9538243r64598R022625
37376d8233593N052763L349183J5090937K2030315L977469k0390803j5413003
37369c4536732J2464836J8376929j1131617l3346319j3039542K4860321L3412111
37362b940013Q436010j5266560j6126641m041791O301918J3058312J6850327J2947865
37354A9219427L15632j1968540j3024097j881884J0504184J0912801k484701j6924343
37346e331521j8767270p980731N316396J3433758J3232154L150282j0846217j3909724
$$ plain form
37399 44044466 47043971 48586915 47870014 28942007 4003369 6614708 34627327 42042889
37391 42042889 6009406 -34076059 -30196109 9236617 37649806 34690066 21157075
37384 21157075 18572737 22252007 15614871 -7280163 -36753377 -56291620 -57256218 -48233593
37376 -48233593 -43180830 -39831647 -24740710 -2710395 1267074 -19123729 -34536732
37369 -34536732 -22071896 -3694967 -14826584 -48172903 -61212445 -36352124 -2940013
37362 -2940013 5495997 -9770563 -25897204 -29938995 -23637077 -10578765 6271562 19219427
37354 19219427 19535059 7566519 -5457578 -7339462 3164722 14077523 11592822 -5331521
37346 -5331521 -24098791 -32079522 -26763126 -13329368 -97214 3053068 -7793149 -21702873
37338b1702873j106378R696464O19402j7810668k1148721o974332P644093J8137457
37330c2645556L1752243L7618214J4037423k7844116m4438268j8233005J6907183
37323b2845882K5836887J4974497M548884p852362k6563154l0478240l354086
37316d5733456K9121482L0279229O142008q453642n286049n068095j1898395p544234
37308a8441152Q407220J3655940M758292M375566J6019144J1007464k0223401
37301A9559073m0319711j6977961K5351366L8898758J8355140j978777m907112
37294C7980776o152930j4532582j3466743O214369K3844352J7678950k742353
37287D8823839j2475069p573177n687184j5331668k3505595j6312290J698564
$$ plain form
37338 -21702873 -22809251 -13112787 -12493385 -30304053 -51452774 -58427106 -50783013 -32645556
37330 -32645556 -893313 36724901 50762324 22918208 -21520060 -39753065 -22845882
37323 -22845882 2991005 17965502 22514386 14662024 -11901130 -42379370 -45733456
37316 -45733456 -16611974 13667255 19809263 11355621 6069572 1001477 -10896918 -18441152
37308 -18441152 -10033932 3622008 8380300 12755866 28775010 39782474 19559073
37301 19559073 -20760638 -37738599 -12387233 26511525 44866665 42887888 37980776
37294 37980776 31827846 17295264 3828521 10042890 33887242 51566192 48823839
37287 48823839 36348770 28775593 23088409 7756741 -15748854 -32061144 -30362580
37280c0362580J4437694J3004082K657220n319483n846325m767787j0111410j8320997
37272d4629586j5633832K252845J9956842K0998913R388652N07065k363737n806691
37264a5329529o487889M193686J7209878J3792882K9266M312772K9706746M0096175
37256H7523987J3269437k1698738k7127774j0783763l927623p567951j477107
37249B8210468Q056193l914405k9680960l2445611o294483J1553360j23334j6567929
37241d1206701j3006539j972206k058876l319883Q654622K1181925J5976864J540309
37233a4210485l530914k430353q065830j3047675m7285K5009427L5069437J6413369
37225C5159691j5025553l0594579j4588687J9671058L5470697R231789l4109857
$$ plain form
37280 -30362580 -15924886 -2920804 -263584 -5583067 -11429392 -16197179 -26308589 -44629586
37272 -44629586 -60263418 -58010573 -38053731 -17054818 -7666166 -7159101 -9522838 -15329529
37264 -15329529 -21817418 -17623732 -413854 13379028 13408294 17721066 47427812 87523987
37256 87523987 100793424 79094686 51966912 41183149 37255526 29687575 28210468
37249 28210468 36266661 32352256 2671296 -29774315 -36068798 -24515438 -24638772 -41206701
37241 -41206701 -54213240 -56185446 -58244322 -61564205 -52909583 -31727658 -15750794 -14210485
37233 -14210485 -17741399 -20171752 -28237582 -41285257 -41332542 -16323115 18746322 35159691
37225 35159691 20134138 -10460441 -25049128 -5378070 30092627 39324416 5214559
37218E214559m3718122q446044K7367718K6620549N805323l299608m576168j6108423
37210a1140216k5362772q672901K0636074K7137742Q902925k472022N332941J1700483
37202B6062254M388272k237721K438589Q297519P351724P137606J1475951R618684
37194G4532878o547723l0621012n0075020n1568256k2483664L0744795P0042636
37187A4024634N9142862J0985171k4744492k3600646q429497n993088j2377563
37180I007381j2407165o032317K75267P730834J5496966J2486571p088737l0298005
37172a0829205l7275384k0285513J0324336L1399651K3643145l910251j4920622
37165b1853843J0099339M1613892L8559528O876345j3261679j0936112j2789981
$$ plain form
37218 5214559 -38503563 -46949607 -19581889 7038660 12843983 9544375 4968207 -11140216
37210 -11140216 -36502988 -45175889 -24539815 2597927 11500852 9028830 14361771 26062254
37202 26062254 30450526 28212805 30651394 38948913 46300637 53438243 64914194 74532878
37194 74532878 67985155 37364143 -12710877 -64279133 -86762797 -56018002 14024634
37187 14024634 73167496 84152667 59408175 35807529 27378032 21384944 9007381
37180 9007381 -3399784 -9432101 -9156834 -1426000 14070966 26557537 19468800 -10829205
37172 -10829205 -48104589 -68390102 -58065766 -26666115 -3022970 -6933221 -21853843
37165 -21853843 -11754504 29859388 68418916 75295261 62033582 51097470 38307489
37158C8307489k6916598k5611664K267962K5283347J7723696k517650q736819
37151A9799763n935630j0097785j5041750q463385J050656Q0080m324179J159187
37143b1773043J2728327J9812402K1799316J8085496K043645j8986799k1970632
37136A1738712m300877N324919p792478j8554937o152873Q940057L639753m455798
37128a1613522Q654860K4698501J3546375j1225385j5330873l198451l219342
37121B312163r217462O613949L0982597K1236349j8216455l3109623n078294J9688365
37113A5211589R048676n253063J0516336L0647091J4771474k2615900l6146225
37106A6179978k0321277q462877j2600890j0377807Q003723K0369089J0553808
$$ plain form
37158 38307489 11390891 -14220773 -11952811 13330536 31054232 28536582 19799763
37151 19799763 13864133 3766348 -11275402 -19738787 -18688131 -18608051 -22932230 -21773043
37143 -21773043 -9044716 10767686 32567002 50652498 52696143 33709344 11738712
37136 11738712 7437835 12762754 4970276 -13584661 -19737534 -10797477 -7157724 -11613522
37128 -11613522 -2958662 21739839 35286214 24060829 8729956 5531505 2312163
37121 2312163 -6905299 -291350 30691247 51927596 33711141 601518 -4476776 15211589
37113 15211589 24260265 19007202 29523538 60170629 74942103 52326203 16179978
37106 16179978 -4141299 -12604176 -25205066 -35582873 -27579150 -7210061 3343747
37099C343747n099604n089045M932220N843072k067749j182113J1078224J2949344
37091B4708096r107981l3595047k8670473J545149J8841482M262667j4641870
37084c6657977n018564K4131561L8947979K8900956J0473663o234406k3344724
37077C1198488l3098577k3309006n577126n106969j8005290j2786310J6536000
37070e0148790L4503193J8154189o258321m389245J5979074K3943568J3016635
37063D4800303p53420j1887269k4332044k7581648p794253J9833740K2255197
37056A4540606l281279k1151014p580973J6150650J6813055l924061j7218797
37049e651813j0592101N55279L516354O042677J4916890J7948845N172554p529074
$$ plain form
37099 3343747 -1755857 -6844902 -1912682 3930390 1862641 680528 11758752 24708096
37091 24708096 15600115 -17994932 -46665405 -45120256 -26278774 -22016107 -36657977
37084 -36657977 -41676541 -17544980 21402999 50303955 60777618 54543212 31198488
37077 31198488 -1900089 -25209095 -30786221 -35893190 -53898480 -66684790 -50148790
37070 -50148790 -15645597 2508592 -3749729 -8138974 7840100 31783668 44800303
37063 44800303 44046883 32159614 7827570 -19754078 -27548331 -7714591 14540606
37056 14540606 11259327 -9891687 -17472660 -1322010 15491045 11566984 -5651813
37049 -5651813 -16243914 -15688635 -12172281 -6129604 8787286 26736131 31908685 24379611
37041B4379611j316851Q110891j0587810m6333983m6212098P709261N9280921
37034d970058M8543629p096828m2169407l3061911j1686898r48172J0222436K5095743
37026a6071466K3886065L841123q708067j969596M740986J922484N565316J5790795
37018B8997640N941855k4014847l1124269K027896K9346787J1614778j9452910
37011C336930j5731351Q756816J0550622n113881l025071R111959m012342l0338889
37003b6465207k2875625J4956928K8285944K888542j2696766N085660J4891448
36996D070924j1134124l3272629j1819088K3601225K3006362m273405j1795293
36989b1616028P747523J9947141R050471m698782m285571L446696O529748J309183
$$ plain form
37041 24379611 23062760 31173651 20585841 -25748142 -71960240 -64250979 -4970058
37034 -4970058 43573571 36476743 -5692664 -38754575 -50441473 -51389645 -41167209 -16071466
37026 -16071466 7814599 11655722 2947655 978059 5719045 7641529 13206845 28997640
37018 28997640 34939495 10924648 -20199621 -18171725 11175062 22789840 3336930
37011 3336930 -12394421 -3637605 6913017 1799136 -1225935 7886024 3873682 -26465207
37003 -26465207 -49340832 -34383904 -6097960 -3209418 -15906184 -10820524 4070924
36996 4070924 -7063200 -40335829 -52154917 -28553692 -5547330 -9820735 -21616028
36989 -21616028 -13868505 6078636 15129107 10430325 6144754 9591450 16121198 17430381
36981A7430381j1450362k4938735k6225967j2939459K39525M978128J2257062
36974d0649427K6160302K7418951O197485j2145765m253675R609026k144377k5620254
36966a5427734k0583359J1707704K6449077M468751j9981080j3299889J1800462
36959a4866068K2619258J0930585p542200j8119537j5276311o19075J4334702
36952h538646J4737456O7261j4858656j9316938j4821438m831707O935097R706657
36944c0920914k119258j1739645j04108J7881527R497778j9649146k4438118J0568412
36936e1023472M0996784K7928436k955596m219859J9444185K4897565J923139
36929E6991182j6799832j3769984r242190j7958721k2819122p902250J2737086
$$ plain form
36981 17430381 5980019 -18958716 -45184683 -58124142 -57884617 -52906489 -40649427
36974 -40649427 -14489125 12929826 19127311 6981546 2727871 12336897 10192520 -15427734
36966 -15427734 -36011093 -24303389 2145688 6614439 -13366641 -26666530 -14866068
36959 -14866068 7753190 18683775 11141575 -6977962 -22254273 -22873348 -8538646
36952 -8538646 6198810 6266071 -8592585 -27909523 -42730961 -47562668 -40627571 -30920914
36944 -30920914 -33040172 -44779817 -44883925 -27002398 -17504620 -37153766 -61591884 -51023472
36936 -51023472 -10026688 17901748 14946152 10726293 30170478 55068043 56991182
36929 56991182 40191350 26421366 17179176 -779545 -23598667 -31500917 -18763831
36922a8763831J8547345J2220833P122054L003386o248051j3877318q768498N364731
36914a399349J5972870K0364410K2666855J8323632L70272k0353481k1204425
36907C4740784O70236J9673804J4660895l088313q592962M14419M501252m305787
36899E8674328j2471267j1617972j2325441j9733975j7507766L580350J9990923
36892H589180P429400j4217545n101891K8507549L5464529k453676l7673948k6751823
36884f208225M981864N865396k2782056l4607643j1146325J8524182K7888929
36877a7483878K1472692J0105595m699450j4298988m940752J3887107J4380012
36870A8422338n495477j3765115O210177K8618164K5236758N166892o068889l482349
$$ plain form
36922 -18763831 -216486 12004347 19126401 22129787 15881736 2004418 -6764080 -1399349
36914 -1399349 14573521 34937931 57604786 75928418 76298690 55945209 34740784
36907 34740784 35411020 55084824 69745719 66657406 58064444 58478863 62980115 58674328
36899 58674328 46203061 34585089 22259648 2525673 -14982093 -11401743 8589180
36892 8589180 16018580 1801035 -3300856 25206693 60671222 58217546 20543598 -6208225
36884 -6208225 -1226361 4639035 -18143021 -52750664 -63896989 -45372807 -17483878
36877 -17483878 3988814 14094409 9394959 -4904029 -9844781 4042326 18422338
36870 18422338 12926861 -838254 5371923 33990087 59226845 64393737 58324848 54842499
36862E4842499K874342R559299J3748256L702777k2262644m1794123l3755563
36855a3085157n051102K2976396L8355442L4481298N436011l4399894m9778114
36848a065120k8568341l871273n647964j5801970m930091J2401436L337465k1681886
36840f5827744k3628398q89505J1759124O598410J1169009K9354039K9775394
36833a689671N687846p204325P023781J5170911n343429k4470115j1179497J3560821
36825h443678J4011844l147577q569978m15836M238031N631418J1090074Q725500
36817B3119798j1238641k7531894j7731433J021902j71282j1917701o620564Q804311
36809d2265504P807254k348101N316778J9455203N069114k5657708k1153417K1332927
$$ plain form
36862 54842499 57716841 67276140 81024396 84727173 62464529 20670406 -13085157
36855 -13085157 -18136259 4840137 43195579 77676877 83112888 48712994 -1065120
36848 -1065120 -29633461 -33504734 -39152698 -54954668 -59884759 -47483323 -44145858 -65827744
36840 -65827744 -89456142 -90345647 -78586523 -71988113 -60819104 -31465065 -1689671
36833 -1689671 3998175 -3206150 3817631 18988542 13645113 -10825002 -22004499 -8443678
36825 -8443678 5568166 2420589 -6149389 -6565225 -2327194 3304224 14394298 23119798
36817 23119798 11881157 -15650737 -33382170 -32360268 -32531550 -44449251 -51069815 -42265504
36809 -42265504 -34458250 -36806351 -31489573 -12034370 -6965256 -32622964 -53776381 -32443454
36801c2443454M1035969R723587k1489717p491833J7280575J567286l2691391
36794b4508978k5552960K2164008M8852755K3425177j8217549l1590523j4270256
36787a9698326R790603K1056657J0556054j5997026l2573812j5761285K1673475
36780b0953660M3050155L5325285J8546906O310913j1098415l4578752l9882769
36773c280337j3440167J9768321K7387170J2208802R99440L158865M520801l112793
36765D8210102r422436n311625J753588n04275j0725220j4583717k932236J4370611
36757B0854792J7224454N96552j5314667r995107P371943R412284q232049j9113836
36749B804366p337272O670837m10060j5277772q463360J6823518K7081557Q954687
$$ plain form
36801 -32443454 8592515 18316102 -3173615 -10665448 6615127 8182413 -24508978
36794 -24508978 -50061938 -27897930 20954825 44380002 26162453 -5428070 -19698326
36787 -19698326 -9907723 11148934 21704988 5707962 -26865850 -42627135 -20953660
36780 -20953660 22096495 57421780 75968686 82279599 71181184 36602432 -3280337
36773 -3280337 -16720504 3047817 30434987 42643789 43643229 46802094 51322895 48210102
36765 48210102 38787666 33476041 35229629 34725354 24000134 9416417 6484181 20854792
36757 20854792 38079246 38675798 23361131 13366024 20737967 30150251 21918202 2804366
36749 2804366 -4532906 2137931 1727871 -13549901 -22013261 -5189743 21891814 30846501
36741C0846501j2527620j3743711l769646j077651j192710J0074573K4407493
36734C3017229J8236837r177155k8175768j7066190Q368493J6459590J318824
36727B2981860j2827477p661816N096650L751724j1004778j9292894j3629468
36720c2586199q235507j1632337r076301J2413166L5144776K9306066l471344
36713A1862320k7935550k0431912L658777J5945293J1100294M369194N695034
36706D263450J0843232J1849544M974549p284445j4701125o785254J1128641J8709793
36698C2998385O709040q500384q543746R47j109809j0596519j0833985J178908
36690A302837Q042222j28815j1183518j0628760q75095O170484M502715l355952
$$ plain form
36741 30846501 18318881 4575170 805524 -272127 -1464837 8609736 33017229
36734 33017229 51254066 42076911 13901143 -3165047 5203446 21663036 22981860
36727 22981860 10154383 2492567 7589217 11340941 336163 -18956731 -32586199
36720 -32586199 -40821706 -52454043 -61530344 -49117178 -13972402 15333664 11862320
36713 11862320 -16073230 -36505142 -32846365 -16901072 -5800778 -1431584 4263450
36706 4263450 15106682 26956226 31930775 24646330 9945205 3159951 14288592 32998385
36698 32998385 39707425 31207041 22663295 22664242 21554433 10957914 123929 1302837
36690 1302837 9345059 9216244 -1967274 -12596034 -13471129 -7300645 -2797930 -6153882
36682f153882j0013482p218498M226980R420665k750669j8502399j4201728O655787
36674c8537226J4502959j230130j2994209L278666K9184379K9780685M932174
36667B8917298j1508240J1913K0951739K3325195N262578j0646404p414257N137357
36659E4037179J828435k3777986m3329615k5370420J8361937L9829371J6050081
36652C7628982j9539548k4136155k335162J0116807K922399k339885L498733K906003
36644H722174j1864370j9708293l671891J9422285K1028225m25223j9640596j7058923
36636b3196612J289551J4756452J1424029n18957m354303K668089N994968j582236
36628F480981m368317J1879608L0672545K3341267p161860k7644476k2053781
$$ plain form
36682 -6153882 -16167364 -23385862 -19158882 -9738217 -12488886 -30991285 -45193013 -38537226
36674 -38537226 -24034267 -25264397 -38258606 -34979940 -5795561 23985124 28917298
36667 28917298 17409058 17420971 38372710 61697905 66960483 56314079 48899822 54037179
36659 54037179 55865614 32087628 -11241987 -36612407 -18250470 21578901 37628982
36652 37628982 18089434 -6046721 -8381883 1734924 4657323 2317438 5816171 8722174
36644 8722174 -3142196 -22850489 -26522380 -7100095 13928130 13502907 -6137689 -23196612
36636 -23196612 -21907061 -7150609 4273420 3754463 -599840 2068249 8063217 6480981
36628 6480981 2112664 13992272 44664817 68006084 60844224 33199748 11145967
36621A1145967j0013787j0318325j3398822m406251J0355764J8047470K0256932
36614B1668948K0653364J0794085j0451834k1395482p243749R283360l014061
36607B0294631l3259189l9837450j0670865K0767164K5425209J3732357Q273458
36600D725315Q990719M803709j420918k759994q149741k6592776m0267335k2360694
36592h3031715J8079130L8146873J7564356j2620538j5125604K030733N421884
36585b9534881p588758p603926J4133081K8889065J6664570m277937j2433719
36578a752505j6606068k8462305l0097737m597840K3218516J9529161o155O354833
36570c2420100L1913993K7338816j3504645l4553401o144258K5660278J4416589
$$ plain form
36621 11145967 1132180 -9186145 -22584967 -26991218 -16635454 1412016 21668948
36614 21668948 42322312 53116397 42664563 21269081 14025332 23308692 20294631
36607 20294631 -12964558 -52802008 -63472873 -42705709 -17280500 -3548143 4725315
36600 4725315 13716034 18519743 17098825 14338831 6189090 -20403686 -60671021 -83031715
36592 -83031715 -64952585 -26805712 -9241356 -21861894 -36987498 -34956765 -29534881
36585 -29534881 -37123639 -44727565 -30594484 -1705419 14959151 10681214 -1752505
36578 -1752505 -18358573 -46820878 -76918615 -81516455 -58297939 -38768778 -38774933 -32420100
36570 -32420100 -506107 26832709 13328064 -21225337 -27369595 -1709317 12707272
36563A2707272j3734618j0577171J3170593J5311543j09057K687216J6627070
36556C6082848Q90904l7538403m0472991Q604453M9670781L1420100j8215698
36549C0441994m0007068k3002992J10203Q872108R489047J0042098J1686272J4610954
36541B2242616J2713789l897341k4902575j9550496J7672652M3985903K1001427
36534F9265975k7268444m3985095j6309182J4552076J7030367M643629M94877
36527A8424203R15730p672709j9457195j8262453l870873Q536585J0007766N837002
36519e541944M043604N450895O195939N127221O463495J4387003K4507437K4370099
36511H5003749P472048j5270839k4644216j4043696M259431J4381905J2694350
$$ plain form
36563 12707272 -1027346 -11604517 1566076 16877619 16768562 19455778 36082848
36556 36082848 36973752 -564651 -41037642 -32433189 17237592 48657692 30441994
36549 30441994 -9565074 -32568066 -32457863 -23585755 -14096708 -4054610 7631662 22242616
36541 22242616 34956405 31059064 6156489 -13394007 4278645 48264548 69265975
36534 69265975 41997531 -1987564 -18296746 -3744670 13285697 17929326 18424203
36527 18424203 19339933 11667224 -7789971 -26052424 -29923297 -21386712 -11378946 -5541944
36519 -5541944 -1498340 3952555 10148494 15275715 21739210 36126213 60633650 85003749
36511 85003749 92475797 77204958 52560742 38517046 42776477 57158382 69852732
36504F9852732O188049j17530q481570k0249193k6825311j6329468P852778K3495336
36496C5385823J4498554n985356j2117185k874422k779486k0444419k9987148
36489b4303639r521392K1457936K7031155N777618j0017741k750962R497729M889309
36481B2060013j1987147k1977322j7199820l847171R788882J7706492J5725462
36474A0269389N369589n129517q305349l553780M314766Q078542J917728j0471280
36466B490088j4719473k717037J2801249J3818719M284061M441864J7603517K2831076
36458F0834064O527332j7952326l0991694k9068584j6898061L280845K1790440
36451b477984K1277263L723262k164708J7681256L3727110J4070105k2315353
$$ plain form
36504 69852732 76040781 75923251 67441681 47192488 20367177 4037709 11890487 35385823
36496 35385823 49884377 43899021 31781836 28907414 26127928 5683509 -24303639
36489 -24303639 -33825031 -12367095 14664060 20441678 10423937 7672975 17170704 22060013
36481 22060013 10072866 -11904456 -29104276 -32951447 -23162565 -5456073 10269389
36474 10269389 15638978 10509461 2204112 -1349668 2965098 11043640 12961368 2490088
36466 2490088 -12229385 -14946422 -2145173 11673546 15957607 20399471 38002988 60834064
36458 60834064 67361396 49409070 18417376 -10651208 -27549269 -24268424 -2477984
36451 -2477984 18799279 22522541 20357833 38039089 71766199 85836304 63520951
36444F3520951l0693558r161193J740780j1219757j3022323J4947293L5652454
36437E1764647J3468742k5312595l0082324r17057J8696143J1886051L993292
36430D3496899Q524716M757739j7229204l0360134j3473992J0962197J1244888
36423A7923109m363867n458535Q314176Q695240j1890390k7643880k1795492j0813838
36415d7033477j2897607j7791962p597342J0850134J7826192J3768283J5177902
36408b7697877K1751181J4629114p906235j9009945j815859K1258497J8994644
36401B0203520k663754j1443874O05597Q006603k063237o415867J3501808L3348338
36393E3079134J6728993k9209649n9237593m7458299j2347448J5650915K5177619
$$ plain form
36444 63520951 32827393 23666200 25406980 14187223 1164900 16112193 51764647
36437 51764647 65233389 39920794 9838470 8921413 27617556 39503607 43496899
36430 43496899 52021615 56779354 39550150 9190016 -4283976 6678221 17923109
36423 17923109 13559242 8100707 16414883 25110123 13219733 -14424147 -36219639 -47033477
36415 -47033477 -59931084 -77723046 -85320388 -74470254 -56644062 -42875779 -27697877
36408 -27697877 -5946696 8682418 776183 -18233762 -20049621 1208876 20203520
36401 20203520 17539766 6095892 6701489 14708092 12644855 6228988 19730796 53079134
36393 53079134 69808127 40598478 -18639115 -66097414 -78444862 -62793947 -37616328
36386c7616328J8875619L767192m406362Q960548L2238456L4933007J1899092
36379F8651224m658751O414758K1184919Q966814j8807375k9079882j9122297
36372C3549410j2790563j5373989r614348N990155J1352315P75793q019461o513886
36364f44574n766063p429577K837528K2218963K4298295K069228j4086669k295949
36356B1201182J6073386J2653626l644746q642852o237115j4140456k2763370
36349e500345q538137J8260868J9740433j1401880l5996572k2925118R213085
36342c7147666K1473102M701750j7523467k2534988q601267J1003291K0347759
36335b8281486J1081217r398829k1385256j1378648J2742196K8234359J9027681
$$ plain form
36386 -37616328 -18740709 -14973517 -19379879 -10419331 21819125 56752132 68651224
36379 68651224 63992473 70407231 91592150 100558964 81751589 52671707 33549410
36372 33549410 20758847 5384858 -4229490 1760665 13112980 13888773 5869312 -644574
36364 -644574 -6410637 -13840214 -11002686 11216277 35514572 37583800 23497131 21201182
36356 21201182 37274568 49928194 46283448 37640596 31403481 17263025 -5500345
36349 -5500345 -14038482 4222386 23962819 12560939 -23435633 -46360751 -37147666
36342 -37147666 -15674564 -10972814 -28496281 -51031269 -59632536 -48629245 -28281486
36335 -28281486 -17200269 -26599098 -47984354 -59363002 -46620806 -18386447 641234
36328F41234r220722l3363662l2760836q515085J7501035K5454136J7393560J0479347
36320a2390993J3297631J5957627M899455j7674471l3144438k5669564o45275
36313e5370028J9585880K0694609J1712469R126475J2459341Q773976k690058
36306B4292664q883596o780011p777564j2983088p805790P429711O872428k0691472
36298b6326718m3350827k5638467J8294079M1975131K9264904Q251806M169675
36291F639583R939061J0114183O726459P594429P254599m863173k4905812l3962090
36283a5462761j7145821J7234008L8613206K3423615j3040230k8939752r020407
36276d338142J4097027P889837j3512890j7478633p030130r830125k5534100k6357057
$$ plain form
36328 641234 -8579488 -41943150 -74703986 -83219071 -65718036 -40263900 -22870340 -12390993
36320 -12390993 906638 16864265 21763720 4089249 -29055189 -54724753 -55370028
36313 -55370028 -35784148 -15089539 -3377070 5749405 18208746 26982722 24292664
36306 24292664 15409068 8629057 851493 -12131595 -19937385 -12507674 -5635246 -26326718
36298 -26326718 -69677545 -95316012 -77021933 -35046802 -5781898 2469908 6639583
36291 6639583 16578644 26692827 33419286 41013715 48268314 43405141 18499329 -15462761
36283 -15462761 -32608582 -15374574 23238632 46662247 33622017 4682265 -4338142
36276 -4338142 9758885 17648722 4135832 -13342801 -20372931 -30203056 -55737156 -82094213
36268h2094213p046810P846815R519396J6072299L0353725K8163965K459637j9187896
36260a3913082j8556482j2191607j4032426r115711J1232996K2039448K501018
36253c2035846k5733107k8226189m257301K3082857M1714162M8431953L3546428
36246E6522957j948244l0424260k7697515n887748P618010P700665M352274k266739
36238G969400j2075015r653864J1105973K4885326R635842j3684624j0740325
36231G442713J2428060K2673852J3430461N010543J426381j0196263k2234636
36224B9981111j2619227J0875357J4504585q028892k5055174j7461424l221711
36217a1025375j681640o744081o705452j681972P699975K1941134K7968175J1748394
$$ plain form
36268 -82094213 -89141023 -81294208 -71774812 -55702513 -25348788 2815177 5274814 -13913082
36260 -13913082 -32469564 -44661171 -58693597 -67809308 -56576312 -34536864 -32035846
36253 -32035846 -57768953 -85995142 -90252443 -67169586 -25455424 22976529 56522957
36246 56522957 54574713 24150453 -3547062 -9434810 -1816800 5883865 10236139 7969400
36238 7969400 -4105615 -13759479 -2653506 22231820 31867662 18183038 7442713
36231 7442713 19870773 42544625 55975086 60985629 62412010 52215747 29981111
36224 29981111 17361884 28237241 42741826 34712934 9657760 -7803664 -11025375
36217 -11025375 -12707015 -19451096 -26156548 -27838520 -20138545 1802589 29770764 41519158
36209D1519158j1504484j2356042N063986Q053069p051282o297576K0351131L5341432
36201G3119392J3595317j7130803k4956369k3083444l4390181m1405131j5676533
36194f9927752K5391874L6363599Q760371k0470658k2203717m866205Q961956
36187c7990532R464312O53893o904522l281666R136725J5272975P878528j198725
36179f969012m66428L695698J735572j180813K913599Q390631O895104J824083
36171A6838434j867360p733387j4489987j0462860L804099Q007151n239261j2927424
36163b4070595J769425J9533891J7511920P509763J0262671J4832351R78693j7954639
36155C0373480j6816962p588014j9709167m1553181l2631675P158366L2200146
$$ plain form
36209 41519158 30014674 17658632 22722618 30775687 23724405 17426829 37777960 73119392
36201 73119392 86714709 69583906 44627537 21544093 -12846088 -54251219 -69927752
36194 -69927752 -44535878 -8172279 588092 -19882566 -42086283 -46952488 -37990532
36187 -37990532 -28526220 -27872327 -34776849 -38058515 -28921790 -13648815 -5770287 -6969012
36179 -6969012 -7435440 -3739742 -2004170 -3184983 -271384 8119247 15014351 16838434
36171 16838434 14971074 7237687 -7252300 -17715160 -13911061 -5903910 -11143171 -24070595
36163 -24070595 -22301170 -2767279 14744641 22254404 32517075 47349426 48328119 30373480
36155 30373480 13556518 5968504 -13740663 -55293844 -87925519 -80767153 -48567007
36148d8567007K1934944P417736J3886038K4164234J9303547J2062252J3780832
36141F3982576O226717k2446621m5230571l3900898n282528M523513n291480n661115
36133d3080407J3201297L0764900L0529519J7420708N29350j7917292l2522731
36126a074656l2150263j4316507P943649J8148773J1191766k969697p479714M985527
36118a5721122K1099798J9794984p4505j5442061q826727Q738293J4079438J712861
36110B5360959j3723694j7958923r299977M782611J3784056J0139423l525088
36103I559367j5508862j7530690j2043275m864107K347009Q796732J1368474Q875671
36095h999681L151818n670234j6548447j9960065n476308J9817420L3308493K2688672
$$ plain form
36148 -48567007 -26632063 -19214327 -5328289 18835945 38139492 50201744 63982576
36141 63982576 70209293 47762672 2532101 -31368797 -36651325 -32127812 -37419292 -43080407
36133 -43080407 -29879110 885790 31415309 48836017 49365367 31448075 -1074656
36126 -1074656 -33224919 -47541426 -39597777 -21449004 -10257238 -13226935 -20706649 -15721122
36118 -15721122 5378676 25173660 25099155 9657094 830367 9568660 23648098 25360959
36110 25360959 11637265 -6321658 -15621635 -10839024 2945032 13084455 9559367
36103 9559367 -5949495 -23480185 -35523460 -40387567 -38040558 -29243826 -17875352 -8999681
36095 -8999681 -5847863 -11518097 -28066544 -48026609 -53502917 -33685497 -377004 22311668
36087B2311668r77905j9606502k5311652j8059669p19009J7608810K5999938K4138729
36079B5384408J8673939P863974j2073852k6440032j4294054J3746533K0035684
36072C2896600n786528k7844726j7594176M401703N705868o832052n412264J0438340
36064a0027235J8826537J4202477P746380R29765q962080q949128R135500J9312329
36056D2214545p611646m9811307n4158421j1608215K9592685L3386700J6984558
36049a011101R009531O956503r96464m909511P723016K3765689K2315985O477340
36041F9330988n290736q733041j4564618k6451207l4790061k9910052j2052199
36034f2460926Q729643J9018992J4461731N836996L949289K853716o986217j5332501
$$ plain form
36087 22311668 21333763 1727261 -23584391 -41644060 -42363069 -24754259 1245679 25384408
36079 25384408 44058347 51922321 39848469 13408437 -885617 12860916 32896600
36072 32896600 27110072 -734654 -18328830 -13927127 -8221259 -15053311 -20465575 -10027235
36064 -10027235 8799302 23001779 30748159 31677924 22715844 13766716 22902216 42214545
36056 42214545 34602899 -15208408 -69366829 -80975044 -51382359 -17995659 -1011101
36049 -1011101 7998430 14954933 13958469 9048958 16771974 40537663 62853648 69330988
36041 69330988 64040252 55307211 40742593 14291386 -20498675 -50408727 -62460926
36034 -62460926 -53731283 -34712291 -20250560 -14413564 -10464275 -7610559 -14596776 -29929277
36026b9929277n609931J1381942P489670j5467680k1761094L819445L0692136
36019a9384789K8926680R896802j418364n630836j3401935j6193715m119529O495470
36011a4830216l509607j9314541j1873020J4606640K7116450J1751169j1609270
36004g662395k1307828j5706788l253654P724563R336424J656376k333037O353212
35996b5193127J7694273J8693281J2894346P675580k169723j7598332k0722509
35989h726211l581990P940531q024494k6512241j1548399K0876597K4476234j428550
35981f528523j2411992M307691J1871921o248766j6375831L006291K2332132J4056233
35973A4009156l057075o143128r441787k4612252k3403025J2458044M1588520
$$ plain form
36026 -29929277 -35539208 -24157266 -16667596 -32135276 -53896370 -50076925 -19384789
36019 -19384789 9541891 19438693 18020329 12389493 -1012442 -17206157 -21325686 -14830216
36011 -14830216 -18339823 -37654364 -49527384 -34920744 -7804294 3946875 -7662395
36004 -7662395 -28970223 -44677011 -47930665 -40206102 -30869678 -29213302 -31546339 -25193127
35996 -25193127 -7498854 11194427 24088773 31764353 29594630 11996298 -8726211
35989 -8726211 -12308201 -4367670 -12392164 -38904405 -50452804 -29576207 -5099973 -6528523
35981 -6528523 -18940515 -14632824 -2760903 -9009669 -25385500 -22379209 -47077 14009156
35973 14009156 10952081 4808953 -4632834 -29245086 -52648111 -40190067 1398453
35966A398453J9104327k4925626k4144213K2423794M9793574K5122066j3705624
35959E5066751k6131934k0923420k1195157k2535687j1684631N041524J5991071
35952b6371483K3250221K8280341J9959424m486813k4760903k1535089j547778
35945g212080J5202684K0076742J5499747L824769j0099716j5692924p675730
$$ plain form
35966 1398453 20502780 -4422846 -28567059 -6143265 43650309 68772375 55066751
35959 55066751 28934817 8011397 -13183760 -35719447 -47404078 -42362554 -26371483
35952 -26371483 -3121262 25159079 45118503 40631690 15870787 -5664302 -7212080
35945 -7212080 7990604 28067346 43567093 47391862 37292146 21599222 13923492
$$ [...]
##END NTUPLES=NMR SPECTRUM
##END=
