##TITLE=31Pdec_LR-675-H2O
 , 24 sc
 28.5.2019
##JCAMPDX= 6.0         $$ Bruker NMR JCAMP-DX V2.0
##DATA TYPE= NMR SPECTRUM
##DATA CLASS= NTUPLES
##ORIGIN= UXNMR, Bruker Analytische Messtechnik GmbH
##OWNER= root
$$ XWIN-NMR		Version 3.5
$$ Tue May 28 14:04:57 2019 Russian Standard Time (UT+4h)  she@DPX200
##.OBSERVE FREQUENCY= 81.013821
##.OBSERVE NUCLEUS= ^31P
##.ACQUISITION MODE= SIMULTANEOUS
##.ACQUISITION SCHEME= undefined
##.AVERAGES= 24
##.DIGITISER RES= 17
##SPECTROMETER/DATA SYSTEM= spect
##.PULSE SEQUENCE= zgpg30
##.SOLVENT NAME= DMSO
##.SHIFT REFERENCE= (INTERNAL, DMSO, 0, 182.463)
##AUDIT TRAIL= $$ (NUMBER, WHEN, WHO, WHERE, WHAT)
$$ ##TITLE= Audit trail, XWIN-NMR		Version 3.5
$$ ##JCAMPDX= 5.01
$$ ##ORIGIN= Bruker BioSpin GmbH
$$ ##OWNER= she
$$ F:/spectra/data/she/nmr/P31/1/pdata/1/auditp.txt
$$ ##AUDIT TRAIL=  $$ (NUMBER, WHEN, WHO, WHERE, WHAT)
(   1,<2019-05-28 14:03:46.06 +0400>,<she>,<DPX200>,
      <created by zg, POWCHK disabled, PULCHK disabled
       configuration hash MD5:
       00 E9 B6 7A A2 85 ED C7 34 08 36 98 17 FE 4E 26
       data hash MD5: 32K
       07 95 CE 1A 17 8D 81 51 71 D9 04 37 C7 26 AD A1>)
(   2,<2019-05-28 14:03:49.21 +0400>,<she>,<DPX200>,
      <Start of raw data processing
       efp BC_mod = 2 LB = 1 FT_mod = 6 PKNL = 1 PHC0 = -1810.684 PHC1 = 74.39899 SI = 64K 
       data hash MD5: 64K
       42 07 79 52 86 B2 9C 47 55 CC 91 EF D6 B5 BB 0E>)
(   3,<2019-05-28 14:04:15.39 +0400>,<she>,<DPX200>,
      <pk PHC0 = -0.7394922 PHC1 = -54.99999 
       data hash MD5: 64K
       84 C6 76 76 71 73 C8 AF 3A 31 9C 59 3C BE A8 4D>)
$$ ##END=
$$ 
$$ hash MD5
$$ 67 8C 0C 6A AA 03 3A DB 6B 60 F4 1F E3 F7 E7 53
##$RELAX= 
##$RELAX= 
##$RELAX= 
##$RELAX= 
##$RELAX= 
##$RELAX= 
##$RELAX= 
##$RELAX= 
$$ Bruker specific parameters
$$ --------------------------
##$DU= <F:/spectra>
##$EXPNO= 1
##$NAME= <P31>
##$PROCNO= 1
##$TYPE= <nmr>
##$USER= <she>
##$AMP= (0..31)
100 100 100 100 100 100 100 100 100 100 100 100 100 100 100 100 100 100 
100 100 100 100 100 100 100 100 100 100 100 100 100 100 
##$AQSEQ= 0
##$AQ_mod= 1
##$AUNM= <au_zg>
##$AUTOPOS= <>
##$BF1= 81.014009
##$BF2= 200.13
##$BF3= 200.13
##$BF4= 200.13
##$BF5= 200.13
##$BF6= 200.13
##$BF7= 200.13
##$BF8= 200.13
##$BYTORDA= 1
##$CFDGTYP= 0
##$CFRGTYP= 5
##$CHEMSTR= <none>
##$CNST= (0..31)
1 1 145 1 1 1 1 1 1 1 1 1 1 1 1 1 1 1 1 1 1 1 1 1 1 1 1 1 1 1 1 1 
##$CPDPRG= <waltz16>
##$CPDPRG1= <>
##$CPDPRG2= <waltz16>
##$CPDPRG3= <>
##$CPDPRG4= <mlev>
##$CPDPRG5= <mlev>
##$CPDPRG6= <mlev>
##$CPDPRG7= <mlev>
##$CPDPRG8= <mlev>
##$CPDPRGB= <>
##$CPDPRGT= <>
##$D= (0..31)
0 1 0 0 0 0 0 0 0 0 0 0.03 2e-05 3e-06 0 0 0 0 0 0 0 0 0 0 0 0 0 0 0 0 
0 0 
##$DATE= 1559037825
##$DBL= (0..7)
120 120 120 11 120 120 24 19 
##$DBP= (0..7)
150 150 150 150 150 150 150 150 
##$DBP07= 0
##$DBPNAM0= <>
##$DBPNAM1= <>
##$DBPNAM2= <>
##$DBPNAM3= <>
##$DBPNAM4= <>
##$DBPNAM5= <>
##$DBPNAM6= <>
##$DBPNAM7= <>
##$DBPOAL= (0..7)
0.5 0.5 0.5 0.5 0.5 0.5 0.5 0.5 
##$DBPOFFS= (0..7)
$$ [...]
##$SUBNAM2= <"">
##$SUBNAM3= <"">
##$SUBNAM4= <"">
##$SUBNAM5= <"">
##$SUBNAM6= <"">
##$SUBNAM7= <"">
##$SUBNAM8= <"">
##$SUBNAM9= <"">
##$SW= 369.568048894756
##$SWIBOX= (0..15)
0 1 3 0 0 0 0 0 0 0 0 0 0 0 0 0 
##$SW_h= 29940.119760479
##$TD= 32768
##$TD0= 1
##$TE= 0
##$TE2= 300
##$TE3= 300
##$TEG= 300
##$TL= (0..7)
0 120 53 12 22 120 120 120 
##$TP= (0..7)
150 150 150 150 150 150 150 150 
##$TP07= 0
##$TPNAME0= <>
##$TPNAME1= <>
##$TPNAME2= <>
##$TPNAME3= <>
##$TPNAME4= <>
##$TPNAME5= <>
##$TPNAME6= <>
##$TPNAME7= <>
##$TPOAL= (0..7)
0.5 0.5 0.5 0.5 0.5 0.5 0.5 0.5 
##$TPOFFS= (0..7)
0 0 0 0 0 0 0 0 
##$TUNHIN= 0
##$TUNHOUT= 0
##$TUNXOUT= 0
##$USERA1= <user>
##$USERA2= <user>
##$USERA3= <user>
##$USERA4= <user>
##$USERA5= <user>
##$V9= 5
##$VALIST= <valist>
##$VCLIST= <CCCCCCCCCCCCCCC>
##$VD= 0
##$VDLIST= <DDDDDDDDDDDDDDD>
##$VPLIST= <PPPPPPPPPPPPPPP>
##$VTLIST= <TTTTTTTTTTTTTTT>
##$WBST= 1024
##$WBSW= 4
##$XGAIN= (0..3)
0 0 0 0 
##$XL= 0
##$YL= 0
##$YMAX_a= 282320
##$YMIN_a= -269305
##$ZGOPTNS= <>
##$ZL1= 120
##$ZL2= 120
##$ZL3= 120
##$ZL4= 120
##$ABSF1= 0
##$ABSF2= 0
##$ABSG= 0
##$ABSL= 0
##$ALPHA= 0
##$AQORDER= 0
##$ASSFAC= 0
##$ASSFACI= 0
##$ASSFACX= 0
##$ASSWID= 0
##$AUNMP= <proc_1d>
##$AZFE= 0.1
##$AZFW= 0.5
##$BCFW= 0
##$BC_mod= 2
##$BYTORDP= 0
##$COROFFS= 0
##$CY= -3
##$DATMOD= 1
##$DC= 0
##$DFILT= <>
##$DTYPP= 0
##$F1P= 0
##$F2P= 0
##$FCOR= 1
##$FTSIZE= 65536
##$FT_mod= 6
##$GAMMA= 0
##$GB= 0
##$INTBC= 1
##$INTSCL= 5.30512e-09
##$ISEN= 30
##$LB= 1
##$LEV0= 0
##$LPBIN= 0
##$MAXI= 10000
##$MC2= 0
##$MEAN= 0
##$ME_mod= 0
##$MI= 50
##$NCOEF= 0
##$NC_proc= -2
##$NLEV= 6
##$NOISF1= 182.463
##$NOISF2= 159.3651
##$NSP= 0
##$NTH_PI= 0
##$NZP= 0
##$OFFSET= 182.463
##$PC= 4
##$PHC0= -1811.423
##$PHC1= 19.399
##$PH_mod= 1
##$PKNL= yes
##$PPARMOD= 0
##$PSCAL= 0
##$PSIGN= 0
##$REVERSE= no
##$SF= 81.0140089999434
##$SI= 65536
##$SIGF1= 159.3651
##$SIGF2= -187.1042
##$SINO= 113.3802
##$SIOLD= 16384
##$SREGLST= <1H.CDCl3>
##$SSB= 0
##$STSI= 65536
##$STSR= 0
##$SW_p= 29940.119760479
##$SYMM= 0
##$S_DEV= 0
##$TDeff= 32768
##$TDoff= 0
##$TI= <>
##$TILT= no
##$TM1= 0
##$TM2= 0
##$TOPLEV= 0
##$USERP1= <user>
##$USERP2= <user>
##$USERP3= <user>
##$USERP4= <user>
##$USERP5= <user>
##$WDW= 1
##$XDIM= 65536
##$YMAX_p= 440421308
##$YMIN_p= -6345838
$$ End of Bruker specific parameters
$$ ---------------------------------
##NTUPLES= NMR SPECTRUM
##VAR_NAME=  FREQUENCY,     SPECTRUM/REAL,   SPECTRUM/IMAG
##SYMBOL=    X,             R,               I
##VAR_TYPE=  INDEPENDENT,   DEPENDENT,       DEPENDENT
##VAR_FORM=  AFFN,          ASDF,            ASDF
##VAR_DIM=   65536,         65536,           65536
##UNITS=     HZ,            ARBITRARY UNITS, ARBITRARY UNITS
##FACTOR=    0.456856943014862, 1,           1
##FIRST=     14782.0589164792, 0,            0
##LAST=      -15158.0608439998, 0,           0
##MIN=       -15158.0608439998, -6345838,    0
##MAX=       14782.0589164792, 440421308,    0
$$ Real data points
##PAGE= N=1
##DATA TABLE= (X++(R..R)), XYDATA
$$ [...]
37472H3852j15644N3935O5687m5220p9177J3003Q1557M6751J1150N1201Q7722
$$ 83852 -31792 22143 87830 42610 -36567 -23564 57993 104744 115894 167095 254817
37461B54817M9819K25l189j8876q4503j11443m1294K1859k6445j09134r2464L461
$$ 254817 304636 304861 301672 282796 198293 86850 45556 67415 40970 -68164 -160628 -157167
37449a57167O4225O4883M8763O444o9559q7556J7913J28623Q7374n2769j09273
$$ -157167 -92942 -28059 20704 27148 -42411 -129967 -112054 16569 103943 51174 -58099
37438e8099n6840k8732n2553j0088J13702J62046N7762o5481p4827k1811j3955
$$ -58099 -114939 -143671 -196224 -206312 -92610 69436 127198 61717 -13110 -34921 -48876
37427d8876l9900l3045k656O537P391L1906O1333O2948L8856n145o6937r4210
$$ -48876 -88776 -121821 -124477 -117940 -110549 -78643 -17310 45638 84494 79349 12412 -81798
37415h1798k1571J00446J29305L7167l3639M816M4397k6850j21008q7904L6901
$$ -81798 -103369 -2923 126382 163549 129910 134726 179123 152273 31265 -56639 -19738
37404a9738Q6601J5157o2103o0876k1743q486k6174n2967o8634m7933P857M6740
$$ -19738 66863 82020 19917 -40959 -62702 -71188 -97362 -150329 -218963 -266896 -259039 -212299
37392b12299L4180J2349K4173K7878k6091q5318p0107j3794n814k7176J8207J18000
$$ -212299 -178119 -165770 -141597 -113719 -139810 -225128 -295235 -309029 -314843 -342019 -323812 -205812
37380b05812J44189N2125m7402n4125P87M4803O7295P9114O2846K2042L632K0354
$$ -205812 -61623 -9498 -56900 -111025 -110238 -65435 1860 80974 143820 165862 169494 189848
37368A89848K0667k0025m9561k5827J5438K6911J9638J9660J3967j3469m2538
$$ 189848 210515 190490 140929 115102 130540 157451 177089 196749 210716 197247 154709
37357A54709n1964m6092k4520J6236L7717l484n5780j1685J15923J71596P6115
$$ 154709 102745 56653 32133 48369 86086 82602 26822 15137 131060 302656 378771
37346C78771m7155n5939P055J1669m4178n5143P099O7095P7089N1957o968j00511
$$ 378771 331616 275677 282732 294401 250223 195080 202179 269274 346363 398320 391352 290841
37334B90841j56983r7534J8236L8933o1427j32933o2194O9780J06964J9425q3342
$$ 290841 133858 36324 54560 93493 32066 -100867 -163061 -93281 13683 33108 -50234
37323e0234r4296r730Q4869R6801J4451p5090q0415q169O7235J10218J32455J17393
$$ -50234 -144530 -154260 -69391 27410 41861 -33229 -113644 -121813 -54578 55640 188095 305488
37311C05488L3867p2055j03442n4095k0858m2241l8925K9010O5128j0159j09658
$$ 305488 339355 267300 163858 109763 88905 46664 7739 36749 101877 91718 -17940
37300a7940j00475l850N3071L7197K5381M1355J8484n6696r0383k1266P8687J01361
$$ -17940 -118415 -122265 -69194 -31997 -6616 34739 53223 -3473 -93856 -115122 -36435 64926
37288F4926L5650m8891j00441j14173r6589n0012J6601Q5227J30290J23749O4738
$$ 64926 100576 51685 -48756 -162929 -259518 -309530 -292929 -207702 -77412 46337 111075
37277A11075R13j7702n407j6350n4673o8238m0346j7289k0186n881L9775M7306
$$ 111075 111988 94286 88879 72529 17856 -50382 -90728 -108017 -128203 -134084 -94309 -47003
37265d7003k6505r9067o6286L5113P6252K9652k654L1653M8344k3716j06058p7348
$$ -47003 -73508 -172575 -238861 -203748 -127496 -97844 -100498 -68845 -20501 -44217 -150275 -227623
37253b27623M0348J05545N2437l1655l9181K3596P2301O0675J2115l6153o8306
$$ -227623 -187275 -81730 -29293 -60948 -100129 -76533 -4232 56443 68558 32405 -35901
37242c5901p3831m2348R418L7247K3001R529M6710J09070J13562L5868l9404k8141
$$ -35901 -109732 -152080 -142662 -105415 -82414 -72885 -26175 82895 196457 232325 192921 164780
37230A64780L1246L2368l9863r0765o9638m6071p9918j02632k2141J08584J42213
$$ 164780 196026 228394 188531 97766 28128 -17943 -97861 -200493 -222634 -114050 28163
37219B8163M2026p4205j06435q3411o8962n6319j4297L7822O6990P8332P0484
$$ 28163 70189 -4016 -110451 -193862 -262824 -319143 -333440 -295618 -228628 -150296 -79812
37208g9812L084j17448j81243j01144M3403R3381K2434m5538k9536J2418Q484
$$ -79812 -76728 -194176 -375419 -476563 -433160 -339779 -317345 -362883 -392419 -380001 -371517
37197c71517j4206l354J2418k9740j15729j60233j10588n34R0829J08062O2092
$$ -371517 -385723 -389077 -376659 -406399 -522128 -682361 -792949 -793483 -702654 -594592 -532500
37186e32500K0328L4615P3965O4412j75m2070j4621K8503J8102l2135o2709n6594
$$ -532500 -512172 -477557 -403592 -339180 -339355 -381425 -396046 -367543 -349441 -381576 -444285 -500879
37174e00879l4303k056L4537M2684J4970J4401Q8484J64674J24446k2794j33641
$$ -500879 -535182 -537238 -502701 -460017 -445047 -430646 -342162 -177488 -53042 -75836 -209477
37163b09477j14280k3839L4298M1247L4112J8561k0723n9070m7362J9418R1263
$$ -209477 -323757 -347596 -313298 -272051 -237939 -219378 -240101 -299171 -346533 -327115 -235852
37152b35852J16773Q2832J2563n1938p3644m7103J638M3996O4424N3047J3271
$$ -235852 -119079 -36247 -23684 -75622 -149266 -196369 -194731 -150735 -86311 -33264 -19993
37141a9993k3759l0309k8994n9614r5261o2339K8925N7246m2308j54706j23623
$$ -19993 -43752 -74061 -103055 -162669 -257930 -320269 -291344 -234098 -276406 -431112 -554735
37130e54735K9989J38691J23434P5918Q2676Q8238Q486j04468j15610K592J25682
$$ -554735 -524746 -386055 -262621 -186703 -104027 -15789 -7303 -111771 -227381 -224789 -99107
37119i9107J32332L8137m9777o7086m5199m5896p7258q9628m7540J7073M1750
$$ -99107 33225 71362 21585 -45501 -90700 -136596 -213854 -303482 -351022 -333949 -292199
37108b92199J2410k3927k5676k413J5974K0374J3036q993l3131k5048K2183N9375
$$ -292199 -279789 -303716 -329392 -331805 -315831 -295457 -282421 -291414 -324545 -349593 -327410 -268035
37096b68035M0812j0175l7175k9527j6225l000K2816L7269J761n7390o5865j3207
$$ -268035 -227223 -237398 -274573 -304100 -320325 -323325 -300509 -263240 -261479 -318869 -384734 -397941
37084c97941K6910J3586k998J8236L1404p927m5098m311Q0195J05062M9091o869
$$ -397941 -371031 -357445 -360443 -342207 -310803 -318730 -363828 -368139 -287944 -182882 -133791 -140660
37072a40660p395J5133J7196Q179J1987J8881J617n1342j22985j59157r3988O2982
$$ -140660 -148055 -132922 -115726 -107547 -95560 -76679 -75062 -126404 -249389 -408546 -502534 -439552
37060d39552J86839J58936K1788o7184l7853K3662K0501l3656p0193n8853r009
$$ -439552 -252713 -93777 -71989 -139173 -177026 -153364 -132863 -166519 -236712 -295565 -304574
37049c04574M7946M9897l8452j34186j05143L2954J09274M5116l0203k904L4659
$$ -304574 -256628 -206731 -245183 -379369 -484512 -451558 -342284 -297168 -327371 -330275 -295616
37038b95616l6831j23961n8250J06209J53328L7206o5482n0066j5862m6585o0747
$$ -295616 -332447 -456408 -514658 -408449 -255121 -217915 -283397 -333463 -349325 -395910 -456657
37027d56657J5646R1924N8270k9950m4960J7233N3287J1109o6929j16894r4307
$$ -456657 -441011 -349087 -290817 -320767 -365727 -348494 -295207 -284098 -351027 -467921 -562228
37016e62228P392J14985J17169J5324m6570J6617R2371M4455o4132p2651J3921
$$ -562228 -554836 -439851 -322682 -307358 -353928 -337311 -244940 -200485 -264617 -337268 -323347
37005c23347M1423l0085o6682K515O6039K7820k6590J7777R4678M6714j20300
$$ -323347 -281924 -312009 -378691 -376176 -310137 -282317 -308907 -291130 -196452 -149738 -270038
36994b70038k18089j22910O7586J63856R7761m0429j29743j29078p8505l6852
$$ -270038 -488127 -611037 -543451 -379595 -281834 -322263 -452006 -581084 -659589 -696441
36984f96441k4792j0793M5825J28136J57666Q7535j6968m2722K3467P3834L2359
$$ -696441 -721233 -732026 -686201 -558065 -400399 -312864 -329832 -372554 -349087 -275253 -242894
36973b42894l9159m2503J1610M3203M1829N6880P0850J2028r0764j01320J9979
$$ -242894 -282053 -324556 -312946 -269743 -227914 -171034 -100184 -88156 -178920 -280240 -260261
36962b60261J25136P5501o7188j43035j06809l1964L1186Q0036Q5104J7408o3282
$$ -260261 -135125 -59624 -126812 -269847 -376656 -408620 -377434 -297398 -212294 -194886 -258168
36951b58168n9587K5585R8122J11187R4644N5160l5733j39155j51915n4298M0228
$$ -258168 -317755 -292170 -194048 -82861 11783 66943 31210 -107945 -259860 -314158 -273930
36940b73930L2206m2818q5348n6983Q510O1236O4931K0791j4241J3725O7044N6854
$$ -273930 -241724 -284542 -369890 -426873 -418363 -357127 -292196 -271405 -285646 -271921 -204877 -148023
36928a48023j7312n8145k4973O238j7662l8028n831J6236k7964o4099p722O6531
$$ -148023 -165335 -223480 -248453 -242215 -259877 -297905 -303736 -287500 -315464 -379563 -387285 -320754
36916c20754K6590q7796j03162J8232J09843M6604q3961j31917q6814l0069J9960
$$ -320754 -294164 -381960 -485122 -466890 -357047 -310443 -394404 -526321 -613135 -643204 -623244
36905f23244R0674J39420R2742r276l8255K8905O1070k7708j36516j25787k7617
$$ -623244 -532570 -393150 -300408 -309684 -347939 -319034 -257964 -285672 -422188 -547975 -575592
36894e75592J1440m2707p6285k2414M2893M5238L3130P3138J15316O8457m4606
$$ -575592 -564152 -606859 -683144 -705558 -662665 -617427 -584297 -511159 -395843 -327386 -371992
36883c71992j12633q9669k9171J6512L9887L3715n215l0215Q400O9096O2544n440
$$ -371992 -484625 -574294 -603465 -586953 -547066 -513351 -518566 -548781 -540381 -471285 -408741 -414181
36871d14181l3795J1720M0579j5628r1917q7238m314O9985P6328K4806l7272o2260
$$ -414181 -447976 -436256 -395677 -411305 -503222 -590460 -594774 -524789 -448461 -423655 -460927 -523187
36859e23187l8369o876p982j5274J6216N1408J7602n6854o3879M292K8696l6838
$$ -523187 -561556 -568432 -576414 -591688 -575472 -524064 -506462 -563316 -627195 -622903 -594207 -631045
36847f31045p9909j9708N4592M1867J134L4628J01747R6242L0536p706k1643p2739
$$ -631045 -710954 -730662 -676070 -634203 -633069 -598441 -496694 -400452 -369916 -377622 -399265 -472004
36835d72004j26247q8418K1219Q2618N4399Q317p266r968N41L8800N4703r383
$$ -472004 -598251 -686669 -665450 -582832 -528433 -520116 -527382 -537350 -536809 -498009 -443306 -452689
36823d52689r2363q3308m244K7838R434M3189J18558J05386O521l200J22422J77602
$$ -452689 -545052 -628360 -632604 -604766 -595332 -552143 -433585 -328199 -321678 -324878 -202456 -24854
36811b4854J9698j82110j91544n0569K0740l2948p0308j2497O4601Q8478P3873
$$ -24854 -5156 -187266 -378810 -429379 -408639 -441587 -511895 -524392 -459791 -371313 -297440
36800b97440M1113j1029m3419j0940L8337J7729m5765m2393L0918N2789k1523
$$ -297440 -256327 -267356 -310775 -321715 -283378 -265649 -311414 -353807 -322889 -270100 -291623
36789b91623q3527n3022l948k5541p1907n5900n261m180l6875j7886M7340O0668
$$ -291623 -375150 -428172 -432120 -457661 -529568 -585468 -590729 -594909 -631784 -649670 -602330 -541662
36777e41662k614m4284L022P1774O7258K557m3305m4225k7520Q21M5048O1051
$$ -541662 -544276 -588560 -585538 -513764 -446506 -443949 -487254 -531479 -558999 -558178 -513130 -452079
36765d52079M836o7437m9917M8411R5778L1747l8166q342O5671O6257m677n4308
$$ -452079 -447243 -514680 -564597 -516186 -420408 -388661 -426827 -435169 -369498 -303241 -307918 -362226
36753c62226n0806k7672J8695J04906J62283J04435j3993n0796M902K2144l7840
$$ -362226 -413032 -440704 -422009 -317103 -154820 -50385 -64378 -115174 -110272 -88128 -125968
36742a25968m9248M9210J20774M0029r8696j18538q913R9644J36827J33559J15088
$$ -125968 -175216 -126006 -5232 34797 -63899 -182437 -191350 -91706 45121 178680 293768
36731B93768Q5735Q6326J44521J92050J45440M7893J6842O4436Q6242K9223l9320
$$ 293768 379503 465829 610350 802400 947840 995733 1012575 1077011 1163253 1192476 1153156
36720A153156m5994j759M0050M1435j2124r2866j24564o5780J4716K3256k1367
$$ 1153156 1107162 1105403 1145453 1186888 1174764 1081898 957334 891554 906270 929526 908159
36709I08159l0808l157j5880o8164o5852J1081N7542Q661o2244p3682n7447p5536
$$ 908159 877351 874194 858314 790150 724298 735379 792921 801582 739338 665656 608209 532673
36697E32673j08147j09378j01156j24467j51957j31642p7860m6907n3895p2251
$$ 532673 424526 315148 213992 89525 -62432 -194074 -271934 -318841 -372736 -444987
36687d44987q2171o9390j6939N1552O6271J505p7792j12226j28090j54367j33617
$$ -444987 -527158 -596548 -613487 -561935 -495664 -494159 -571951 -684177 -812267 -966634 -1100251
36676a100251j7568J05591J05758O129m7758r962J3700m0674r2165o9285l8313
$$ -1100251 -1117819 -1012228 -906470 -900341 -948099 -958061 -944361 -985035 -1077200 -1146485 -1184798
36665a184798p8371j28764q5239J6768N2104Q817j513N7563Q0426j197r6737r6394
$$ -1184798 -1263169 -1391933 -1477172 -1460404 -1408300 -1399483 -1400996 -1343433 -1263007 -1264204 -1360941 -1457335
36653a457335l5774j8826m4485k6383N0088J08621J12976J07871J17989J06701
$$ -1457335 -1493109 -1511935 -1556420 -1582803 -1532715 -1424094 -1311118 -1203247 -1085258 -978557
36643i78557O0040K2725K3507M8195J06470K24480L40419L28008J85965Q4482
$$ -978557 -918517 -895792 -872285 -824090 -717620 -493140 -152721 175287 361252 445734
36633D45734J34606K26358K10549J31089J23363J67676J33064K9427J5393J36688
$$ 445734 580340 806698 1017247 1148336 1271699 1439375 1572439 1601866 1617259 1753947
36623A753947K38377J94300P5587K0437N8493J38600K25749K91068K90078K27148
$$ 1753947 1992324 2186624 2262211 2282648 2341141 2479741 2705490 2996558 3286636 3513784
36613C513784J75467J72460J61783R4062J4033j4289n841j6700o2492j26616j94353
$$ 3513784 3689251 3861711 4023494 4117556 4131589 4117300 4111459 4094759 4032267 3905651 3711298
36602C711298k32225j94751j00153l6848m7777p5317o6686n4044p2271q3266n6729
$$ 3711298 3479073 3284322 3184169 3147321 3099544 3024227 2957541 2903497 2831226 2747960 2691231
36591B691231m4364q5694j14762o0458K4584M4581J9536M7501J40513K14911K32611
$$ 2691231 2646867 2561173 2446411 2385953 2410537 2455118 2474654 2522155 2662668 2877579 3110190
36580C110190K42400K75614K95843K69399K12350J50097Q3495L883r5424k13361
$$ 3110190 3352590 3628204 3924047 4193446 4405796 4555893 4639388 4643271 4547847 4334486
36570D334486l15355l43471k92630k37336k35767k55095k45529k27477k32152
$$ 4334486 4019131 3675660 3383030 3145694 2909927 2654832 2409303 2181826 1949674
36561A949674k17732j38341m6476k5175n8783p5461p8633j17794j57331j07387
$$ 1949674 1731942 1593601 1547125 1521950 1463167 1387706 1309073 1191279 1033948 926561
36551I26561J5061Q1554K9175o1512q8654m1428K9494P7890Q2243N6750L8538
$$ 926561 941622 1023176 1052351 990839 902185 860757 890251 968141 1050384 1107134 1145672
36540A145672K1325n2238j70134k02711q1391N8232N8066j5403Q856J02392Q5595
$$ 1145672 1166997 1114759 944625 741914 660523 718755 776821 761418 770274 872666 958261
36529I58261m1297p8726K5139P6596k5019j10387m0956N0285J988r1508n2913
$$ 958261 916964 838238 863377 939973 914954 804567 763611 813896 815884 724376 671463
36518F71463P5709J28512J00186J08370J49436J13649L260o6022o1019n1169n2999
$$ 671463 747172 875684 975870 1084240 1233676 1347325 1350585 1284563 1223544 1172375 1119376
36507A119376k5063l83n1319j29035j10408j1051J9855o0922j24588q4167j5724
$$ 1119376 1094313 1093930 1042611 913576 803168 792117 811972 751050 626462 542295 526571
36496E26571o508k5438k0711k4148p0120j04467o4207J3999M0714r821q0902j00353
$$ 526571 520063 494625 473914 449766 379646 275179 210972 224971 265685 255864 174962 74609
36484G4609l9671N9855J10554O7780j0662m4538m5024p0076r3849l5227Q2738
$$ 74609 34938 94793 205347 273127 262465 217927 172903 102827 8978 -26249 56489
36473E6489J28794N2974l3700j9050O8525J30788J23209N4947m9191j29312j11214
$$ 56489 185283 238257 204557 185507 254032 384820 508029 562976 513785 384473 273259
36462B73259n345Q3211R1647P2847Q8017J12673J06063Q6912P4416L8506k1704
$$ 273259 267914 351125 442772 515619 603636 716309 822372 909284 983700 1022206 1000502
36451A000502l8587O945K2201n1314j24413j04767n9874r3520j40729o3085R3820
$$ 1000502 961915 968860 991061 939747 815334 710567 650693 557173 416444 353359 447179
36440D47179J32671J454j26588j13712k9187J2579L0452Q2986J17793N3492n4414
$$ 447179 579850 581304 454716 341004 311817 324396 354848 437834 555627 609119 554705
36429E54705o5499M7236J59267J56517N2726o2112j21653j15828p5130m1912l0539
$$ 554705 489206 536442 695709 852226 904952 842840 721187 605359 530229 488317 457778
36418D57778j4966K1294M2568J0328m3136m9003m982K1617K366j3503M293R083
$$ 457778 442812 464106 506674 517002 473866 424863 419881 441498 443864 430361 434654 443737
36406D43737k9926m8044J6149R2350O0000n7525j05222k7927L6525l3962j52487
$$ 443737 413811 365767 381916 474266 534266 476741 371519 343592 380117 346155 193668
36395A93668j50852k9321N6844L3100j4313q642M900k4057l7557L0498J14645
$$ 193668 42816 13495 70339 103439 89126 80484 85384 61327 23770 54268 168913
36384A68913R1687l1861j10833n1517P0693J16189M6301o0900j24297j31317r8711
$$ 168913 260600 228739 117906 66389 137082 253271 299572 238672 114375 -16942 -115653
36373a15653k3873Q0313J37420P2796n9185r4390L7404J94120J94000N8463l3515
$$ -115653 -139526 -59213 78207 151003 91818 -2572 34832 228952 422952 481415 447900
36362D47900r748K2256j3752m0731M981L3042m5875j36726r2441M0054Q0937n679
$$ 447900 438152 460408 446656 405925 410906 443948 398073 261347 168906 208960 289897 284218
36350B84218p5556m9838j4320k9636k1454N1215P8854j7225j14571o1894O7249
$$ 284218 208662 158824 144504 114868 93414 144629 223483 206258 91687 29793 97042
36339I7042P7416l5323p2979M6303J55105R6721m6634j03843o8186n3867q0832
$$ 97042 174458 139135 66156 112459 267564 364285 317651 213808 145622 91755 10923
36328A0923o7270n109J9493r821l994O6579J08376O4018P903N103j972o0849p8828
$$ 10923 -56347 -61456 -41963 -51784 -55778 10801 119177 183195 191098 196201 194229 133380 54552
36315E4552K9169J47790R2791j00172j98716r4326O7115J12802M8357k5203o4804
$$ 54552 83721 231511 324302 224130 25414 -68912 -1797 111005 159362 134159 69355
36304F9355p4577m8567o764m727m0827l8586K0433M6676m229l7837K4792J00330
$$ 69355 -5222 -53789 -60553 -65280 -106107 -144693 -124260 -77584 -81813 -119650 -94858 5472
36292E472O6277m8442j15206q7421k0143L5186N1364J931p8212p7757L3600J12219
$$ 5472 71749 23307 -91899 -179320 -199463 -164277 -112913 -110982 -189194 -266951 -233351 -121132
36280a21132L5227r6072j04481j1288K1888l4238o9464o5187j08880j81225j59551
$$ -121132 -85905 -181977 -286458 -297746 -275858 -310096 -379560 -444747 -553627 -734852 -894403
36269h94403o0970n1720j59075k01294q8036K6154n458j16485j90286k29833k32118
$$ -894403 -955373 -1007093 -1166168 -1367462 -1455498 -1429344 -1434802 -1551287 -1741573 -1971406 -2203524
36258b203524r4155J84790L83854L37369J86329J57971K28915K22717J29098Q7752
$$ -2203524 -2297679 -2112889 -1729035 -1391666 -1205337 -1047366 -818451 -595734 -466636 -378884
36248c78884J23250J28979Q1040N7347O5371M5736K5722P6383J37362Q4893l6949
$$ -378884 -255634 -126655 -45615 11732 77103 122839 148561 224944 362306 447199 410250
36237D10250o2306J6662L6276m5892p3383K8728J13030N2233o1572p9633j0162
$$ 410250 347944 364606 400882 354990 281607 310335 423365 475598 414026 334393 324231
36226C24231M6989N4443K0556n5518j23043p8960P0577J60789Q8180l0532l8540
$$ 324231 371220 425663 446219 390701 267658 188698 259275 420064 508244 477712 439172
36215D39172K7929K7759m7885q4636m5819j1918k9508n0459l3118k588R043Q560
$$ 439172 467101 494860 446975 362339 316520 304602 275094 224635 191517 188929 197972 206532
36203B06532J1916K0690L3722M5208L8811J2222j3203l0973o1127r6938r0354
$$ 206532 218448 239138 272860 318068 356879 369101 355898 324925 263798 166860 76506
36192G6506k8231L0113L5849J6702J2093J749m1363q2263p6223m6839m9068r1702
$$ 76506 48275 78388 114237 130939 143032 144781 103418 21155 -55068 -101907 -150975 -242677
36180b42677j48227k01531k33512k27095k22810k99679m46279n40033n25718n12985
$$ -242677 -390904 -592435 -825947 -1053042 -1275852 -1575531 -2021810 -2561843 -3087561 -3600546
36170c600546n96862o81614o13658m09567k08710o4301O6845J82521K47488L05423
$$ -3600546 -4197408 -4879022 -5492680 -5902247 -6110957 -6175258 -6108413 -5925892 -5678404 -5372981
36160e372981M06769M60596L49566J71895J51815K96114L70487K68098J60966
$$ -5372981 -4966212 -4505616 -4156050 -3984155 -3832340 -3536226 -3165739 -2897641 -2736675
36151b736675J85553K17334J20430J4913Q0690K42510K85377J91334J22019J15167
$$ -2736675 -2551122 -2333788 -2213358 -2198445 -2117755 -1875245 -1589868 -1398534 -1276515 -1161348
36141a161348M8372q4127j01926P1469K44072K08026K4908p9504k3914O4716O1890
$$ -1161348 -1112976 -1197103 -1299029 -1227560 -983488 -775462 -750554 -830058 -853972 -789256 -727366
36130g27366j0740o4801o4724k5120L9648J03744J09795L0181o3094o0820L6152
$$ -727366 -738106 -802907 -867631 -892751 -853103 -749359 -639564 -609383 -672477 -733297 -697145
36119f97145J00148M6022m8205n8615O99J4153l7456m2568N0960J34646J00296
$$ -697145 -596997 -550975 -599180 -657795 -657096 -642943 -680399 -722967 -672007 -537361 -437065
36108d37065N870j7222M2042Q2545N8892K7424K5245P894o1045j35589j46531
$$ -437065 -431195 -448417 -406375 -323830 -264938 -237514 -212269 -204375 -265420 -401009 -547540
36097e47540q7028l102O4727R7187Q3561L1263k3112m1355k2263J870M677j0817
$$ -547540 -634568 -637670 -572943 -475756 -392195 -360932 -384044 -425399 -447662 -445792 -441115 -451932
36085d51932k6636l2840k7220l751L6039N8994K1127o4365j12839o7225J2266
$$ -451932 -478568 -511408 -538628 -542379 -506340 -447346 -426219 -490584 -603423 -670648 -658382
36074f58382K2130k9232k5581P4659J51459Q4772o4667j27966n0329N4773P5299
$$ -658382 -636252 -665484 -691065 -616406 -464947 -380175 -444842 -572808 -623137 -568364 -493065
36063d93065L6613L2899Q3370J13051O1714l1561p0216j6246N9422O1449r444
$$ -493065 -456452 -423553 -340183 -227132 -165418 -196979 -267195 -283441 -224019 -162570 -172014
36052a72014n9068k5140M7589P9036N5247K2384J4874K9590M4948L0264l4772
$$ -172014 -231082 -256222 -208633 -129597 -74350 -51966 -37092 -7502 37446 67710 32938
36041C2938j14365j26314m3251N0300N7369l846l4511L116M7978M0493l125k7076
$$ 32938 -81427 -207741 -250992 -200692 -143323 -147169 -181680 -178564 -130586 -90093 -93218 -120294
36029a20294k034N0669P1088R771j01227j53089q3569L3332P9991M7334K0191
$$ -120294 -122328 -71659 -571 9200 -92027 -245116 -328685 -295353 -215362 -168028 -147837
36018a47837L4761M2125J0619k7720m7425o4342q0358o7165k4723J2160L8190
$$ -147837 -113076 -70951 -60332 -88052 -135477 -199819 -280177 -347342 -372065 -359905 -321715
36007c21715P7291J12795J02907P1942Q3306J06259L5280j14326j67812l3975
$$ -321715 -244424 -131629 -28722 43220 126526 232785 268065 153739 -14073 -48048
35997d8048J34179J37197n288j14010j04862m8312j8472j7946l4072n1427k3493
$$ -48048 86131 223328 218040 104030 -832 -49144 -67616 -85562 -119634 -171061 -194554
35986a94554N8545R5156K042j20551r4982N8569J27730K5345q1848m5843L8536
$$ -194554 -136009 -40853 -38811 -159362 -254344 -195775 -68045 -42700 -124548 -170391 -131855
35975a31855K0267m5671j0335R0431Q5698l2649q1073J6067J01311M0153p4800
$$ -131855 -111588 -157259 -167594 -77163 8535 -24114 -105187 -89120 12191 52344 -22456
35964b2456r9558p2480j08162j60233q8972P2940J27961J1380j05518p8295J0746
$$ -22456 -122014 -194494 -302656 -462889 -551861 -478921 -350960 -339580 -445098 -523393 -512647
35953e12647K1678j7036J861N2428K7913m7935m4732M5052P8578J710m9107L6751
$$ -512647 -490969 -508005 -506144 -453716 -425803 -473738 -518470 -473418 -394840 -393130 -442237 -405486
35941d05486J60842J58922L5324o4633o3892k2487j6849m7069p1490o6546l5656
$$ -405486 -244644 -85722 -50398 -115031 -178923 -201410 -218259 -265328 -336818 -403364 -439020
35930d39020N672M4534P9838J04455Q4573L222p5038n7264L7454P8326P993o9143
$$ -439020 -433348 -388814 -308976 -204521 -119948 -116726 -191764 -249028 -211574 -133248 -125255 -194398
35918a94398n2148O488J8389K6450J09890J96670J49799J1279l1763O0129J10617
$$ -194398 -246546 -240058 -221669 -195219 -85329 111341 261140 272419 240656 300785 411402
35907D11402J1589j02996p2229M7540Q9034K4879l2905k7199r055j5332j5874
$$ 411402 422991 319995 247766 295306 384340 409219 376314 349115 340060 324728 308854
35896C08854O422J7266l405k3862j2925J4785K5107Q545j1840l289M0750P9924
$$ 308854 315276 332542 329137 305275 292350 307135 332242 340787 328947 325658 366408 446332
35884D46332O4554N625k7040K983M8799N1412J6857j5560l5673m4009j5602N5445
$$ 446332 510886 516511 489471 492454 541253 592665 609522 593962 558289 514280 498678 554123
35872E54123J09582Q7443J7546k7131l5380m7328n9627l1188J6720J014r2958
$$ 554123 663705 751148 768694 741563 706183 658855 599228 568040 584760 585774 492816
35861D92816j59162r7304N4818J58538J20784j9436j31284j10896J7973J24775
$$ 492816 333654 236350 291168 449706 570490 551054 419770 308874 326847 451622
35851D51622J16654L8490j3030l3513q1971j31581p6810Q0398J78248J05468l7055
$$ 451622 568276 606766 593736 560223 478252 346671 269861 350259 528507 633975 596920
35840E96920q4559l6339r580j9636L6722J73024K41603J38307l0863q3995p83
$$ 596920 512361 476022 466442 446806 483528 656552 898155 1036462 1005599 921604 920821
35829I20821P6376N1977j6575l6781j1486L485Q804M6658R9250R3695K6184n444
$$ 920821 997197 1049174 1032599 995818 984332 987817 996621 1043279 1142529 1236224 1262408 1256964
35817A256964N3122J09138N3428n6138o4420L6118P2249m9762j83584j44674K3622
$$ 1256964 1310086 1419224 1472652 1416514 1352094 1388212 1460461 1410699 1227115 1082441 1106063
35806A106063J18463N9277m1690p7167o9840p3087p5193o1230p0163j18208j40521
$$ 1106063 1224526 1283803 1242113 1164946 1095106 1022019 946826 885596 815433 697225 556704
35795E56704q4052j440K0071k2780p1456j02865j27235j23843o7015j558m392
$$ 556704 472652 471212 491283 468503 397047 294182 166947 43104 -23911 -25469 -29861
35784b9861o6727r4151m0716K8655L5849j3749o6437r5693r6993n2106M2292J30340
$$ -29861 -96588 -190739 -231455 -202800 -166951 -180700 -247137 -342830 -439823 -491929 -449637 -319297
35772c19297J39286P0283L586j372K3866J4658k2806j6468N1775Q6101o434j63866
$$ -319297 -180011 -109728 -106142 -107514 -83648 -68990 -91796 -108264 -56489 29612 23178 -140688
35760a40688k15317r5869O3855J09998N5170K0056M2987N4070J7778j3331k069
$$ -140688 -356005 -451874 -388019 -278021 -222851 -202795 -159808 -105738 -87960 -101291 -103360
35749a03360J7897K2782M3839Q7398R5772M9058L0351J10064K19052K24974J10158
$$ -103360 -85463 -62681 -18842 68556 164328 213386 243737 353801 572853 797827 907985
35738I07985l942k153J12805K46752L03700K56456J66100J21875J41910J68294
$$ 907985 904043 901890 1014695 1261447 1565147 1821603 1987703 2109578 2251488 2419782
35728B419782J80652K42275L73303M56463L77166K08697J27323J60173J61685
$$ 2419782 2600434 2842709 3216012 3672475 4049641 4258338 4385661 4545834 4707519
35719D707519N9957k4594K3893J30149J48561Q5813P4345J57377K23549J70667
$$ 4707519 4767476 4742882 4766775 4896924 5045485 5131298 5205643 5363020 5586569 5757236
35709E757236M4224k8827J755N7811L1214q4618j76827j43762l0311J6147o7186
$$ 5757236 5801460 5772633 5774388 5832199 5863413 5778795 5601968 5458206 5427895 5444042 5376856
35698E376856j83396k26620k32857k96116l86899l78460k56415j75089k46958
$$ 5376856 5193460 4966840 4733983 4437867 4050968 3672508 3416093 3241004 2994046
35689B994046l74726l85584k69994j72699j67154j66458r3261k3143o8471j89438
$$ 2994046 2619320 2233736 1963742 1791043 1623889 1457431 1364170 1341027 1272556 1083118
35679A083118k37725j69414r5113r5429j02402l3373N0934L3055o2514q3522K8642
$$ 1083118 845393 675979 580866 485437 383035 349662 400596 433651 371137 287615 316257
35668C16257J43266J16008j7636r5676l9734N8605O3811l9149j33745j14519j2315
$$ 316257 459523 575531 557895 462219 422485 481090 544901 505752 372007 257488 245173
35657B45173M8206P410o0978o2515r419K0130Q761N813K3650J7990j9520l4089
$$ 245173 293379 300789 239811 177296 167877 188007 196768 202581 226231 244221 224701 190612
35645A90612J680M4019N3759M5651L1227j3099p8914r8594l7947M4753Q1848P5693
$$ 190612 192292 236311 290070 335721 366948 353849 274935 176341 138394 183147 264995 340688
35633C40688M6463k2044j14617j39800m8648N9885N9607j7912l5698L2739O7145
$$ 340688 387151 365107 250490 110690 62042 121927 181534 163622 127924 160663 227808
35622B27808o380j03917j12457m2971O830r201m3404l0746L2696Q8907Q2320J8272
$$ 227808 221428 117511 5054 -37917 -31087 -40288 -83692 -114438 -81742 7165 89485 107757
35610A07757n2541j00331j31449j36490q4578N000N5731M4211M2802R0226J05360
$$ 107757 55216 -45115 -176564 -313054 -397632 -392632 -336901 -292690 -249888 -159662 -54302
35599e4302K1880p6044p6532k5362l6449p3896r017J28169J63361O5435L484N1318
$$ -54302 -32422 -108466 -184998 -210360 -246809 -320705 -329722 -201553 -38192 27243 30727 82045
35587H2045N3457r2657k20176j36700O3971J40848O2451P229M9518O5434k4421
$$ 82045 135502 42845 -177331 -314031 -250060 -109212 -46761 -39532 9986 75420 50999
35576E0999j09818o6652N2561R7265J7396r3341j19778m0349O7347J10862P3275
$$ 50999 -58819 -125471 -72910 24355 41751 -51590 -171368 -211717 -144370 -33508 39767
35565C9767J4959j4243k5822l4117n703P3414J27921P4819m5674j05724n5137
$$ 39767 54726 40483 14661 -19456 -25159 48255 176176 250995 205321 99597 44460
35554D4460K4122L6078k2660q7465j02525o0401n302K060m3093p0654l1082K5957
$$ 44460 68582 104660 82000 -5465 -107990 -168391 -173693 -171633 -214726 -285380 -316462 -290505
35542b90505L3508K6403P9901J53401J21037k7086j40433j13379k3850L633k2581
$$ -290505 -256997 -230594 -150693 2708 123745 96659 -43774 -157153 -181003 -177370 -199951
35531a99951j2570M1696O0556Q177n9406p5037k8552L9450O6057P918r5268j26180
$$ -199951 -212521 -170825 -110269 -102092 -161498 -236535 -265087 -225637 -159580 -151662 -246930 -373110
35519c73110k4341J05660J03920k6044j01856p36J72603K26534J30367K4840P683
$$ -373110 -397451 -291791 -187871 -213915 -315771 -316507 -143904 82630 212997 237837 245520
35508B45520K1403j4635o2938m0969K6962L9138j8100m5209P714N6611J8328n5939
$$ 245520 266923 252288 189350 148381 175343 214481 196381 151172 158886 215497 233825 177886
35496A77886o3628o807K9339J8137J1637L1164L5462Q183r719K156Q260j1805
$$ 177886 114258 107451 136790 154927 166564 197728 233190 241373 231654 233810 242070 230265
35484B30265k2831J733L0632K4754q277l7342m5611k5839J9044N6883N5221L5186
$$ 230265 207434 209167 239799 264553 256276 218934 173323 147484 166528 223411 278632 313818
35472C13818L5744K4227o6116j89480j94778m3731Q9853M3563r8156j25531o034
$$ 313818 349562 373789 307673 118193 -76585 -120316 -30463 13100 -85056 -210587 -216621
35461b16621Q9287N4646j2901Q069P7785P7034n525o6871m0098L0676O5523M1277
$$ -216621 -127334 -72688 -85589 -77520 265 77299 71774 4903 -35195 -4519 61004 102281
35449A02281l982k3678l934K9923L6051m630o1564p3598j1096P6632R5569J0631
$$ 102281 98299 74621 70687 100610 136661 132031 70467 -3131 -14227 62405 157974 168605
35437A68605r6435j08026j2971P1669L9890p7836j58228j25723j2884R8411J52252
$$ 168605 72170 -35856 -48827 22842 62732 -15104 -173332 -299055 -311939 -213528 -61276
35426f1276J39894Q4880J9471l8201q6035j15855j07756n8181N850N4023P4125
$$ -61276 78618 163498 182969 144768 58733 -57122 -164878 -223059 -217209 -163186 -89061
35415h9061N9221Q157m6596n4832j8533j123l3521n9602k0945N1072Q3927O3980
$$ -89061 -29840 -21683 -68279 -123111 -141644 -142767 -176288 -235890 -256835 -205763 -121836 -57856
35403e7856K8619j334j7697L420N2551N4311k8600j02455n9060N0129P9895R059
$$ -57856 -29237 -30571 -48268 -44848 7703 62014 33414 -69041 -128101 -77972 1923 10982
35391A0982m8957n0751p7340j50215j56490l4609J03174J28411O2844n801o2069
$$ 10982 -37975 -88726 -166066 -316281 -472771 -507380 -404206 -275795 -212951 -218752 -280821
35380b80821j09909q9713K0062J02259M3053q5889j25950o1903q503m126K3724
$$ -280821 -390730 -480443 -460381 -358122 -315069 -400958 -526908 -588811 -597314 -601440 -577716
35369e77716R3501J25000Q3224L5615L2039L9280K7678K1591L1761L0103J8225
$$ -577716 -484215 -359215 -275991 -240376 -208337 -169057 -141379 -119788 -88027 -57924 -39699
35358c9699L0883N1707K1627m9601q2665n8931l9637l4509J6910R5466Q4202l0098
$$ -39699 -8816 42891 64518 14917 -67748 -126679 -166316 -200825 -183915 -88449 -4247 -34345
35346c4345q9651n460P8785N193j34425j29287K8428J39183R0143j9857o1712
$$ -34345 -123996 -129456 -50671 -45478 -179903 -309190 -280762 -141579 -51436 -71293 -133005
35335a33005l1068J5592N5285P5330M7569j9700o6508n8817l2741l1204l8476
$$ -133005 -164073 -148481 -93196 -17866 29703 10003 -56505 -115322 -148063 -179267 -217743
35324b17743p374P1068J42537J32793L0488p4176p8811m812K9658n282k986Q2031
$$ -217743 -225117 -154049 -11512 121281 151769 77593 -1218 -6030 23628 18346 15360 97391
35312I7391J20962J3932j17649j08570j7745j4183p2545k9883Q7674P6198p9479
$$ 97391 218353 232285 114636 6066 -11679 -25862 -98407 -128290 -40616 35582 -43897
35301d3897j39818j465J24124O6004l3512K796O7857k0317j65788j33306O4737
$$ -43897 -183715 -185180 -61056 4948 -28564 -25768 42089 21772 -144016 -277322 -212585
35290b12585J94420J58566P5480K9064j6246n4256k1098M1361J6501p0203p0475
$$ -212585 -18165 140401 215881 244945 228699 174443 153345 194706 211207 141004 70529
35279G0529K4175N2669l7808j02793n9833j8198m8106l4628R5231J89749R7871
$$ 70529 94704 147373 109565 6772 -53061 -71259 -119365 -153993 -58762 130987 228858
35268B28858o6751q3214N0461J38062P4003o1345j59116j75561q8723Q4896K25131
$$ 228858 162107 78893 129354 267416 341419 280074 120958 -54603 -143326 -58430 166701
35257A66701J95010J9460j25703j26553m4969K03j9468n0658n2166l3770k3782
$$ 166701 361711 381171 255468 128915 83946 84149 64681 14023 -38143 -71913 -95695
35246i5695k4933q051M0593P5043L8021m0180n9164N889N4861J3068n0920l9433
$$ -95695 -120628 -128679 -88086 -13043 24978 -15202 -74366 -68477 -13616 -548 -51468 -90901
35234i0901J5221J3351l9858m5987K0908P6928O3290J8352m246n816o342m399
$$ -90901 -75680 -62329 -102187 -148174 -127266 -50338 12952 31304 27058 21242 14900 10501
35222A0501J843j18j7794n1281r9073j32062r5027J3090J00559R3239M0838K9343
$$ 10501 12344 12226 -5568 -56849 -155922 -287984 -383011 -369921 -269362 -176123 -135285 -105942
35210a05942L6650j0096p0394l0532R1672J36399L5439q5303j00392n2527l8149
$$ -105942 -69292 -79388 -149782 -180314 -88642 47757 83196 -2107 -102499 -155026 -193175
35199a93175l8166K0907J10810J30754O3267l821o748K2986K4305j3506m8547
$$ -193175 -231341 -210434 -99624 31130 94397 90576 83828 106814 131119 117613 69066
35188F9066l2747L9998J14266J16259L5304n7268q8598n9965k4452j7234l2156
$$ 69066 36319 76317 190583 306842 342146 284878 196280 136315 111863 94629 62473
35177F2473m6925n0466n5232q2455j16793r5192J1342J20508J16869J2752n2861
$$ 62473 15548 -34918 -90150 -172605 -289398 -384590 -373248 -252740 -135871 -123119 -175980
35166a75980m123O9536N4576k1212m5853J903K6645m0427j42415j61186n1196
$$ -175980 -180103 -110567 -55991 -77203 -123056 -121153 -94508 -134935 -277350 -438536 -489732
35155d89732J04737J72885J09676J2474j525N2775O1407r352n8423o707Q0917
$$ -489732 -384995 -212110 -102434 -89960 -91485 -38710 22697 13345 -45078 -51785 29132
35144B9132R4405L3769r591J3098O1588P2466J9947p0261j32147j10028k4443
$$ 29132 123537 157306 147715 160813 222401 294867 314814 244553 112406 2378 -22065
35133b2065M6472O6830O9848O9902L0726l8382m7690M0289J23721R3299j4599
$$ -22065 24407 91237 161085 230987 261713 223331 175641 215930 339651 432950 418351
35122D18351q6006r0232p6370o2612l3933j1157k0862k8988J527K7441K98k2613
$$ 418351 332345 242113 165743 103131 69198 58041 37179 8191 9718 37159 37457 14844
35110A4844L6786J20001R8742j7025q0962k6917N1648N8594O654n2531r1812p6757
$$ 14844 51630 171631 270373 253348 172386 145469 197117 255711 262365 209834 118022 41265
35098D1265J2173R8476P0664m3189q6287l34Q6138N5106l8359p5149l5726K4952
$$ 41265 53438 151914 222578 179389 93102 92768 178906 234012 195653 120504 84778 109730
35086A09730P2047Q3733L5049m1067o0090j2825R596k5116k5518N1418R6894L1843
$$ 109730 181777 265510 300559 259492 199402 186577 196173 171057 145539 196957 293851 325694
35074C25694l7097R690Q6970L8492q8760j05097J6250R4392K0361r6334j14474
$$ 325694 288597 298287 385257 423749 334989 229892 246142 340534 360895 264561 150087
35063A50087n1391j3334l7364p6128p8547l2369L6120Q0642Q1465O6359N1629
$$ 150087 98696 85362 47998 -28130 -106677 -139046 -102926 -22284 59181 125540 177169
35052A77169L701p7846r7836O435J19982P3636j01827j99117j25400q116L3197
$$ 177169 180870 103024 5188 11623 131605 205241 103414 -95703 -221103 -229219 -196022
35041a96022N2556J25112J76566R7395o4720j56602j13271m4R1634J02530J1093
$$ -196022 -143466 -18354 158212 255607 190887 34285 -78986 -79030 12604 115134 126227
35030A26227j26837j85084j00755L6560J05486J08616J14919J06662J3178j28324
$$ 126227 -610 -185694 -286449 -249889 -144403 -35787 79132 185794 198972 70648
35020G0648j83750j08362p635J5276k2770m8064k4633M3928J27891J58414P9726
$$ 70648 -113102 -221464 -229099 -213823 -236593 -284657 -309290 -265362 -137471 20943 100669
35009A00669n4653j14816n6490K7658N1178L7982L4938J7924l6718o9113k0016
$$ 100669 46016 -68800 -125290 -97632 -46454 -8472 26466 44390 7672 -61441 -81457
34998h1457O1535R0495P3823O5322M3844l9498j24952r9152J1921N2695k5055
$$ -81457 -19922 70573 144396 209718 253562 214064 89112 -10040 1881 54576 29521
34987B9521p9551k555J04743Q3618n1242j52267j46705q3339j2439N8426J02790
$$ 29521 -50030 -52585 52158 135776 84534 -67733 -214438 -297777 -310216 -251790 -149000
34976a49000Q2885K5067n070n420k4784n0619j7359N9393P4729j79n9179k8634
$$ -149000 -66115 -41048 -46118 -51538 -76322 -126941 -144300 -84907 -10178 -10357 -69536 -98170
34964i8170J6559q691m4832J0302J13970J31209M6461j5656J1239M4653K853o1313
$$ -98170 -81611 -90302 -135134 -124832 -10862 120347 166808 151152 162391 207044 209897 148584
34952A48584m6568M3906J11154R2159K2470k4345j7645J3117J9824j2113n0824
$$ 148584 102016 145922 257076 349235 371705 347360 329715 342832 362656 350543 299719
34941B99719n9032l7372j1528R117L0945M4787L4401J6046K8817P5727J09868
$$ 299719 240687 203315 191787 200904 231849 276636 311037 327083 355900 431627 541495
34930E41495R2155L3848k7517o4602o4666l0662R719K5870K5333M1884P4175P5977
$$ 541495 633650 667498 639981 575379 510713 480051 489770 515640 540973 582857 657032 733009
34918G33009K6768k6007k6092J5483L6188L418m5812m9616K623M7452J8482n6210
$$ 733009 759777 733770 707678 723161 759349 762767 716955 667339 669962 717414 735896 679686
34906F79686o8895K1996J06884N3743j07715k18361j96525j13340n3311j3206
$$ 679686 610791 632787 739671 793414 685699 467338 270813 157473 104162 90956
34896I0956K1342J2066m7346p5965k0849M6473L6538k0374l5291q48K6100K9177
$$ 90956 112298 124364 77018 1053 -19796 26677 63215 42841 7550 6702 32802 61979
34884F1979J9620k7391j12015j38662l7392Q6226P5060l0140l8483Q7502J63752
$$ 61979 81599 54208 -57807 -196469 -233861 -147635 -72575 -102715 -141198 -53696 110056
34873A10056P1648o6715r2335l2536o47o30K6489N2393P682p1366p7779O831R8286
$$ 110056 181704 114989 22654 -9882 -10529 -11159 15330 67723 75405 4039 -73740 -66909 31377
34860C1377J37529J35545J07603N4830L135j6798j8038k3920j5959J7060K2716
$$ 31377 168906 304451 412054 466884 470019 453221 435183 411263 395304 412364 435080
34849D35080l3816p4876n394J24286J69061R3773R495K416M4750Q9853J33961
$$ 435080 401264 326388 320994 445280 614341 708114 717609 720025 764775 854628 988589
34838I88589J51282Q5724m0675j10685n9644M2752J04709J19977J15718Q5020
$$ 988589 1139871 1225595 1184920 1074235 1014591 1057343 1162052 1282029 1397747 1482767
34828A482767L3676J2615M0271O7752P6722J22461K12932K46615J66149Q0545
$$ 1482767 1516443 1529058 1569329 1637081 1713803 1836264 2049196 2295811 2461960 2542505
34818B542505J14810K12646K25341J44855R9152J38444J78645J66148J52445J64523
$$ 2542505 2657315 2869961 3095302 3240157 3339309 3477753 3656398 3822546 3974991 4139514
34808D139514J30558N486j22912j35354l6630N7175N9917l062m0472M465R2722
$$ 4139514 4270072 4275558 4152646 4017292 3980662 4037837 4097754 4094692 4054220 4058685 4151407
34797D151407J29327P9004J7512K7717P5953O2514k1588p9406n9589k9580o0267
$$ 4151407 4280734 4359738 4377250 4404967 4480920 4543434 4521846 4442440 4382851 4353271 4293004
34786D293004j19609j38687j23241j32645j81901k25710k27654k00392j78545
$$ 4293004 4173395 4034708 3911467 3778822 3596921 3371211 3143557 2943165 2764620
34777B764620j78054j84026j70928j37686j13942j17179j22999j06616q8843r6770
$$ 2764620 2586566 2402540 2231612 2093926 1979984 1862805 1739806 1633190 1544347 1447577
34767A447577j05144p7582m4119o2558j15742j31956j01674q0173p4390l6173
$$ 1447577 1342433 1264851 1220732 1158174 1042432 910476 808802 728629 654239 618066
34757F18066J9628J3816m8759o2140l252R307p7484j33120n6259L2299k2235j34876
$$ 618066 637694 651510 602751 540611 537359 546666 469182 336062 279803 312102 289867 154991
34745A54991j03309N1598R7662m4810j71732j03173O0689J12003L3463k0867K4871
$$ 154991 51682 103280 200942 156132 -15600 -118773 -58084 53919 87382 66515 91386
34734I1386Q1311N1877l1929p0186l0507K3194K4766r831j3507L4454Q3225Q8178
$$ 91386 172697 224574 192645 122459 91952 115146 139912 130081 116574 151028 234253 322431
34722C22431O3752L4215j2321p4228r4307l4020N1097Q2608O8484O1674M9672
$$ 322431 386183 420398 408077 333849 239542 205522 256619 339227 407711 469385 519057
34711E19057j2042q1720o5870K6857Q3739N7135J9953K1599O972o5529j31609
$$ 519057 507015 425295 359425 386282 470021 527156 547109 568708 575680 510151 378542
34700C78542j21626p0090m5973m0305m923M5895N4243J3314k3348j6166K0582
$$ 378542 256916 186826 140853 100548 95625 141520 195763 209077 185729 169563 190145
34689A90145M2503J5716m5566p3349j6238P7855J02825L0549n4867p4349l8013
$$ 190145 232648 248364 202798 129449 113211 191066 293891 324440 269573 195224 157211
34678A57211M799K3373n023p4907j00799L130J54778J51932l7018j74897p0943
$$ 157211 162010 185383 180360 105453 4654 7784 162562 314494 277476 102579 31636
34667C1636J35746J74880L0453p3424k4037O2443Q7222J14871J92586K05636N0735
$$ 31636 167382 342262 372715 299291 275254 337697 424919 539790 732376 938012 988747
34656I88747j58554k12282q5774L4893J1873p6068p4120J9495N8879k6753j15715
$$ 988747 830193 617911 532137 567030 578903 502835 428715 448210 507089 480336 364621
34645C64621n9746R7571J72972R8944N407J2195N9270K4539q0748j39113r2969
$$ 364621 304875 402446 575418 674362 679769 691964 751234 775773 695025 555912 462943
34634D62943J4363J19718J70228J18795j0329r2332m3741M5640L6113m8295o7112
$$ 462943 477306 597024 767252 886047 875718 783386 739645 785285 821398 773103 705991
34623G05991L442M5556J1797o917L5759N4058l079m4380O302O7305L1709n0260
$$ 705991 709433 754989 766786 759869 795628 849686 846607 802227 808529 875834 907543 857283
34611H57283n1872K4589N6861J228m0096K2823J29306J45190M4080m8739j4308
$$ 857283 805411 830000 886861 888089 847993 870816 1000122 1145312 1189392 1140653 1126345
34600A126345R5471J15537m027j14742p4474M8350Q3285J0507l7382j468L4622
$$ 1126345 1221816 1337353 1333326 1218584 1144110 1192460 1275745 1286252 1248870 1247402 1282024
34589A282024J4700r672j0017m1164j09545j23769n2868j0l2660o9580l3589J3059
$$ 1282024 1296724 1287052 1277035 1235871 1126326 1002557 949689 949679 917019 847439 813850 826909
34577H26909j195j7759K9745O9581J7567n2703k8075M2329L8808p668K0866R2866
$$ 826909 825714 807955 837700 907281 924848 872145 844070 886399 925207 917539 938405 1031271
34565A031271O4524n6046r2761J7558J20163Q2435k4603o8153m3388k5607l0023
$$ 1031271 1095795 1039749 946988 964546 1084709 1167144 1142541 1074388 1031000 1005393 975370
34554I75370j4423L4951Q9931J17202R3085K1443m6166n4102j2590K2928L1004
$$ 975370 960947 995898 1085829 1203031 1296116 1317559 1271393 1217291 1204701 1227629 1258633
34543A258633K6831J3307J037L5673J11794J14659k1625j52226r4071P2212R1693
$$ 1258633 1285464 1298771 1299808 1335481 1447275 1561934 1540309 1388083 1294012 1366224 1457917
34532A457917o3561j34553R766J59144J11482m181K9101J39521J01488o8711j38854
$$ 1457917 1394356 1259803 1269569 1428713 1540195 1536014 1565115 1704636 1806124 1737413 1598559
34521A598559m2360L9841r85m8714K24N8650J8589o0002n7786J2784M6380R831
$$ 1598559 1556199 1596040 1595055 1546341 1546565 1605215 1623804 1563802 1506016 1518800 1565180 1575011
34509A575011l6614m6804l2766j7634o185K754J1527K6638M9086P1259Q5504P9094
$$ 1575011 1538397 1491593 1458827 1441193 1435008 1437762 1449289 1475927 1525013 1596272 1681776 1760870
34497A760870L4552l1449n0875J7735J07929J12860L3429j8525K4026J05052J43381
$$ 1760870 1795422 1763973 1713098 1730833 1838762 1951622 1985051 1966526 1990552 2095604 2238985
34486B238985J23984O0427m1351j29900j10132K4021J31877Q9452m6057j25631
$$ 2238985 2362969 2423396 2382045 2252145 2142013 2166034 2297911 2387363 2341306 2215675
34476B215675j08573o7205l4204K5882J02380J26933R6500Q8506J19078J04562
$$ 2215675 2107102 2039897 2005693 2031575 2133955 2260888 2357388 2445894 2564972 2669534
34466B669534J7493l7941J2246Q2174O5785J4262L8851J04041Q1098j8005l7318
$$ 2669534 2687027 2649086 2661332 2743506 2809291 2823553 2862404 2966445 3047543 3029538 2992220
34455B992220O8770J47702Q3131l0105m4517K6641P3497P2437P0042N2786j8461
$$ 2992220 3060990 3208692 3291823 3261718 3217201 3243842 3317339 3389776 3459818 3512604 3494143
34444C494143q0293k7046J03135J49581O2392j9277L0278J61301K55262K92792
$$ 3494143 3413850 3386804 3489939 3639520 3701912 3682635 3712913 3874214 4129476 4422268
34434D422268L30797L80915L96018L42884K31438J04935L6951Q4500J99539K46259
$$ 4422268 4753065 5133980 5529998 5872882 6104320 6209255 6246206 6330706 6530245 6776504
34424F776504J63204N3240M8094J35040J94912J73700J30497J29199J60351J78503
$$ 6776504 6939708 6992948 7041042 7176082 7370994 7544694 7675191 7804390 7964741 8143244
34414H143244J66066J49050J69148K29342K64716K14597J33738J49614K69288
$$ 8143244 8309310 8458360 8627508 8856850 9121566 9336163 9469901 9619515 9888803
34405I888803L31606K37314J28266K04640M29661N75076N35233M30814L90574
$$ 9888803 10220409 10457723 10585989 10790629 11220290 11795366 12330599 12761413 13151987
34396A3151987L96238L94617M13069M75975N19430M88046M40259M68546N72369
$$ 13151987 13548225 13942842 14355911 14831886 15351316 15839362 16279621 16748167 17320536
34387A7320536O85970P77870Q49033Q83754Q82331R04965J005541J146163J244405
$$ 17320536 18006506 18784376 19633409 20517163 21399494 22304459 23310000 24456163 25700568
34378B5700568J283154J312345J366720J447815J568792J747939J963100K173360
$$ 25700568 26983722 28296067 29662787 31110602 32679394 34427333 36390433 38563793
34370C8563793K384769K638651K933598L216696L468968L756482M172394M747758
$$ 38563793 40948562 43587213 46520811 49737507 53206475 56962957 61135351 65883109
34362F5883109N432058O152744O894149P724384Q738415R979472J1443383J3154580
$$ 65883109 71315167 77467911 84362060 92086444 100824859 110804331 122247714 135402294
34354A35402294J5179891J7543432K0184927K3037409K6077029K9218638L2168471
$$ 135402294 150582185 168125617 188310544 211347953 237424982 266643620 298812091
34347B98812091L4358731L4882483L2442167K5695950J4229886m98436j5357207
$$ 298812091 333170822 368053305 400495472 426191422 440421308 439922872 424565665
34340D24565665k7073597l3904479l6102006l5097051l2411339k9113271k5799549
$$ 424565665 397492068 363587589 327485583 292388532 259977193 230863922 205064373
34333B05064373k2735044j9987256j7546468j5383949j3445499j1679530j0111240
$$ 205064373 182329329 162342073 144795605 129411656 115966157 104286627 94175387
34326I4175387q823991p819871o962773o125165n335676m698131m208073l755694
$$ 94175387 85351396 77531525 70568752 64443587 59107911 54409780 50201707 46446013
34318D6446013l296342k902609k626517k415701k208762k018172j859419j686029
$$ 46446013 43149671 40247062 37620545 35204844 32996082 30977910 29118491 27432462
34310B7432462j474584j301764j242389j242797j192883j082344r81675r02342
$$ 27432462 25957878 24656114 23413725 22170928 20978045 19895701 18914026 18011684
34302A8011684p95939o79325o33340o63838o82010o45438o01852n64961m77774
$$ 18011684 17215745 16536420 15903080 15239242 14557232 13911794 13309942 12744981 12267207
34293A2267207l51956l08356l92280m67736m04443k71301k23180k78617l42556
$$ 12267207 11915251 11606895 11214615 10746879 10342436 10071135 9847955 9569338 9226782
34284I226782l81843m29462m55636l88245k51181j46466j04317q0753r1258j93339
$$ 9226782 8844939 8415477 7959841 7571596 7320415 7173949 7069632 6988879 6897621 6704282
34274F704282l27157l40176k14535j13052j35689j84112j53520j04799j23390
$$ 6704282 6377125 6036949 5822414 5709362 5573673 5389561 5236041 5131242 5007852
34265E007852j43493p1613J4687k9088j68023k28154j65050j13593j51488j82588
$$ 5007852 4864359 4792746 4807433 4778345 4610322 4382168 4217118 4103525 3952037 3769449
34255C769449j14974j4168Q095m3108q3781q0267n7150l0913j5118m8364j36569
$$ 3769449 3654475 3640307 3648402 3605294 3521513 3441246 3384096 3353183 3338065 3289701 3153132
34244C153132j96541j38574M164J00387P8071l035m5505k7751l746k7263r8907
$$ 3153132 2956591 2818017 2822181 2922568 3000639 2997604 2952099 2924348 2920602 2893339 2794432
34233B794432j69403j84180j36440p3466l7953k0936J279J0210k3704o7885n3777
$$ 2794432 2625029 2440849 2304409 2230943 2192990 2172054 2173333 2183543 2159839 2091954 2038177
34222B038177J5463N4123J8662k6022j3914J1596l0175j13508j25482k6364R0037
$$ 2038177 2053640 2107763 2126425 2100403 2086489 2098085 2067910 1954402 1828920 1802556 1892593
34211A892593J17927N9533p092l3183l3812m3914p4974j09074j18855r4782n2263
$$ 1892593 2010520 2070053 2062961 2029778 1995966 1952052 1877078 1768004 1649149 1554367 1502104
34200A502104o024M6368R5577R9687L4030n3233q7013o2181m1131n6262p5947
$$ 1502104 1496080 1542448 1638025 1737712 1771742 1718509 1631496 1569315 1528184 1471922 1395975
34189A395975p3710o4025n1896j4377M0912O2732L1341j4987n3009r8857j28832
$$ 1395975 1322265 1258240 1206344 1191967 1232879 1295611 1326952 1311965 1258956 1160099 1031267
34178A031267p0343O9375J58550J08039L491k4761R222K561m8768n0886K1469
$$ 1031267 960924 1030299 1188849 1296888 1300379 1275618 1284840 1287401 1238633 1187747 1209216
34167A209216Q4531P3522R116o5191j19955j17062m0859M8631P4239M2125O715
$$ 1209216 1293747 1367269 1376385 1311194 1191239 1074177 1033318 1081949 1156188 1198313 1205028
34156A205028l0488q8431j14325n0958L3379K5196m3543m3785K1434J9109o6177
$$ 1205028 1174540 1086109 971784 920826 954205 979401 935858 892073 913507 932616 866439
34145H66439q5678J8067J01937N1444n6103j09293j14150r1471J22J23606J26717
$$ 866439 780761 798828 900765 952209 896106 786813 672663 581192 581314 704920 831637
34134H31637j6846j08084k1493Q1068K4897p4892k5965Q6787M8266r5535j08687
$$ 831637 814791 706707 685214 766282 791179 716287 690322 777109 825375 729840 621153
34123F21153K3034P0568m2037j21540l8565R0719J30307R7562L7631n3777j10800
$$ 621153 644187 714755 672718 551178 512613 603332 733639 831201 868832 815055 704255
34112G04255k3437J38644J56546N744p2182M3159J46802N5866q4231n9763N2902
$$ 704255 680818 819462 976008 981752 909570 952729 1099531 1155397 1071166 1011403 1064305
34101A064305M6843n2911o2612K4918N3392j519j3182L4858J7684q1094j16567
$$ 1064305 1111148 1058237 995625 1020543 1073935 1072416 1059234 1094092 1111776 1030682 914115
34090I14115l0557M6784J2837o1726q3333p9864r7704q0813K9780J56022J59885
$$ 914115 883558 930342 943179 881453 798120 718256 620552 539739 569519 725541 885426
34079H85426L0732r2747q7835J7303Q5384K6926r8769j53804q9435J73J4393k2095
$$ 885426 916158 823411 735576 752879 838263 865189 766420 612616 523181 523354 537747 515652
34067E15652j9845L2824O6019L9982j5845o0786p3659m2004J8633N6471M9807
$$ 515652 495807 528631 594650 634632 618787 558001 484342 442338 460971 517442 567249
34056E67249M4198O4360N0599k9844p8534L80J15725R5319m7058j23052n8508
$$ 567249 611447 675807 726406 696562 618028 618408 734133 829452 782394 659342 600834
34045F00834P962l5108j03047p4640J7570O3171L7461j1712n5938p1995j5967
$$ 600834 608796 573688 470641 396001 413571 476742 514203 502491 446553 374558 358591
34034C58591R2535J34740M4756o6720n2321N7901J02948K5260o5287o7723j8190
$$ 358591 451126 585866 630622 563902 511581 569482 672430 697690 632403 564680 546490
34023E46490m146l2013l7213J1500O7425O4879P14n8464n7020k0716j5803m9745
$$ 546490 542344 510331 473118 484618 552043 616922 617636 559172 502152 481436 465633 415888
34011D15888o5057l5734m464q45P911M2079N1960k410o7131o3050k097L9342L7661
$$ 415888 350831 315097 310633 309788 317699 359778 411738 409328 342197 279147 277050 316392 354053
33998C54053L5621N1393N1509J9254j6734l4580m2921l9245p18O1078Q7904N1476
$$ 354053 389674 441067 492576 511830 495096 460516 417595 378350 377632 438710 526614 578090
33986E78090J472m757J1383j1105o1278n4728L3965J04422N7197n6363r7754l9031
$$ 578090 579562 574805 586188 575083 513805 459077 493042 597464 654661 598298 500544 461513
33974D61513Q922j8133m5902j3571P731m5010p9913O045J20562R8224k0034m0786
$$ 461513 470435 452302 406400 392829 400560 355550 275637 281682 402244 500468 480434 439648
33962D39648N8014Q8380k3098j10140n7638J2064j7553m0147O2243J70808J13860
$$ 439648 497662 586042 562944 452804 395166 407230 389677 349530 411773 582581 696441
33951F96441l6337q5275l3517k7571o6666k2020Q0924O9342o7212j28170k2658
$$ 696441 660104 574829 541312 513741 447075 425055 505979 575321 508109 379939 357281
33940C57281R0513O8802j2653k9797j076O453J0739L5975L0615k1182k5207P0595
$$ 357281 447794 516596 503943 474146 473070 479523 490262 526237 556852 535670 510463 581058
33928E81058J59021J26416K4928k4411r215J3524M8189J20875J75556J41253N8484
$$ 581058 740079 866495 891423 867012 857797 871321 919510 1040385 1215941 1357194 1415678
33917A415678K4650N4767R7132J35062J68392J53406P8555M1024J15927K04731
$$ 1415678 1440328 1495095 1592227 1727289 1895681 2049087 2127642 2168666 2284593 2489324
33907B489324J67558O4564Q4677K41284L34449K56771J47397J52536J97457J30761
$$ 2489324 2656882 2721446 2806123 3047407 3381856 3638627 3786024 3938560 4136017 4266778
33897D266778j9969r1985k9356O3797R5310Q2101O2538K4264l5085n7375K82Q3591
$$ 4266778 4246809 4154824 4125468 4189265 4284575 4366676 4429214 4453478 4418393 4361018 4361300 4444891
33885D444891R9177L6525k5849l3441j7962l0915o7965r4530j05260j12510j08971
$$ 4444891 4544068 4580593 4554744 4521303 4503341 4472426 4404461 4309931 4204671 4092161 3983190
33874C983190r5736j16696j94914k57623k13922j02333n8206j17332j64933j24044
$$ 3983190 3887454 3770758 3575844 3318221 3104299 3001966 2943760 2826428 2661495 2537451
33864B537451p6772j17497j89785j80982j04011o0957p3463p5225m7970m2556
$$ 2537451 2460679 2343182 2153397 1972415 1868404 1807447 1733984 1658759 1610789 1568233
33854A568233p0793q7091p9574p8079p1721k3638K8385m5r1561j20815l4569O6390
$$ 1568233 1497440 1410349 1330775 1252696 1180975 1157337 1185722 1185677 1094116 973301 938732 1005122
33842A005122P5206J4904l2631n1522p6231j10792j29841j22592r0713l8533N736
$$ 1005122 1080328 1095232 1062601 1011079 934848 824056 694215 571623 480910 442377 448113
33831D48113M661k8010l2983P409M5137M6305K7215l315n1964p0113J8618J74240
$$ 448113 452774 424764 391781 399190 444327 490632 517847 514532 462568 392455 411073 585313
33819E85313K33904J19107n0783j28754j19779r9050o3241R433M7188j1844p1830
$$ 585313 819217 938324 887541 758787 639008 539958 476717 486150 533338 521494 449664
33808D49664m508J18531J01784o8819j79996r1987P3543J16537O742j27987j70715
$$ 449664 445156 563687 665471 596652 416656 324669 398212 514749 521491 393504 222789
33797B22789j03477P042O1198J7619m5546k5820M7820N4682j5735l5973M4267
$$ 222789 119312 126354 187552 205171 159625 133805 181625 236307 220572 184599 228866
33786B28866J00703L5420n6694l8107N7914R4948M2000j6693l2602l1794l4895
$$ 228866 329569 364989 308295 270188 328102 423050 465050 448357 415755 383961 349066
33775C49066m4560q0535j29635j05529L1884J63501J44790J6410n8140l7307k4467
$$ 349066 304506 223971 94336 -11193 20691 184192 328982 345392 287252 249945 225478
33764B25478n3918l5848M7886P1586k8424j24649q1524M5646J05388N8468j3355
$$ 225478 171560 135712 183598 255184 226760 102111 20587 66233 171621 230089 216734
33753B16734m0877j4382M9258J02970Q2100r275p9252p5144n5839p0339n8201
$$ 216734 175857 161475 210733 313703 395803 386528 307276 232132 176293 105954 47753
33742D7753L2890J22819J14106N1836L0762J4319q8386k11015j82869N703J65047
$$ 47753 80643 203462 317568 369404 400166 414485 326099 115084 -67785 -62082 102965
33731A02965J62171O2375j9668o2976q4871p5974m8448l8815k5438L9917R9095
$$ 102965 265136 327511 307843 244867 159996 84022 35574 -3241 -28679 11238 110333
33720A10333L9851q4951p8480Q4367J66613K4915j41405q6529R8598J35020j6878
$$ 110333 150184 65233 -13247 71120 237733 262648 121243 34714 133312 268332 251454
33709B51454j34740r6507j5120M10o559J9234M2954M0402M6251M8167j8614j18553
$$ 251454 116714 20207 5087 5497 -1062 18172 61126 101528 147779 195946 177332 58779
33697E8779j13353J6672J01438K6518q8816p6433L2807Q1452K5617l5393k7597
$$ 58779 -54574 -37902 63536 90054 1238 -75195 -42388 39064 64681 29288 1691
33686A691J9347M5200K0867m6016r8563n4719Q7172K03125J78635N5461l3911
$$ 1691 21038 66238 87105 41089 -57474 -112193 -25021 178104 356739 412200 378289
33675C78289m3851l6317m5361k6953L8882Q3574L3807q2890j53618r1821P1547
$$ 378289 334438 298121 252760 225807 264689 348263 382070 299180 145562 53741 125288
33664A25288J99897J69261m200j68540j85723o0147R0438J55637J06998O00o0778
$$ 125288 325185 494446 490246 321706 135983 75836 166274 321911 428909 429509 368731
33653C68731j1071R6656J32760M8777o0539r1761o1840m3290m0127j3663K1305
$$ 368731 357660 454316 587076 635853 575314 483553 421713 378423 338296 324633 345938
33642C45938K2367O958K1004M7263L5160l762k0768k0912l1240j1998Q2907J81597
$$ 345938 368305 375263 396267 443530 478690 474928 454160 433248 402008 390010 472917 654514
33630F54514J65032N4676j3440n956k2459q1197n6360R2112J97002J17363l9873
$$ 654514 819546 874222 860782 854826 832367 751170 694810 786922 983924 1101287 1061414
33619A061414p7695R298O6313K8844j3971J6506R3003J47475J31704K7456j13302
$$ 1061414 983719 993017 1059330 1088174 1074203 1090709 1183712 1331187 1462891 1490347 1377045
33608A377045j67179p7134M2446M8907j9933j8741N3546N2863m3979o8716O4545
$$ 1377045 1209866 1132732 1175178 1224085 1204152 1185411 1238957 1291820 1247841 1179125 1243670
33597A243670J93070J43942L27l4209N5812J09745O8815M8033J11473J55164R0948
$$ 1243670 1436740 1580682 1581009 1546800 1602612 1712357 1781172 1829205 1940678 2095842 2186790
33586B186790P877L5200J31381J42170L8876k8197O3525K46138L59872L53191
$$ 2186790 2194667 2229867 2361248 2503418 2542294 2514097 2577622 2823760 3183632 3536823
33576C536823L13010L18905L45780L34828L03422L27196M29189N46142O20403
$$ 3536823 3849833 4168738 4514518 4849346 5152768 5479964 5909153 6455295 7075698
33567G075698O76768P70989Q95678R93916J061864J181158J425173J768042K115545
$$ 7075698 7752466 8523455 9419133 10413049 11474913 12656071 14081244 15849286 17964831
33558A7964831K405844K652219K893585L115328L203553K969057K254548J068410
$$ 17964831 20370675 23022894 25916479 29031807 32235360 35204417 37458965 38527375
33550C8527375l75379j759244k806593l360599l413398l123328k749870k469154
$$ 38527375 38151996 36392752 33586159 30225560 26812162 23688834 20938964 18469810
33542A8469810k244776j944324j569492j274549j146592j085121r59871p89443
$$ 18469810 16225034 14280710 12711218 11436669 10290077 9204956 8245085 7455642
33534G455642o74967o32426n97425n46906n03428m48547l48935k55118k50943
$$ 7455642 6780675 6148249 5550824 5003918 4500490 4051943 3703008 3447890 3196947
33525C196947k99997k72829j54905q9352j50007k06812j24035J5783K7854r7735
$$ 3196947 2896950 2624121 2469216 2379864 2229857 2023045 1899010 1914793 1942647 1844912
33515A844912j89991j52940p7358o8830r7260q4980m4970l9268n6981l1890L4011
$$ 1844912 1654921 1501981 1424623 1355793 1258533 1173553 1128583 1089315 1032334 1000444 1034455
33504A034455N2437k5543j27230j41685n5746L5003M5123q399m6472l2225l471
$$ 1034455 1086892 1061349 934119 792434 736688 771691 816814 808415 761943 729718 726247
33493G26247q644m5074p2950o6453l2354P947L6223M3809L3780J5037p965l0437
$$ 726247 717603 672529 599579 533126 500772 508719 544942 588751 622531 637568 629603 599166
33481E99166l5324q626K8913L2914q814n6946p1822n6258l0725j024K1857P280
$$ 599166 563842 555216 584129 617043 608229 551283 479461 423203 392478 391454 413311 420591
33469D20591m6376p8362l5225M3491O8281K1950k5454l1140l8038q3870j12849
$$ 420591 374215 295853 260628 304119 372400 394350 368896 337756 299718 215848 102999
33458A02999m3745R7046J78718J17209k2016j02327p1826k050K2759O516N574
$$ 102999 59254 156300 335018 452227 430211 327884 256058 254008 276767 283283 288857
33447B88857L0961M0014J5237p437j699J1093J1078J7763M4840O1655M0332P59
$$ 288857 319818 359832 375069 367632 365933 377026 388104 405867 450707 512362 552694 553453
33435E53453l4178q2877j49491j70337r0744L5490J03678R3541O3312K9912m0642
$$ 553453 519275 436398 286907 116570 25826 61316 164994 258535 321847 351759 311117
33424C11117j22903j26573l3631N8195P2458M4891K9916R226l9019o2720j2818
$$ 311117 188214 61641 28010 86205 158663 203554 233470 242696 203677 140957 128139
33413A28139O1788Q0284M5279J4611K370j1250j2866J3631K4742j9851n9992o477
$$ 128139 189927 270211 315490 330101 332471 321221 308355 321986 346728 326877 266885 260408
33401B60408J01651J24624K0069r3963j07283n2109j8619j7563M153O0117J01848
$$ 260408 362059 486683 506752 412789 305506 253397 234778 217215 221368 281485 383333
33390C83333Q0227p420j11712j53421q5042M6002J27605R8800Q252n3010l9997
$$ 383333 463560 456140 344428 191007 105965 151967 279572 378372 386624 333614 293617
33379B93617L1033J03602J04137O058j05596j02220J8509J04143M4616p4078r3231
$$ 293617 324650 428252 532389 538447 432851 330631 349140 453283 497899 423821 330590
33368C30590q36P1650M1487l9702q7799p8872k7249M6362J01490R9551O0398L8628
$$ 330590 329754 401404 442891 403189 315390 236518 209269 255631 357121 456672 517070 555698
33356E55698L2355j3028r2219j17394n2451J2165j1297o9812n1891L2955O4667
$$ 555698 588053 575025 482806 365412 312961 325126 313829 244017 192126 225081 289748
33345B89748O23n3021R55J02511J14853J3041q5818p9436N57N3743M3332J2701
$$ 289748 290371 237350 238305 340816 455669 468710 382892 303456 304013 357756 401088 413789
33333D13789k992j5802l1391k1222J9817M0811Q680k4855Q421Q2474J03919M3077
$$ 413789 410797 394995 363604 342382 362199 403010 411690 386835 395256 477730 581649 624726
33321F24726k9864m5519j0173K9074L3493k1245j20722j80315j13593M3771J54450
$$ 624726 594862 549343 539170 568244 601737 580492 459770 279455 165862 209633 364083
33310C64083J49498R1622M0858k6490j03762r1900L5234J20832L3724j05201r1051
$$ 364083 513581 605203 646061 619571 515809 423909 459143 579975 613699 508498 417447
33299D17447L4519M5059r2237j52781k9903P6006j4973j54842r4296J19865K09541
$$ 417447 451966 497025 404788 252007 222104 298110 283137 128295 33999 153864 363405
33288C63405P2300j01839j29838n5740j3130k0801q243M7395J00198J09571P5349
$$ 363405 435705 333866 204028 148288 135158 114357 106114 153509 253707 363278 438627
33277D38627K1371k1730l4481k4727j0674O071K4149J8876j8770l8251J1916Q9024
$$ 438627 459998 438268 403787 379060 368386 374457 398606 417482 398712 360461 372377 461401
33265D61401R2593N058p6064o9331o922L0883K1288j005o568N123J7515P485l1012
$$ 461401 553994 559052 482988 413657 406735 437618 458906 457901 451333 456456 473971 481456 450444
33252D50444o3330m8355l30K9453L4815N6482R2973Q7853L2444m549M376j1959
$$ 450444 387114 338759 338429 367882 402697 459179 552152 640005 672449 667900 672276 660317
33240F60317r1402j38206o0822N5936M7659q8670j84639j34809j3781O5932Q8268
$$ 660317 568915 430709 369887 425823 473482 384812 200173 65364 51583 117515 205783
33229B05783P5195J2107q4975j20175l8291O7093P0485l912k7345L3919Q5102
$$ 205783 280978 293085 208110 87935 49644 116737 187222 183310 155965 189884 274986
33218B74986O8709L8738L7972J9955m4307q3344l4873L8658M1085q728k3804k178
$$ 274986 343695 382433 420405 440360 396053 312709 277836 316494 357579 348851 325047 322869
33206C22869j5610o4446o7045k713M9899M1117J0259j1261m5950p9455m1915N9553
$$ 322869 307259 242813 175768 173055 222954 264071 274330 263069 217119 137664 95749 155302
33194A55302J07865N4107Q177M9531P3121l0580j49893r5639R0760J78817Q3884
$$ 155302 263167 317274 325451 374982 448103 417523 267630 171991 262751 441568 525452
33183E25452m3874q6022j06362j68319j88761q6372O1001J25148R5521L8089k2960
$$ 525452 481578 395556 289194 120875 -67886 -154258 -93257 31891 127412 165501 142541
33172A42541q2900r7750n1355j7125n8055j21030j16468m7864J8762N6759P1119
$$ 142541 59641 -38109 -89464 -106589 -164644 -285674 -402142 -450006 -431244 -374485 -303366
33161c03366N1000J2097K2527J01131J57043J19787N4540M6856N5463N179n1839
$$ -303366 -252366 -240269 -217742 -116611 40432 160219 214759 261615 317078 322257 270418
33150B70418j9772N3878M2721m0087o1147P564N9425N8324R1508J80026K13107
$$ 270418 250646 304524 347245 307158 246011 253575 313000 371324 462832 642858 855965
33139H55965J40443P3138J03430J55699J17437J2734n6998o4242n3637n2212o0977
$$ 855965 996408 1069546 1172976 1328675 1446112 1458846 1401848 1337606 1283969 1231757 1170780
33128A170780q3661j03107q4026m3878m9968j03258j14717n2891j3037n9218r7928
$$ 1170780 1087119 984012 899986 856108 806140 702882 588165 535274 522237 463019 365091
33117C65091j7746J22548J66881P4694n2768j25003j32651q8328n028O6771O8945
$$ 365091 347345 469893 636774 711468 658700 533697 401046 312718 307690 374461 443406
33106D43406J2572l4846l4112K855N1193P8947M7163l0986o5289K963R8611J01720
$$ 443406 455978 421132 387020 389875 441068 520015 567178 536192 470903 473866 572477 674197
33094F74197J4977m7624k6777J9351K0483k2141o9597r1684o8758r675K7696m187
$$ 674197 689174 641550 614773 634124 654607 632466 562869 471185 402427 392752 420448 416261
33082D16261o2129n6117K5110R9818J07430O7036J5955l5499p1198o2304k0473
$$ 416261 354132 298015 323125 422943 530373 597409 613364 577865 506667 444363 423890
33071D23890j037k8125o2979o1450j6929N8303J37959J63228Q6366m8646j29477
$$ 423890 422853 394728 331749 270299 253370 311673 449632 612860 699226 650580 521103
33060E21103j01259j7745M4676O4161N0461J1058l3056n1909m8878n1344n4484
$$ 521103 419844 402099 446775 510936 561397 572455 539399 487490 438612 387268 332784
33049C32784l4823j6678m1987p1014j9556Q1842Q9731l4617j33973p3953N4836
$$ 332784 297961 281283 239296 168282 148726 230568 320299 285682 151709 77756 132592
33038A32592P3415k8210j05991q2565j2072N2440J16135J60415J31389M1590j8093
$$ 132592 206007 177797 71806 -10759 -22831 29609 145744 306159 437548 479138 461045
33027D61045k940L3012L7465L0173L9731M9030M2683L7853L1375r255o1626l9516
$$ 461045 458105 491117 528582 558755 598486 647516 690199 728052 759427 750172 688546 649030
33015F49030P0803J47896R4437q666j4139P1416J05047L4624k4503K5709J21177
$$ 649030 719833 867729 962166 953500 939361 1010777 1115824 1150448 1125945 1151654 1272831
33004A272831J45182R7083O4033P8126R6413J01316J29684J94786K53323K71987
$$ 1272831 1418013 1515096 1579129 1657255 1753668 1854984 1984668 2179454 2432777 2704764
32994B704764K72245K85779L09476L25572L27075L05726K56498K10804K14961
$$ 2704764 2977009 3262788 3572264 3897836 4224911 4530637 4787135 4997939 5212900
32985E212900K50350K31748J24968Q935l4754l8123p6206j26218r8817O351Q4082
$$ 5212900 5463250 5694998 5819966 5828901 5794147 5756024 5679818 5553600 5454783 5461134 5545216
32974E545216P4782L1586P195k6857r3784j33569r3349l6383o8088j78769k46869
$$ 5545216 5619998 5651584 5658779 5631922 5538138 5404569 5311220 5274837 5206749 5027980 4781111
32963D781111k02090j17552j17330k31540l68245m18804l77085l39000l70339
$$ 4781111 4579021 4461469 4344139 4112599 3744354 3325550 2948465 2609465 2239126
32954B239126m03951l25853j53655m0404p1729j52380j55816r7409o6676o5297
$$ 2239126 1835175 1509322 1355667 1315263 1243534 1091154 935338 837929 771253 705956
32944G05956l7746j2229o2228j41088j13124K3053R4001l509j50822j86101j16274
$$ 705956 668210 655981 593753 452665 339541 362594 456595 453086 302264 116163 -111
32933a11m4514Q230P3281J03658L3955o3673m7591O5962J02908n723j14377q8117
$$ -111 -44625 -36395 36886 140544 174499 110826 63235 129197 232105 226382 112005 23888
32921B3888J196J2016m3531n1029P66J6740k8101n5596l5072k9432n7344l8695
$$ 23888 25084 37100 -6431 -57460 -56694 -39954 -68055 -123651 -158723 -188155 -245499 -284194
32909b84194O0299J39393J05273J1577l4366k9930l8937n6899l3494J0376J3695
$$ -284194 -223895 -84502 20771 32348 -2018 -31948 -70885 -127784 -161278 -150902 -137207
32898a37207J53L8460Q6210K4715j25567j82144n8896R5793J14275L6227k22J5298
$$ -137207 -137054 -98594 -12384 12331 -113236 -295380 -354276 -258483 -144208 -107981 -108203 -92905
32886i2905r39m0858k0821M5394N2157j5402n0862k094N5262N5799L3477K6131
$$ -92905 -93844 -134702 -155523 -110129 -57972 -73374 -124236 -126330 -71068 -15269 18208 44339
32874D4339N254l9816n0709l81M6474M1925L4332O2467N9699l7228j54938j68901
$$ 44339 49593 9777 -40932 -41313 5161 47086 81418 143885 203584 166356 11418 -157483
32862a57483p5484K4575P4669Q9493O8846J413o0740m8726K005q295p4563q2288
$$ -157483 -232967 -208392 -133723 -44230 24616 26029 -34711 -83437 -81432 -89727 -164290 -246578
32850b46578j530M6165j7962q7711k9200J04990J47713O2273j9032m742L6022
$$ -246578 -248108 -201943 -219905 -307616 -336816 -231826 -84113 -21840 -40872 -45614 -9592
32839i592J4069k5351J4697J02789J04714m632p4900O215J25411R0066p9168j53770
$$ -9592 4477 -20874 -6177 96612 201326 196694 121794 128009 253420 343486 264318 110548
32827A10548k0221J54906J69135O1828J0059M2214L5348m1624p8792l6078j3522
$$ 110548 90327 245233 414368 476196 486255 528469 563817 522193 443401 407323 393801
32816C93801n1360m0054O8425J23746N52j66803j53739K3628J36117P4123l3083
$$ 393801 342441 302387 370812 494558 495110 328307 174568 198196 334313 408436 375353
32805C75353n0648k0509m2187r8301r4518r415P4212O7942k6889j09888p3552
$$ 375353 324705 304196 262009 163708 69190 59775 133987 201929 175040 65152 -8400
32794h400O4944J53475Q5913m4463o6839K1155O0076j5039p6743j7192Q2573Q8375
$$ -8400 56544 210019 295932 251469 184630 205785 265861 250822 174079 156887 239460 327835
32782C27835P919n9542q5864j09091j22428q6727k5287m31p690J5085P6137J05846
$$ 327835 335754 276212 190348 81257 -41171 -127898 -153185 -153616 -161306 -146221 -70084 35762
32770C5762N0163o7539j75453k04071j29541r237N5587L3646k890J74n201o3145
$$ 35762 85925 18386 -157067 -361138 -490679 -499916 -444329 -410683 -413573 -413399 -418600 -481745
32758d81745j03618m4533N8668R0111N3507L8364M2608j2387r9804r3016K0019
$$ -481745 -585363 -629896 -571228 -481117 -427610 -389246 -346638 -359025 -458829 -551845 -531826
32747e31826R3193M5845k2895j3161K6805K0002j996J2552K1174k3343o1766k5422
$$ -531826 -438633 -392788 -415683 -428844 -402039 -382037 -384033 -371481 -350307 -373650 -435416 -460838
32735d60838L2380K1303l3729m3589m581J9805K0322K8792K4330k9083q5497p5642
$$ -460838 -428458 -407155 -440884 -484473 -489054 -469249 -448927 -420135 -395805 -424888 -510385 -586027
32723e86027l1223k9518m7696r821M7999K1003n7625l2157J15773K00828J08304
$$ -586027 -617250 -646768 -694464 -704285 -656286 -635283 -692908 -725065 -609292 -408464 -300160
32712c00160k5363k3939O6427P3067l0358j05171o7712J5785N6092M3642L734
$$ -300160 -325523 -349462 -283035 -209968 -240326 -345497 -413209 -397424 -341332 -297690 -293956
32701b93956n2327r6190p7803O256Q9681J13435Q4526L5703k2666p4601p1701
$$ -293956 -346283 -442473 -520276 -514020 -424339 -310904 -226378 -190675 -213341 -287942 -359643
32690c59643O006Q6053O6228n3508j55741j42390m4246L4124M2515J7898J3187
$$ -359643 -353637 -267584 -201356 -254864 -410605 -552995 -597241 -563117 -520602 -502704 -489517
32679d89517M1008Q1559J03167P5240q3o9113p9174m7749l2526l6922j0244M9526
$$ -489517 -448509 -366950 -263783 -188543 -188626 -257739 -336913 -384662 -417188 -454110 -464354 -414828
32667d14828P1864K5788k0762o496K5982N713m9512o8006l4850Q917M4660P7342
$$ -414828 -342964 -317176 -337938 -344434 -318452 -312739 -362251 -430257 -465107 -456190 -411530 -334188
32655c34188Q5950M8940k907k8834m4710p6471q8169m4000K196j2472l1122L7369
$$ -334188 -248238 -199298 -202205 -231039 -275749 -352220 -440389 -484389 -482193 -494665 -525787 -488418
32643d88418J31368R7817n1765j22091k1234J00359Q3007j9933o6330m6475m3517
$$ -488418 -357050 -259233 -310998 -433089 -454323 -353964 -270957 -290890 -357220 -403695 -447212
32632d47212o1866l8041K6492O8443O9086N6350L2000j1288l6427j6432k064m0168
$$ -447212 -509078 -547119 -520627 -452184 -383098 -326748 -294748 -306036 -342463 -358895 -360959 -401127
32620d01127p0214j2696Q0577R4092M2528N3308J52737K17496J72657R6898O9856
$$ -401127 -471341 -484037 -403460 -309368 -266840 -213532 -60795 156701 329358 426256 496112
32609D96112M3822m3077j31429j30798p4800o5850j03341r0114p243L6561l2021
$$ 496112 539934 496857 365428 234630 159830 93980 -9361 -99475 -106718 -70157 -102178
32598a02178j32841j44370p2790k5757m4658n8094j7723J2278l5934j01933p1677
$$ -102178 -235019 -379389 -452179 -477936 -522594 -580688 -598411 -586133 -622067 -724000 -795677
32587g95677L9663R0954K1789n1615r537Q9002R2765k1165j19794r9585n507N4359
$$ -795677 -756014 -665060 -643271 -694886 -704423 -615421 -522656 -543821 -663615 -763200 -768707 -714348
32575g14348M0103p531l7387l4630j9252j7802k7835j5865L0949O9186N0072j0180
$$ -714348 -674245 -681776 -719163 -753793 -773045 -790847 -818682 -834547 -803598 -734412 -684340 -694520
32563f94520n4962o7163o8829n2398J2573R2562R2400j2881j16808j14746m7936
$$ -694520 -749482 -816645 -885474 -937872 -925299 -832737 -740337 -753218 -870026 -984772 -1032708
32552a032708l6487r8065j28294p0265q354l9641j20495j26480l9294J9625l9815
$$ -1032708 -1069195 -1167260 -1295554 -1365819 -1374173 -1413814 -1534309 -1660789 -1700083 -1680458 -1720273
32541a720273j50668j82855j10505k6744k0824r5995j90793k31043j79069q3832
$$ -1720273 -1870941 -2053796 -2164301 -2191045 -2211869 -2307864 -2498657 -2729700 -2908769 -2992601
32531b992601o1570j66780l05185l48156l10517l16640l97087m40288l74645k74091
$$ -2992601 -3054171 -3220951 -3526136 -3874292 -4184809 -4501449 -4898536 -5338824 -5713469 -5987560
32521e987560k16091j42187M3693L09403N26165O24960O37699O12239N62210M88248
$$ -5987560 -6203651 -6345838 -6302145 -5992742 -5466577 -4841617 -4203918 -3591679 -3029469 -2541221
32511b541221L96912L09287K69783L04014L51426L10233J81515Q6597R6800J37667
$$ -2541221 -2144309 -1835022 -1565239 -1261225 -909799 -599566 -418051 -331454 -234654 -96987
32501i6987J19955O5204K7084o022l8330n857R9522J50670N9010p2050j06502
$$ -96987 22968 88172 115256 109234 70904 65047 164569 315239 374249 302199 195697
32490A95697q2205r5369r1222K1291J34799P1040r9598j25965L5588J58565J07136
$$ 195697 113492 18123 -73099 -51808 82991 154031 54433 -71532 -35944 122621 229757
32479B29757O018k0642l5636j02292j26955l0660Q7513R9391L2377j3317j8162
$$ 229757 235775 215133 179497 77205 -49750 -80410 7103 106494 138871 125554 107392
32468A07392j1720N933K5315J3115k384M8636J26677J04323j0713n5874J3295
$$ 107392 95672 101605 126920 140035 137651 186287 312964 417287 406574 350700 363995
32457C63995L8564n2607j03482j8965L5589p0403j57851j9590J96850J90564j7031
$$ 363995 402559 349952 246470 227505 263094 192691 34840 15250 212100 402664 385633
32446C85633j21829r778J11369O9595m9573j00520q1798o0814m9779l0239R79
$$ 385633 263804 254026 365395 434990 385417 284897 203099 142285 92506 62267 63246
32435F3246M4788Q1122N2747m3644r7804k9792O8010O6294M447L0K7602j5681
$$ 63246 108034 189156 241903 198259 100455 70663 138673 204967 209414 209444 237046 221365
32423B21365q1892l4671Q8387J11398J6712l3434J0293J8491m5103m2570O3733
$$ 221365 139473 104802 193189 304587 321299 287865 298158 316649 271546 228976 292709
32412B92709J04900m461r9331m0335M7935j598j07411q0018N9773J17482K7177
$$ 292709 397609 393148 293817 253482 301417 299819 192408 112390 172163 289645 316822
32401C16822p1513n2872M3650J01764P3555R894j3155J0691L156q1259j48686
$$ 316822 245309 192437 236087 337851 411406 421300 408145 418836 421992 340733 192047
32390A92047p1220J04056J78170O6190q8751j25163o2270j1616m565n643r284
$$ 192047 120827 224883 403053 469243 380492 255329 193059 181443 176878 171235 161951
32379A61951k4882k7204K84K5735K6556K6314L7431M2117N4689J03945J31072
$$ 161951 137069 109865 110149 135884 162440 188754 226185 268302 322991 426936 558008
32368E58008L4773j40134k05941r1321M9979P2810L1063L0512M3569M396m1582
$$ 558008 592781 452647 246706 155385 205364 278174 309237 339749 383318 387714 346132
32357C46132k5781J4426K4692L9633P3604L6257r5778j61011m4557J01954P6351
$$ 346132 320351 334777 359469 399102 472706 508963 413185 252174 207617 309571 385922
32346C85922n3755p8922k137l66q2882p2162O4793J38169M8232o3117o2579j8653
$$ 385922 332167 253245 251108 250742 167860 95698 160491 298660 346892 283775 221196 202543
32334B02543l3753o0002j4113N5459M9069k3034p2371o3750k5010K4481P5279
$$ 202543 168790 108788 94675 150134 199203 176169 103798 40048 15038 39519 114798
32323A14798R1882M3019m3477r5379o3299L2945J12074R6744m936j00561j16737
$$ 114798 206680 249699 206222 110843 47544 80489 192563 289307 284371 183810 67073
32312F7073o6890K994P1629J07908O4373l0570o4947q286J9587n1889r7970p14
$$ 67073 183 3177 74806 182714 247087 216517 151570 143284 162871 110982 13012 12298
32300A2298J21356Q3508n4096p5332M2975J17425P8490M9282Q0231O0408m2014
$$ 12298 133654 217162 163066 87734 130709 248134 326624 375906 456137 516545 474531
32289D74531q9642j9039M1611L094l8546l597J7211n1443j03730k8428R3051J18705
$$ 474531 384889 365850 407461 410555 372009 368412 385623 334180 230450 202022 295073 413778
32277D13778N5873l603m5116q8395q8390j7105N0640N8105O9501J28104J33719
$$ 413778 469651 466048 420932 332537 244147 227042 277682 335787 405288 533392 667111
32266F67111J2918j06449p0526M5550N3331m6698q5260j3033L8945l051m5632
$$ 667111 680029 573580 503054 548604 601935 555237 469977 456944 495889 492838 447206
32255D47206k923O6521O0573k6196j12473j18346k4660J03589J57087R4716o175
$$ 447206 444283 510804 571377 545181 432708 314362 289702 393291 550378 645094 638919
32244F38919n8165p0510q2947o4449K0315J02814R1709K4817J3854N9282M9264
$$ 638919 580754 510244 427297 362848 383163 485977 577686 602503 616357 675639 724903
32233G24903n7087j63956j72380q6551K3271Q5731N9749k4421o9348k6875K3030
$$ 724903 667816 503860 331480 244929 268200 353931 413680 389259 319911 293036 316066
32222C16066p772o7453m8695K4144L3023k9858m9136J4561O2637L0161j5741j659
$$ 316066 308294 240841 192146 216290 249313 219455 170319 184880 247517 277678 261937 260278
32210B60278M0682M7620J9936n430j0144J2316N3239O4539J1727m7221k5940M8032
$$ 260278 300960 348580 368516 363086 352942 365258 418497 483036 494763 447542 421602 469634
32198D69634O3962P941j5006L4440O0839N433m6623j5218L2676l837q7591r8281
$$ 469634 533596 541537 526531 560971 621810 627243 580620 565402 598078 594241 506650 408369
32186D08369j2849O8710N8094l1892j17840j17998j6445J08089J44713O8735l5395
$$ 408369 395520 464230 522324 490432 372592 254594 238149 346238 490951 559686 524291
32175E24291q3617p2664l4508J8176O2843N0989k4853r6493r8756m0889L2496
$$ 524291 440674 368010 333502 351678 414521 465510 440657 344164 245408 204519 237015
32164B37015R5198J16205M9903q7961j83280j32791K9737J65549J74230P4529
$$ 237015 332213 448418 498321 410360 227080 94289 124026 289575 463805 538334
32154E38334l5013o8963k7547J0054j6404o9080p3276l4663j9836l2275p876N6518
$$ 538334 503321 434358 406811 416865 400461 331381 258105 223442 203606 171331 163455 219973
32142B19973Q1504M2872J7651M4535N3550J911l3256J3254P1445M8870j7450l2099
$$ 219973 301477 344349 362000 406535 460085 461996 428740 441994 513439 562309 544859 512760
32130E12760O184L5499N2882Q7420J00696L7358n4989p2725n909O1071P9909P1459
$$ 512760 518944 554443 607325 694745 795441 832799 777810 705085 699176 760247 840156 911615
32118I11615M8499N800k5704q853K6942K7059L163j228J140j2826J0278J14521
$$ 911615 960114 965914 940210 931357 958299 985358 988521 987293 988433 975607 985885 1100406
32106A100406K02098J41037j1224o1439L3208J11448P7081L3774P3798J13939
$$ 1100406 1302504 1443541 1432317 1370878 1404086 1515534 1592615 1626389 1700187 1814126
32096A814126O3588K805M1039J15754R9499K5190K7816J08202J35377P7847N8868
$$ 1814126 1877714 1880519 1921558 2037312 2136811 2162001 2189817 2298019 2433396 2511243 2570111
32085B570111J46040K36087K17879J36243J07989J49448J73223J17618Q565r0953
$$ 2570111 2716151 2952238 3170117 3306360 3414349 3563797 3737020 3854638 3863203 3772250
32075C772250j43174j53217j52641j59043j48292r6461m9242q8510k01645k53886
$$ 3772250 3629076 3475859 3323218 3164175 3015883 2919422 2870180 2781670 2580025 2326139
32065B326139j55827n603K4817q3365j86987j97077j82103k11213k15087j07648
$$ 2326139 2170312 2164709 2189526 2106161 1919174 1722097 1539994 1328781 1113694 1006046
32055A006046L0346K6241j40841k98674l09660k30639j91929k08217j96279j31832
$$ 1006046 1036392 1062633 921792 623118 313458 82819 -109110 -317327 -513606 -645438
32045f45438r2912j44040k41494k77784j95553m5400O1223N8609r947m4546p39
$$ -645438 -738350 -882390 -1123884 -1401668 -1597221 -1642621 -1581398 -1522789 -1532736 -1577282 -1578021
32034a578021P2838J04520P1797J733n8056o2175r447L0615n769o3198j4737J42260
$$ -1578021 -1505183 -1400663 -1328866 -1327133 -1385189 -1447364 -1456811 -1426196 -1431965 -1495163 -1509900 -1367640
32022a367640K37524J49195j7108p7018k2361Q949k5253k2842N9181J13039N4921
$$ -1367640 -1130116 -980921 -998029 -1075047 -1097408 -1088459 -1113712 -1136554 -1077373 -964334 -909413
32011i09413l5623m0999K0061M3660P971j4442J2285L8331J6372l2313n9900n1948
$$ -909413 -945036 -986035 -965974 -922314 -914343 -928785 -916500 -878169 -861797 -894110 -954010 -1005958
31999a005958k3154J3798N1434P7690Q3235P0837M4433k039o5436j07051p8485
$$ -1005958 -1029112 -1015314 -963880 -886190 -802955 -732118 -687685 -689724 -755160 -862211 -940696
31988i40696O402N6963P964q0107q4920J0613R0112P0609J5249J7281M6916J3208
$$ -940696 -934294 -877331 -869367 -949474 -1034394 -1023781 -933669 -863060 -847811 -830530 -783614 -770406
31976g70406o6588p9935J666P1895M8935j1593j5425L3403O0802M1282J8925K5267
$$ -770406 -836994 -916929 -915263 -843368 -794433 -806026 -821451 -788048 -727246 -685964 -667039 -641772
31964f41772L4732J3770j9360j2555M1218P0514P115j07088j53752r5172k5010
$$ -641772 -607040 -593270 -612630 -625185 -583967 -513453 -506338 -613426 -767178 -862350 -887360
31953h87360j8155j3884O6232J58436J39217K6514m1093j6104R670j7385l1439
$$ -887360 -905515 -919399 -853167 -694731 -555514 -529000 -570093 -586197 -576527 -593912 -625351
31942f25351J3528N4256K8823l2945q5455j25244j20810r994J59118K14043Q5104
$$ -625351 -611823 -557567 -528744 -561689 -647144 -772388 -893198 -903192 -744074 -530031 -444927
31931d44927o9730q2017l945J3644k7111j0285O7163Q9664K5303l1912k9607k0817
$$ -444927 -514657 -596674 -600619 -586975 -614086 -624371 -557208 -467544 -442241 -474153 -503760 -524577
31919e24577l8907l8488O198N2706P0985P8423P3498K8616l2899m9188k7393l7495
$$ -524577 -563484 -601972 -595774 -543068 -472083 -393660 -320162 -291546 -324445 -373633 -401026 -438521
31907d38521p8086o0853L3413R7821N7464j8263l3731q331j6844n9691p9366n5891
$$ -438521 -516607 -577460 -544047 -446226 -388762 -407025 -440756 -449087 -465931 -525622 -604988 -660879
31895f60879q396N5914J23185J43154Q8911J4118j4057o394j3720l5012l4651
$$ -660879 -669275 -613361 -490176 -347022 -258111 -243993 -258050 -264444 -278164 -313176 -347827
31884c47827j8936j7422j2536L0194P8634O7980J1359j4643P71j4773q2297j19536
$$ -347827 -366763 -384185 -396721 -366527 -287893 -219913 -208554 -223197 -222426 -237199 -319496 -439032
31872d39032p1841n814k934l3327k2713Q770k0646j03692j33107n5627N2297R5049
$$ -439032 -510873 -516687 -519621 -552948 -575661 -566891 -587537 -691229 -824336 -879963 -827666 -732617
31860g32617P2525M3222L1695K3758J4190R871R578J6108M1399P0378N8599K806
$$ -732617 -660092 -616870 -585175 -561417 -547227 -537356 -527778 -511670 -470271 -399893 -341294 -338488
31848c38488l2292p638J9362j4201o2810m1919K1905K4232m0580o0917Q583O7532
$$ -338488 -370780 -378418 -359056 -373257 -436067 -477986 -456081 -431849 -472429 -533346 -524763 -457231
31836d57231K8995n0678p7063n9272n3659m2473K0082Q7675O5529l6571r6947
$$ -457231 -428236 -478914 -555977 -615249 -668908 -711381 -691299 -603624 -538095 -574666 -671613
31825f71613m0665P0021J21743P2855k2674p4989l6765N0268R3437N2983j7374
$$ -671613 -712278 -642257 -520514 -447659 -470333 -545322 -582087 -531819 -438382 -385399 -402773
31814d02773n4263o0947n9987k8555M9356J11834Q5919J248m6270l0039j1283
$$ -402773 -457036 -517983 -577970 -606525 -557169 -445335 -359416 -358168 -404438 -434477 -445760
31803d45760k9858n7102o0661m4562j7495J7376L7326K0609q935q455K1668M9668
$$ -445760 -475618 -532720 -593381 -637943 -655438 -638062 -600736 -580127 -589062 -597517 -575849 -526181
31791e26181O3849N9999J4894n8976p5813J6869J30114J32778L0685n8657q1031
$$ -526181 -462332 -402333 -387439 -446415 -522228 -505359 -375245 -242467 -211782 -270439 -351470
31780c51470p7048o4590k4183J0415j3443m8262o573O8927O0515n329P708P7890
$$ -351470 -428518 -493108 -517291 -506876 -520319 -568581 -575154 -506227 -445712 -451041 -443333 -365443
31768c65443K8517j38879j74073K7175K06081J15808r6548j29062J2756P4076
$$ -365443 -336926 -475805 -649878 -622703 -416622 -300814 -397362 -526424 -513668 -439592
31758d39592k1624r6479n0483L582k2050m9066p054L4841L734m5719k8337L8031
$$ -439592 -461216 -557695 -608178 -604596 -626646 -675712 -682766 -647925 -644191 -689910 -718247 -680216
31746f80216P3739M8228m435l5238j6788L3075O1805N0178L9501M3551m423j30500
$$ -680216 -606477 -558249 -562684 -597922 -614710 -581635 -519830 -469652 -430151 -386600 -391023 -521523
31734e21523k14697j35589K6447Q0727k611p3929n2651k0646m0335n2195j1458
$$ -521523 -736220 -871809 -845362 -764635 -767246 -841175 -893826 -914472 -954807 -1007002 -1018460
31723a018460K7971L6311P0667J37791J37578L9464k3434M2258J15720L9959j17126
$$ -1018460 -990489 -954178 -883511 -745720 -608142 -568678 -592112 -549854 -434134 -394175 -511301
31712e11301j49167j5843J05309P6495l2674p6108k5847K6984R977n2161q4543
$$ -511301 -660468 -676311 -571002 -494507 -527181 -603289 -629136 -602152 -592175 -644336 -728879
31701g28879m9649K4056Q7003J14770R9754L5328n0947q3403k3945N0658L8197
$$ -728879 -778528 -754472 -667469 -552699 -452945 -417617 -468564 -551967 -575912 -525254 -487057
31690d87057l6110n4481O667M3031J284l3997R804P1208O1587p66m5862n5541
$$ -487057 -523167 -577648 -570981 -527950 -526666 -560663 -550859 -479651 -418064 -418830 -464692 -520233
31678e20233l1133N0204J52237J46991j4406j75879j56390K066J07528R2069N4539
$$ -520233 -551366 -501162 -348925 -201934 -216340 -392219 -548609 -546543 -439015 -346946 -292407
31667b92407N2592K7760l9106o3230r336K7351k2249p2789j4310J05923J42259
$$ -292407 -239815 -212055 -251161 -314391 -323727 -296376 -318625 -391414 -405724 -299801 -157542
31656a57542N5300m4859n7997j2144K276m0484q2180o7100j0054K7698R087m5427
$$ -157542 -102242 -147101 -205098 -217242 -214966 -255450 -337630 -404730 -414784 -387086 -377999 -423426
31644d23426q3453o5435M004O9750O5574j0305p2990m4330M5207J00839R5019
$$ -423426 -506879 -572314 -568310 -498560 -432986 -443291 -516281 -560611 -515404 -414565 -319546
31633c19546P9585P1482K8116l9397m2361L6585P8309k309j15103j29109o4928
$$ -319546 -239961 -168479 -140363 -179760 -222121 -185536 -107227 -109536 -224639 -353748 -418676
31622d18676k7755j8441L7174J09296Q1224m8060j30628p6668L0150P1886M6212
$$ -418676 -446431 -464872 -427698 -318402 -237178 -285238 -415866 -492534 -462384 -390498 -344286
31611c44286K4223M2465Q7333J23396J04239J4876p9902r7161n2802l4991n7463
$$ -344286 -320063 -277598 -190265 -66869 37370 52246 -27656 -124817 -177619 -212610 -270073
31600b70073m4998J5871L4796k4277o2755j899Q5431R0451L1315l089o850m1843
$$ -270073 -315071 -299200 -264404 -288681 -351436 -353335 -267904 -177453 -146138 -149227 -156077 -197920
31588a97920j06523j29984q9148m1472l2905m0266j7493M6084J20319J56617J18992
$$ -197920 -304443 -434427 -523575 -565047 -597952 -638218 -655711 -609627 -489308 -332691 -213699
31577b13699J8314q7957j41793j20830l8086N7527R0974L3627l3848r642P0867
$$ -213699 -195385 -283342 -425135 -545965 -584051 -526524 -435550 -401923 -435771 -445413 -374546
31566c74546O8938l4994q0750L1481J64286J32479k2415j02335m6754J1566j7890
$$ -374546 -305608 -340602 -421352 -389871 -225585 -93106 -115521 -217856 -264610 -253044 -270934
31555b70934n4769l758Q5670R3448n849j18256j39763n3712O1616J09270P1491
$$ -270934 -325703 -329461 -243791 -150343 -156192 -274448 -414211 -467923 -406307 -297037 -225546
31544b25546J9719J0049J1312j9498m7387k3342J1777p787l9283R252R9838R2706
$$ -225546 -205827 -195778 -184466 -203964 -251351 -274693 -262916 -270703 -309986 -300734 -200896 -108190
31532a08190k4730r1246j6738O9235J4817j22046j65254p1094M2545P9622N7567
$$ -108190 -132920 -224166 -240904 -171669 -156852 -278898 -444152 -515246 -472701 -393079 -335512
31521c35512K6410L072j109L1327Q6296J20246J09252N9481j8970j02935j39537
$$ -335512 -309102 -306030 -307139 -275812 -189516 -69270 39982 99463 80493 -22442 -161979
31510a61979r6815j9992K1344K9977N7586R3439O2695m5181j29332j04373j3767
$$ -161979 -258794 -278786 -257442 -227465 -169879 -76440 -13745 -58926 -188258 -292631 -306398
31499c06398L5973J0403l7933n7268l9919O171O8484J07450P5116j9591r6471
$$ -306398 -270425 -260022 -297955 -355223 -395142 -388971 -320487 -213037 -137921 -157512 -253983
31488b53983q5548r818M1486K1325k1846j5598L3607M7259j2222p8394o3245K4638
$$ -253983 -339531 -349349 -307863 -286538 -308384 -323982 -290375 -243116 -255338 -333732 -396977 -372339
31476c72339R1856Q2243L5837J6920L3389N2878N5548L4013k3246j00411j31570
$$ -372339 -280483 -198240 -162403 -145483 -112094 -59216 -3668 30345 7099 -93312 -224882
31465b24882o8170L7476P5618J5664n6020n6226q772J1696m822n651K4704L4478
$$ -224882 -293052 -255576 -179958 -164294 -220314 -276540 -285312 -273616 -278438 -284089 -259385 -224907
31453b24907r383n7458l9403L4120P4176K1995p6658j24988q5836j0275M1134
$$ -224907 -234290 -291748 -331151 -297031 -222855 -200860 -277518 -402506 -488342 -498617 -457483
31442d57483O6831R2158J03837O5596j1390o8031p4448n5689k7808K7799R4156
$$ -457483 -390652 -298494 -194657 -129061 -140451 -208482 -282930 -338619 -366427 -338628 -244472
31431b44472R4600M186p4420l9126M4450J8244j29393k25335j50507K66P3873
$$ -244472 -149872 -145686 -220106 -259232 -214782 -196538 -325931 -551266 -701773 -701507 -627634
31420f27634P5391J12191J80124J51991q337j49696j20711K5810J03660L4141
$$ -627634 -552243 -440052 -259928 -107937 -116274 -265970 -386681 -360871 -257211 -223070
31410b23070p4859r5037l4312K0815N0197R6031J38263Q7012o5447j81849j42634
$$ -223070 -297929 -392966 -427278 -406463 -356266 -260235 -121972 -34960 -100407 -282256 -424890
31399d24890m412Q8367R3851P3347M9023o875n6638j9056P1883P6608l2518j07038
$$ -424890 -429302 -340935 -247084 -173737 -124714 -131589 -188227 -207283 -135400 -58792 -91310 -198348
31387a98348n1385K5189m759p4814m3249O9452J22477P7711K1122q349n3582j07913
$$ -198348 -249733 -224544 -229303 -304117 -347366 -277914 -155437 -77726 -56604 -64953 -118535 -226448
31375b26448r8107j9279L7971K2112k0559l8223k7546J2220P8715J16098P0131
$$ -226448 -324555 -343834 -305863 -283751 -304310 -342533 -370079 -357859 -279144 -163046 -92915
31364i2915o137j5343K0020q452r1635r2494K4481J15638P6655j0459l1635m452
$$ -92915 -99052 -114395 -94375 -102827 -194462 -286956 -262475 -146837 -70182 -80641 -112276 -116728
31352a16728O523J1481L0211J9581l2095m9227o934l688q6387j37382p2486j2107
$$ -116728 -110205 -98724 -68513 -48932 -81027 -130254 -137188 -140876 -227263 -364645 -437131 -449238
31340d49238p8665j49684l3265J95256K76098J50349K0569K0013N4852K0123m1366
$$ -449238 -527903 -677587 -710852 -515596 -239498 -89149 -68580 -48567 6285 26408 -14958
31329a4958o8681q6152r6831m0530N7922O2433n5298j28169l9171R4633J16577
$$ -14958 -83639 -169791 -266622 -307152 -249230 -186797 -242095 -370264 -409435 -314802 -198225
31318a98225O7950O9075Q3552j433j34277j51039m6508J2377l5468n0578N6121
$$ -198225 -130275 -61200 22352 20919 -113358 -264397 -310905 -298528 -333996 -384574 -328453
31307c28453J52989Q6997p2274j33850o0367J0069l977k4003K6779Q8607P1842
$$ -328453 -175464 -88467 -160741 -294591 -354958 -344889 -348866 -372869 -346090 -257483 -185641
31296a85641Q643o086K5082J5988m4639o9312k6221K0m4325p9625k0894P5985
$$ -185641 -176998 -183084 -158002 -142014 -186653 -255965 -282186 -282166 -326491 -406116 -427010 -351025
31284c51025R8744N0575K7127N8449Q4214O6600K3235l8176j13527j42869o9189
$$ -351025 -252281 -201706 -174579 -116130 -31916 34684 57919 19743 -93784 -236653 -305842
31273c05842M6562Q4711M2346K5044N5855L7993n6011j09355m6766L8484L4514
$$ -305842 -259280 -174569 -132223 -107179 -51324 -13331 -69342 -178697 -225463 -186979 -152465
31262a52465k5596m9592l7605m2248n7591n2057m4536n1529k6799M8716Q7971
$$ -152465 -178061 -227653 -265258 -307506 -365097 -417154 -461690 -513219 -540018 -491302 -403331
31251d03331J8705p9001p4410K2690R0835P8402L8061R829j1835j4502J4345K2352
$$ -403331 -384626 -463627 -538037 -515347 -424512 -346110 -308049 -298220 -310055 -324557 -310212 -287860
31239b87860m1132j08152o3164P0852J40784P3929l4249o9711l2559J5358M1548
$$ -287860 -328992 -437144 -500308 -429456 -288672 -214743 -248992 -318703 -351262 -335904 -294356
31228b94356L6177j1010p9263j10930o9403K6894J29058J79816J33774J4419p2507
$$ -294356 -258179 -269189 -348452 -459382 -528785 -501891 -372833 -193017 -59243 -44824 -117331
31217a17331n1820J8892L3538j0068l2775j3948J116O862K9057L0449m2190j28241
$$ -117331 -169151 -150259 -116721 -126789 -159564 -173512 -172396 -165534 -136477 -106028 -148218 -276459
31205b76459j13638j7840L1869J2095J6308M7532K902r3387o8215J00928J92992
$$ -276459 -390097 -407937 -376068 -363973 -347665 -300133 -297231 -390618 -458833 -357905 -164913
31194a64913Q4549l5800K4841J42200R2211p0224j19317m2240k7523j10954j18804
$$ -164913 -80364 -116164 -91323 50877 143088 72864 -46453 -88693 -116216 -227170 -345974
$$ [...]
##END NTUPLES=NMR SPECTRUM
##END=
