##TITLE=31Pdec_LR-675-H2O-P3
 H2O, 24 sc
 31.5.2019
##JCAMPDX= 6.0         $$ Bruker NMR JCAMP-DX V2.0
##DATA TYPE= NMR SPECTRUM
##DATA CLASS= NTUPLES
##ORIGIN= UXNMR, Bruker Analytische Messtechnik GmbH
##OWNER= root
$$ XWIN-NMR		Version 3.5
$$ Fri May 31 16:40:38 2019 Russian Standard Time (UT+4h)  she@DPX200
##.OBSERVE FREQUENCY= 81.013821
##.OBSERVE NUCLEUS= ^31P
##.ACQUISITION MODE= SIMULTANEOUS
##.ACQUISITION SCHEME= undefined
##.AVERAGES= 24
##.DIGITISER RES= 17
##SPECTROMETER/DATA SYSTEM= spect
##.PULSE SEQUENCE= zgpg30
##.SOLVENT NAME= CDCl3
##.SHIFT REFERENCE= (INTERNAL, CDCl3, 0, 182.463)
##AUDIT TRAIL= $$ (NUMBER, WHEN, WHO, WHERE, WHAT)
$$ ##TITLE= Audit trail, XWIN-NMR		Version 3.5
$$ ##JCAMPDX= 5.01
$$ ##ORIGIN= Bruker BioSpin GmbH
$$ ##OWNER= she
$$ F:/spectra/data/she/nmr/P31/1/pdata/1/auditp.txt
$$ ##AUDIT TRAIL=  $$ (NUMBER, WHEN, WHO, WHERE, WHAT)
(   1,<2019-05-31 16:39:47.50 +0400>,<she>,<DPX200>,
      <created by zg, POWCHK disabled, PULCHK disabled
       configuration hash MD5:
       00 E9 B6 7A A2 85 ED C7 34 08 36 98 17 FE 4E 26
       data hash MD5: 32K
       6C 89 D3 4B 75 49 31 3F 77 10 C0 3B 82 B0 51 48>)
(   2,<2019-05-31 16:39:51.67 +0400>,<she>,<DPX200>,
      <Start of raw data processing
       efp BC_mod = 2 LB = 1 FT_mod = 6 PKNL = 1 PHC0 = -2222.365 PHC1 = 194.5991 SI = 64K 
       data hash MD5: 64K
       21 29 43 A1 93 8A FE 77 63 40 93 37 1D A5 FC 57>)
(   3,<2019-05-31 16:40:08.65 +0400>,<she>,<DPX200>,
      <pk PHC0 = 16.09415 PHC1 = -103 
       data hash MD5: 64K
       C4 B2 CF 88 63 98 2F 4B 56 40 83 87 55 87 5A A5>)
(   4,<2019-05-31 16:40:12.54 +0400>,<she>,<DPX200>,
      <abs ABSG = 5 
       data hash MD5: 64K
       BA D8 79 8C 87 2B 0C C8 63 CB 3C FE 3F 8A 9E 04>)
$$ ##END=
$$ 
$$ hash MD5
$$ AD CC 24 7D D3 28 A2 45 96 86 C2 5D 99 63 E9 C4
##$RELAX= 
##$RELAX= 
##$RELAX= 
##$RELAX= 
##$RELAX= 
##$RELAX= 
##$RELAX= 
##$RELAX= 
$$ Bruker specific parameters
$$ --------------------------
##$DU= <F:/spectra>
##$EXPNO= 1
##$NAME= <P31>
##$PROCNO= 1
##$TYPE= <nmr>
##$USER= <she>
##$AMP= (0..31)
100 100 100 100 100 100 100 100 100 100 100 100 100 100 100 100 100 100 
100 100 100 100 100 100 100 100 100 100 100 100 100 100 
##$AQSEQ= 0
##$AQ_mod= 1
##$AUNM= <au_zg>
##$AUTOPOS= <>
##$BF1= 81.014009
##$BF2= 200.13
##$BF3= 200.13
##$BF4= 200.13
##$BF5= 200.13
##$BF6= 200.13
##$BF7= 200.13
##$BF8= 200.13
##$BYTORDA= 1
##$CFDGTYP= 0
##$CFRGTYP= 5
##$CHEMSTR= <none>
##$CNST= (0..31)
1 1 145 1 1 1 1 1 1 1 1 1 1 1 1 1 1 1 1 1 1 1 1 1 1 1 1 1 1 1 1 1 
##$CPDPRG= <waltz16>
##$CPDPRG1= <>
##$CPDPRG2= <waltz16>
##$CPDPRG3= <>
##$CPDPRG4= <mlev>
##$CPDPRG5= <mlev>
##$CPDPRG6= <mlev>
##$CPDPRG7= <mlev>
##$CPDPRG8= <mlev>
##$CPDPRGB= <>
##$CPDPRGT= <>
##$D= (0..31)
0 1 0 0 0 0 0 0 0 0 0 0.03 2e-05 3e-06 0 0 0 0 0 0 0 0 0 0 0 0 0 0 0 0 
0 0 
##$DATE= 1559306386
##$DBL= (0..7)
120 120 120 11 120 120 24 19 
##$DBP= (0..7)
150 150 150 150 150 150 150 150 
##$DBP07= 0
##$DBPNAM0= <>
##$DBPNAM1= <>
##$DBPNAM2= <>
$$ [...]
##$SUBNAM3= <"">
##$SUBNAM4= <"">
##$SUBNAM5= <"">
##$SUBNAM6= <"">
##$SUBNAM7= <"">
##$SUBNAM8= <"">
##$SUBNAM9= <"">
##$SW= 369.568048894756
##$SWIBOX= (0..15)
0 1 3 0 0 0 0 0 0 0 0 0 0 0 0 0 
##$SW_h= 29940.119760479
##$TD= 32768
##$TD0= 1
##$TE= 0
##$TE2= 300
##$TE3= 300
##$TEG= 300
##$TL= (0..7)
0 120 53 12 22 120 120 120 
##$TP= (0..7)
150 150 150 150 150 150 150 150 
##$TP07= 0
##$TPNAME0= <>
##$TPNAME1= <>
##$TPNAME2= <>
##$TPNAME3= <>
##$TPNAME4= <>
##$TPNAME5= <>
##$TPNAME6= <>
##$TPNAME7= <>
##$TPOAL= (0..7)
0.5 0.5 0.5 0.5 0.5 0.5 0.5 0.5 
##$TPOFFS= (0..7)
0 0 0 0 0 0 0 0 
##$TUNHIN= 0
##$TUNHOUT= 0
##$TUNXOUT= 0
##$USERA1= <user>
##$USERA2= <user>
##$USERA3= <user>
##$USERA4= <user>
##$USERA5= <user>
##$V9= 5
##$VALIST= <valist>
##$VCLIST= <CCCCCCCCCCCCCCC>
##$VD= 0
##$VDLIST= <DDDDDDDDDDDDDDD>
##$VPLIST= <PPPPPPPPPPPPPPP>
##$VTLIST= <TTTTTTTTTTTTTTT>
##$WBST= 1024
##$WBSW= 4
##$XGAIN= (0..3)
0 0 0 0 
##$XL= 0
##$YL= 0
##$YMAX_a= 134215
##$YMIN_a= -141300
##$ZGOPTNS= <>
##$ZL1= 120
##$ZL2= 120
##$ZL3= 120
##$ZL4= 120
##$ABSF1= 182.463
##$ABSF2= -187.1042
##$ABSG= 5
##$ABSL= 3
##$ALPHA= 0
##$AQORDER= 0
##$ASSFAC= 0
##$ASSFACI= 0
##$ASSFACX= 0
##$ASSWID= 0
##$AUNMP= <proc_1d>
##$AZFE= 0.1
##$AZFW= 0.5
##$BCFW= 0
##$BC_mod= 2
##$BYTORDP= 0
##$COROFFS= 0
##$CY= -3
##$DATMOD= 1
##$DC= 0
##$DFILT= <>
##$DTYPP= 0
##$F1P= 0
##$F2P= 0
##$FCOR= 1
##$FTSIZE= 65536
##$FT_mod= 6
##$GAMMA= 0
##$GB= 0
##$INTBC= 1
##$INTSCL= 5.30512e-09
##$ISEN= 30
##$LB= 1
##$LEV0= 0
##$LPBIN= 0
##$MAXI= 10000
##$MC2= 0
##$MEAN= 0
##$ME_mod= 0
##$MI= 50
##$NCOEF= 0
##$NC_proc= -4
##$NLEV= 6
##$NOISF1= 182.463
##$NOISF2= 159.3651
##$NSP= 0
##$NTH_PI= 0
##$NZP= 0
##$OFFSET= 182.463
##$PC= 4
##$PHC0= -2206.271
##$PHC1= 91.59911
##$PH_mod= 1
##$PKNL= yes
##$PPARMOD= 0
##$PSCAL= 0
##$PSIGN= 0
##$REVERSE= no
##$SF= 81.0140089999434
##$SI= 65536
##$SIGF1= 159.3651
##$SIGF2= -187.1042
##$SINO= 113.3802
##$SIOLD= 16384
##$SREGLST= <1H.CDCl3>
##$SSB= 0
##$STSI= 65536
##$STSR= 0
##$SW_p= 29940.119760479
##$SYMM= 0
##$S_DEV= 0
##$TDeff= 32768
##$TDoff= 0
##$TI= <>
##$TILT= no
##$TM1= 0
##$TM2= 0
##$TOPLEV= 0
##$USERP1= <user>
##$USERP2= <user>
##$USERP3= <user>
##$USERP4= <user>
##$USERP5= <user>
##$WDW= 1
##$XDIM= 65536
##$YMAX_p= 499775200
##$YMIN_p= -16570128
$$ End of Bruker specific parameters
$$ ---------------------------------
##NTUPLES= NMR SPECTRUM
##VAR_NAME=  FREQUENCY,     SPECTRUM/REAL,   SPECTRUM/IMAG
##SYMBOL=    X,             R,               I
##VAR_TYPE=  INDEPENDENT,   DEPENDENT,       DEPENDENT
##VAR_FORM=  AFFN,          ASDF,            ASDF
##VAR_DIM=   65536,         65536,           65536
##UNITS=     HZ,            ARBITRARY UNITS, ARBITRARY UNITS
##FACTOR=    0.456856943014862, 1,           1
##FIRST=     14782.0589164792, 0,            0
##LAST=      -15158.0608439998, 0,           0
##MIN=       -15158.0608439998, -16570128,   0
##MAX=       14782.0589164792, 499775200,    0
$$ Real data points
##PAGE= N=1
##DATA TABLE= (X++(R..R)), XYDATA
$$ [...]
38230a17083j8614J43560K8607K4962K63872L78606J56864j12950j46683m6580
$$ -117083 -135697 7863 36470 61432 325304 703910 860774 747824 601141 554561
38220E54561K9934J48306L19402L52170K18041J73061K88036K71556J5716j35527
$$ 554561 584495 732801 1052203 1404373 1622414 1795475 2083511 2355067 2370783 2235256
38210B235256J5991J36613j2993o0215L12087O31577K95370l49675m20508J40966
$$ 2235256 2251247 2387860 2374867 2314652 2626739 3258316 3553686 3204011 2783503 2924469
38200B924469M94045K24237j36951j22233j743o8754m7183K45056L31360j41286
$$ 2924469 3418514 3642751 3505800 3383567 3381824 3313070 3265887 3510943 3842303 3701017
38190C701017o06269l51693L02038M54103J5923k62472j05948r7851n48453q67050
$$ 3701017 3094748 2743055 3045093 3499196 3515119 3252647 3146699 3048848 2500395 1633345
38180A633345n15473R2893K17665j43199l87854k19176J20231L53265M20834L00179
$$ 1633345 1117872 1210765 1428430 1285231 897377 678201 798432 1151697 1572531 1872710
38170A872710j0131l20066l82881k20175q2878j05273j91856k02842q0122J38490
$$ 1872710 1862579 1542513 1159632 939457 856579 751306 559450 356608 276486 414976
38160D14976K83310J60710j48087k89000j34132k4357k21306l99418j19490M07790
$$ 414976 698286 858996 710909 421909 287777 263420 42114 -357304 -476794 -69004
38150f9004N70785K64072l5498r0517j72986l90149l80984J6290L42303J72269
$$ -69004 501781 765853 730355 639838 466852 76703 -304281 -287991 54312 226581
38140B26581k25254l30621j49213o6637j49758r7310J82945L93111K87780j8249
$$ 226581 1327 -329294 -478507 -545144 -694902 -792212 -609267 -216156 71624 53375
38130E3375k53958k91393j90877q6648n2158j9943J14911K92737L38843K50290
$$ 53375 -200583 -491976 -682853 -769501 -821659 -841602 -726691 -433954 -95111 155179
38120A55179K05992K15179N9069k59230l55088k6236L48126L29531N6059o7754
$$ 155179 361171 576350 635419 376189 21101 -5135 342991 672522 728581 660827
38110F60827o6271k56592n62719n40711r8942L19352L58633J22992j55606l94399
$$ 660827 594556 337964 -224755 -765466 -864408 -545056 -186423 -63431 -219037 -613436
38100f13436m91131k92689R8018L31363K83578J95661K09839J35330j35193l40258
$$ -613436 -1104567 -1397256 -1299238 -967875 -684297 -488636 -278797 -143467 -278660 -618918
38090f18918k48482n2955p3252k65669l00807l863M69718P79012O17386j6033
$$ -618918 -867400 -920355 -993607 -1259276 -1560083 -1563946 -1094228 -315216 302170 286137
38080B86137o62514p67611l24964J16094K09882K11592L90796M78852J35889l45716
$$ 286137 -376377 -1143988 -1468952 -1352858 -1142976 -931384 -540588 -61736 74153 -271563
38070b71563l70651M0646K35915r2566m26653j75042M38528O15699K4835p31632
$$ -271563 -642214 -601568 -365653 -458219 -884872 -1059914 -621386 -5687 19148 -712484
38060g12484q26639k08954L66348L23960l0718m5341L04484M45892J47431j44518
$$ -712484 -1539123 -1748077 -1381729 -1057769 -1088487 -1133828 -829344 -383452 -236021 -380539
38050c80539o8360R6945k5332k61649k30966o016O0374n1349q0072l598k2435
$$ -380539 -448899 -351954 -377286 -638935 -869901 -875917 -815543 -866892 -946964 -950562 -972997
38039i72997j09897m4531J44143K00371J04116R5267K30753L11469K56075J58810
$$ -972997 -1082894 -1127425 -983282 -782911 -678795 -583528 -352775 -41306 214769 373579
38029C73579j3760l54306o34185m68548N2973L63876J83561j50963k62332j99082
$$ 373579 359819 5513 -628672 -1097220 -1044247 -680371 -496810 -647773 -910105 -1109187
38019a109187j35365m3186Q6712R1033l0995L399K66900L74935N9168l49684l86438
$$ -1109187 -1244552 -1287738 -1201026 -1109993 -1140988 -1137589 -870689 -495754 -436586 -786270 -1172708
38008a172708j19365L9566k7597r3422j8461J27888K69304L36199J94882j52964
$$ -1172708 -1292073 -1252507 -1280104 -1373526 -1391987 -1264099 -994795 -658596 -463714 -616678
37998f16678m29817m10119k34226j28791k1044K33874M47423L38265M8957j3605
$$ -616678 -1046495 -1456614 -1690840 -1819631 -1840675 -1606801 -1159378 -821113 -772156 -785761
37988g85761K05957L71552L07129J79610J12108N005j84858l14424k84937j50102
$$ -785761 -579804 -208252 98877 278487 390595 395600 210742 -103682 -388619 -538721
37978e38721K3814J64008J05406k10064n08656m80877k27091n5958L9805K53242
$$ -538721 -514907 -350899 -245493 -455557 -964213 -1445090 -1672181 -1728139 -1688334 -1435092
37968a435092M26921K32002j44984j62776J51759J79220j93743k65501K82191
$$ -1435092 -1008171 -776169 -921153 -1083929 -932170 -752950 -946693 -1212194 -930003
37959i30003O85610K52190m65753m84754J07722L99839J18074j46713j05288j69249
$$ -930003 -244393 7797 -457956 -942710 -834988 -435149 -317075 -463788 -569076 -738325
37949g38325n18876o69868l23736Q3025J10730r435R1672K33964Q3502j61473
$$ -738325 -1257201 -1927069 -2250805 -2167780 -2057050 -2066485 -1974813 -1740849 -1657347 -1818820
37939a818820q3020J99968J92014j54687l41393r4374K48131K77302P2569j3956
$$ -1818820 -1901840 -1701872 -1509858 -1664545 -2005938 -2100312 -1852181 -1574879 -1502310 -1516266
37929a516266R5486J38624n5924k77590j77353K42488N29698L02481k14771m19906
$$ -1516266 -1420780 -1282156 -1338080 -1615670 -1793023 -1550535 -1020837 -718356 -933127 -1353033
37919a353033j28134J58563m5267n01111n58109m4215N04240N33314J23833j63198
$$ -1353033 -1481167 -1322604 -1367871 -1868982 -2427091 -2471306 -1967066 -1433752 -1309919 -1473117
37909a473117L9041M95006O37186K34859k88346l58842j7348J39747j50640m19361
$$ -1473117 -1434076 -939070 -301884 -67025 -355371 -714213 -731561 -591814 -742454 -1161815
37899a161815k24163J28620R9437j89101k07905K6462M901k85490k38526L00159
$$ -1161815 -1385978 -1257358 -1157921 -1347022 -1554927 -1528465 -1523564 -1809054 -2047580 -1747421
37889a747421O27484K63462k48004j91880K11384K41095j56860l87755k14551
$$ -1747421 -1119937 -856475 -1104479 -1296359 -1084975 -843880 -1000740 -1388495 -1603046
37880a603046k4683j03589k67773k99435k29583r8157J16721K55843R6756k15454
$$ -1603046 -1627729 -1731318 -1999091 -2298526 -2528109 -2626266 -2509545 -2253702 -2156946 -2372400
37870b372400k77256k6568K02371K70928L78386N12590L22999k32229o37891n20424
$$ -2372400 -2649656 -2676224 -2473853 -2202925 -1824539 -1311949 -988950 -1221179 -1859070 -2379494
37860b379494j38390J17952K46388L27214K06420r5425j52808J81185L43257p7502
$$ -2379494 -2517884 -2399932 -2153544 -1826330 -1619910 -1715335 -1868143 -1686958 -1343701 -1421203
37850a421203n06950j89287N28020O30724j36m46017k17017J31289J00856J8994
$$ -1421203 -1928153 -2117440 -1589420 -958696 -958832 -1404849 -1621866 -1490577 -1389721 -1370727
37840a370727K33052L69850M4243l46812k73125j9235j83148n68140m53977J42534
$$ -1370727 -1137675 -767825 -723582 -1070394 -1343519 -1362754 -1545902 -2114042 -2568019 -2425485
37830b425485L67639j61415p20838n14719K17223N98755K96591j85987k88734
$$ -2425485 -2057846 -2219261 -2940099 -3454818 -3237595 -2638840 -2342249 -2528236 -2816970
37821b816970m0599J68684J80566J89911L28117L85433J34964k08748j89642J93933
$$ -2816970 -2857569 -2688885 -2508319 -2318408 -1990291 -1604858 -1469894 -1678642 -1868284 -1674351
37811a674351L72566j38m87082m71911o3488R4083j99120m50923k62345J40085
$$ -1674351 -1301785 -1301923 -1789005 -2260916 -2324404 -2230321 -2429441 -2880364 -3142709 -3002624
37801c002624L35492K58664Q2202j12525k70301k27375O1015L17187K19702k02608
$$ -3002624 -2667132 -2408468 -2326266 -2438791 -2709092 -2936467 -2875452 -2558265 -2338563 -2541171
37791b541171o11370o83058l08494L24629P36641N17260j31786n01982k64844
$$ -2541171 -3152541 -3835599 -4144093 -3819464 -3082823 -2565563 -2697349 -3199331 -3464175
37782c464175O9013p9213m62751m14682O3665K81527n6856m04195k37563J75691
$$ -3464175 -3395162 -3474375 -3937126 -4351808 -4288143 -4006616 -4063472 -4467667 -4705230 -4529539
37772d529539K57282k5140k21722j03387J21484K08024J37267j2366j72927k40851
$$ -4529539 -4272257 -4297397 -4519119 -4622506 -4501022 -4292998 -4155731 -4168097 -4341024 -4581875
37762d581875j40185L6081J07725L0539j06465k63428m36699m99482l14243m4792
$$ -4581875 -4722060 -4685979 -4578254 -4547715 -4654180 -4917608 -5354307 -5853789 -6168032 -6212824
37752f212824p1951m48833o94709l91512J83901L70798K9398k63413o3342K76635
$$ -6212824 -6284775 -6733608 -7428317 -7819829 -7635928 -7265130 -7235732 -7499145 -7562487 -7285852
37742g285852J41817l85488o08975k48501J56085R7186j26428P3926O14511Q68458
$$ -7285852 -7144035 -7529523 -8138498 -8386999 -8230914 -8133728 -8260156 -8186230 -7571719 -6703261
37732f703261O30922L44039L12568L11288J88080K64384P24556J082746Q09348
$$ -6703261 -6072339 -5728300 -5415732 -5104444 -4916364 -4651980 -3927424 -2844678 -2035330
37723b035330J85962n6792K13692M60128L98746L50096N52176P32137O41871N25807
$$ -2035330 -1849368 -1906160 -1692468 -1232340 -833594 -483498 68678 800815 1442686 1968493
37713A968493O86170R54856J001582Q90842R05867J007042R09514O14826M38226
$$ 1968493 2654663 3609519 4611101 5501943 6407810 7414852 8324366 8939192 9377418
37704I377418M99314N65152M67919L43972L40445L68150K99520J84794J04481
$$ 9377418 9876732 10441884 10909803 11253775 11594220 11962370 12261890 12446684 12551165
37695A2551165m446j88839k93291j47745J33685K49034J00343q0534m6106J43524
$$ 12551165 12546719 12357880 12064589 11916844 12050529 12299563 12399906 12319372 12273266 12416790
37685A2416790J97792l8836l76030m79764k72626m5573r4362l23508l87599k21536
$$ 12416790 12614582 12575746 12199716 11719952 11447326 11401753 11307391 10983883 10596284 10374748
37675A0374748j75459m71259p58097n31008R0208L97652K4417n24795n55448j37085
$$ 10374748 10199289 9728030 8969933 8438925 8529133 8926785 8951202 8426407 7870959 7733874
37665G733874M3847l01610o83228n95493k22772o1070j48650j20268J10693K17916
$$ 7733874 7777721 7476111 6792883 6197390 5974618 5913548 5764898 5644630 5755323 5973239
37655E973239N0824j03035l0244K1981k30261n79409n91460k47781N0282O8045
$$ 5973239 6024063 5921028 5890784 5912765 5682504 5103095 4511635 4263854 4314136 4382181
37645D382181k1526j0770M8608K5072p4099j90599l17978l89502k51660R5145
$$ 4382181 4360655 4349885 4398493 4423565 4349466 4158867 3840889 3451387 3199727 3294872
37635C294872L83107L79228J92143J03487J73462J97987K3680k69335n05935n86341
$$ 3294872 3677979 4057207 4249350 4352837 4526299 4724286 4747966 4478631 3972696 3386355
37625C386355m82275j95836J87779M66098M38658J01597k94167m35532k50389
$$ 3386355 2904080 2708244 2896023 3362121 3800779 3902376 3608209 3172677 2922288
37616B922288R614O4642m7261n7060J00314J50477j01271m13653m00038o1886
$$ 2922288 2931902 2996544 2949283 2892223 2992537 3143014 3041743 2628090 2228052 2166166
37606B166166K34188K70221J79932J11757K046j78373k30330j5012K52910K72280
$$ 2166166 2400354 2670575 2850507 2962264 2964310 2785937 2555607 2540595 2793505 3065785
37596C065785R9070L5865J39832J58813k2346j99501k24124k48476l88364m08176
$$ 3065785 3164855 3200720 3340552 3499365 3477019 3277518 3053394 2804918 2416554 2008378
37586B008378n4092M56395O31429L48892k8995k01469k49459l19091l29345j94416
$$ 2008378 1954286 2410681 3042110 3391002 3362007 3160538 2911079 2591988 2262643 2068227
37576B068227n3199k1725M5793K52615L41595P3893k41362j06793L03385K39770
$$ 2068227 2015028 1993303 2039096 2291711 2633306 2707199 2465837 2359044 2662429 2902199
37566B902199m79018j001872n49325M48433Q87312M27028k26054m03992j94443
$$ 2902199 2423181 1421309 871984 1320417 2207729 2634757 2408703 2004711 1810268
37557A810268M8065K76174M95877M36270m3407n17812m67399k3880K28608R5788
$$ 1810268 1858333 2134507 2630384 3066654 3023247 2505435 2038036 2014156 2242764 2338552
37547B338552p7800p3413o9965j48167o5090K25003L08679n4088m26225k81134
$$ 2338552 2260752 2187339 2117374 1969207 1904117 2129120 2437799 2383711 1957486 1676352
37537A676352J95396M07079K54245J57921K50688J77397j89187m31457k49030
$$ 1676352 1871748 2278827 2533072 2690993 2941681 3119078 2929891 2498434 2249404
37528B249404N6023R7786O88P1575K08689J09134j46516k04039k6574Q4452K3972
$$ 2249404 2305427 2403213 2403901 2475476 2684165 2793299 2646783 2442744 2416170 2500622 2524594
37517B524594m661O0077M478k36376l95677k70894M58K04240L00388K66716O888
$$ 2524594 2519933 2580010 2584488 2348112 1952435 1681541 1681999 1886239 2186627 2453343 2460231
37506B460231l69647m61820o5487M42900N16790J28506k30013j82441J46769L79436
$$ 2460231 2090584 1628764 1563277 2006177 2522967 2651473 2421460 2239019 2385788 2765224
37496B765224L08900M1675j53110j07546O8073J06553o6809k10851r8241J52528
$$ 2765224 3074124 3115799 2962689 2855143 2923216 3029769 2962960 2752109 2653868 2806396
37486B806396K39699Q6091j07058j68967j25285o0205j464J9805m8155j73024
$$ 2806396 3046095 3132186 3025128 2856161 2730876 2670671 2669207 2689012 2640857 2467833
37476B467833k31224j65506o3238k3960k0887M0995J64612K25340J21728n9301
$$ 2467833 2236609 2071103 2007865 1983905 1963018 2004013 2168625 2393965 2515693 2456392
37466B456392r3710J09227L46132L42773J04985j13295j86000k39659l44965l44156
$$ 2456392 2362682 2471909 2818041 3160814 3265799 3152504 2966504 2726845 2381880 2037724
37456B037724j47329L5049n049j17498j9226K51401M04292L41831K20986J09418
$$ 2037724 1890395 1925444 1920395 1802897 1783671 2035072 2439364 2781195 3002181 3111599
37446C111599q6500l18853l50246j21660R1607L3770k08110l54769k59891M992
$$ 3111599 3025099 2706246 2356000 2234340 2325947 2359717 2151607 1796838 1536947 1541939
37436A541939K53274L02481J20991r9207j42785m5426l752l3800M1788K39752
$$ 1541939 1795213 2097694 2218685 2119478 1976693 1931267 1927515 1893715 1935503 2175255
37426B175255L15897J11766k20562m28013l88155q9403L60155O48757M97326P8426
$$ 2175255 2491152 2602918 2382356 1954343 1566188 1476785 1836940 2485697 2983023 3061449
37416C061449j33973m4849n7715l29716m09332R365M45934L06686j47618j86260
$$ 3061449 2927476 2882627 2824912 2495196 2085864 2095229 2541163 2847849 2700231 2513971
37406B513971K20015L60974n6366m52369l12459M7046L7662l30051n72380m39880
$$ 2513971 2733986 3094960 3038594 2586225 2273766 2320812 2358474 2028423 1456043 1016163
37396A016163q4221K99830O14445P30011N52873K20107o641m8668n5608j68708
$$ 1016163 931942 1231772 1846217 2576228 3129101 3349208 3342567 3293899 3238291 3069583
37386C069583l65069m95119l83756J3401M57620N72005K84862k1255M376J96679
$$ 3069583 2704514 2209395 1825639 1839040 2296660 2868665 3153527 3132272 3136648 3333327
37376C333327J41827j79242l56969j77166O1303l132k80372l83293j69402R2927
$$ 3333327 3475154 3295912 2938943 2761777 2823080 2819948 2539576 2156283 1986881 2079808
37366B079808R6829j15533k17651k0216K60583K57598l3430j82614R5785M76397
$$ 2079808 2176637 2061104 1843453 1823237 2083820 2341418 2307988 2125374 2221159 2697556
37356B697556M18122n8323l63420j66466J69839J90622J4463L3327K11552J68155
$$ 2697556 3115678 3057355 2693935 2527469 2697308 2887930 2902393 2935720 3147272 3315427
37346C315427j32520k82755r8462Q1096m4065k69684k67508j07750n1503o2745
$$ 3315427 3182907 2900152 2801690 2882786 2838721 2569037 2301529 2193779 2142276 2079531
37336B079531O8899K63152K35568L867j05845K1703J68093K33537L68870N10268
$$ 2079531 2148430 2411582 2647150 2651017 2545172 2566875 2734968 2968505 3337375 3847643
37326C847643K68430l93999p97614l54518N07786P96756K64425l02425k14424
$$ 3847643 4116073 3722074 2924460 2569942 3077728 3874484 4138909 3836484 3622060
37317C622060K26250K78546j60048m77782k38143K67206M52776J66516k05467
$$ 3622060 3848310 4126856 3966808 3489026 3250883 3518089 3970865 4137381 3931914
37308C931914k65003l7059J71662K10017K07681K75104K86805R9955j49763j79434
$$ 3931914 3666911 3629852 3801514 4011531 4219212 4494316 4781121 4881076 4731313 4551879
37298D551879N2019K78008K58440K1951k36326l42976k16947Q2639L39364L53259
$$ 4551879 4603898 4881906 5140346 5162297 4925971 4582995 4366048 4448687 4788051 5141310
37288E141310J63938k5689j30489k13248k68278k24530j65101k43655l45516j93438
$$ 5141310 5305248 5279559 5149070 4935822 4667544 4443014 4277913 4034258 3688742 3495304
37278C495304J15118J15481k70747m77233j60528J53663j42201o95405o92796
$$ 3495304 3610422 3725903 3455156 2977923 2817395 2971058 2828857 2133452 1440656
37269A440656j93959q2652o43021j089983q21738l11658k41422m49647m23709
$$ 1440656 1246697 1164045 521024 -568959 -1390697 -1702355 -1943777 -2393424 -2817133
37260b817133k98851n57357j054225j189949r36968q80693j205575j409637j188370
$$ -2817133 -3115984 -3673341 -4727566 -5917515 -6854483 -7735176 -8940751 -10350388 -11538758
37251a1538758q90095q25424p74493n39063l94511n40787o14139k78277J16391
$$ -11538758 -12428853 -13254277 -14028770 -14567833 -14962344 -15503131 -16117270 -16395547 -16279156
37242a6279156O3712k24064j30620L64529O85739O07029N13597O32504O55565
$$ -16279156 -16215444 -16439508 -16570128 -16205599 -15519860 -14912831 -14399234 -13766730 -13111165
37233a3111165L67539R9409K16993N66662P76030P84622P35086O11262L51774
$$ -13111165 -12743626 -12644217 -12427224 -11860562 -11084532 -10299910 -9564824 -8953562 -8601788
37224h601788J26583J35177K52094K05249J9928l1594J28501K96581L31499L06498
$$ -8601788 -8475205 -8340028 -8087934 -7882685 -7862757 -7894351 -7765850 -7469269 -7137770 -6831272
37214f831272K95606K60177K00173K05483K93437L70395M03569M56448M95746
$$ -6831272 -6535666 -6275489 -6075316 -5869833 -5576396 -5206001 -4802432 -4345984 -3850238
37205c850238L47062m2621m28187m92639k06328J39803K60544J78673J62873L56467
$$ -3850238 -3503176 -3545797 -3973984 -4466623 -4672951 -4533148 -4272604 -4093931 -3931058 -3574591
37195c574591N27762L08293l00019q06593p31477j22441N37722Q34262O99479
$$ -3574591 -3046829 -2738536 -3038555 -3845148 -4576625 -4699066 -4161344 -3327082 -2627603
37186b627603L12356p7327k75436k74974k37071k21624n0073L74547P48525O70051
$$ -2627603 -2315247 -2392574 -2668010 -2942984 -3180055 -3401679 -3451752 -3077205 -2328680 -1658629
37176a658629K09116j49251j46394j2246k4357j34109j70217j28795p7719O865
$$ -1658629 -1449513 -1598764 -1745158 -1757404 -1781761 -1915870 -2086087 -2214882 -2292601 -2285736
37166b285736J29293J78245R7350o076l9609l5192J4825J99427M39202M53961
$$ -2285736 -2156443 -1978198 -1880848 -1886924 -1926533 -1961725 -1946900 -1747473 -1308271 -854310
37156h54310J57433j64867k64669k47922k60083j71425J00248K58103N0800k08264
$$ -854310 -696877 -861744 -1126413 -1374335 -1634418 -1805843 -1705595 -1447492 -1396692 -1604956
37146a604956n8009L21839L16387j52525m61856k22014J84825K56982Q7928P2483
$$ -1604956 -1662965 -1341126 -1024739 -1177264 -1639120 -1861134 -1676309 -1419327 -1331399 -1258916
37136a258916K43920L01716J07658j86768l97314m31922k64224l986J11604m340
$$ -1258916 -1014996 -713280 -605622 -792390 -1189704 -1621626 -1885850 -1889836 -1778232 -1782572
37126a782572j32396n1173J43711K29878K12114K33091K60757J57608j5538o4829
$$ -1782572 -1914968 -1966141 -1822430 -1592552 -1380438 -1147347 -886590 -728982 -744520 -809349
37116h09349k425l2711j98188l11206k59374j19789N0365K58067L74064K08038
$$ -809349 -811774 -844485 -1042673 -1353879 -1613253 -1733042 -1682677 -1424610 -1050546 -842508
37106h42508j14205j74528J56798M59969L28074o2247k42413j17713J4376L415
$$ -842508 -956713 -1131241 -974443 -514474 -186400 -248647 -491060 -608773 -594397 -590982
37096e90982J3390J33548J76087j1911k85456l98679l00186j14760L5733R9314
$$ -590982 -577592 -444044 -267957 -279868 -565324 -964003 -1264189 -1378949 -1343216 -1243902
37086a243902J04077J69898L70504N27091L37400j66482m98476k77220K32805
$$ -1243902 -1139825 -969927 -599423 -72332 265068 98586 -399890 -677110 -444305
37077d44305M05287L3456m34294m80434j17232K13551J98552l7809j57499l7625
$$ -444305 -39018 -5562 -439856 -920290 -1037522 -823971 -625419 -663228 -820727 -858352
37067h58352J04148M0245j02148N325L51264M69482O6952m67887n30563j46595
$$ -858352 -754204 -713959 -816107 -810782 -459518 9964 76916 -390971 -921534 -1068129
37057a068129P8674j39746l87127k32254J45773L12975K19565J06851K2757j42788
$$ -1068129 -989455 -1129201 -1516328 -1748582 -1602809 -1289834 -1070269 -963418 -940661 -1083449
37047a083449k81057j65120J13498K21301J07752N0653J23125M6234k71985m64373
$$ -1083449 -1364506 -1529626 -1416128 -1194827 -1087075 -1036422 -913297 -867063 -1139048 -1603421
37037a603421k37565J56261L03225K19272J88292K10825N9799j88843j56688K19620
$$ -1603421 -1840986 -1684725 -1381500 -1162228 -973936 -763111 -703312 -892155 -1048843 -829223
37027h29223M88073L02885p8747j98431n5368j3170j70327k29456m4296Q8048
$$ -829223 -341150 -38265 -117012 -315443 -370811 -383981 -554308 -783764 -828060 -740012
37017g40012r2229l12502j13137M13793O40257K50428k90867l65322j9398K16708
$$ -740012 -832241 -1144743 -1257880 -844087 -203830 46598 -244269 -609591 -628989 -412281
37007d12281J69704J94280M57924N66734J92777l14741l82634n5978J12902n1602
$$ -412281 -242577 -48297 409627 976361 1169138 854397 471763 415785 528687 477085
36997D77085j15942J93702N00455L62217l2070j67692K0900J36439l914j33358
$$ 477085 361143 554845 1055300 1417517 1385447 1217755 1238655 1375094 1371180 1237822
36987A237822l3825J27956J18295j4580r6031r0420k6713J18025K53450J18446
$$ 1237822 1203997 1331953 1450248 1435668 1339637 1249217 1222504 1340529 1593979 1712425
36977A712425l30748o52472l97980K12041M73115J13573l30799k33812L01212
$$ 1712425 1381677 729205 331225 543266 1016381 1129954 799155 565343 866555
36968H66555O10268L40061j28872j84824K59041O60696N00608r1624m99724l73816
$$ 866555 1476823 1816884 1688012 1503188 1762229 2422925 2923533 2831909 2332185 1958369
36958A958369l304J47982L1608q7810j16239j55663j48031P9935L86874L65618
$$ 1958369 1955065 2103047 2134655 2046845 1930606 1774943 1626912 1706847 2093721 2459339
36948B459339k8985k97432q1249L06042L41199J9396k36426k23926j48652k19144
$$ 2459339 2430354 2132922 2051673 2357715 2698914 2718310 2481884 2257958 2109306 1890162
36938A890162l68484m06154k54403j9453Q5763l2622j56665Q325L30069L09219
$$ 1890162 1521678 1115524 861121 841668 927431 894809 738144 746469 1076538 1385757
36928A385757j59518m78312j67200L62349L70735j28398m59526l29491j25018
$$ 1385757 1226239 747927 580727 943076 1313811 1185413 725887 396396 271378
36919B71378j52546k20834j22264L2136J47388L13912M51139K71159j87703m69801
$$ 271378 118832 -102002 -224266 -192130 -44742 269170 720309 991468 803765 333964
36909C33964l72016k17683k21817j28787J91401L57373J34509n7568J58749M07294
$$ 333964 -38052 -255735 -477552 -606339 -414938 -57565 76944 19376 178125 585419
36899E85419J93271j75185p2990L32455L22493j44262l45071j2095K29565q0267
$$ 585419 778690 603505 530515 862970 1185463 1041201 696130 684035 913600 833333
36889H33333m93091l90995J09265M71756N32495M81422L56354O1493k53821k87026
$$ 833333 340242 -50753 58512 530268 1062763 1544185 1900539 1962032 1708211 1421185
36879A421185m4747J17301l4177l18528l90811j60964J14984J54992J3273L096
$$ 1421185 1376438 1493739 1459562 1141034 750223 589259 704243 859235 872508 875604
36869H75604K05325K69725o0235m31643l08486J77308L35443m9333l77303j86526
$$ 875604 1080929 1350654 1290419 858776 550290 727598 1063041 1013708 636405 449879
36859D49879J24085o541l31111j69513M63745Q06945M63467m7901q0019K70318
$$ 449879 573964 567423 236312 66799 530544 1337489 1800956 1753055 1673036 1943354
36849A943354M17536J36224k21228k75802p5045P8373N9005J9059R3829J76524
$$ 1943354 2360890 2497114 2275886 2000084 1925039 2003412 2062417 2081476 2175305 2351829
36839B351829J05266j7784Q6614M31464O39485M19603n896j69068N0451L35709
$$ 2351829 2457095 2439311 2525925 2957389 3596874 4016477 4010581 3841513 3891964 4227673
36829D227673L94336K74294J96237K69577M33207N37633M47122J83660j2656R7752
$$ 4227673 4622009 4896303 5092540 5362117 5795324 6332957 6780079 6963739 6951083 7048835
36819G048835M48626P12526O78305M54664K77360K66738M19871O76039Q97119
$$ 7048835 7497461 8209987 8888292 9342956 9620316 9887054 10306925 10982964 11880083
36810A1880083R17961P31423N39946N38959P23628R57258J111201J074046P88091
$$ 11880083 12798044 13529467 14069413 14608372 15332000 16289258 17400459 18474505 19262596
36801A9262596M14820L13890O46877J080245J108710O58077J50473m6754m121
$$ 19262596 19677416 19991306 20638183 21718428 22827138 23485215 23635688 23588934 23584813
36792B3584813J9486k4753k0717R470j04391l90448o34184o45528n08995m69402
$$ 23584813 23604299 23579546 23558829 23568299 23463908 23073460 22439276 21793748 21284753 20815351
36782B0815351o18448p88996p72187n77957m24618m75996o56203p76708p91062
$$ 20815351 20196903 19407907 18635720 18057763 17633145 17157149 16500946 15724238 14933176
36773A4933176q10087q69773q38130o35518m18779l99425n42567o02653m46330
$$ 14933176 14123089 13253316 12415186 11779668 11360889 10961464 10418897 9816244 9369914
36764I369914k05289r6590j96267l97014n01480l74103r4790P5995p645j88854
$$ 9369914 9164625 9068035 8871768 8474754 7973274 7599171 7504381 7580376 7572731 7383877
36754G383877k61751k96612m54283n69254l10537J99109L66250o4758n76166n64072
$$ 7383877 7122126 6825514 6371231 5801977 5491440 5690549 6056799 5992041 5415875 4851803
36744D851803j48531Q5455p5648l26673l98349l24946k05713r5985j24765l53184
$$ 4851803 4703272 4788727 4713079 4386406 3988057 3663111 3457398 3361413 3236648 2883464
36734B883464n27695l54316q799O0175j32054p5059L76412O40841K41732m21543
$$ 2883464 2355769 2001453 1992654 2052829 1920775 1845716 2222128 2862969 3104701 2683158
36724B683158n77172r7419M29886N07958J99980j57823l41899k99753j03166P5142
$$ 2683158 2105986 2008567 2438453 2946411 3146391 2988568 2646669 2346916 2243750 2318892
36714B318892J05809N9135R0602J85104J63363n0365k92250l16015l1905L79790
$$ 2318892 2424701 2483836 2574438 2759542 2922905 2872540 2580290 2264275 2232370 2612160
36704B612160N59578K78552k60810n58006l72164k2571K6901k36140m07533k30887
$$ 2612160 3171738 3450290 3189480 2631474 2259310 2236739 2263640 2027500 1619967 1389080
36694A389080J15789L12650K64084R7865m6748j22785j43709j43604j62468k24424
$$ 1389080 1504869 1817519 2081603 2179468 2132720 2009935 1866226 1722622 1560154 1335730
36684A335730l06785l30781k16948J1993K13929K71140K16360J47043Q2050J3539
$$ 1335730 1028945 698164 481216 493209 707138 978278 1194638 1341681 1423731 1437270
36674A437270O407P0364L7009j79487k95289L210M63261M76122k4173l88585k10985
$$ 1437270 1443677 1514041 1551050 1371563 1076274 1079484 1542745 2018867 1994694 1606109 1395124
36663A395124P5573m0361k87814j07778L34901L59384j21331m24708j36623L09082
$$ 1395124 1470697 1430336 1142522 1034744 1369645 1729029 1607698 1182990 1046367 1355449
36653A355449L44348O0453o5942R5340K62349K53156K04864K60851K87189N5447
$$ 1355449 1699797 1760250 1694308 1789648 2051997 2305153 2510017 2770868 3058057 3113504
36643C113504l54690n32383k58385Q6411n2073n75174p57891k60362L55079M49990
$$ 3113504 2758814 2226431 1968046 2054457 2002384 1427210 669319 408957 764036 1214026
36633A214026J92669J09350J54454q2876m85077n01753q9659K02001J41239O4582
$$ 1214026 1406695 1516045 1670499 1587623 1102546 600793 511134 713135 854374 918956
36623I18956J01197o6577m24903m13297J09989M39194R7249l34476j32491L89252
$$ 918956 1020153 953576 528673 115376 225365 664559 761808 427332 294841 684093
36613F84093M11762p0911l30500j15162P0532r1145k69899j33689J57730L28599
$$ 684093 1095855 1024944 694444 579282 649814 558669 288770 155081 312811 641410
36603F41410L70972L26052R2437k96353n20204l47426N1740L44591M00219K83268
$$ 641410 1012382 1338434 1430871 1134518 614314 266888 318628 663219 1063438 1346706
36593A346706R0637n3008j0079K00241L62231L07078R4485j18672k59417l11458
$$ 1346706 1437343 1384335 1374256 1574497 1936728 2243806 2338291 2219619 1960202 1648744
36583A648744k53463j33644q1129j21548r4585R6748K53461J10981k12161k50101
$$ 1648744 1395281 1261637 1180508 1058960 964375 1061123 1314584 1425565 1213404 963303
36573I63303J91751O54912N35205r2950m95827k23241K95789L55229q4629m29815
$$ 963303 1155054 1809966 2345171 2252221 1756394 1533153 1828942 2184171 2099542 1669727
36563A669727l00396P0010K74497J81047j17502m39791n14096j82238K96041M70673
$$ 1669727 1369331 1439341 1713838 1894885 1777383 1337592 823496 641258 937299 1407972
36553A407972K98263J31146O5543j79667n83063o30540j38094L18345K59526N1125
$$ 1407972 1706235 1837381 1902924 1723257 1140194 509654 371560 689905 949431 1000556
36543A000556K15289M83913K73540k45835l88739q8964N2223j59377k21747J26265
$$ 1000556 1215845 1699758 1973298 1727463 1338724 1249760 1301983 1142606 920859 1047124
36533A047124M40195L32498O5987K5126J03104Q890j97834k63243j63760m7463
$$ 1047124 1487319 1819817 1885804 1910930 2014034 2022924 1825090 1561847 1398087 1350624
36523A350624M9268J58818K14935J46816K2966m6706m4750k764M9691N8451R864
$$ 1350624 1399892 1558710 1773645 1920461 1943427 1896721 1851971 1849207 1898898 1957349 1967213
36512A967213J1877J40665K58273J90697M801j37359k74941m85775n75200l29993
$$ 1967213 1979090 2119755 2378028 2568725 2573526 2436167 2161226 1675451 1100251 770258
36502G70258L7664J53637P6399J17858J93642k0892l53188k80533J52047L37926
$$ 770258 807922 961559 1037958 1155816 1349458 1328566 975378 694845 846892 1184818
36492A184818J40711P6123K66163J55329l58643n02199P2667N08651O3763o18633
$$ 1184818 1325529 1401652 1667815 1823144 1464501 962302 1034969 1543620 1607383 988750
36482I88750n23883J25679L57612M5423j33870k4098r3325l39116k40473J63342
$$ 988750 464867 590546 948158 993581 859711 835613 742288 403172 162699 326041
36472C26041K30610j10710j88864J85236L37169o5096l83640q4022M05435M82303
$$ 326041 556651 445941 257077 442313 779482 714386 330746 246724 652159 1134462
36462A134462K91929K39448K09814n1954k93383j75906O3225M4097j8585K69534
$$ 1134462 1426391 1665839 1875653 1823699 1530316 1354410 1417635 1461732 1443147 1712681
36452A712681O04962L24591m57841q32332l39335M01101N52806Q3654l69758l42676
$$ 1712681 2317643 2642234 2184393 1352061 1012726 1413827 1966633 2050287 1680529 1337853
36442A337853M4877L59936L17384J272k79463l41773k75774j95011k824L93261
$$ 1337853 1382730 1742666 2060050 2061322 1781859 1440086 1164312 969301 966477 1359738
36432A359738P52318O80198J50981m04842n99069m69668k91189j96077j19276
$$ 1359738 2112056 2792254 2943235 2538393 1939324 1469656 1178467 982390 863114
36423H63114k67J09960J27433M7302l2883q085Q8630P4731j61266m42882m33173
$$ 863114 862847 972807 1100240 1147542 1114659 1106574 1195204 1269935 1108669 665787 232614
36412B32614l3644M37845N66636L07184K7437O2641L15417L95149J22678k41528
$$ 232614 198970 636815 1203451 1510635 1538072 1600713 1916130 2311279 2433957 2192429
36402B192429l32500j27684P2470N6911o5623p6050N2282J53308J14553K9464
$$ 2192429 1859929 1732245 1804715 1861626 1796003 1719953 1772235 1925543 2040096 2069560
36392B069560P1898K42298L09605Q7109k69096l96276k01113o988j02119l41435
$$ 2069560 2141458 2383756 2693361 2780470 2511374 2115098 1913985 1906997 1804878 1463443
36382A463443m11231l07184k34329j44668K18569P76999J012370N94022j49104
$$ 1463443 1052212 745028 510699 366031 584600 1361599 2373969 2967991 2818887
36373B818887n87802m68004p9183J22099n9733m02111m70807r3887L73115M36103
$$ 2818887 2231085 1763081 1683898 1805997 1746264 1344153 873346 779459 1152574 1588677
36363A588677R8881j58408o7738R2039k4349l36264n26841m56574j77636K10762
$$ 1588677 1687558 1529150 1461412 1553451 1529102 1192838 665997 209423 31787 242549
36353B42549N00473M28463N1260j81817j3432K13419O6270k99349l91378j36146
$$ 242549 743022 1171485 1222745 1040928 1027496 1240915 1307185 1007836 616458 480312
36343D80312R1124J10774J20932K12255J81257l6779j64660k7864J20223k7458
$$ 480312 571436 682210 803142 1015397 1196654 1159875 995215 967351 1087574 1060116
36333A060116l51641m58019j94956J84818L33360J49545j56095k67067o6415K37731
$$ 1060116 708475 250456 55500 240318 573678 723223 567128 300061 233646 471377
36323D71377L42368J91619J91m1722L9931J05935O6574p3601k14839k01553J2320
$$ 471377 813745 1005364 1005555 963833 1003764 1109699 1176273 1102672 887833 686280 698600
36312F98600K40910K55206R9116M7451K10358L58037K34857r0471l16020k72369
$$ 698600 939510 1194716 1293832 1341283 1551641 1909678 2144535 2054064 1738044 1465675
36302A465675p4487P0399R8054Q6167Q2771M5799j8351J1000J65574K39979P7600
$$ 1465675 1391188 1461587 1559641 1645808 1728579 1774378 1756027 1767027 1932601 2172580 2250180
36291B250180q5685Q5414L98456K73655l33341o79495k65969L68878M26721K0691
$$ 2250180 2164495 2249909 2648365 2922020 2588679 1909184 1643215 2012093 2438814 2459505
36281B459505j22423J27401K06404q2033k57920p4129N7706j33384k57356K4599
$$ 2459505 2337082 2464483 2670887 2588854 2330934 2256805 2314511 2181127 1923771 1948370
36271A948370L63062L01367Q805j03976j01301k82029n29028m87581j97090M325
$$ 1948370 2311432 2612799 2621604 2517628 2416327 2134298 1605270 1117689 920599 924924
36261I24924O2935J73154K70920J02050k35096l24402n2262K35039K42093J7783
$$ 924924 987859 1161013 1431933 1533983 1298887 974485 922223 1157262 1399355 1417138
36251A417138k80352n34167n50961j88918L40258O37434O22401N29817M04843
$$ 1417138 1136786 602619 51658 -137260 202998 840432 1462833 1992650 2397493
36242B397493M5588m73401o96229m09914K0038J78690J31097J66287L05471L53459
$$ 2397493 2443081 1969680 1273451 863537 883575 1062265 1193362 1359649 1665120 2018579
36232B018579K31852R275k32700l67384k48180L8759J50454o9326l17381k32195
$$ 2018579 2250431 2259706 2027006 1659622 1411442 1450201 1600655 1531329 1213948 981753
36222I81753J15759L81436M21034L34766J76035p2202k98250l27141j75440j8140
$$ 981753 1097512 1478948 1899982 2234748 2410783 2338581 2040331 1713190 1537750 1519610
36212A519610P6391J73468K65580K51376J18749l0806j34454j90061j60491k4492
$$ 1519610 1596001 1769469 2035049 2286425 2405174 2374368 2239914 2049853 1889362 1864870
36202A864870J08378J01706j9896j39286k33620l08837k44980L1709K83529J89480
$$ 1864870 1973248 2074954 2055058 1915772 1682152 1373315 1128335 1160044 1443573 1633053
36192A633053j46797k55366M2474L64541L18993K1072j74613j94411j87130j32240
$$ 1633053 1486256 1230890 1273364 1637905 1956898 1977970 1803357 1608946 1421816 1289576
36182A289576J13247M26385M52198J14676j95800j06285K58453M56063K70974
$$ 1289576 1402823 1829208 2281406 2396082 2200282 2093997 2352450 2808513 3079487
36173C079487r6373l28990l14347j57900j0943N4079O1981Q3297J45711J85743
$$ 3079487 2983114 2654124 2339777 2181877 2170934 2225013 2286994 2370291 2516002 2701745
36163B701745J19221m2037j93640k58061k29811r9583J43466L73936L45679M853
$$ 2701745 2820966 2778929 2585289 2327228 2097417 1997834 2141300 2515236 2860915 2865768
36153B865768l18519k60060P4687K23063J6513j89094p9074J32389O1338k26978
$$ 2865768 2547249 2287189 2361876 2584939 2601452 2412358 2333284 2465673 2527011 2300033
36143B300033l28611j18242J36302K47750K84040K18066j42996o80440q37279
$$ 2300033 1971422 1853180 1989482 2237232 2521272 2739338 2596342 1915902 1078623
36134A078623l16720L85500N47127J32244k71138k98504j31382J963J45793L01066
$$ 1078623 761903 1147403 1694530 1826774 1555636 1257132 1125750 1127713 1273506 1574572
36124A574572K40633r3480l41668j88242J65647L04117J77135L5903n8199k49367
$$ 1574572 1815205 1721725 1380057 1191815 1357462 1661579 1838714 1874617 1816418 1567051
36114A567051m60832l88888j0544K83765K30597M5429K5405R5471M1370l3176
$$ 1567051 1106219 717331 706787 990552 1221149 1266578 1291983 1387454 1428824 1395648
36104A395648J41770M79231N37738J06842m77572p06921m23803R3699M33545L86540
$$ 1395648 1537418 2016649 2554387 2661229 2183657 1476736 1052933 1146632 1580177 1966717
36094A966717J00102o8707O3872L04466L67549K59749J72185R8919j04640l14341
$$ 1966717 2066819 1998112 2061984 2366450 2733999 2993748 3165933 3264852 3160212 2845871
36084B845871k07356J66543L24079O9618j59076P458K42109O6299l17816l46112
$$ 2845871 2638515 2805058 3129137 3198755 3039679 3047137 3289246 3355545 3037729 2691617
36074B691617m3724L0076k42371l32172J2965L18390J72240j18164r4862R2525
$$ 2691617 2647893 2677969 2435598 2103426 2116391 2434781 2607021 2488857 2393995 2486520
36064B486520J3905k82385l81341j86414R621L9997O425k7476p9721m6662J48060
$$ 2486520 2500425 2218040 1836699 1650285 1659906 1699903 1706328 1678852 1599131 1552469 1700529
36053A700529K61501Q255m07198m83935j57310J32225J56629J78662L67029M47909
$$ 1700529 1962030 1970285 1563087 1079152 921842 1054067 1210696 1389358 1756387 2204296
36043B204296K15997l9821L0123K97112L87221K02471r1684l56278m65347k62304
$$ 2204296 2420293 2380472 2410595 2707707 3094928 3297399 3205715 2849437 2384090 2121786
36033B121786J44826K99098k4368l87247k57972J92119L53516J05963p4283P0491
$$ 2121786 2266612 2565710 2541342 2154095 1896123 2088242 2441758 2547721 2473438 2543929
36023B543929K16435M9469k58929l94167l49802k88889k27667r4206Q4813K30773
$$ 2543929 2760364 2809833 2550904 2156737 1806935 1518046 1290379 1196173 1280986 1511759
36013A511759K96053K15131k3414j97775k8188L59572M60449O0845m15694m66496
$$ 1511759 1807812 2022943 1999529 1801754 1773566 2133138 2593587 2654432 2238738 1772242
36003A772242j44649J34346J79398R7695l4776k18818l27500j79249J77809M72281
$$ 1772242 1627593 1761939 1941337 2039032 2004256 1785438 1457938 1278689 1456498 1928779
35993A928779N00911K82963p542j54167p0610L9240j02398l63397k64663K58172
$$ 1928779 2429690 2712653 2705111 2550944 2480334 2519574 2417176 2053779 1789116 2047288
35983B047288N76078K52068k08867r8514L25447K01259n20526r08006m35441L00950
$$ 2047288 2623366 2875434 2666567 2568053 2893500 3094759 2574233 1666227 1230786 1531736
35973A531736N76731M84074M21372L22631N818k42668j05903J33159P0021m7708
$$ 1531736 2108467 2592541 3013913 3336544 3342362 3099694 2993791 3126950 3196971 3149263
35963C149263K47493O92103N87402m6879m40458k54034K160p9616j92878O511
$$ 3149263 3396756 4088859 4676261 4629382 4188924 3934890 3937050 3857434 3664556 3671067
35953C671067K75653K84838K09213L21500M14624J64717k37225l60774k43725
$$ 3671067 3946720 4231558 4440771 4762271 5176895 5341612 5104387 4743613 4499888
35944D499888k90974n63261o75530m17713l6349J95279L32233N31682P14622O32166
$$ 4499888 4208914 3645653 2970123 2552410 2516061 2711340 3043573 3575255 4289877 4922043
35934D922043J86831l95536p04781n00563K7298M29661M68359K95599J52418J17873
$$ 4922043 5108874 4713338 4008557 3507994 3535292 3964953 4433312 4728911 4881329 4999202
35924D999202K18955M68637O36687L59520k39157m30360J85804R67166J010938
$$ 4999202 5218157 5686794 6323481 6683001 6443844 6013484 6199288 7166454 8177392
35915H177392M06524N0967L29001P09021P21233O09130P40972R74524R77436P51375
$$ 8177392 8583916 8634883 8963884 9672905 10394138 11003268 11744240 12718764 13696200 14447575
35905A4447575N00438L13092K35815L31333M49693L13605L5697J07355O09831
$$ 14447575 14948013 15261105 15496920 15828253 16277946 16591551 16627248 16734603 17344434
35896A7344434R25528O04548N6427o7062K36536N30669O49928O61620M78094J06955
$$ 17344434 18269962 18874510 18930937 18863875 19100411 19631080 20281008 20942628 21420722 21527677
35886B1527677k2123L73916Q05680O52204J91811J94729O26601O55514j696o29420
$$ 21527677 21505554 21879470 22685150 23337354 23529165 23723894 24350495 25006009 25004313 24374893
35876B4374893o20428k31089N9072J91491J67144k47228r73836j380659j102279
$$ 24374893 23754465 23523376 23582448 23773939 23941083 23693855 22720019 21339360 20237081
35867B0237081o22743n53249p84390q56937p34133o47427n58453l75031l90464
$$ 20237081 19614338 19061089 18276699 17419762 16685629 16038202 15479749 15104718 14714254
35858A4714254q75752j450184j477941r58048m52812k55305k06368k47048n25905
$$ 14714254 13838502 12388318 10910377 9952329 9499517 9244212 9037844 8790796 8264891
35849H264891r24051j048380q19293n95695n92123n88949l58047j8677J69555
$$ 8264891 7340840 6292460 5473167 4877472 4285349 3696400 3338353 3319676 3489231
35840C489231R8138j73515m51754m78395k36428r8511l30920n83620l40758K19998
$$ 3489231 3587369 3413854 2962100 2483705 2247277 2148766 1817846 1234226 893468 1113466
35830A113466M05671N8548k17752l3463K35473J61161o7550r7214k9093j09461
$$ 1113466 1519137 1577685 1359933 1326470 1561943 1723104 1655554 1558340 1529247 1419786
35820A419786j96429m3401J80842J56437l2203r5985r9117k89205m98630k95166
$$ 1419786 1223357 1179956 1360798 1517235 1485032 1389047 1289930 1000725 502095 206929
35810B06929K58404N51252K77156j31687j56549J09312K30794J24596Q7545K26409
$$ 206929 465333 1016585 1293741 1162054 1005505 1114817 1345611 1470207 1557752 1784161
35800A784161K53005m7045m21062m51631j25977J59504J62028Q0768J55211K40240
$$ 1784161 2037166 1990121 1569059 1117428 991451 1150955 1312983 1393751 1548962 1789202
35790A789202N8901k84113l99297j85061N6007J14630J26622K07917J91933m6931
$$ 1789202 1848103 1563990 1164693 979632 1035639 1150269 1276891 1484808 1676741 1629810
35780A629810k83193k22849P3212K80021K07111o1926l07441l23401p4738J93447
$$ 1629810 1346617 1123768 1196980 1477001 1684112 1622186 1314745 991344 916606 1110053
35770A110053J88350r391k0881K27480L33135P0922j66383N0931M75679N10721
$$ 1110053 1298403 1289012 1268131 1495611 1828746 1899668 1733285 1784216 2259895 2770616
35760B770616O7879l60944m03164j56251J17440K63042K14801L9147k8375J19056
$$ 2770616 2838495 2477551 2074387 1918136 2035576 2298618 2513419 2552566 2524191 2643247
35750B643247K18276K3363k12393q6998K28272J77229k56828m22940K1138N60536
$$ 2643247 2861523 2884886 2672493 2585495 2813767 2990996 2734168 2311228 2332366 2892902
35740B892902N59895J05759k47913k37954k2920J91721K91179J84903o5659j73371
$$ 2892902 3452797 3558556 3310643 3072689 3049769 3241490 3532669 3717572 3651913 3478542
35730C478542L6473L27932L60180J69218N1349O8931J9808j20011r3709J85601
$$ 3478542 3515015 3842947 4203127 4372345 4423694 4492625 4512433 4392422 4298713 4484314
35720D484314L91661K08635j95567l75605k06789j3340p4804k54415k54380m7782
$$ 4484314 4875975 5084610 4889043 4513438 4306649 4293309 4218505 3964090 3709710 3661928
35710C661928J57288K58639L02316K54087M4404j58212p7805J86105J97674j29191
$$ 3661928 3819216 4077855 4380171 4634258 4678662 4520450 4442645 4628750 4826424 4697233
35700D697233l04659J641M17263M50456K32183J74486K16993K6932k73877k64834
$$ 4697233 4392574 4394215 4811478 5261934 5494117 5668603 5885596 5912528 5638651 5373817
35690E373817q032K0079k29870k99379m7021J35020N3928j9243K0446o8497k11920
$$ 5373817 5365785 5385864 5155994 4856615 4809594 4944614 4998542 4979299 4999745 4931248 4719328
35679D719328M5423O17782P03511J4695o04778m21382N7596j9602m49883m15298
$$ 4719328 4764751 5382533 6086044 6100739 5495961 5074579 5132175 5112573 4662690 4247392
35669D247392J07554L89741J96788K5090J33538K22747J41198J13662J49688m1527
$$ 4247392 4354946 4744687 4941475 4966565 5100103 5322850 5464048 5577710 5727398 5685871
35659E685871l93685m35105r4507R9058j31571l66030j93195J71425L11184K08841
$$ 5685871 5292186 4857081 4762574 4861632 4730061 4364031 4170836 4342261 4653445 4862286
35649D862286R2047L8144K1490N3530O0267q4444k64289k12859p708k6729k69357
$$ 4862286 4954333 4992477 5013967 5067497 5127764 5043320 4779031 4566172 4558464 4531735 4262378
35638D262378k54975J56846M20205J64206j45297O1062N02165M70134o3407m33521
$$ 4262378 4007403 4164249 4584454 4748660 4603363 4664425 5166590 5636724 5573317 5139796
35628E139796k75406Q0213K25619J57867L6606j01771k26023k25606r7367J2650
$$ 5139796 4864390 4944603 5170222 5328089 5364695 5262924 5036901 4811295 4713928 4726578
35618D726578N2117J33838K85767L47598K23591N3841R229N6593N8440Q533K7458
$$ 4726578 4778695 4912533 5198300 5545898 5769489 5823330 5832559 5889152 5947592 5956125 5983583
35607E983583J54787K71322K71557K37909L36439N27681N16894J20323m08814
$$ 5983583 6138370 6409692 6681249 6919158 7255597 7783278 8300172 8420495 8011681
35598H011681o24678m46828k42083k90911m15868k90718P8600L89743M42282K94462
$$ 8011681 7387003 6940175 6698092 6407181 5991313 5700595 5779195 6168938 6611220 6905682
35588F905682Q8334p9756j21212L0532K95035M27007K25077k17315n23693l98687
$$ 6905682 6994016 6914260 6793048 6823580 7118615 7545622 7770699 7553384 7029691 6631004
35578F631004R01K04385K7337j56500N0644M52602N20125J71279j33737r8958
$$ 6631004 6631905 6836290 6863627 6707127 6757771 7210373 7730498 7901777 7768040 7669082
35568G669082M5804J4993j12307j38909n6040J11945M25445P60358P70333L87402
$$ 7669082 7714886 7729879 7617572 7478663 7422623 7534568 7960013 8720371 9490704 9878106
35558I878106J8529m6444m8429k29810l09708J405L11570L1535o13405p46065
$$ 9878106 9896635 9850191 9801762 9571952 9262244 9263649 9575219 9606754 8993349 8247284
35548H247284m8912P85231R62118M69226j26586l69970k03780J40164L47103K91557
$$ 8247284 8198372 8983603 9945721 10414947 10288361 9918391 9714611 9854775 10201878 10493435
35538A0493435J73156K18450L11428K01793J763O8407L80084M82860J77455j69767
$$ 10493435 10666591 10885041 11196469 11398262 11400025 11468432 11848516 12331376 12508831 12339064
35528A2339064j90512O595J62703L05127N33755O61187M50290N6497j21456K3885
$$ 12339064 12148552 12155147 12317850 12622977 13156732 13817919 14268209 14324706 14203250 14227135
35518A4227135K07038J68652k8170j31615L1565M25698Q13878R07744O41710L09114
$$ 14227135 14434173 14602825 14574655 14443040 14474605 14900303 15714181 16621925 17263635 17572749
35508A7572749L01039O54160R49387P68823K31577q0300J74361O23968O62572
$$ 17572749 17873788 18527948 19477335 20246158 20477735 20397435 20571796 21195764 21858336
35499B1858336L13703K18575O76432J162911J103802P01531N17950N74506M90024
$$ 21858336 22172039 22390614 23067046 24229957 25333759 26035290 26553240 27127746 27617770
35490B7617770L11000M73629R51891J186310J002472Q82355J070268J133543Q17800
$$ 27617770 27928770 28402399 29354290 30540600 31543072 32425427 33495695 34629238 35447038
35481C5447038O42955J053180J551055J425868R46299R84596J631352K049667
$$ 35447038 36089993 37143173 38694228 40120096 41066395 42050991 43682343 45732010
35473D5732010J768540J330911J390092J801134K014982J937858J944158K256434
$$ 45732010 47500550 48831461 50221553 52022687 54037669 55975527 57919685 60176119
35465F0176119K701025L004076L067385K990939K997261L278730L775274M169903
$$ 60176119 62877144 65881220 68948605 71939544 74936805 78215535 81990809 86160712
35457H6160712M252346M229437M510201N202497N990539O538013O847963P141051
$$ 86160712 90413058 94642495 99152696 104355193 110345732 116883745 123731708 130872759
35449A30872759P536071Q025444Q669586R560820J0576660J1439273J2137765
$$ 130872759 138408830 146434274 155103860 164664680 175241340 186680613 198818378
35442A98818378J3023965J4275086J5521299J6350774J6993134J8039853J9538557
$$ 198818378 211842343 226117429 241638728 257989502 274982636 293022489 312561046
35435C12561046K0859903K1526055K1663839K1469475K0757463J9378015J7617319
$$ 312561046 333420949 354947004 376610843 398080318 418837781 438215796 455833115
35428D55833115J5698774J3208586R582182N026862M25681l672827p492429j1366901
$$ 455833115 471531889 484740475 494322657 499349519 499775200 496102373 488609944 477243043
35420D77243043j5062730j7999623j9921838k1111595k1970020k2511945k2361295
$$ 477243043 462180313 444180690 424258852 403147257 381177237 358665292 336303997
35413C36303997k1311690j9811833j8642287j8044016j7463926j6341068j4835382
$$ 336303997 314992307 295180474 276538187 258494171 241030245 224689177 209853795
35406B09853795j3495360j2501920j1645001j0834597j0161263r548314q805318
$$ 209853795 196358435 183856515 172211514 161376917 151215654 141667340 132862022
35399A32862022q000582p364523o852154o228531n559907n138416m902520m470140
$$ 132862022 124861440 117496917 110644763 104416232 98856325 93717909 88815389 84345249
35391H4345249l853553l573017l824733m068177l785973l200125k819536k660112
$$ 84345249 80491696 76918679 73093946 69025769 65239796 62039671 59220135 56560023
35383E6560023k406312k073745j965798k086426k102286j886703j666515j575359
$$ 56560023 54153711 52079966 50114168 48027742 45925456 44038753 42372238 40796879
35375D0796879j457691j242167j164540j403073j720718j722125j374873j056729
$$ 40796879 39339188 38097021 36932481 35529408 33808690 32086565 30711692 29654963
35367B9654963j071118j269661j253808r02646n64700o34655j017080j194789
$$ 29654963 28583845 27314184 26060376 25157730 24593030 23958375 22941295 21746506
35359B1746506q69832l48154j47212l64026o46768p26724p06152p48353p36241
$$ 21746506 20876674 20528520 20381308 20017282 19370514 18643790 17937638 17189285 16453044
35350A6453044m65303o1415Q0336j75186m86269n13362m10808n47963q43252p85249
$$ 16453044 15987741 15926326 16006662 15831476 15345207 14831845 14421037 13873074 13029822 12244573
35340A2244573k15543L06487K00882l51692o84236n22938j95160m1879m8041r4374
$$ 12244573 12029030 12335517 12536399 12184707 11500471 10977533 10782373 10740494 10692453 10598079
35330A0598079j88416l21396l96657m19401m94582n55055l98663j00260k9328
$$ 10598079 10409663 10088267 9691610 9272209 8777627 8222572 7823909 7723649 7694321
35321G694321k69616l82892l7462M41565N11988J65663j63734k72450l15861l47671
$$ 7694321 7424705 7041813 7004351 7445916 7957904 8123567 7959833 7687383 7371522 7023851
35311G023851k19316O075L526k71844l88177n6595L54544K74086k77248p08319
$$ 7023851 6804535 6810610 6814136 6542292 6154115 6097520 6452064 6726150 6448902 5740583
35301E740583o08410j37425L27933N78068N12163P2400n15537p24867l04209K84163
$$ 5740583 5132173 4994748 5322681 5900749 6412912 6485312 5969775 5244908 4940699 5224862
35291E224862L68705p4130m53198m09285j68589M331J80064L68144K55657k67605
$$ 5224862 5593567 5519437 5066239 4656954 4488365 4492696 4672760 5040904 5296561 5028956
35281E028956p16976o06656j42968J39863J61691J90962K08228M303k35054j26786
$$ 5028956 4311980 3705324 3562356 3702219 3863910 4054872 4263100 4267403 4032349 3905563
35271C905563J71122J23292k47194l33384R747J86920q5577k50866R4912M14222
$$ 3905563 4076685 4199977 3952783 3619399 3629146 3816066 3730489 3479623 3574535 3988757
35261C988757Q6506n20619n96528j17210K47476K24902J66299K60964K57002M9137
$$ 3988757 4075263 3554644 2958116 2840906 3088382 3313284 3479583 3740547 3997549 4046686
35251D046686p0572P2738K39356J80661j2915j35394j57293j50937j35222j09026
$$ 4046686 3976114 4048852 4288208 4468869 4455954 4320560 4163267 4012330 3877108 3768082
35241C768082j01099j31657k01213k74062k16234Q1617M11722L51384j23947m46671
$$ 3768082 3666983 3535326 3334113 3060051 2843817 2925434 3337156 3688540 3564593 3117922
35231C117922k24148J11632q5660o48574p94521k87497K38079K22085j21324k72369
$$ 3117922 2893774 3005406 2919746 2271172 1476651 1189154 1427233 1649318 1527994 1255625
35221A255625j15401J10772K49026L13800L25750K76637J70713J1479j57585k05552
$$ 1255625 1140224 1250996 1500022 1813822 2139572 2416209 2586922 2598401 2440816 2235264
35211B235264o0698J31883J84351J30245R5681J9162j95005l44379j42114K59354
$$ 2235264 2174566 2306449 2490800 2621045 2716726 2735888 2540883 2196504 2054390 2313744
35201B313744L76504Q9139j64819j5371L46133M54784J24091l95895o51636l76239
$$ 2313744 2690248 2779387 2614568 2599197 2945330 3400114 3524205 3128310 2476674 2100435
35191B100435J91902M83469K90908O2040J85153L10101o4003o02261n05127K25561
$$ 2100435 2292337 2775806 3066714 3128754 3313907 3624008 3560005 2957744 2452617 2678178
35181B678178P34774N96095K78890J49620o8072m62179m81225R4912N31003K09467
$$ 2678178 3412952 4009047 4287937 4437557 4369485 3907306 3426081 3520993 4051996 4261463
35171D261463l30282k30542L36287N28651J63806k09045l24901m06598m58482
$$ 4261463 3931181 3700639 4036926 4565577 4729383 4520338 4195437 3788839 3330357
35162C330357k12046J94532K56066o7300k37643o292K29713J27261j09389j65202
$$ 3330357 3118311 3312843 3568909 3501609 3263966 3257674 3487387 3614648 3505259 3340057
35152C340057o6194L4060J04924P6412j70033m52135l45867J58062M60847J50519
$$ 3340057 3273863 3307923 3412847 3489259 3319226 2867091 2521224 2679286 3140133 3290652
35142C290652l45729l18952K14308N21214J64601l96122m18368J22061M65446
$$ 3290652 2944923 2625971 2840279 3361493 3526094 3129972 2711604 2833665 3299111
35133C299111O8655o16716o97644o8985M05646J15280m06219k68473M53094Q29714
$$ 3299111 3367766 2751050 2053406 1984421 2390067 2505347 2099128 1830655 2283749 3113463
35123C113463M05275k65082n16586m04180l35610l56228k32866J2894J01307k9618
$$ 3113463 3518738 3253656 2737070 2332890 1997280 1641052 1408186 1421080 1522387 1492769
35113A492769q9532J42070M56586M19982r5267o90302q40946m85027o1477N6670
$$ 1492769 1403237 1545307 2001893 2421875 2326608 1636306 795360 310333 248856 305526
35103C05526m6669j09351r4823p9097L6443L53255O42374N49583J01490l08619
$$ 305526 258857 149506 54683 -24414 12029 365284 1007658 1557241 1658731 1350112
35093A350112m21156l09394j18053Q6270K15188K01471J32351Q9277n3020l58827
$$ 1350112 928956 619562 501509 587779 802967 1004438 1136789 1226066 1173046 814219
35083H14219n09400j87649L09950L74087j2531k49330p8018O2443j34434k85619
$$ 814219 304819 117170 427120 801207 788676 539346 461328 523771 389337 103718
35073A03718P838M42981M77343J55333m8759J2639O5923l4012j19389o7202K3161
$$ 103718 111556 554537 1031880 1187213 1138454 1151093 1217016 1183004 1063615 996413 1019574
35062A019574N0500M4888M1750J8529j8582k7263j3048k1679o8229j34480j79661
$$ 1019574 1070074 1114962 1156712 1175241 1156659 1129396 1116348 1094669 1026440 891960 712299
35051G12299j18925J01570L63410M39370K55654k5648k06315j95309J7913L14030
$$ 712299 593374 694944 1058354 1497724 1753378 1727730 1521415 1326106 1344019 1658049
35041A658049L92693O9900l51603l61668K7413K26773q6497m80864m00807O5882
$$ 1658049 2050742 2120642 1769039 1407371 1434784 1661557 1575060 1094196 693389 759271
35031G59271L98480L60474J49036J1936M7191K48483M57931L95620K238l64754
$$ 759271 1157751 1518225 1667261 1679197 1726388 1974871 2432802 2828422 2830660 2465906
35021B465906l25709L8153L15959K65716j4793k77911k95985O104M04999N34198
$$ 2465906 2140197 2178350 2494309 2760025 2745232 2467321 2171336 2177440 2582439 3116637
35011C116637L45573J87174K46636K36509p5196l44804r5194N23916Q86174P28806
$$ 3116637 3462210 3649384 3896020 4132529 4057333 3712529 3617335 4141251 5027425 5756231
35001E756231M19643L65168N06723N17815K97757J37002L82488R24811J156700
$$ 5756231 6175874 6541042 7047765 7565580 7863337 8000339 8382827 9307638 10464338
34992A0464338O94096J9414n1036M84699Q23371O25663M93774Q35869J105803
$$ 10464338 11158434 11177848 11126812 11611511 12434882 13060545 13554319 14390188 15495991
34983A5495991Q04424M49535O86443J092022Q95998L80186L89194P89696O95237
$$ 15495991 16300415 16749950 17436393 18528415 19424413 19804599 20193793 20983489 21678726
34974B1678726Q3570j46726K05132L20006q4525k19553K76122N82017J24966l92340
$$ 21678726 21762296 21615570 21820702 22140708 22056183 21836630 22112752 22694769 22819735 22427395
34964B2427395k30769J30094o4357n08940n08557k89021n06489r48838q80129
$$ 22427395 22196626 22326720 22262363 21753423 21244866 20955845 20449356 19500518 18620389
34955A8620389l74695j91915m67193n78142k95832r5957k35296l92502l83354
$$ 18620389 18245694 18053779 17586586 17008444 16712612 16616655 16381359 15988857 15605503
34946A5605503m56828o88260p67079n89937m50112m59048l75702j89013k61722
$$ 15605503 15148675 14460415 13693336 13103399 12653287 12194239 11818537 11629524 11367802
34937A1367802o53228q67384n75744j10929O4661l6143j47277k06537k88820l66650
$$ 11367802 10714574 9847190 9271446 9160517 9225178 9189035 9041758 8835221 8546401 8179751
34927H179751l89373l86180l50351k56288k38674m32489o19309m55716q7373j5382
$$ 8179751 7790378 7404198 7053847 6797559 6558885 6126396 5507087 5051371 4963998 4948616
34917D948616k61544k83808P6848K51343r4602m36705k58521Q3766L2448j81353
$$ 4948616 4687072 4403264 4480112 4731455 4636853 4200148 3941627 4025393 4057841 3876488
34907C876488l3975K29020q956n08001m12818K55549M48948k51751q55478m36175
$$ 3876488 3842513 4071533 4062577 3554576 3141758 3397307 3846255 3594504 2739026 2302851
34897B302851M49287O33074M3798l96730k81534j32120k94545l55722K2873M23240
$$ 2302851 2752138 3385212 3429010 3032280 2750746 2618626 2324081 1968359 1991232 2414472
34887B414472L18914q8746k30474n2947K9267q6317m6599K81242N19488L67336
$$ 2414472 2733386 2644640 2414166 2361219 2390486 2304169 2257570 2538812 3058300 3425636
34877C425636O9598M038R0948k5975l63464n47681l80708j21163p1934j33948
$$ 3425636 3495234 3499272 3590220 3564245 3200781 2653100 2272392 2151229 2079295 1945347
34867A945347O236L49520N02566J96184k91916m28624j04028K15206J14237k12670
$$ 1945347 1951583 2301103 2803669 2999853 2707937 2279313 2175285 2390491 2504728 2292058
34857B292058k80770l7962J04300m6230j75920j9540J92420J30277j00640j80408
$$ 2292058 2011288 1973326 2077626 2031396 1855476 1835936 2028356 2158633 2057993 1877585
34847A877585r7812o1651o6667K5446J01348m1520k29895j26939J17833K2049
$$ 1877585 1779773 1718122 1651455 1676901 1778249 1736729 1506834 1379895 1497728 1519777
34837A519777l49710l25521K94390P56274M14971k72425m25875j4123K60451J14169
$$ 1519777 1170067 844546 1138936 1895210 2310181 2037756 1611881 1597758 1858209 1972378
34827A972378n1885o734m1212k78798l11442J08517N19253L53316k24940n47126
$$ 1972378 1920493 1913759 1872547 1593749 1282307 1390824 1910077 2263393 2038453 1491327
34817A491327l37838M2891J97653J43541J01795J33011J35933O1155j7929j5585
$$ 1491327 1153489 1196380 1394033 1537574 1639369 1772380 1908313 1969468 1951539 1935954
34807A935954N5253R1731J3125j50097l06841m18574m82669m17239j04689L86190
$$ 1935954 1991207 2082938 2096063 1945966 1639125 1220551 737882 320643 215954 602144
34797F02144P46362P07874L18993j30442l76126l12376L75L25325L66918Q3564
$$ 602144 1348506 2056380 2375373 2244931 1868805 1556429 1556804 1882129 2249047 2332611
34787B332611j92748j41814J10841J83013Q788r7815J904K3380k32480m57294
$$ 2332611 2139863 1998049 2108890 2291903 2300691 2202876 2204780 2228160 1995680 1538386
34777A538386k75125J09850J48615k27552m80001k54202J29687K00031p395j30134
$$ 1538386 1263261 1373111 1521726 1294174 814173 559971 689658 889689 882294 752160
34767G52160n7125M9219J44063L05473M15290K45817j12873k96039j99362q9119
$$ 752160 695035 744254 888317 1193790 1609080 1854897 1742024 1445985 1246623 1157504
34757A157504q1220N5238L68829M48422L5352m49334m44259n2488J95827J88785
$$ 1157504 1076284 1131522 1500351 1948773 1984125 1534791 1090532 1038044 1233871 1422656
34747A422656K48455L79187J79398l59532o13454k18180L14744L15184j00923
$$ 1422656 1671111 2050298 2229696 1870164 1256710 1038530 1353274 1668458 1567535
34738A567535l16780j88713j54128m20852o02850l24208J98980M33024K03067
$$ 1567535 1250755 1062042 907914 487062 -115788 -439996 -241016 192008 395075
34729C95075j20131q3844L02340N46964K50896l51604o22582l31285N6914Q5085
$$ 395075 274944 191100 493440 1040404 1291300 939696 317114 -14171 42743 127828
34719A27828l2970J67336N68205N93939J12776l42786l61463j51498n4249k9098
$$ 127828 94858 262194 830399 1424338 1537114 1194328 832865 681367 627118 598020
34709E98020P7854J50948O2519K111J51302K85855J35977o7037R0010M53302M43755
$$ 598020 675874 826822 889341 891452 1042754 1328609 1464586 1397549 1487559 1940861 2384616
34698B384616j3850k81826M6575M92881L71277k16555n49500l18849L635q4312
$$ 2384616 2370766 2088940 2135515 2628396 2999673 2783118 2233618 1914769 1918404 1834092
34688A834092m04530m05586M0354M87892N44588L35338K06459K02304R5217j70090
$$ 1834092 1429562 1023976 1064330 1552222 2096810 2432148 2638607 2840911 2936128 2766038
34678B766038l71829l77795l28751l43570l03038j08601P4134P5866M1725J88228
$$ 2766038 2394209 2016414 1687663 1344093 1041055 932454 1006588 1082454 1124179 1312407
34668A312407L70982K52092j33043l46375j57985J43375J96923M9933j7014N7244
$$ 1312407 1683389 1935481 1802438 1456063 1298078 1441453 1638376 1688309 1671295 1728539
34658A728539Q9250r714j02675n3179O9509Q0121p9802k51634k41621o9982M2237
$$ 1728539 1817789 1808075 1705400 1652221 1721730 1801851 1722049 1470415 1228794 1158812 1201049
34647A201049m1344k11930l05263l05350k35708k4219L06260M71705K55916r3645
$$ 1201049 1159705 947775 642512 337162 101454 77235 383495 855200 1111116 1017471
34637A017471j48361P4790J59889m0422k30155k28648k08672k13520K6587M89028
$$ 1017471 869110 943900 1103789 1063367 833212 604564 395892 182372 208959 697987
34627F97987O01730P2963m60027k34367M73159O90074J46425m11972l94808j34720
$$ 697987 1299717 1372680 912653 678286 1151445 1841519 1987944 1575972 1181164 1046444
34617A046444j79112m05138l25593P6133L35818K02098r3912k53577k46342j62064
$$ 1046444 867332 462194 136601 212734 548552 750650 656738 403161 156819 -5245
34607e245n293K12439L38308K20184n2912j99683p8445J30483J63821K8496l2401
$$ -5245 -10538 201901 540209 760393 707481 507798 429353 559836 723657 752153 719752
34596G19752Q2107J82706J06932j0016L1545J31880K5667k54577l31217R077M66446
$$ 719752 801859 984565 1091497 1081481 1113026 1244906 1270573 1015996 684779 693856 1160302
34585A160302N50564J57246l26028m67889k25438J00669K42337J85802M9396q7095
$$ 1160302 1710866 1868112 1542084 1074195 848757 949426 1191763 1377565 1426961 1339866
34575A339866j44310p206K77406M00542J66220j24877l1146L27169L90804N6117
$$ 1339866 1195556 1188350 1465756 1866298 2032518 1907641 1876495 2203664 2594468 2650585
34565B650585j20364J45741L38033K016m20951k90282J23752N4354m59716o01958
$$ 2650585 2530221 2675962 3013995 3016011 2595060 2304778 2428530 2482884 2023168 1421210
34555A421210j17056K90696J24252j77494q1203J82736J39341r7279j06267Q9770
$$ 1421210 1304154 1594850 1719102 1541608 1460405 1643141 1782482 1685203 1578936 1668706
34545A668706J35745k0900j22042q3454l7574J0830J64198L15320K12918j38762
$$ 1668706 1804451 1783551 1661509 1578055 1540481 1551311 1715509 2030829 2243747 2104985
34535B104985m10936l20460P0217M06373L44270q1386l84659j62526K85295K61797
$$ 2104985 1694049 1373589 1443806 1850179 2194449 2113063 1728404 1565878 1851173 2112970
34525B112970k90513n72451o3557O30725N88122j38172o56321m72711L2871L23938
$$ 2112970 1822457 1250006 1186449 1817174 2405296 2267124 1610803 1138092 1170963 1494901
34515A494901L23724K32132J78061J85776J93545N8841k18135l42005q2341L14242
$$ 1494901 1818625 2050757 2228818 2414594 2608139 2666980 2448845 2106840 2024499 2338741
34505B338741M15460K09661M0755L0698Q48p9986l2369J33553J88083Q3576j6207
$$ 2338741 2754201 2963862 3004617 3035315 3036163 2956177 2923808 3057361 3245444 3329020 3312813
34494C312813r8679k55054l05626o056L60918K21629l42899n48729m9962N28974
$$ 3312813 3214134 2959080 2653454 2647398 3008316 3229945 2887046 2338317 2288355 2817329
34484B817329N65448L02637K29587J79439k46830p40948n90361J75769O99180
$$ 2817329 3382777 3685414 3915001 4094440 3847610 3106662 2516301 2692070 3391250
34475C391250M81103N0628J64083P54677J052930N87136k59915p26774n21179
$$ 3391250 3872353 3922981 4087064 4841741 5894671 6481807 6221892 5495118 4973939
34466D973939n2021J51803N2640k2904L7587R581k12758m02639l84837l24081
$$ 4973939 4921918 5073721 5126361 5103457 5141044 5150625 4937867 4535228 4150391 3826310
34456C826310m21085n69361n46704l54174j44350K0204J35781J45903M5674n8123
$$ 3826310 3405225 2835864 2289160 1934986 1790636 1810840 1946621 2092524 2138198 2080075
34446B080075j34137k68504l85798k19994K22254M85542K58706j38821k23156
$$ 2080075 1945938 1677434 1291636 1071642 1293896 1779438 2038144 1899323 1676167
34437A676167m5496o973j75182k59919j65406r0153r4866j4283J55342J77927
$$ 1676167 1630671 1623698 1448516 1188597 1023191 933038 838172 823889 979231 1157158
34427A157158j5160j60563k6022K84772M71111L33183n9272l68244k62241J55537
$$ 1157158 1141998 981435 955413 1240185 1711296 2044479 1985207 1616963 1354722 1510259
34417A510259L83839J98231M806J80747L94455J21262m14502n03743p0441K17236
$$ 1510259 1894098 2092329 2097135 2277882 2672337 2793599 2379097 1875354 1804913 2022149
34407B022149J9467k32828j67577l1676r8606j60073k0077O7282q8651j75359
$$ 2022149 2041616 1808788 1641211 1609535 1510929 1350856 1330779 1398061 1309410 1134051
34397A134051L8908J51101k45001p42527o09919J14488O67278O09527K37961l4276
$$ 1134051 1172959 1324060 1079059 336532 -273387 -158899 508379 1117906 1355867 1321591
34387A321591j47663j69417p5623Q2645J25560j1900j97927l00372k79435j35613
$$ 1321591 1173928 1004511 928888 1011533 1137093 1125193 927266 626894 347459 211846
34377B11846L1503K7570j34024j12968K51701N24783K13591m27367o66781l15328
$$ 211846 243349 270919 136895 23927 275628 800411 1014002 586635 -80146 -395474
34367c95474R7141J87968J60320K43191K95615K18539K15815L30750K25671k05001
$$ -395474 -298333 -110365 49955 293146 588761 807300 1023115 1353865 1579536 1374535
34357A374535m74286k03630K30422K66301K2315k261J71617Q3286k87576m28483
$$ 1374535 900249 696619 927041 1193342 1215657 1213396 1385013 1468299 1180723 752240
34347G52240j59829O6421m1546j17792J90922N35675L70612j31283k62951J56949
$$ 752240 592411 658832 617286 499494 690416 1226091 1596703 1465420 1202469 1359418
34337A359418M80573J78567l67420m05453J15459N08268L51029J7911J2130K12173
$$ 1359418 1839991 2018558 1651138 1245685 1361144 1869412 2220441 2238352 2250482 2462655
34327B462655J78586q4298j88006n6459j2203j48323j68702Q824M0522k03327
$$ 2462655 2641241 2556943 2368937 2312478 2300275 2151952 1983250 1992074 2032596 1829269
34317A829269l17130l5490K64739J92639J6386J43199L22524N8865m49690n46518
$$ 1829269 1512139 1476649 1741388 1934027 1950413 2093612 2416136 2475001 2025311 1478793
34307A478793j61139J46580J46865J58222K62740J34621j82591j73817J88222
$$ 1478793 1317654 1464234 1611099 1769321 2032061 2166682 1984091 1810274 1998496
34298A998496K38041k15082l94036J63085O68124K70983n12653n86965l806K44179
$$ 1998496 2236537 2021455 1627419 1790504 2458628 2729611 2216958 1629993 1626187 1870366
34288A870366p9845j82630K79187O14382L30071o2783k017J96209J3406k98254
$$ 1870366 1790521 1607891 1887078 2501460 2831531 2768748 2766731 2962940 2976346 2678092
34278B678092j63022K88791L81693o2285m74961l56843J27488M63995L90210P0873
$$ 2678092 2515070 2803861 3185554 3123269 2648308 2291465 2418953 2882948 3273158 3344031
34268C344031j65193j81126j36585k02397k48362l7001K95667L04142j09631m62486
$$ 3344031 3178838 2997712 2861127 2658730 2410368 2373367 2669034 2973176 2863545 2401059
34258B401059l26492J07869L46544J97739j68672m82475m60545L1881O22925O12996
$$ 2401059 2074567 2182436 2528980 2726719 2558047 2075572 1615027 1646908 2269833 2882829
34248B882829j14396p44310n62432M6461K31475l8350r8961J91793K70413m8925
$$ 2882829 2768433 2024123 1461691 1508152 1739627 1701277 1602316 1794109 2064522 2015597
34238B015597k13406P4943L21541J15162j74558j07327M1721j49619m01288k05206
$$ 2015597 1802191 1877134 2198675 2313837 2139279 2031952 2073673 1924054 1522766 1317560
34228A317560J88996Q9010m68090o80210j95030L80236M22375J18208j5506N2242
$$ 1317560 1506556 1595566 1127476 447266 252236 632472 1054847 1173055 1157549 1209791
34218A209791k247k01062k18184Q7645M50563N31842K69329j08028k74115n5355
$$ 1209791 1207544 1006482 788298 875943 1326506 1858348 2127677 2019649 1745534 1690179
34208A690179L69627N57856K39546l35444o12980l18027K58098N69304L53907
$$ 1690179 2059806 2617662 2857208 2521764 1908784 1590757 1848855 2418159 2772066
34199B772066j54640n10271m94846k48056p201J34963J50642l9641l71968m76030
$$ 2772066 2617426 2107155 1612309 1364253 1357052 1492015 1642657 1603016 1231048 755018
34189G55018p0605N11908O28960K30357m3003J24030J83052l34133q66758n70662
$$ 755018 684413 1196321 1825281 2055638 2012635 2136665 2319717 1985584 1118826 548164
34179E48164K93288O24932J16617l22071j7716M85646M06302o2982k21733l397
$$ 548164 841452 1466384 1583001 1260930 1243214 1728860 2135162 2072180 1850447 1847050
34169A847050J32648J08754K21056L92799K27823k03297l59440r7054J20648K4327
$$ 1847050 1979698 2088452 2309508 2702307 2930130 2726833 2367393 2270339 2390987 2415314
34159B415314q2801M1683J60251N6745o9330l8824n2272k49344l34802n7708K86753
$$ 2415314 2332513 2374196 2534447 2591192 2521862 2483038 2430766 2181422 1846620 1788912 2075665
34148B075665K71810j1221j41051N86J81304K43169K11132J08479j2367J1750
$$ 2075665 2347475 2336254 2195203 2195789 2377093 2620262 2831394 2939873 2927506 2939256
34138B939256K07281K91586N7092k39046k13093O0342J73365O912j40506k8837
$$ 2939256 3146537 3438123 3495215 3256169 3043076 3103418 3276783 3283695 3143189 3114352
34128C114352K23416L31599J41022k27115m00141q8195M61539O19300K07590j69053
$$ 3114352 3337768 3669367 3810389 3583274 3183133 3094938 3556477 4175777 4383367 4214314
34118D214314J6552M01870L09374j63769l00717J09607M94389L99991O2062q3909
$$ 4214314 4230866 4632736 4942110 4778341 4477624 4587231 5081620 5481611 5543673 5459764
34108E459764K9834K03067K58553J11142j40101j66751K03491O06438N62102K07529
$$ 5459764 5489598 5692665 5951218 6062360 5922259 5755508 5958999 6565437 7127539 7335068
34098G335068J07502L73761N52142M18555K73452L33694M35414M93338O55850
$$ 7335068 7442570 7816331 8368473 8787028 9060480 9394174 9829588 10322926 10978776
34089A0978776Q26613O47042J70952o2820J29665L06342K30036K67464O08528
$$ 10978776 11805389 12452431 12623383 12560563 12690228 12996570 13226606 13494070 14102598
34080A4102598Q18230O30652M84183P21824R46565Q01156P12013J103711J486695
$$ 14102598 14920828 15551480 16035663 16757487 17704052 18505208 19217221 20320932 21807627
34071B1807627J202150N88557M74052Q64880J073421Q78043O20351L72365j6729
$$ 21807627 23009777 23598334 24072386 24937266 26010687 26888730 27509081 27881446 27864717
34062B7864717k00159K99941J040365J036716K95566r8999L30340P43633L85099
$$ 27864717 27664558 27964499 29004864 30041580 30337146 30238147 30568487 31312120 31697219
34053C1697219k82073m57373k21581j46745k61801j59966J91571M03675K75608
$$ 31697219 31415146 30957773 30736192 30589447 30327646 30167680 30359251 30762926 31038534
34044C1038534o042j59951p046M40567Q69669R09128O82635P76235J414069K051882
$$ 31038534 31032492 30872541 30865495 31306062 32175731 33084859 33767494 34543729 35957798 38009680
34034C8009680K111472J763862J616167J921131K463550K960021L204034L055139
$$ 38009680 40121152 41885014 43501181 45422312 47885862 50845883 54049917 57105056
34026E7105056K641363K356543K331866K147771J402752L11353o29946j315156
$$ 57105056 59746419 62102962 64434828 66582599 67985351 68296704 67666758 66351602
34018F6351602j954072k558128k967983l237352l526011l717991l594613l298667
$$ 66351602 64397530 61839402 58871419 55634067 52108056 48390065 44795452 41496785
34010D1496785l163345l135283k858828k341562k023200k070437k089254j761952
$$ 41496785 38333440 35198157 32339329 29997767 27974567 25904130 23814876 22052924
34002B2052924j363959j329675j575028j609883j227047p79095p28813j094273
$$ 22052924 20688965 19359290 17784262 16174379 14947332 14168237 13439424 12345151
33994A2345151j431448j327557q37230l79457k45640l42554m44093n00597n56914
$$ 12345151 10913703 9586146 8748916 8369459 8123819 7781265 7337172 6836575 6279661
33985F279661n32257l13745l70J61554P0150j63690l93509n17011m41084j73421
$$ 6279661 5747404 5433659 5433289 5594843 5664993 5501303 5107794 4590783 4149699 3976278
33975C976278P4003P2143j36274l08329l35144l07533k75451j84895p3477p0250
$$ 3976278 4050281 4122424 3986150 3677821 3342677 3035144 2759693 2574798 2501321 2431071
33965B431071j28814j8310K88018M55319K19412k06212m01849l02130k03427k53460
$$ 2431071 2302257 2283947 2571965 3027284 3246696 3040484 2638635 2336505 2133078 1879618
33955A879618k55107o6366J04137J9943j75725j71185J4050R4276N2597J81811
$$ 1879618 1624511 1558145 1662282 1682225 1506500 1335315 1349365 1443641 1496238 1678049
33945A678049M72434M30060j65540p16886n35469J31028M08377N3476k68793p8179
$$ 1678049 2150483 2580543 2415003 1698117 1162648 1293676 1702053 1755529 1486736 1408557
33935A408557K30197J26143j93929k00382Q0559J43120j83049n00883m26870l2844
$$ 1408557 1638754 1764897 1570968 1370586 1451145 1594265 1411216 910333 483463 450619
33925D50619L30171L95028J54335j42685k02110k5986P4253n9831j67283J2234
$$ 450619 780790 1175818 1330153 1187468 985358 959372 1033625 973794 806511 818745
33915H18745K83587K90096Q1947k363Q1543M8314j72203k66275k1028L35185M25512
$$ 818745 1102332 1392428 1474375 1472012 1553555 1601869 1429666 1163391 1142363 1477548 1903060
33904A903060J68416j68861k45379L2945L64699L07658j71808n52123l92503M4892
$$ 1903060 2071476 1902615 1657236 1690181 2054880 2362538 2190730 1638607 1246104 1290996
33894A290996J44380j95301m49521k35156K05999M07970K57371J2633n7462O9945
$$ 1290996 1435376 1240075 790554 555398 761397 1169367 1426738 1439371 1381909 1451854
33884A451854J77766M9671k28852l23137j24771M0839q4816k46678r5290J98701
$$ 1451854 1629620 1679291 1450439 1127302 1002531 1043370 958554 711876 616586 815287
33874H15287K38861J10693J93385L82175K03111k77654m15449l4121K28678o6842
$$ 815287 1054148 1164841 1358226 1740401 1943512 1665858 1250409 1216288 1444966 1378124
33864A378124m94339n14536k66546j16923M400K40630K86555j07105n01866l43660
$$ 1378124 883785 369249 102703 -14220 -9820 230810 517365 410260 -91606 -435266
33854d35266J29826K71189Q1280J03905L76695L29647j78867n19859k61693J79536
$$ -435266 -305440 -34251 47029 150934 527629 857276 678409 158550 -103143 76393
33844G6393K33880l031q8736J0407k4863k54541l84289k51014n0607j8203j18834
$$ 76393 310273 307242 218506 228913 204050 -50491 -434780 -685794 -736401 -754604 -873438
33833h73438j64895j06440o5182r7970o1896J73324M41203M05985K9496k94727
$$ -873438 -1038333 -1144773 -1209955 -1307925 -1369821 -1196497 -755294 -349309 -319813 -614540
33823f14540k19474J13590K97331J83460l4082j49942j31329m5876q479j13974
$$ -614540 -834014 -720424 -423093 -239633 -273715 -423657 -554986 -600862 -609341 -723315
33813g23315k44000r8993L43233O08316L10326k26578l72239r0005R2902k7603
$$ -723315 -967315 -1066308 -723075 -114759 195567 -31011 -403250 -493255 -400353 -427956
33803d27956q5897R9911J55145j69438m70035k67843K49896M98699K71783j21807
$$ -427956 -513853 -413942 -258797 -428235 -898270 -1166113 -916217 -417518 -145735 -267542
33793b67542l11632j60209K04885L99526P4345n33929o63658l011P31571O72656
$$ -267542 -579174 -739383 -534498 -134972 -60627 -594556 -1258214 -1261225 -529654 143002
33783A43002k7487m83160l24922J1891J66838K78577M23179L41420j621j85177
$$ 143002 115515 -367645 -692567 -680676 -513838 -235261 187918 529338 527717 342540
33773C42540R59J69962k5517l46400m46362m28714m61396k92611K57846O96884
$$ 342540 343499 513461 487944 141544 -304818 -733532 -1194928 -1487539 -1229693 -532809
33763e32809M57686j21370j84299L36339N87921R5471n53617o25338k18077Q9015
$$ -532809 -75123 -196493 -380792 -44453 543468 638939 85322 -540016 -758093 -669078
33753f69078R0786r582r4420j90355k17212p8205J00747J26929L9877Q560N0021
$$ -669078 -578292 -587874 -682294 -872649 -1089861 -1168066 -1067319 -940390 -900513 -891953 -841932
33742h41932P9228J01688J29108N4887j50608k82861j91966n5885q9838j65900
$$ -841932 -762704 -661016 -531908 -477021 -627629 -910490 -1102456 -1158341 -1248179 -1414079
33732a414079m7058J64501J84013K7937m5346J0831L4876M1377J69728K81870
$$ -1414079 -1461137 -1296636 -1112623 -1084686 -1130032 -1119201 -1084325 -1042948 -873220 -591350
33722e91350P7988l50743n49234l68077j56152j59492j83232l6602J27768J66441
$$ -591350 -513362 -864105 -1413339 -1781416 -1937568 -2097060 -2280292 -2316894 -2189126 -2022685
33712b022685K33635M25693M94084K38165j13970k42974j94937j83130j90323
$$ -2022685 -1789050 -1363357 -869273 -631108 -745078 -988052 -1182989 -1366119 -1556442
33703a556442j15579r0510k71525m83198m34253j61404P6382K08407L10168K96124
$$ -1556442 -1672021 -1762531 -2034056 -2517254 -2951507 -3112911 -3036529 -2828122 -2517954 -2221830
33693b221830N9050j73868o0186K92508M05371J27203j53411j19137L3753j8964
$$ -2221830 -2162780 -2336648 -2396834 -2104326 -1698955 -1571752 -1725163 -1844300 -1810547 -1829511
33683a829511k00308j81957Q8766K96787J83894j34534l46414l32449k63641l05145
$$ -1829511 -2029819 -2211776 -2123010 -1826223 -1642329 -1776863 -2123277 -2455726 -2719367 -3024512
33673c024512l51196j91410J19906K74050J24983j16085j90375q8567P1265K35694
$$ -3024512 -3375708 -3567118 -3447212 -3173162 -3048179 -3164264 -3354639 -3443206 -3371941 -3136247
33663c136247L34818K40857k960j34682n2135J0098r7240j47098K4731J22787
$$ -3136247 -2801429 -2560572 -2563532 -2698214 -2750349 -2740251 -2837491 -2984589 -2959858 -2837071
33653b837071j33175m31386l09432M5083O7054k26368k51216J36613L70789J02320
$$ -2837071 -2970246 -3401632 -3711064 -3665981 -3598927 -3825295 -4076511 -3939898 -3569109 -3466789
33643c466789k69128l04038j78413k33665l62181k99561j56569j98465l67086
$$ -3466789 -3735917 -4039955 -4218368 -4452033 -4814214 -5113775 -5270344 -5468809 -5835895
33634e835895m35544m00322l45385j74231J25517K15097j38216n58283n20168
$$ -5835895 -6271439 -6671761 -7017146 -7191377 -7065860 -6850763 -6988979 -7547262 -8067430
33625h067430j49458j9986k58748m46595m01087m21935o25975o62295l69812j65514
$$ -8067430 -8216888 -8236874 -8495622 -8942217 -9343304 -9765239 -10391214 -11053509 -11423321 -11588835
33615a1588835l80053o61171n22550j37253l0548k18576k70320j26250j82496
$$ -11588835 -11968888 -12630059 -13152609 -13289862 -13320410 -13538986 -13809306 -13935556 -14118052
33606a4118052m78293m73632P4102O00396N53553K62829M11491R59270J262925
$$ -14118052 -14596345 -15069977 -14995875 -14395479 -13841926 -13579097 -13167606 -12208336 -10945411
33597a0945411J128466J015023J140529J120889P60809N36238Q40690J273419
$$ -10945411 -9816945 -8801922 -7661393 -6540504 -5779695 -5243457 -4402767 -3129348
33589c129348J231456Q37103O71120Q22123Q37341N26757K04355J02573R8508
$$ -3129348 -1897892 -1060789 -389669 432454 1269795 1796552 2000907 2103480 2201988
33580B201988J15687K86150N51671N64203K07146j57819j89939K945J42782J77238
$$ 2201988 2317675 2603825 3155496 3719699 3926845 3769026 3579087 3582032 3724814 3902052
33570C902052J71441R1850m9080p2483R3598K28583J41707k2100l8397L4231J6007
$$ 3902052 4073493 4165343 4116263 4043780 4137378 4365961 4507668 4485568 4447171 4481402 4497409
33559D497409m8085j1924K7527j51024m61638n22273j73028K54175L18798L235
$$ 4497409 4449324 4437400 4464927 4313903 3852265 3329992 3156964 3411139 3729937 3733172
33549C733172k70202j36291K85802N22260K85742k13127n46685n33380k91052
$$ 3733172 3462970 3326679 3612481 4134741 4420483 4207356 3660671 3127291 2836239
33540B836239K6034K98403L37537L6744l47137l74641J3247L73589L19555k6664
$$ 2836239 2862273 3160676 3498213 3534957 3187820 2813179 2826426 3200015 3519570 3492906
33530C492906k55933j50718J56506L35677J34062l14052m94312j11780L88498
$$ 3492906 3236973 3086255 3242761 3578438 3712500 3398448 2904136 2792356 3180854
33521C180854L27478j99144l88612N9983M53009J64464m18706n53409k63330j33792
$$ 3180854 3508332 3309188 2920576 2980559 3433568 3598032 3179326 2625917 2362587 2228795
33511B228795k77788k34281J67017M92406L63739m5713l19421k76961m7092J05720
$$ 2228795 1951007 1716726 1883743 2376149 2739888 2694175 2374754 2097793 2050701 2156421
33501B156421L449k16272j78322K13681N18296L30716p4836j19998J78995K27833
$$ 2156421 2159870 1943598 1765276 1978957 2497253 2827969 2753133 2633135 2812130 3039963
33491C039963j96917n63848l61863J77887M43013K35065j21394l06508l27231
$$ 3039963 2843046 2279198 1917335 2095222 2538235 2773300 2651906 2345398 2018167
33482B018167l28036l20737k06276K8726K56022L59029L44147K34352k5502l95643
$$ 2018167 1690131 1369394 1163118 1191844 1447866 1806895 2151042 2385394 2359892 1964249
33472A964249n90746l77623K6622J87831Q0968Q3398K99234L82256J84785M2423
$$ 1964249 1373503 995880 1022502 1210333 1291301 1374699 1673933 2056189 2240974 2283397
33462B283397J36806J23934k12234m71026k96840k8143r3130k22076L5348M02856
$$ 2283397 2420203 2544137 2331903 1860877 1564037 1535894 1442764 1220688 1256036 1658892
33452A658892K96759j26786k14152M8217L9405l65652n57791k15175K32176L55081
$$ 1658892 1955651 1828865 1614713 1662930 1702335 1336683 778892 563717 795893 1150974
33442A150974K42011O9690j81639l82330k49447J12339K54995J17469Q6043K12183
$$ 1150974 1392985 1462675 1281036 898706 649259 761598 1016593 1134062 1220105 1432288
33432A432288J00553k47448k89868O2655J49184l11638o09625j48272N54545O67764
$$ 1432288 1532841 1285393 995525 1058180 1207364 895726 286101 137829 692374 1360138
33422A360138K75176N9971J94426K97426K20140J66036J64003J4009k91913n23593
$$ 1360138 1635314 1695285 1889711 2187137 2407277 2573313 2737316 2751325 2459412 1935819
33412A935819n25044k89398J11147M32116L55914o0393l33311j87899J08301K65363
$$ 1935819 1410775 1121377 1232524 1664640 2020554 1960161 1626850 1438951 1547252 1812615
33402A812615L58258M13516J68100l45728n36796j00378L89181L12918n9462j18512
$$ 1812615 2170873 2584389 2752489 2406761 1869965 1769587 2158768 2471686 2412224 2293712
33392B293712P3762O7341p1284M7578L08570K69831p278q8117R053j03681l53803
$$ 2293712 2367474 2434815 2363531 2411109 2719679 2989510 2982232 2894115 2903168 2799487 2445684
33381B445684k50577K21957M89380K62206j07501k50146k01111j06194K665O3654
$$ 2445684 2195107 2417064 2906444 3168650 3061149 2811003 2609892 2503698 2506363 2570017
33371B570017K1330l512P7962J07068L9474J92225O17706O67402q2596q86116
$$ 2570017 2591347 2587835 2665797 2772865 2812339 3004564 3622270 4289672 4207076 3320960
33361C320960p46882L3139L20356l5662j19450L09684L80586k62376p28150l61799
$$ 3320960 2574078 2607217 2927573 2891911 2772461 3082145 3462731 3200355 2472205 2110406
33351B110406K12540K55986Q8462K64487M71610J86665k75962l20837j19281j79072
$$ 2110406 2322946 2578932 2667394 2931881 3403491 3590156 3314194 2993357 2874076 2695004
33341B695004l32504q8390L50942L51728p4873l08836j23883J02325J12657K6414
$$ 2695004 2362500 2274110 2625052 2976780 2901907 2593071 2469188 2571513 2684170 2710584
33331B710584q0234k36978k74157j9396K69844K09514o9341j24835O1247J25787
$$ 2710584 2630350 2393372 2119215 2099819 2369663 2579177 2509836 2385001 2446248 2572035
33321B572035q57o8393q1100k59799m57633k83269J51855K87421K3569j05469
$$ 2572035 2571178 2502785 2421685 2161886 1704253 1420984 1572839 1860260 1883829 1778360
33311A778360J49999L53367J93090K9193J96732L43738K2961m81664n38089j20511
$$ 1778360 1928359 2281726 2474816 2504009 2700741 3044479 3067440 2585776 2047687 1927176
33301A927176K23241K31114J64675J89590R0932k24578m15909k00800J51617J74971
$$ 1927176 2150417 2381531 2546206 2735796 2826728 2602150 2186241 1985441 2137058 2312029
33291B312029j15281k59484l3209K53926K24559p8501l31562l54293k02806P900
$$ 2312029 2196748 1937264 1904055 2157981 2382540 2304039 1972477 1618184 1415378 1423278
33281A423278J59826J22012r0179k30036j19576N7172K1671j36095r6451J46641
$$ 1423278 1583104 1705116 1614937 1384901 1265325 1322497 1344168 1208073 1111622 1258263
33271A258263K81584K27242K32440L27658J68926l27756o45172l27950L35310
$$ 1258263 1539847 1767089 1999529 2327187 2496113 2168357 1523185 1195235 1530545
33262A530545O84964N14353J40637j58889l62119m32476k40568J65198M56868
$$ 1530545 2215509 2729862 2870499 2711610 2349491 1917015 1676447 1841645 2298513
33253B298513L20755j88458o02961m26333K86658Q25083N92764q0018l33329J6491
$$ 2298513 2619268 2430810 1827849 1401516 1688174 2513257 3106021 3026003 2692674 2709165
33243B709165K69645K428k76960m7217L21530K14981j93960k98436o9434N6380
$$ 2709165 2978810 2981238 2704278 2657061 2978591 3193572 2999612 2701176 2631742 2688122
33233B688122L3752J59957L40490K07442j12424j41000P4643L8979k25029j49998
$$ 2688122 2721874 2881831 3222321 3429763 3317339 3176339 3250982 3289961 3064932 2914934
33223B914934L18480N32706K55040O8431L00559M14241J6497l22202K4716O37544
$$ 2914934 3233414 3766120 4021160 4089591 4390150 4804391 4820888 4498686 4523402 5160946
33213E160946O62938J04311l10013k81485j73294k05746j62604O2601K40580K28738
$$ 5160946 5823884 5928195 5618182 5336697 5163403 4957657 4795053 4857654 5098234 5326972
33203E326972J42024L3378j57999k88072r3316L05186M26770J23537j59443l5526
$$ 5326972 5468996 5502374 5344375 5056303 4962987 5268173 5694943 5818480 5659037 5623511
33193E623511K78069L53477J90651J07626J86162K15352J20949Q2984J92073L07406
$$ 5623511 5901580 6255057 6445708 6553334 6739496 6954848 7075797 7158781 7350854 7658260
33183G658260L42161L89105M24161K03477k89021n76393k58528L31476N04524
$$ 7658260 8000421 8389526 8813687 9017164 8728143 8151750 7893222 8224698 8729222
33174H729222J77629n9983J22852L79438L73049K91150L44836L24111J12390J08780
$$ 8729222 8906851 8846868 8969720 9349158 9722207 10013357 10358193 10682304 10794694 10903474
33164A0903474N40019Q33195M21298k10526j70333L93550M97902p3274m54423
$$ 10903474 11443493 12276688 12697986 12487460 12317127 12710677 13208579 13135305 12680882
33155A2680882j80612Q3449k59179p55214p40032l93651k51844k71050j32683
$$ 12680882 12500270 12583719 12324540 11569326 10829294 10435643 10183799 9912749 9780066
33146I780066j7610l03735p90196r43160p29999n76489o38533o99762o83672p21639
$$ 9780066 9762456 9458721 8668525 7725365 6995366 6418877 5780344 5080582 4396910 3675271
33136C675271p76053o77345m91433m49682n84832p63632r19619r36219n78380
$$ 3675271 2899218 2221873 1730440 1280758 695926 -67706 -987325 -1923544 -2501924
33127b501924M7416K95388k10737q58292p77167q1735L21264N2186l47495l40103
$$ -2501924 -2454508 -2159120 -2369857 -3228149 -4005316 -4087051 -3765787 -3713601 -4061096 -4401199
33117d401199o738L45756N54405M69823M5556l48749k76340M9529J8716l66731
$$ -4401199 -4407937 -4062181 -3507776 -3037953 -2992397 -3341146 -3617486 -3567957 -3549241 -3915972
33107c915972m72323j38337K7340k53196l90875L5589M87840L42038q9699j35084
$$ -3915972 -4388295 -4526632 -4499292 -4752488 -5143363 -5107774 -4619934 -4277896 -4367595 -4502679
33097d502679J41577J92576j4406m0482J74410K53192J08196N5542J83696J97204
$$ -4502679 -4361102 -4168526 -4182932 -4223414 -4049004 -3795812 -3687616 -3632074 -3448378 -3251174
33087c251174k6850k20765j71836P568J32690J37381o147k30527k60993P3775
$$ -3251174 -3278024 -3498789 -3670625 -3663057 -3530367 -3392986 -3399133 -3629660 -3890653 -3816878
33077c816878M45306L52453j44671m59422l11600o2826p1170j63897j5646L08137
$$ -3816878 -3371572 -3019119 -3163790 -3623212 -3934812 -3997638 -4068808 -4232705 -4248351 -3940214
33067c940214N00996M65672L25622J67113L0983J5614J36530J91027J579k77863
$$ -3940214 -3439218 -2973546 -2647924 -2480811 -2449828 -2434214 -2297684 -2106657 -2105078 -2382941
33057b382941l25563q9521J48269J58381L4762J3784J44048K42680J57476j9295
$$ -2382941 -2708504 -2798025 -2649756 -2491375 -2456613 -2442829 -2298781 -2056101 -1898625 -1917920
33047a917920p0963L1452O5029j18876l32365k90719m1211Q1496o8448k62917
$$ -1917920 -1988883 -1957431 -1892402 -2011278 -2343643 -2634362 -2675573 -2594077 -2662525 -2925442
33037b925442k56814r0766P7103K08703K88743K08917k0512j21296J02412L75229
$$ -2925442 -3182256 -3273022 -3195919 -2987216 -2698473 -2489556 -2510068 -2631364 -2528952 -2153723
33027b153723K43936k54293n55784l01888J83345L41330J07944o1178J62766N46144
$$ -2153723 -1909787 -2164080 -2719864 -3021752 -2838407 -2497077 -2389133 -2450311 -2287545 -1741401
33017a741401N83726J09370m97546p16233m21427M4097K98709L00501K48258K48133
$$ -1741401 -1157675 -1048305 -1545851 -2262084 -2683511 -2639414 -2340705 -2040204 -1791946 -1543813
33007a543813K43242K04860J81769J45212r799k39627l20474j57315M4225O5214
$$ -1543813 -1300571 -1095711 -913942 -768730 -778529 -1018156 -1338630 -1495945 -1451720 -1386506
32997a386506j6550L930R9790P1078q5242j35470J6101J59208J05509q497P1269
$$ -1386506 -1403056 -1399126 -1299336 -1228258 -1313500 -1448970 -1432869 -1273661 -1168152 -1176649 -1105380
32986a105380L09151L80549Q9171l58067n66783l92925q3621M4171m320M4987
$$ -1105380 -796229 -415680 -326509 -684576 -1251359 -1644284 -1727905 -1683734 -1688054 -1643067
32976a643067K75752L68073K7075m98086o22183j79585L27045L79683Q3414r5849
$$ -1643067 -1367315 -999242 -972167 -1470253 -2092436 -2272021 -1944976 -1565293 -1481879 -1577728
32966a577728l0059n701j60492k48388r3959O3517m5863k20878m8075L97783N29397
$$ -1577728 -1607787 -1613488 -1773980 -2022368 -2116327 -2052810 -2098673 -2319551 -2367626 -1969843 -1440446
32955a440446O4319m88442m63667O5221M27064L00012N0537M3676R8209p9659
$$ -1440446 -1376127 -1864569 -2328236 -2263015 -1835951 -1535939 -1485402 -1441726 -1343517 -1423176
32945a423176l06703k07152J36563K98267J79109Q2530J24322O7526j48323k06050
$$ -1423176 -1729879 -1937031 -1800468 -1502201 -1323092 -1240562 -1116240 -1048714 -1197037 -1403087
32935a403087K8965J79242p8285m46997m09526J7513L35490K74572P1024K4410
$$ -1403087 -1374122 -1194880 -1273165 -1720162 -2129688 -2112175 -1776685 -1502113 -1431089 -1406679
32925a406679R6877O2819j28170k74319j84039M2063Q1583j71833l64533j19690
$$ -1406679 -1309802 -1246983 -1375153 -1649472 -1833511 -1791448 -1709865 -1881698 -2246231 -2365921
32915b365921L59377M94620J60194j55330j46278j19736l33793m49705j32734
$$ -2365921 -2006544 -1511924 -1351730 -1507060 -1653338 -1773074 -2106867 -2556572 -2689306
32906b689306K56623J99494q0619L3348M85086N84958J05314l87104m15841j70617
$$ -2689306 -2432683 -2233189 -2313808 -2280460 -1795374 -1210416 -1105102 -1492206 -1908047 -2078664
32896b078664m692P3821J55719J53800M2939j370P6954J00609K9560P9246L06625
$$ -2078664 -2083356 -2009535 -1853816 -1700016 -1657077 -1658447 -1581493 -1480884 -1451324 -1372078 -1065453
32885a065453M47586L31221J05015p4069j93956j57165J36548L87681J39411m23393
$$ -1065453 -617867 -286646 -181631 -255700 -449656 -606821 -470273 -82592 56819 -366574
32875c66574n56956r0633K28509q1723m38767j62182M14270N40387K41816P8642
$$ -366574 -923530 -1014163 -785654 -867377 -1306144 -1468326 -1054056 -513669 -271853 -193211
32865a93211Q4752j52020n49578n72626j83871P7009L5620J24526N11834P07891
$$ -193211 -108459 -260479 -810057 -1382683 -1566554 -1489545 -1453925 -1329399 -817565 -109674
32855a09674L40654k46540n07538l79642j58780k7342J6543k398n1343q6596j19425
$$ -109674 230980 -15560 -523098 -902740 -1061520 -1088862 -1072319 -1074717 -1126060 -1212656 -1332081
32844a332081j48610p5787J04527J53758o9610k67284r3586K54932L20222J25370
$$ -1332081 -1480691 -1556478 -1451951 -1298193 -1367803 -1635087 -1728673 -1473741 -1153519 -1028149
32834a028149P0071J73118Q6124j42288o6607K75411K77513j88590m49271j48192
$$ -1028149 -958078 -784960 -698836 -841124 -907731 -632320 -354807 -543397 -992668 -1140860
32824a140860J05598k24254o36007l95993K53470N15816K76917P1722O5196o6780
$$ -1140860 -1035262 -1259516 -1895523 -2291516 -2038046 -1522230 -1245313 -1173591 -1108395 -1175175
32814a175175l24663k88682Q6094K97998Q2344k34203l27662k77669j98078P586
$$ -1175175 -1499838 -1788520 -1702426 -1404428 -1322084 -1556287 -1883949 -2161618 -2359696 -2352110
32804b352110K97355L72943J66829K7775J59088K72443R8934j27511n4236K20250
$$ -2352110 -2054755 -1681812 -1514983 -1487208 -1328120 -1055677 -956743 -1084254 -1138490 -918240
32794i18240L41678K50016J59676J39644P3714m6387j11953j32785j99751k54707
$$ -918240 -576562 -326546 -166870 -27226 46488 101 -111852 -244637 -444388 -699095
32784f99095j65816K492O1907J8243L9095J07149J1350k59287m15917k88066q0819
$$ -699095 -864911 -862419 -800512 -782269 -743174 -636025 -624675 -883962 -1299879 -1587945 -1668764
32773a668764n6119j80392k62115k29938p4089K79357P66814J018136P09617K3212
$$ -1668764 -1724883 -1905275 -2167390 -2397328 -2471417 -2192060 -1425246 -407110 302507 325719
32763C25719n30634o93676n77039k89538J37836M46928K65873k83425n39322j66960
$$ 325719 -204915 -898591 -1475630 -1765168 -1627332 -1180404 -914531 -1197956 -1737278 -1904238
32753a904238L22343L20771M4994J50508O24031P34186J51380n01670m95523N8654
$$ -1904238 -1581895 -1261124 -1216130 -1065622 -441591 292595 443975 -57695 -553218 -494564
32743d94564M68105L73330J8936k39250l19456l01007k14589n9985R7753J57301
$$ -494564 -26459 346871 365807 126557 -192899 -493906 -708495 -768480 -670727 -513426
32733e13426R2037o398k0408M8127O8588l7706j67102j68495n4386K9084m634
$$ -513426 -421389 -427787 -448195 -400068 -331480 -369186 -536288 -704783 -759169 -730085 -734719
32722g34719j25223k51033k52275m020L84238N25558K03877k44513l26823r3668
$$ -734719 -859942 -1110975 -1363250 -1367270 -983032 -457474 -253597 -498110 -824933 -918601
32712i18601l4131k76781l80250n7105L66699M74142L33671K28366J54074k2986
$$ -918601 -952732 -1229513 -1609763 -1666868 -1300169 -826027 -492356 -263990 -109916 -132902
32702a32902j68589o9051J37374J31827n5483p1954J99149M37761L12107j19664
$$ -132902 -301491 -370542 -233168 -101341 -156824 -228778 -29629 408132 720239 600575
32692F00575m89934m67294l8087M28565M59710k5821n65482o44011k56272J68586
$$ 600575 110641 -356653 -394740 33825 493535 467714 -97768 -741779 -998051 -829465
32682h29465K97903J62528k0467q4661m84J28328J78755J81831K66893L76637
$$ -829465 -531562 -369034 -389501 -474162 -474646 -346318 -167563 14268 281161 657798
32672F57798K58388j21838m05678k98829L1103K62888L81259N08802N13658K04156
$$ 657798 916186 794348 388670 89841 120944 383832 765091 1273893 1787551 1991707
32662A991707k17412l28855p8566J74482J90574O6527o2585j85996k58879j96013
$$ 1991707 1774295 1445440 1366874 1541356 1731930 1798457 1735872 1549876 1290997 1094984
32652A094984n7735J1398J0005N718o9778k54974l21072q0196J91398R5498k04346
$$ 1094984 1037249 1048647 1058652 1064370 994592 739618 418546 338350 529748 625246 420900
32641D20900j67219K65092N57234M07796J17484k2969j43483l55100m38073k80960
$$ 420900 253681 518773 1076007 1483803 1601287 1578318 1434835 1079735 641662 360702
32631C60702j55177k18206j98221N8740J84879j11648m53919l39603M1045J24280
$$ 360702 205525 -12681 -210902 -152162 32717 -78931 -532850 -872453 -831408 -707128
32621g07128j04436j44146J42817L28875J80441L0456J54808K51866q2011o36503
$$ -707128 -811564 -955710 -812893 -484018 -303577 -273121 -118313 133553 51542 -584961
32611e84961p65868k32286M62951O82979L69212j8386j44439j17845j44545j52561
$$ -584961 -1350829 -1583115 -1120164 -437185 -67973 -86359 -230798 -348643 -493188 -645749
32601f45749K4913K80450L33134J18216j86954m53506o32963n79967k04676K19160
$$ -645749 -620836 -340386 -7252 110964 -75990 -529496 -1162459 -1742426 -1947102 -1727942
$$ [...]
##END NTUPLES=NMR SPECTRUM
##END=
