##TITLE=31Pdec_LR-675-H2O-P2
 H2O, 24 sc
 29.5.2019
##JCAMPDX= 6.0         $$ Bruker NMR JCAMP-DX V2.0
##DATA TYPE= NMR SPECTRUM
##DATA CLASS= NTUPLES
##ORIGIN= UXNMR, Bruker Analytische Messtechnik GmbH
##OWNER= root
$$ XWIN-NMR		Version 3.5
$$ Wed May 29 12:47:16 2019 Russian Standard Time (UT+4h)  she@DPX200
##.OBSERVE FREQUENCY= 81.013821
##.OBSERVE NUCLEUS= ^31P
##.ACQUISITION MODE= SIMULTANEOUS
##.ACQUISITION SCHEME= undefined
##.AVERAGES= 24
##.DIGITISER RES= 17
##SPECTROMETER/DATA SYSTEM= spect
##.PULSE SEQUENCE= zgpg30
##.SOLVENT NAME= DMSO
##.SHIFT REFERENCE= (INTERNAL, DMSO, 0, 182.463)
##AUDIT TRAIL= $$ (NUMBER, WHEN, WHO, WHERE, WHAT)
$$ ##TITLE= Audit trail, XWIN-NMR		Version 3.5
$$ ##JCAMPDX= 5.01
$$ ##ORIGIN= Bruker BioSpin GmbH
$$ ##OWNER= she
$$ F:/spectra/data/she/nmr/P31/1/pdata/1/auditp.txt
$$ ##AUDIT TRAIL=  $$ (NUMBER, WHEN, WHO, WHERE, WHAT)
(   1,<2019-05-29 12:45:59.81 +0400>,<she>,<DPX200>,
      <created by zg, POWCHK disabled, PULCHK disabled
       configuration hash MD5:
       00 E9 B6 7A A2 85 ED C7 34 08 36 98 17 FE 4E 26
       data hash MD5: 32K
       E9 60 9B 90 C6 49 64 AA 70 BE DB 68 A9 ED B8 96>)
(   2,<2019-05-29 12:46:06.96 +0400>,<she>,<DPX200>,
      <Start of raw data processing
       efp BC_mod = 2 LB = 1 FT_mod = 6 PKNL = 1 PHC0 = -1796.04 PHC1 = 19.39899 SI = 64K 
       data hash MD5: 64K
       C0 31 5E 67 A8 93 36 8D BA 56 59 DA 53 3F A8 BE>)
(   3,<2019-05-29 12:46:32.12 +0400>,<she>,<DPX200>,
      <pk PHC0 = -15.81097 PHC1 = 0 
       data hash MD5: 64K
       61 87 38 07 58 60 D8 3B 16 3C D3 62 2A 55 F9 DD>)
$$ ##END=
$$ 
$$ hash MD5
$$ 52 8C 31 D0 83 A0 4C D2 8F E7 DA 29 AD C6 73 29
##$RELAX= 
##$RELAX= 
##$RELAX= 
##$RELAX= 
##$RELAX= 
##$RELAX= 
##$RELAX= 
##$RELAX= 
$$ Bruker specific parameters
$$ --------------------------
##$DU= <F:/spectra>
##$EXPNO= 1
##$NAME= <P31>
##$PROCNO= 1
##$TYPE= <nmr>
##$USER= <she>
##$AMP= (0..31)
100 100 100 100 100 100 100 100 100 100 100 100 100 100 100 100 100 100 
100 100 100 100 100 100 100 100 100 100 100 100 100 100 
##$AQSEQ= 0
##$AQ_mod= 1
##$AUNM= <au_zg>
##$AUTOPOS= <>
##$BF1= 81.014009
##$BF2= 200.13
##$BF3= 200.13
##$BF4= 200.13
##$BF5= 200.13
##$BF6= 200.13
##$BF7= 200.13
##$BF8= 200.13
##$BYTORDA= 1
##$CFDGTYP= 0
##$CFRGTYP= 5
##$CHEMSTR= <none>
##$CNST= (0..31)
1 1 145 1 1 1 1 1 1 1 1 1 1 1 1 1 1 1 1 1 1 1 1 1 1 1 1 1 1 1 1 1 
##$CPDPRG= <waltz16>
##$CPDPRG1= <>
##$CPDPRG2= <waltz16>
##$CPDPRG3= <>
##$CPDPRG4= <mlev>
##$CPDPRG5= <mlev>
##$CPDPRG6= <mlev>
##$CPDPRG7= <mlev>
##$CPDPRG8= <mlev>
##$CPDPRGB= <>
##$CPDPRGT= <>
##$D= (0..31)
0 1 0 0 0 0 0 0 0 0 0 0.03 2e-05 3e-06 0 0 0 0 0 0 0 0 0 0 0 0 0 0 0 0 
0 0 
##$DATE= 1559119559
##$DBL= (0..7)
120 120 120 11 120 120 24 19 
##$DBP= (0..7)
150 150 150 150 150 150 150 150 
##$DBP07= 0
##$DBPNAM0= <>
##$DBPNAM1= <>
##$DBPNAM2= <>
##$DBPNAM3= <>
##$DBPNAM4= <>
##$DBPNAM5= <>
##$DBPNAM6= <>
##$DBPNAM7= <>
##$DBPOAL= (0..7)
0.5 0.5 0.5 0.5 0.5 0.5 0.5 0.5 
##$DBPOFFS= (0..7)
0 0 0 0 0 0 0 0 
$$ [...]
##$SUBNAM2= <"">
##$SUBNAM3= <"">
##$SUBNAM4= <"">
##$SUBNAM5= <"">
##$SUBNAM6= <"">
##$SUBNAM7= <"">
##$SUBNAM8= <"">
##$SUBNAM9= <"">
##$SW= 369.568048894756
##$SWIBOX= (0..15)
0 1 3 0 0 0 0 0 0 0 0 0 0 0 0 0 
##$SW_h= 29940.119760479
##$TD= 32768
##$TD0= 1
##$TE= 0
##$TE2= 300
##$TE3= 300
##$TEG= 300
##$TL= (0..7)
0 120 53 12 22 120 120 120 
##$TP= (0..7)
150 150 150 150 150 150 150 150 
##$TP07= 0
##$TPNAME0= <>
##$TPNAME1= <>
##$TPNAME2= <>
##$TPNAME3= <>
##$TPNAME4= <>
##$TPNAME5= <>
##$TPNAME6= <>
##$TPNAME7= <>
##$TPOAL= (0..7)
0.5 0.5 0.5 0.5 0.5 0.5 0.5 0.5 
##$TPOFFS= (0..7)
0 0 0 0 0 0 0 0 
##$TUNHIN= 0
##$TUNHOUT= 0
##$TUNXOUT= 0
##$USERA1= <user>
##$USERA2= <user>
##$USERA3= <user>
##$USERA4= <user>
##$USERA5= <user>
##$V9= 5
##$VALIST= <valist>
##$VCLIST= <CCCCCCCCCCCCCCC>
##$VD= 0
##$VDLIST= <DDDDDDDDDDDDDDD>
##$VPLIST= <PPPPPPPPPPPPPPP>
##$VTLIST= <TTTTTTTTTTTTTTT>
##$WBST= 1024
##$WBSW= 4
##$XGAIN= (0..3)
0 0 0 0 
##$XL= 0
##$YL= 0
##$YMAX_a= 117919
##$YMIN_a= -139955
##$ZGOPTNS= <>
##$ZL1= 120
##$ZL2= 120
##$ZL3= 120
##$ZL4= 120
##$ABSF1= 0
##$ABSF2= 0
##$ABSG= 0
##$ABSL= 0
##$ALPHA= 0
##$AQORDER= 0
##$ASSFAC= 0
##$ASSFACI= 0
##$ASSFACX= 0
##$ASSWID= 0
##$AUNMP= <proc_1d>
##$AZFE= 0.1
##$AZFW= 0.5
##$BCFW= 0
##$BC_mod= 2
##$BYTORDP= 0
##$COROFFS= 0
##$CY= -3
##$DATMOD= 1
##$DC= 0
##$DFILT= <>
##$DTYPP= 0
##$F1P= 0
##$F2P= 0
##$FCOR= 1
##$FTSIZE= 65536
##$FT_mod= 6
##$GAMMA= 0
##$GB= 0
##$INTBC= 1
##$INTSCL= 5.30512e-09
##$ISEN= 30
##$LB= 1
##$LEV0= 0
##$LPBIN= 0
##$MAXI= 10000
##$MC2= 0
##$MEAN= 0
##$ME_mod= 0
##$MI= 50
##$NCOEF= 0
##$NC_proc= -4
##$NLEV= 6
##$NOISF1= 182.463
##$NOISF2= 159.3651
##$NSP= 0
##$NTH_PI= 0
##$NZP= 0
##$OFFSET= 182.463
##$PC= 4
##$PHC0= -1811.851
##$PHC1= 19.39899
##$PH_mod= 1
##$PKNL= yes
##$PPARMOD= 0
##$PSCAL= 0
##$PSIGN= 0
##$REVERSE= no
##$SF= 81.0140089999434
##$SI= 65536
##$SIGF1= 159.3651
##$SIGF2= -187.1042
##$SINO= 113.3802
##$SIOLD= 16384
##$SREGLST= <1H.CDCl3>
##$SSB= 0
##$STSI= 65536
##$STSR= 0
##$SW_p= 29940.119760479
##$SYMM= 0
##$S_DEV= 0
##$TDeff= 32768
##$TDoff= 0
##$TI= <>
##$TILT= no
##$TM1= 0
##$TM2= 0
##$TOPLEV= 0
##$USERP1= <user>
##$USERP2= <user>
##$USERP3= <user>
##$USERP4= <user>
##$USERP5= <user>
##$WDW= 1
##$XDIM= 65536
##$YMAX_p= 471950107
##$YMIN_p= -16516584
$$ End of Bruker specific parameters
$$ ---------------------------------
##NTUPLES= NMR SPECTRUM
##VAR_NAME=  FREQUENCY,     SPECTRUM/REAL,   SPECTRUM/IMAG
##SYMBOL=    X,             R,               I
##VAR_TYPE=  INDEPENDENT,   DEPENDENT,       DEPENDENT
##VAR_FORM=  AFFN,          ASDF,            ASDF
##VAR_DIM=   65536,         65536,           65536
##UNITS=     HZ,            ARBITRARY UNITS, ARBITRARY UNITS
##FACTOR=    0.456856943014862, 1,           1
##FIRST=     14782.0589164792, 0,            0
##LAST=      -15158.0608439998, 0,           0
##MIN=       -15158.0608439998, -16516584,   0
##MAX=       14782.0589164792, 471950107,    0
$$ Real data points
##PAGE= N=1
##DATA TABLE= (X++(R..R)), XYDATA
$$ [...]
$$ plain form
38566 -1193148 -1499386 -1628966 -1408267 -1046314 -815374 -653618 -438857 -378866 -664499 -970388
38556 -970388 -864651 -561388 -633615 -1049790 -1206074 -964636 -885111 -1205950 -1379239 -1026034
38546 -1026034 -638606 -769746 -1130203 -1161526 -1004572 -1125907 -1349972 -1121419 -544911 -303402
38536 -303402 -572604 -831294 -809426 -818786 -981398 -934957 -608281 -538799 -981322 -1344172
38526 -1344172 -1032869 -327796 134300 303670 527020 755912 616285 109058 -357593
38517 -357593 -575759 -677418 -721026 -617981 -458399 -463107 -582733 -535026 -269407 -36037
38507 -36037 24060 8415 -27837 -107706 -68223 334285 970523 1368066 1312656 1076310 935804
38496 935804 836035 697300 681684 896877 1135172 1190897 1195070 1336729 1460724 1301118
$$ packed form
38566a193148l06238j29580K20699L61953K30940J61756K14761N9991k85633l05889
38556i70388J05737L03263p2227m16175j56284K41438P9525l20839j73289L53205
38546a026034L87428j31140l60457l1323J56954j21335k24065K28553N76508K41509
38536c03402k69202k58690K1868r360j62612M6441L26676O9482m42523l62850
38526a344172L11303P05073M62096J69370K23350K28892j39627n07227m66651
38517c57593k18166j01659m3608J03045J59582m708j19626M7707K65619K33370
38507c6037O0097j5645l6252p9869L9483M02508O36238L97543n5410k36346j40506
38496I35804r9769j38735j5616K15193K38295N5725M173J41659J23995j59606
$$ plain form
38486 1301118 1009442 1074125 1672435 2395766 2741192 2674986 2537819 2507817 2399901 2049627
38476 2049627 1668718 1580233 1696237 1604081 1243028 1114288 1572806 2259445 2635465 2802803
38466 2802803 3252032 3951614 4353081 4355175 4589909 5499974 6717425 7713686 8538359 9439753
38456 9439753 10192916 10402053 10200069 10022541 9811758 9075213 7771553 6562525 5991017
38447 5991017 5833337 5499863 4765971 3870084 3127491 2708252 2664935 2932640 3306464 3553954
38437 3553954 3571104 3392383 3084501 2682606 2222973 1803034 1559626 1524328 1516106 1298458
38427 1298458 884535 554540 499230 597825 659605 716758 903736 1186109 1412042 1521807
38417 1521807 1503098 1263396 794622 354888 192612 160860 -71206 -459475 -603290 -358447
$$ packed form
38486A301118k91676O4683N98310P23331L45426o6206j37167l0002j07916l50274
38476B049627l80909q8485J16004r2156l61053j28740M58518O86639L76020J67338
38466B802803M49229O99582M01467K094K34734R10065J217451R96261Q24673R01394
38456I439753P53163K09137k01984j77528k10783p36545j303660j209028n71508
38447E991017j57680l33474p33892q95887p42593m19239m3317K67705L73824K47490
38437C553954J7150j78721l07882m01895m59633m19939k43408l5298q222k17648
38427A298458m13923l29995n5310R8595O1780N7153J86978K82373K25933J09765
38417A521807j8709k39702m68774m39734j62276l1752k32066l88269j43815K44843
$$ plain form
38407 -358447 -53445 26542 12535 109797 198012 51053 -258767 -464415 -477011 -390508 -213291
38396 -213291 130694 562825 858743 922672 860324 741426 469235 -28903 -611055 -1036763
38386 -1036763 -1218773 -1259816 -1255404 -1168208 -956381 -746870 -737528 -903877 -955900 -704379 -362041
38375 -362041 -309259 -607994 -926527 -935496 -609337 -148712 195119 211578 -113245 -469276
38365 -469276 -490016 -237307 -156536 -412345 -576856 -243353 314550 474814 106617 -344784
38355 -344784 -570633 -744551 -1056349 -1321748 -1307016 -1148765 -1146872 -1314694 -1433414 -1445135
38345 -1445135 -1479695 -1522772 -1384573 -1079374 -946526 -1205386 -1582425 -1617878 -1250312 -854868
38335 -854868 -721235 -745880 -714139 -652053 -715603 -874168 -933014 -829184 -692189 -596050 -458551
$$ packed form
38407c58447L05002P9987j4007R7262Q8215j46959l09820k05648j2596Q6503J77217
38396b13291L43985M32131K95918O3929o2348j18898k72191m98138n82152m25708
38386a036763j82010m1043M412Q7196K11827K09511R342j66349n2023K51521L42338
38375c62041N2782k98735l18533q969L26159M60625L43831J6459l24823l56031
38365d69276k0740K52709Q0771k55809j64511L33503N57903J60264l68197m51401
38355c44784k25849j73918l11798k65399J4732J58251J893j67822j18720j1721
38345a445135l4560m3077J38199L05199J32848k58860l77039l5453L67566L95444
38335h54868J33633k4645L1741O2086o3550j58565n8846J03830J36995R6139J37499
$$ plain form
38324 -458551 -264555 -202117 -424055 -785868 -991742 -957905 -873738 -900307 -953463 -848267
38314 -848267 -572751 -334278 -339995 -568123 -778440 -763159 -573047 -450188 -542865 -768574
38304 -768574 -979018 -1140133 -1265177 -1290443 -1173756 -1047906 -1090147 -1248977 -1277026 -1053753
38294 -1053753 -708700 -404632 -193972 -138518 -335322 -693230 -901377 -813069 -685722 -817239
38284 -817239 -1098946 -1196309 -1050965 -888916 -803967 -690351 -580570 -658215 -852808 -812124
38274 -812124 -447125 -149457 -242096 -539257 -719494 -819221 -1018129 -1218889 -1250516 -1265066
38264 -1265066 -1471514 -1642561 -1402901 -920209 -747798 -963254 -1036114 -676044 -261506 -208048
38254 -208048 -418648 -648766 -945713 -1352697 -1568521 -1329402 -855318 -534081 -408312 -332909
$$ packed form
38324d58551J93996O2438k21938l61813k05874L3837Q4167k6569n3156J05196
38314h48267K75516K38473n717k28128k10317J5281J90112J22859r2677k25709
38304g68574k10444j61115j25044k5266J16687J25850m2241j58830k8049K23273
38294a053753L45053L04068K10660N5454j96804l57908k08147Q8308J27347j31517
38284h17239k81707r7363J45344J62049Q4949J13616J09781p7645j94593M0684
38274h12124L64999K97668r2639k97161j80237r9727j98908k00760l1627j4550
38264a265066k06448j71047K39660M82692J72411k15456p2860L60070M14538N3458
38254b08048k10600k30118k96947m06984k15824K39119M74084L21237J25769P5403
$$ plain form
38244 -332909 -366573 -587712 -753717 -601068 -327147 -344054 -692163 -1104982 -1480830 -1830236
38234 -1830236 -1935653 -1619782 -1246185 -1347515 -1775484 -1845275 -1382933 -983639 -1072578 -1352198
38224 -1352198 -1450665 -1514938 -1779041 -2053476 -2086765 -2035717 -2137586 -2249547 -2145447 -1972985
38214 -1972985 -1978329 -2041225 -1934177 -1800925 -1882459 -1958175 -1613859 -999489 -779868 -1263315
38204 -1263315 -2002925 -2352540 -2080985 -1389894 -679335 -382289 -694192 -1318822 -1722855
38195 -1722855 -1744374 -1718882 -1922619 -2164110 -2094592 -1721602 -1409039 -1446664 -1756994 -2005705
38185 -2005705 -1950429 -1700316 -1607214 -1844116 -2162835 -2187429 -1877195 -1537277 -1423243 -1526708
38175 -1526708 -1728910 -1956282 -2156279 -2295417 -2415901 -2551217 -2591259 -2409378 -2128746 -2052399
$$ packed form
38244c32909l3664k21139j66005J52649K73921j6907l48109m12819l75848l49406
38234a830236j05417L15871L73597j01330m27969o9791M62342L99294q8939k79620
38224a352198r8467o4273k64103k74435l3289N1048j01869j11961J04100J72462
38214a972985n344o2896J07048J33252q1534p5716L44316O14370K19621m83447
38204a263315p39610l49615K71555O91091P10559K97046l11903o24630m04033
38195a722855k1519K5492k03737k41491O9518L72990L12563l7625l10330k48711
38185b005705N5276K50113R3102k36902l18719k4594L10234L39918J14034j03465
38175a526708k02202k27372j99997j39138j20484j35316m0042J81881K80632P6347
$$ plain form
38165 -2052399 -2266531 -2494772 -2434393 -2096392 -1729419 -1530775 -1529665 -1672396 -1916317 -2231620
38155 -2231620 -2533253 -2656231 -2504821 -2250968 -2216358 -2446886 -2588220 -2367661 -2010930 -1913664
38145 -1913664 -2067212 -2167325 -2185177 -2393252 -2814709 -3095559 -3045909 -2906762 -2899685 -2883517
38135 -2883517 -2704151 -2561804 -2714455 -3032715 -3163228 -3010737 -2802115 -2762946 -2934416 -3218024
38125 -3218024 -3429345 -3414103 -3265119 -3290630 -3608597 -3934763 -3966196 -3807004 -3777189 -3949737
38115 -3949737 -4153761 -4321446 -4518595 -4681897 -4643695 -4435130 -4279696 -4235851 -4120423 -3891940
38105 -3891940 -3860665 -4320565 -5096252 -5649979 -5637167 -5250286 -4978972 -5074386 -5315262 -5334304
38095 -5334304 -5093926 -4892704 -4920008 -5030703 -5056252 -5103021 -5327972 -5588446 -5597577 -5364744
$$ packed form
38165b052399k14132k28241O0379L38001L66973J98644J110j42731k43921l15303
38155b231620l01633j22978J51410K53853L4610k30528j41334K20559L56731R7266
38145a913664j53548j00113j7852k08075m21457k80850M9650J39147P077J6168
38135b883517J79366J42347j52651l18260j30513J52491K08622L9169j71470k83608
38125c218024k11321J5242J48984k5511l17967l26166l1433J59192K9815j72548
38115c949737k04024j67685j97149j63302L8202K08565J55434M3845J15428K28483
38105c891940L1275m59900p75687n53727J2812L86881K71314r5414k40876j9042
38095e334304K40378K01222k7304j10695k5549m6769k24951k60474r131K32833
$$ plain form
38085 -5364744 -5219370 -5397659 -5812330 -6225733 -6461772 -6467718 -6362263 -6393665 -6645585 -6841812
38075 -6841812 -6702781 -6432177 -6482374 -6812251 -6815162 -6168407 -5355383 -5029633 -5155974 -5160457
38065 -5160457 -4739538 -4106618 -3513371 -2938921 -2304453 -1665207 -1083083 -548562 -111799
38056 -111799 133198 272817 540246 940355 1149336 968103 674580 703760 1123917 1654629
38046 1654629 2068343 2308610 2327064 2153993 2110234 2554773 3311868 3726529 3520244 3266890
38036 3266890 3675250 4633420 5406788 5685774 5927125 6552114 7287174 7623697 7631099 7890299
38026 7890299 8689552 9651896 10241286 10385525 10445322 10701217 11046242 11180468 10987494 10639440
38016 10639440 10359314 10184230 10027964 9893032 9867096 9909272 9817561 9500890 9150765 9010948
$$ packed form
38085e364744J45374j78289m14671m13403k36039n946J05455l1402k51920j96227
38075f841812J39031K70604n0197l29877k911O46755Q13024L25750j26341m483
38065e160457M20919O32920N93247N74450O34468O39246N82124N34521M36763
38056a11799K44997J39619K67429M00109K08981j81233k93523K9180M20157N30712
38046A654629M13714K40267J8454j73071m3759M44539P57095M14661k06285k53354
38036C266890M08360R58170P73368K78986K41351O24989P35060L36523P402K59200
38026G890299P99253R62344N89390J44239N9797K55895L45025J34226j92974l48054
38016A0639440k80126j75084j56266j34932k5936M2176r1711l16671l50125j39817
$$ plain form
38006 9010948 9061395 9071853 8919978 8710456 8580769 8506953 8330055 7920433 7330911 6833556
37996 6833556 6736864 7062113 7449198 7510605 7251089 6995101 6913854 6812560 6451742 5908246
37986 5908246 5470815 5264726 5144474 4954878 4756304 4722088 4891553 5120236 5252214 5236161
37976 5236161 5045517 4613182 3975127 3411573 3255888 3524950 3892717 4093675 4193816
37967 4193816 4353121 4481765 4332369 3867358 3340711 3013329 2924711 2942244 2912936 2771548
37957 2771548 2609838 2620263 2858568 3104080 3105940 2938138 2923847 3193955 3511179 3585336
37947 3585336 3387477 3076641 2788669 2616073 2654707 2907801 3197311 3290061 3100959 2730953
37937 2730953 2361021 2144067 2118789 2178511 2197268 2212013 2370319 2666492 2890318 2930876
$$ packed form
38006I010948N0447J0458j51875k09522j29687p3816j76898m09622n89522m97355
37996F833556r6692L25249L87085O1407k59516k55988q1247j01294l60818n43496
37986E908246m37431k06089j20252j89596j98574l4216J69465K28683J31978j6053
37976E236161j90644m32335o38055n63554j55685K69062L67767K00958J00141
37967D193816J59305J28644j49396m65011n26647l27382q8618J7533k9308j41388
37957B771548j61710J0425K38305K45512J860j67802j4291K70108L17224P4157
37947C585336j97859l10836k87972j72596L8634K53094K89510R2750j89102l70006
37937B730953l69932k16954k5278N9722J8757J4745J58306K96173K23826M0558
$$ plain form
37927 2930876 2969616 3214096 3557578 3692950 3507168 3185242 2950509 2867088 2888661 2937488
37917 2937488 2913211 2759814 2546082 2362349 2149700 1802602 1459173 1462952 1904619 2381264
37907 2381264 2418636 2045857 1731055 1761655 1915101 1822033 1468902 1180103 1194537 1434360
37897 1434360 1678933 1810474 1842936 1829058 1821658 1860381 1923119 1933978 1877440 1858614 1992470
37886 1992470 2283982 2675623 3135001 3595128 3882729 3855836 3584284 3250827 2914033 2562970
37876 2562970 2382007 2670550 3389581 4055532 4285673 4232010 4225898 4204082 3864954 3299853
37866 3299853 3018326 3258834 3664483 3821503 3777510 3772191 3759212 3561196 3310773 3324799
37856 3324799 3596218 3791829 3767476 3729852 3834565 3981804 4116210 4366098 4709130 4849021
$$ packed form
37927B930876L8740K44480L43482J35372j85782l21926k34733q3421K1573M8827
37917B937488k4277j53397k13732j83733k12649l47098l43429L779M41667M76645
37907B381264L7372l72779l14802L0600J53446r3068l53131k88799J4434K39823
37897A434360K44573J31541L2462j3878p400L8723O2738J0859n6538j8826J33856
37886A992470K91512L91641M59378M60127K87601k6893k71552l33457l36794l51063
37876B562970j80963K88543P19031O65951K30141n3663o112k1816l39128n65101
37866C299853k81527K40508M05649J57020m3993n319j2979j98016k50423J4026
37856C324799K71419J95611k4353l7624J04713J47239J34406K49888L43032J39891
$$ plain form
37846 4849021 4666763 4470519 4504376 4534061 4304125 4098574 4328572 4771351 4832251 4486058
37836 4486058 4292517 4424367 4397266 3994935 3745600 4044925 4432824 4339075 4053957 4238462
37826 4238462 4793040 4995082 4617037 4129868 3803293 3382177 2800594 2471202 2555149 2573224
37816 2573224 2136495 1548728 1266316 1219636 1133870 1110861 1347282 1589855 1471054 1194350
37806 1194350 1275809 1691277 1897508 1734009 1696690 2125897 2637288 2668635 2236107 1821153
37796 1821153 1741007 1942545 2277201 2675582 3056437 3262359 3156032 2759501 2316520 2171345
37786 2171345 2452592 2878889 3037553 2869919 2695314 2734449 2854453 2867650 2808686 2745065
37776 2745065 2564411 2194328 1838762 1715307 1704750 1570494 1417006 1567657 2010255 2343481
$$ packed form
37846D849021j82258j96244L3857K9685k29936k05551K29998M42779O0900l46193
37836D486058j93541J31850k7101m02331k49335K99325L87899r3749k85118J84505
37826D238462N54578K02042l78045m87169l26575m21116n81583l29392Q3947J8075
37816B573224m36729n87767k82412m6680q5766k3009K36421K42573j18801k76704
37806A194350Q1459M15468K06231j63499l7319M29207N11391L1347m32528m14954
37796A821153q0146K01538L34656L98381L80855K05922j06327l96531m42981j45175
37786B171345K81247M26297J58664j67634j74605L9135J20004J3197n8964o3621
37776B745065j80654l70083l55566j23455j0557j34256j53488J50651M42598L33226
$$ plain form
37766 2343481 2347935 2257315 2321974 2438369 2434277 2429272 2603038 2807906 2761298 2515502 2384798
37755 2384798 2446449 2473043 2392337 2450487 2786533 3157813 3281499 3195277 3061607 2847575
37745 2847575 2481805 2160057 2164548 2446595 2694030 2790538 2903659 3090269 3132342 2893462
37735 2893462 2590505 2533159 2750034 3028103 3198552 3234627 3167613 3066047 3047568 3172484
37725 3172484 3337141 3368329 3219646 3015490 2916937 2989272 3179615 3381200 3518187 3568658
37715 3568658 3502337 3256678 2847538 2453042 2273237 2322176 2461180 2601089 2739868 2842689
37705 2842689 2862440 2867859 2965813 3100664 3130058 3086485 3119505 3183207 3088202 2901293 2927363
37694 2927363 3185274 3310606 3178921 3181558 3546542 3818558 3522094 3019110 3065356 3643634
$$ packed form
37766B343481M454r0620O4659J16395m092n005J73766K04868m6608k45796j30704
37755B384798O1651K6594q0706N8150L36046L71280J23686q6222j33670k14032
37745B847575l65770l21748M491K82047K47435R6508J13121J86610M2073k38880
37735B893462l02957n7346K16875K78069J70449L6075o7014j01566j8479J24916
37725C172484J64657L1188j48683k04156r8553P2335J90343K01585J36987N0471
37715C568658o6321k45659m09140l94496j79805M8939J39004J39909J38779J02821
37705B842689J9751N419R7954J34851K9394m3573L3020O3702r5005j86909K6070
37694B927363K57911J25332j31685K637L64984K72016k96464n02984M6246N78278
$$ plain form
37684 3643634 3912285 3386573 2572760 2228468 2494089 3024821 3545630 3909948 3925636 3552169
37674 3552169 3135624 3083021 3338879 3465581 3233297 2876489 2723099 2786522 2832854 2711283
37664 2711283 2476860 2244527 2071686 2013294 2163134 2531467 2949976 3230501 3379383 3501347
37654 3501347 3534951 3324034 2982003 2901009 3266790 3809655 4185750 4347954 4372184 4232424
37644 4232424 4002036 3953640 4131302 4154779 3849424 3703397 4150273 4740238 4751129 4392650
37634 4392650 4524016 5219797 5585588 5186660 4696495 4724631 4901260 4720827 4506172 4768386
37624 4768386 5213229 5237099 5001053 5151089 5722253 6148294 6217637 6219486 6194567 5839542
37614 5839542 5239744 4968996 5262375 5674226 5750091 5522898 5171664 4704439 4205751 3940563
$$ packed form
37684C643634K68651n25712q13813l44292K65621N30732N20809L64318J5688l73467
37674C552169m16545n2603K55858J26702k32284l56808j53390O3423M6332j21571
37664B711283k34423k32333j72841n8392J49840L68333M18509K80525J48882J21964
37654C501347L3604k10917l42031q0994L65781N42865L76095J62204K4230j39760
37644D232424k30388m8396J77662K3477l05355j46027M46876N89965J0891l58479
37634D392650J31366O95781L65791l98928m90165K8136J76629j80433k14655K62214
37624D768386M44843K3870k36046J50036N71164M26041O9343J849k4919l55025
37614E839542n99798k70748K93379M11851P5865k27193l51234m67225m98688k65188
$$ plain form
37604 3940563 3952631 3916042 3581202 3021075 2281696 1187215 -297023 -1868496 -3269597
37595 -3269597 -4539838 -5716858 -6672677 -7479039 -8550254 -10111111 -11813105 -13153334
37587 -13153334 -14004067 -14498962 -14727070 -14824048 -15038897 -15384583 -15522955 -15317419 -15158450
37578 -15158450 -15351612 -15534903 -15198196 -14479909 -13871183 -13367213 -12588219 -11630061 -11053273
37569 -11053273 -10960624 -10799707 -10291897 -9894118 -9987881 -10180819 -9892020 -9222771 -8726151 -8564122
37559 -8564122 -8393101 -7960929 -7386037 -6900934 -6665134 -6755541 -6994565 -6865540 -6000819 -4763270
37549 -4763270 -3963525 -3940102 -4270151 -4455715 -4490127 -4574125 -4673329 -4674291 -4701589 -4918911 -5173670
37538 -5173670 -5174522 -4923933 -4666747 -4489499 -4289890 -4093316 -4053651 -4126593 -4075877 -3853032
$$ packed form
37604C940563J2068l6589l34840n60127p39379j094481j484238j571473j401101
37595c269597j270241j177020r55819q06362j071215j560857j701994j340229
37587a3153334q50733m94895k28108r6978k14849l45686j38372K05536J58969
37578a5158450j93162j83291L36707P18287O08726N03970P78994R58158N76788
37569a1053273R2649J60917N07810L97779r3763j92938K88799O69249M96620J62029
37559h564122J71021M32172N74892M85103K35800r0407k39024J29025Q64721J237549
37549d763270P99745K3423l30049j85564l4412q3998r9204r62k7298k17322k54759
37538e173670q52K50589K57186J77248J99609J96574L9665p2942N0716K22845
$$ plain form
37528 -3853032 -3644411 -3480692 -3174216 -2776616 -2692462 -3078855 -3485957 -3443789 -3138038 -3112367
37518 -3112367 -3491894 -3911393 -4083429 -4017019 -3753402 -3326604 -2972100 -2935785 -3040001 -2873889
37508 -2873889 -2475924 -2344533 -2623743 -2794560 -2471488 -2043504 -2096831 -2543902 -2823912 -2757467
37498 -2757467 -2667466 -2707882 -2591199 -2105217 -1520822 -1285841 -1522511 -1979456 -2348099 -2511622
37488 -2511622 -2549786 -2565093 -2513157 -2277927 -1951680 -1864745 -2164813 -2516013 -2469944 -2048221
37478 -2048221 -1674704 -1578700 -1591328 -1556254 -1588937 -1784265 -1952310 -1856954 -1544117 -1251228
37468 -1251228 -1116914 -1126360 -1221861 -1322586 -1336032 -1276871 -1277835 -1377861 -1426165 -1320710 -1195167
37457 -1195167 -1197144 -1218416 -1075508 -868618 -887390 -1166559 -1406165 -1403720 -1323357 -1393873 -1522830
$$ packed form
37528c853032K08621J63719L06476L97600Q4154l86393m07102M2168L05751K5671
37518c112367l79527m19499j72036O6410K63617M26798L54504L6315j04216J66112
37508b873889L97965J31391k79210j70817L23072M27984n3327m47071k80010O6445
37498b757467R0001m0416J16683M85982N84395K34981k36670m56945l68643j63523
37488b511622l8164j5307N1936K35230L26247Q6935l00068l51200M6069M21723
37478b048221L73517R6004j2628L5074l2683j95328j68045R5356L12837K92889
37468a251228J34314r446r5501j00725j3446N9161r64j00026m8304J05455J25543
37457a195167j977k1272J42908K06890j8772k79169k39606K445Q0363p0516j28957
$$ plain form
37446 -1522830 -1409008 -961675 -436278 -167079 -280945 -660005 -1076017 -1352427 -1474180
37437 -1474180 -1542353 -1573590 -1414924 -990951 -579568 -604392 -1082528 -1512572 -1484318 -1203419
37427 -1203419 -1147878 -1342031 -1341262 -944999 -529539 -499366 -730219 -832216 -741066 -720093 -901672
37416 -901672 -1168998 -1446346 -1755359 -1944490 -1712125 -1057021 -443374 -304651 -540950 -703746
37406 -703746 -567917 -324614 -261075 -429357 -642697 -682777 -485260 -182827 16055 1224
37396 1224 -197034 -503704 -851079 -1155143 -1374659 -1604113 -1938119 -2202886 -2050280 -1456406
37386 -1456406 -905487 -843440 -1105660 -1172774 -898999 -650131 -713130 -911594 -927340 -724405
37376 -724405 -475162 -279261 -165770 -220331 -478363 -770507 -881451 -820012 -748987 -691569
$$ packed form
37446a522830J13822M47333N25397K69199j13866l79060m16012k76410j21753
37437a474180o8173l1237J58666M23973M11383k4824m78136m30044K8254K80899
37427a203419N5541j94153P69L96263M15460L0173k30853j01997R1150K0973j81579
37416i01672k67326k77348l09013j89131K32365O55104O13647J38723k36299j62796
37406g03746J35829K43303O3539j68282k13340m0080J97517L02433J98882j4831
37396A224j98258l06670l47375l04064k19516k29454l34006k64767J52606N93874
37386a456406N50919O2047k62220o7114K73775K48868o2999j98464j5746K02935
37376g24405K49243J95901J13491n4561k58032k92144j10944O1439P1025N7418
$$ plain form
37366 -691569 -523502 -265268 -155335 -337019 -632607 -747837 -600324 -344659 -161308 -129441
37356 -129441 -234151 -367697 -352167 -82398 345302 729105 982111 1174974 1364959 1487656
37346 1487656 1460942 1330338 1259064 1382295 1660997 1860163 1739817 1362619 1153330 1489033
37336 1489033 2229063 2833686 2993472 2938229 3026999 3266922 3441967 3520178 3633020 3756748
37326 3756748 3756190 3729746 3949481 4372553 4559256 4261726 3803565 3627504 3700138 3664494
37316 3664494 3414270 3173449 3084768 3066456 3079469 3211299 3430939 3552138 3542056 3606918
37306 3606918 3851739 4108735 4254799 4442344 4799098 5126453 5178943 5085688 5182815 5514572
37296 5514572 5809931 5909689 5900904 5838197 5681710 5575325 5820873 6400883 6833008 6734610
$$ packed form
37366f91569J68067K58234J09933j81684k95588j15230J47513K55665J83351L1867
37356a29441j04710j33546J5530K69769M27700L83803K53006J92863J89985J22697
37346A487656k6714j30604p1274J23231K78702J99166j20346l77198k09289L35703
37336A489033P40030O04623J59786n5243Q8770K39923J75045P8211J12842J23728
37326C756748n58k6444K19735M23072J86703k97530m58161j76061P2634l5644
37316C664494k50224k40821q8681j8312J3013J31830K19640J21199j0082O4862
37306C606918K44821K56996J46064J87545L56754L27355N2490r3255R7127L31757
37296E514572K95359R9758q785o2707j56487j06385K45548N80010M32125r8398
$$ plain form
37286 6734610 6296936 5957245 5830162 5769580 5797301 6058784 6407500 6450609 6098755 5747542
37276 5747542 5776404 6116462 6454930 6647999 6762891 6871627 6966505 6985537 6840669 6550277
37266 6550277 6377382 6601051 7052224 7169828 6724970 6195720 6101606 6225715 5962174 5302846
37256 5302846 4905512 5089115 5310912 4960649 4281169 4042213 4456582 4875044 4617108
37247 4617108 3770994 2988686 2673547 2612845 2408373 2053129 1902136 2131694 2468848 2569601
37237 2569601 2468724 2426118 2441282 2227805 1690457 1144164 949278 1133178 1472117 1754289
37227 1754289 1858988 1773459 1658081 1717080 1894089 1899449 1654022 1444506 1457965 1452186 1173138
37216 1173138 847153 887754 1279716 1643177 1794716 1837598 1776746 1511650 1231015 1341429
$$ packed form
37286F734610m37674l39691j27083o0582K7721K61483L48716M3109l51854l51213
37276E747542K8862L40058L38468J93069J14892J08736R4878J9032j44868k90392
37266F550277j72895K23669M51173J17604m44858n29250r4114J24109k63541o59328
37256E302846l97334J83603K21797l50263o79480k38956M14369M18462k57936
37247D617108q46114p82308l15139o0702k04472l55244j50993K29558L37154J00753
37237B569601j00877m2606J5164k13477n37348n46293j94886J83900L38939K82172
37227A754289J04699q5529j15378N8999J77009N360k45427k09516J3459n779k79048
37216A173138l25985M0601L91962L63461J51539M2882o0852k65096k80635J10414
$$ plain form
37206 1341429 1867783 2314412 2281122 1886970 1461937 1186242 1180037 1532247 2003283 2100935
37196 2100935 1754564 1533586 1838194 2259374 2217099 1900337 1970230 2526552 3030611 3202482
37186 3202482 3315577 3507197 3467280 3076616 2779476 2947266 3323351 3508025 3608135 3936414
37176 3936414 4376318 4592511 4694537 5113921 5847081 6364198 6374751 6223617 6359027 6807194
37166 6807194 7394090 8125642 9033661 9897342 10470670 10862436 11382419 12085038 12762079
37157 12762079 13360497 14097039 15079798 16060959 16714448 17035269 17349173 17989660 19014287
37148 19014287 20158067 21021275 21381140 21361354 21243201 21131043 20917553 20552753 20151971
37139 20151971 19789821 19396304 18962258 18632743 18427414 18083059 17441339 16842154 16793499
$$ packed form
37206A341429N26354M46629l3290l94152m25033k75695o205L52210M71036R7652
37196B100935l46371k20978L04608M21180m2275l16762O9893N56322N04059J71871
37186C202482J13095J91620l9917l90664k97140J67790L76085J84674J00110L28279
37176C936414M39904K16193J02026M19384P33160N17117J0553j51134J35410M48167
37166F807194N86896P31552R08019Q63681N73328L91766N19983P02619O77041
37157A2762079N98418P36542R82759R81161O53489L20821L13904O40487J024627
37148A9014287J143780Q63208L59865j9786j18153j12158k13490l64800m00782
37139B0151971l62150l93517m34046l29515k05329l44355o41720n99185m8655
$$ plain form
37130 16793499 17292934 17814835 18001312 18027199 18170664 18350511 18313898 18064292 17858677 17893769
37120 17893769 18168404 18541050 18774600 18662119 18270194 17917215 17750142 17521393 16987549
37111 16987549 16312651 15768411 15218538 14316620 13142071 12180778 11623275 11125963 10424279
37102 10424279 9775894 9527957 9543777 9373072 8823797 8102518 7497732 7128466 6909857
37093 6909857 6614875 6087832 5504890 5221506 5219637 4992166 4248750 3462274 3303086 3700652
37083 3700652 3955753 3745324 3490196 3599665 3845565 3790579 3486014 3345773 3496180 3640172
37073 3640172 3540941 3298908 3061982 2741562 2226811 1735574 1675892 2120113 2640984 2822383
37063 2822383 2773191 2895358 3237209 3424571 3279005 3107537 3158184 3152908 2749818 2221690
$$ packed form
37130A6793499M99435N21901J86477K5887J43465J79847l6613k49606k05615L5092
37120A7893769K74635L72646K33550j12481l91925l52979j67073k28749n33844
37111A6987549o74898n44240n49873r01918j174549r61293n57503m97312p01684
37102A0424279o48385k47937J5820j70705n49275p21279o04786l69266k18609
37093F909857k94982n27043n82942k83384j869k27471p43416p86476j59188L97566
37083C700652K55101k10429k55128J09469K45900n4986l04565j40241J50407J43992
37073C640172r9231k42033k36926l20420n14751m91237n9682M44221N20871J81399
37063B822383m9192J22167L41851J87362j45566j71468N0647n276m03090n28128
$$ plain form
37053 2221690 2180207 2703746 3229795 3348738 3233358 3155800 3036609 2724668 2367988 2201760
37043 2201760 2205476 2231754 2265675 2311302 2236487 2014522 1941481 2295258 2879107 3197460 3033900
37032 3033900 2609104 2222350 1988567 1908917 1961363 2081391 2201324 2317314 2424345 2450064
37022 2450064 2364076 2255788 2177234 2036543 1803311 1666666 1780102 1989035 2052781 2011677
37012 2011677 2067452 2215135 2298164 2340987 2487616 2645967 2539167 2128500 1675012 1364984
37002 1364984 1187386 1194831 1521342 2049461 2392481 2343035 2078312 1835978 1674492 1635680
36992 1635680 1808437 2083597 2156130 1944652 1734331 1752817 1901370 2059529 2301297 2578304
36982 2578304 2553304 2090054 1626386 1674366 2133614 2463526 2399263 2145750 1955226 1856484
$$ packed form
37053B221690m1483N23539N26049J18943j15380p7558j19191l11941l56680j66228
37043B201760L716K6278L3921M5627p4815k21965p3041L53777N83849L18353j63560
37032C033900m24796l86754k33783p9650N2446J20028J19933J15990J07031K5719
37022B450064q5988j08288p8554j40691k33232j36645J13436K08933O3746m1104
37012B011677N5775J47683Q3029M2823J46629J58351j06800m10667m53488l10028
37002A364984j77598P445L26511N28119L43020m9446k64723k42334j61486l8812
36992A635680J72757K75160P2533k11478k10321J8486J48553J58159K41768K77007
36982B578304k5000m63250m63668M7980M59248L29912o4263k53513j90524r8742
$$ plain form
36972 1856484 1787983 1734829 1717236 1779225 1917903 1945822 1634258 1126290 910434 1161571
36962 1161571 1447464 1399644 1284995 1446660 1554619 1075477 268516 -42064 342016 765935
36952 765935 769703 639144 710760 830342 840810 988475 1413752 1749636 1684944 1485595
36942 1485595 1480895 1444280 1033670 522927 498207 1018305 1620378 2006109 2195546 2147515
36932 2147515 1810736 1488945 1567163 1867032 1855990 1552440 1598961 2261713 2976159 3204540
36922 3204540 3194729 3447165 3867687 3989205 3758137 3535265 3433757 3197625 2764588 2480017
36912 2480017 2604177 2942864 3139516 3094065 2926932 2714368 2444377 2141727 1893856 1784190
36902 1784190 1854752 2071700 2295415 2381624 2361372 2417492 2621613 2810739 2821805 2740563
$$ packed form
36972A856484o8501n3154j7593O1989J38678K7919l11564n07968k15856K51137
36962A161571K85893m7820j14649J61665J07959m79142q06961l10580L84080M23919
36952G65935L768j30559P1616J19582J0468J47665M25277L35884o4692j99349
36942A485595m700l6615m10610n10743k4720N20098O02073L85731J89437m8031
36932B147515l36779l21791P8218K99869j1042l03550M6521O62752P14446K28381
36922C204540r811K52436M20522J21518k31068k22872j01508k36132m33037k84571
36912B480017J24160L38687J96652m5451j67133k12564k69991l02650k47871j09666
36902A784190P0562K16948K23715Q6209k0252N6120K04121J89126J1066q1242
$$ plain form
36892 2740563 2773079 2929140 2995005 2821549 2496915 2195211 1977512 1821359 1761819 1887195
36882 1887195 2195331 2530436 2703264 2661688 2522225 2429433 2402593 2348279 2210504 2041178
36872 2041178 1898229 1767315 1673835 1789444 2258707 2922669 3396852 3499250 3452827 3550328
36862 3550328 3740769 3707986 3301557 2729503 2319512 2203018 2249078 2223176 1989246 1608009
36852 1608009 1258166 1070728 1083638 1321504 1762161 2188529 2289021 2046243 1824654 1871140
36842 1871140 1938614 1699783 1341295 1322065 1625910 1749543 1486889 1228520 1313589 1551937
36832 1551937 1641633 1616879 1547646 1227410 627184 314509 837402 1864461 2509658 2439841
36822 2439841 2106461 1900013 1687380 1327631 1075251 1173636 1461186 1690504 1914000 2245412
$$ packed form
36892B740563L2516J56061O5865j73456l24634l01704k17699j56153n9540J25376
36882A887195L08136L35105J72828m1576j39463r2792k6840n4314j37775j69326
36872B041178j42949j30914r3480J15609M69263O63962M74183J02398m6423R7501
36862C550328J90441l2783m06429n72054m09991j16494M6060k5902k33930l81237
36852A608009l49843j87438J2910K37866M40657M26368J00492k42778k21589M6486
36842A871140O7474k38831l58488j9230L03845J23633k62654k58369Q5069K38348
36832A551937Q9696k4754o9233l20236o00226l12675N22893J027059O45197o9817
36822B439841l33380k06448k12633l59749k52380R8385K87550K29318K23496L31412
$$ plain form
36812 2245412 2512513 2479903 2231890 2029418 1920538 1769937 1576638 1502524 1626001 1852635
36802 1852635 2020849 1968446 1610257 1114634 888561 1191386 1821074 2325441 2450590 2273394
36792 2273394 2021032 1900291 1975703 2077755 1975981 1760533 1823683 2277027 2660895 2532764
36782 2532764 2104260 1913333 2051364 2164720 2115728 2146928 2380408 2615011 2693675 2665815
36772 2665815 2516841 2149130 1711115 1506965 1473305 1225047 776127 670225 1115443 1539209
36762 1539209 1425856 1099883 1127526 1352751 1212668 764899 647301 1049354 1433630 1408249
36752 1408249 1253425 1334421 1503789 1422075 1117526 895456 917245 1126589 1406233 1596674
36742 1596674 1539759 1304783 1214643 1469490 1892184 2197710 2333466 2366627 2216658 1761536
$$ packed form
36812B245412K67101l2610k48013k02472j08880j50601j93299p4114J23477K26634
36802A852635J68214n2403l58189m95623k26073L02825O29688N04367J25149j77196
36792B273394k52362j20741P5412J02052j01774k15448O3150M53344L83868j28131
36782B532764m28504j90927J38031J13356m8992L1200K33480K34603P8664k7860
36772B665815j48974l67711m38015k04150l3660k48258m48920j05902M45218M23766
36762A539209j13353l25973K7643K25225j40083m47769j17598M02053L84276k5381
36752A408249j54824Q0996J69368q1714l04549k22070K1789K09344K79644J90441
36742A596674n6915k34976r0140K54847M22694L05526J35756L3161j49969m55122
$$ plain form
36732 1761536 1136650 704755 725149 1157528 1734945 2132196 2147463 1844516 1487563 1293980
36722 1293980 1317902 1544835 1901418 2156404 2096924 1909737 2071264 2661067 3111194 2944909
36712 2944909 2471367 2336048 2605198 2799077 2719556 2674518 2834131 2923870 2756400 2586442
36702 2586442 2634950 2650070 2321688 1864052 1774993 2156696 2651241 2974565 3152166 3240647
36692 3240647 3182063 3024982 2986067 3137798 3264094 3206599 3175945 3495839 4130684 4689676
36682 4689676 4877704 4743063 4467385 4129679 3781770 3575892 3626355 3813465 3896676 3803181
36672 3803181 3658452 3547216 3413930 3225837 3062724 2967883 2844973 2594257 2255612 1952351
36662 1952351 1788041 1826416 2024365 2143099 1929485 1487203 1253911 1459585 1821667 1966680
$$ packed form
36732A761536o24886m31895K0394M32379N77417L97251J5267l02947l56953j93583
36722A293980K3922K26933L56583K54986n9480j87187J61527N89803M50127j66285
36712B944909m73542j35319K69150J93879p9521m5038J59613Q9739j67470j69958
36702B586442M8508J5120l28382m57636q9059L81703M94545L23324J77601Q8481
36692C240647n8584j57081l8915J51731J26296n7495l0654L19894O34845N58992
36682D689676J88028j34641k75678l37706l47909k05878N0463J87110Q3211r3495
36672C803181j44729j11236j33286j88093j63113r4841j22910k50716l38645l03261
36662A952351j64310L8375J97949J18734k13614m42282k33292K05674L62082J45013
$$ plain form
36652 1966680 1923978 1940510 2022391 2000888 1894738 1826639 1693363 1339376 989602 1027325
36642 1027325 1316199 1253556 646499 64622 86310 598685 1117068 1421923 1538929 1406636
36632 1406636 985827 535154 411995 671946 1101281 1505246 1736471 1642350 1292977 1091439
36622 1091439 1311417 1650600 1609031 1224977 1034975 1304951 1692503 1766310 1538183 1328163
36612 1328163 1324433 1433486 1452719 1305156 1163278 1321187 1841966 2385988 2529852 2205745
36602 2205745 1693101 1272343 1062305 1082262 1229971 1271989 1104565 954567 1055566 1204994
36592 1204994 977839 365745 -138864 -139239 284210 810418 1166499 1143136 704172 212187
36582 212187 199230 734609 1308955 1500991 1442200 1426161 1405837 1201292 958491 1023905
$$ packed form
36652A966680m2702J6532Q1881k1503j06150o8099j33276l53987l49774L7723
36642A027325K88874o2643o07057n81877K1688N12375N18383L04855J17006j32293
36632A406636m20809m50673j23159K59951M29335M03965K31225r4121l49373k01538
36622A091439K19978L39183m1569l84054j90002K69976L87552P3807k28127k10020
36612A328163l730J09053J9233j47563j41878J57909N20779N44022J43864l24107
36602B205745n12644m20758k10038J9957J47709M2018j67424j49998J00999J49428
36592A204994k27155o12094n04609l75M23449N26208L56081k3363m38964m91985
36582B12187j2957N35379N74346J92036n8791j6039k0324k04545k42801O5414
$$ plain form
36572 1023905 1458894 1982436 2357538 2596672 2800127 2981992 3076722 3024862 2871272 2803682
36562 2803682 2983368 3293285 3407289 3182115 2821781 2590748 2566975 2756111 3181783 3696758
36552 3696758 3957068 3810252 3514930 3365642 3309607 3173186 3045268 3120395 3315259 3367758
36542 3367758 3222472 3021083 2798677 2495893 2216016 2171089 2388408 2709959 3028612 3287651
36532 3287651 3344924 3128672 2841787 2693567 2520672 2056705 1520179 1473662 2037335 2678734
36522 2678734 2911119 2797794 2608277 2394867 2161508 2082055 2222892 2319678 2159473 1973448
36512 1973448 2124655 2579788 3026698 3379015 3793862 4241177 4425913 4201772 3786439
36503 3786439 3472706 3324227 3242673 3175974 3154614 3198836 3256726 3225260 3064585 2912581
$$ packed form
36572A023905M34989N23542L75102K39134K03455J81865R4730n1860j53590o7590
36562B803682J79686L09917J14004k25174l60334k31033k3773J89136M25672N14975
36552C696758K60310j46816k95322j49288n6035j36421j27918P5127J94864N2499
36542C367758j45286k01389k22406l02784k79877m4927K17319L21551L18653K59039
36532C287651N7273k16252k86885j48220j72895m63967n36526m6517N63673O41399
36522B678734K32385j13325j89517k13410k33359p9453J40837R6786j60205j86025
36512A973448J51207M55133M46910L52317M14847M47315J84736k24141m15333
36503C786439l13733j48479q1554o6699k1360M4222N7890l1466j60675j52004
$$ plain form
36493 2912581 2969572 3177098 3162306 2689050 2045270 1731955 1834808 1992571 1968133 1907574
36483 1907574 1951531 1940849 1713791 1419757 1273022 1194762 988672 731028 678580 868383
36473 868383 1109493 1319092 1549400 1710319 1637922 1486958 1654868 2167598 2533285 2446794
36463 2446794 2264193 2426217 2734283 2671668 2241575 1947369 1996465 2065518 1930669 1825819
36453 1825819 1987210 2261806 2404063 2416231 2353564 2114348 1701854 1420506 1515155 1831656
36443 1831656 2095158 2287362 2467134 2478028 2198057 1884677 1892263 2192032 2530001 2894033
36433 2894033 3406174 3882999 3978719 3730474 3524619 3542621 3667965 3890312 4283287 4575301
36423 4575301 4343938 3775636 3625149 4156844 4705033 4667030 4400914 4612121 5248778 5623407
$$ packed form
36493B912581N6991K07526j4792m73256o43780l13315J02853J57763k4438o0559
36483A907574M3957j0682k27058k94034j46735p8260k06090k57644n2448J89803
36473H68383K41110K09599K30308J60919p2397j50964J67910N12730L65687q6491
36463B446794j82601J62024L08066o2615m30093k94206M9096O9053j34849j04850
36453A825819J61391K74596J42257J2168o2667k39216m12494k81348R4649L16501
36443A831656K63502J92204J79772J0894k79971l13380P586K99769L37969L64032
36433B894033N12141M76825R5720k48245k05855J8002J25344K22347L92975K92014
36423D575301k31363n68302j50487N31695N48189l8003k66116K11207O36657L74629
$$ plain form
36413 5623407 5422224 5002513 4769461 4801226 5096907 5673910 6278355 6412800 5880124 5063313
36403 5063313 4496291 4325793 4316680 4229751 4049291 3906923 3882912 3899313 3834063 3740116 3815133
36392 3815133 4054243 4099676 3654238 2944791 2511138 2560998 2795495 2886394 2844827 2826509
36382 2826509 2834536 2801212 2798799 2953848 3204520 3314239 3146688 2833259 2637001 2697509
36372 2697509 2943658 3238972 3545510 3873348 4098891 3982217 3454978 2795458 2390566
36363 2390566 2356011 2482996 2518219 2401189 2265998 2310405 2632628 3105017 3443053 3483629
36353 3483629 3346355 3240407 3204174 3164525 3153381 3263028 3422013 3434211 3277333 3180425
36343 3180425 3331866 3645435 3896742 3992947 4016498 4042947 3995962 3736729 3327854 3133930
$$ packed form
36413E623407k01183m19711k33052L1765K95681N77003O04445J34445n32676q16811
36403E063313n67022j70498r113q6929j80460j42368k4011J6401o5250r3947P5017
36392C815133K39110M5433m45438p09447m33653M9860K34497R0899m1567j8318
36382B826509Q027l3324k413J55049K50672J09719j67551l13429j96258O0508
36372B697509K46149K95314L06538L27838K25543j16674n27239o59520m04892
36363B390566l4555J26985L5223j17030j35191M4407L22223M72389L38036M0576
36353C483629j37274j05948l6233l9649j1144J09647J58985J2198j56878r6908
36343C180425J51441L13569K51307R6205K3551K6449m6985k59233m08875j93924
$$ plain form
36333 3133930 3472934 4127935 4457599 4180098 3819985 4064785 4825182 5331954 5140647
36324 5140647 4619126 4341691 4395471 4495128 4466030 4338672 4175167 4063696 4129365 4316231
36314 4316231 4317058 3987403 3697767 3948772 4672701 5242999 5244279 4964156 4982711 5455661
36304 5455661 5974496 6063281 5680270 5227982 5126048 5390893 5650596 5583145 5266551 5011958
36294 5011958 4937717 4907330 4891511 5123753 5716572 6314389 6432908 6117263 5955411 6337873
36284 6337873 6974781 7340332 7361913 7368410 7514614 7662064 7807845 8170541 8695189 8901223
36274 8901223 8537726 8075843 8163448 8803190 9484004 9963296 10423133 10901824 11127220 11055204
36264 11055204 11094086 11542045 12174047 12669094 13124245 13801537 14610704 15244653 15716159
$$ packed form
36333C133930L39004O55001L29664k77501l60113K44800P60397N06772j91307
36324E140647n21521k77435N3780R9657k9098j27358j63505j11471O5669J86866
36314D316231Q27l29655k89636K51005P23929N70298J280k80123J8555M72950
36304E455661N18835Q8785l83011m52288j01934K64845K59703o7451l16594k54593
36294E011958p4241l0387j5819K32242N92819N97817J18519l15645j61852L82462
36284F337873O36908L65551K1581O497J46204J47450J45781L62696N24648K06034
36274H901223l63497m61883Q7605O39742O80814M79292M59837M78691K25396p2016
36264A1055204L8882M47959O32002M95047M55151O77292Q09167O33949M71506
$$ plain form
36255 15716159 16376773 17394542 18510438 19374529 19915798 20315246 20760092 21284459 21771052
36246 21771052 22087812 22258745 22449440 22729647 22940001 22887488 22590601 22234061 21973565
36237 21973565 21890322 22021442 22276987 22401106 22171765 21607130 20886350 20158152 19524928
36228 19524928 19073226 18763632 18420069 17995296 17693999 17628595 17544400 17205915 16921627 17272479
36218 17272479 18313609 19439262 20141260 20560839 21133599 21983463 22885300 23625003 24173604
36209 24173604 24608765 25018852 25412426 25644433 25541368 25157320 24760892 24500531 24241846
36200 24241846 23807319 23188445 22416644 21426737 20211498 18952326 17818963 16754595 15613054
36191 15613054 14395705 13203634 12074567 11031353 10180037 9572663 9050357 8405532 7654596
$$ packed form
36255A5716159O60614J017769J115896Q64091N41269L99448M44846N24367M86593
36246B1771052L16760J70933J90695K80207K10354n2513k96887l56540k60496
36237B1973565q3243J31120K55545J24119k29341n64635p20780p28198o33224
36228A9524928m51702l09594l43563m24773l01297o5404q4195l38485k84288L50852
36218A7272479J041130J125653P01998M19579N72760Q49864R01837P39703N48601
36209B4173604M35161M10087L93574K32007j03065l84048l96428k60361k58685
36200B4241846m34527o18874p71801r89907j215239j259172j133363j064368j141541
36191A5613054j217349j192071j129067j043214q51316o07374n22306o44825p50936
$$ plain form
36182 7654596 6996944 6548419 6250557 5989581 5671326 5229934 4687814 4162949 3731364
36173 3731364 3368440 3094777 3009728 3047782 2911577 2475728 2075509 2101468 2443238 2666364
36163 2666364 2641572 2619859 2721660 2765761 2656426 2540817 2466752 2255739 1871504 1561425
36153 1561425 1439622 1273041 922523 667443 782836 1069442 1158183 1073893 1127099 1394325
36143 1394325 1675634 1868887 2027497 2114843 2053161 1970769 2054790 2201666 2182026 2107942
36133 2107942 2288300 2595110 2499440 1924012 1557708 1973821 2814732 3274690 3132593 2842681
36123 2842681 2739911 2654318 2366460 2038801 1999026 2297513 2636710 2652886 2210021 1508353
36113 1508353 947131 810660 1059851 1447878 1773901 1957361 1971461 1861782 1789160 1902640
$$ packed form
36182G654596o57652m48525k97862k60976l18255m41392n42120n24865m31585
36173C731364l62924k73663q5049L8054j36205m35849m00219K5959L41770K23126
36163B666364k4792k1713J01801M4101j09335j15609p4065k11013l84235l10079
36153A561425j21803j66581l50518k55080J15393K86606Q8741q4290N3206K67226
36143A394325K81309J93253J58610Q7346o1682q2392Q4021J46876j9640p4084
36133B107942J80358L06810r5670n75428l66304M16113Q40911M59958j42097k89912
36123B842681j02770q5593k87858l27659l9775K98487L39197J6176m42865p01668
36113A508353n61222j36471K49191L88027L26023J83460J4100j09679p2622J13480
$$ plain form
36103 1902640 2171922 2438617 2580734 2528365 2232669 1800824 1557677 1720105 2057930 2159264
36093 2159264 2023366 2062073 2447575 2819891 2825537 2616311 2524090 2504460 2293598 1981772
36083 1981772 1993377 2465895 3029398 3336697 3504707 3833427 4334107 4799279 5179498 5577879
36073 5577879 5920910 5963326 5701483 5499709 5622335 5848748 5817936 5646670 5876279 6746501
36063 6746501 7795721 8348741 8235191 7849244 7620855 7638576 7745081 7787171 7721690 7602860
36053 7602860 7510537 7425219 7201502 6774264 6354943 6257002 6505206 6781542 6822318 6724375
36043 6724375 6760091 7003094 7267821 7369155 7317515 7239227 7176996 7035589 6754694 6499412
36033 6499412 6563711 7020133 7576545 7911134 8058688 8278959 8601816 8757604 8603463 8386863
$$ packed form
36103A902640K69282K66695J42117n2369k95696m31845k43147J62428L37825J01334
36093B159264j35898L8707L85502L72316N646k09226r2221j9630k10862l11826
36083A981772J1605M72518N63503L07299J68010L28720N00680M65172L80219L98381
36073E577879L43031M2416k61843k01774J22626K26413l0812j71266K29609Q70222
36063F746501J049220N53020j13550l85947k28389J7721J06505M2090o5481j18830
36053G602860r2323q5318k23717m27238m19321r7941K48204K76336M0776r7943
36043F724375L5716K43003K64727J01334n1640p8288o2231j41407k80895k55282
36033F499412O4299M56422N56412L34589J47554K20271L22857J55788j54141k16600
$$ plain form
36023 8386863 8465008 8906328 9465866 9846298 9935014 9907326 10107795 10654258 11152649 11053913
36013 11053913 10353350 9647263 9375538 9328482 9110571 8755853 8535496 8404132 8080230
36004 8080230 7587258 7297234 7404801 7673421 7750694 7490002 6946956 6298950 5781568 5483128
35994 5483128 5209124 4758192 4261591 3974841 3822716 3529781 3168750 3118920 3410789 3614264
35984 3614264 3572671 3733268 4384156 5003638 4896015 4219795 3808543 4037612 4410760 4355805
35974 4355805 3963922 3728715 3888277 4295926 4743127 5130315 5377869 5396435 5208836 5014617
35964 5014617 5066128 5449155 5966557 6277870 6221076 5981977 5882459 6031378 6273393 6452973
35954 6452973 6599546 6831768 7189749 7595612 7891183 7908730 7634084 7331920 7352139 7723055
$$ packed form
36023H386863P8145M41320N59538L80432Q8716k7688K00469N46463M98391r8736
36013A1053913p00563p06087k71725m7056k17911l54718k20357j31364l23902
36004H080230m92972k90024J07567K68620P7273k60692n43046o48006n17382k98440
35994E483128k74004m50932m96601k86750j52125k92935l61031m9830K91869K03475
35984C614264m1593J60597O50888O19482j07623o76220m11252K29069L73148n4955
35974D355805l91883k35207J59562M07649M47201L87188K47554J8566j87599j94219
35964E014617N1511L83027N17402L11313n6794k39099r9518J48919K42015J79580
35954F452973J46573K32222L57981M05863K95571J7547k74646l02164K0219L70916
$$ plain form
35944 7723055 8080395 8122337 7986479 7981739 8065122 7876701 7303970 6716865 6515802 6678851
35934 6678851 6930448 7147307 7338821 7373645 7072900 6576919 6301538 6429896 6695379 6789967
35924 6789967 6754490 6794724 6922067 7020250 7138545 7441816 7884375 8160590 8038719 7616842
35914 7616842 7201748 7001783 6956353 6845442 6588834 6403816 6539283 6874931 7030767 6949132
35904 6949132 7053551 7613555 8256245 8456460 8277430 8186321 8281807 8222312 7917158 7769402
35894 7769402 8089734 8686235 9207335 9533816 9662314 9553283 9309019 9208288 9359799
35885 9359799 9573474 9716396 9889679 10109383 10184362 10112766 10199460 10515962 10667866 10445515
35875 10445515 10272404 10547986 10944759 10936199 10706779 10858847 11401878 11765193 11771940 11850926
$$ packed form
35944G723055L57340M1942j35858m740Q3383j88421n72731n87105k01063J63049
35934F678851K51597K16859J91514L4824l00745m95981k75381J28358K65483R4588
35924F789967l5477M0234J27343R8183J18295L03271M42559K76215j21871m21877
35914G616842m15094j99965m5430j10911k56608j85018J35467L35648J55836q1635
35904F949132J04419N60004O42690K00215j79030r1109R5486n9495l05154j47756
35894G769402L20332N96501N21100L26481J28498j09031k44264j00731J51511
35885I359799K13675J42922J73283K19704P4979p1596Q6694L16502J51904k22351
35875A0445515j73111K75582L96773q560k29420J52068N43031L63315O747P8986
$$ plain form
35865 11850926 12166970 12266057 11876454 11459693 11565774 12083219 12545040 12853708 13279793
35856 13279793 13933182 14602780 15034965 15133207 14988014 14895731 15210853 15988833 16886886 17560398
35846 17560398 18013298 18423628 18813683 19088850 19259440 19429912 19670138 20042214 20627627
35837 20627627 21379046 22071428 22548354 22905287 23314853 23812615 24368083 24998828 25686696
35828 25686696 26353288 27030059 27840245 28705674 29370235 29887204 30715279 32028099 33302566
35819 33302566 34049643 34650370 35866804 37672189 39242313 40163431 41001570 42431912 44336084
35810 44336084 46130112 47626534 49174642 51132666 53518042 56081692 58520330 60720617
35802 60720617 62941858 65621834 68885612 72431771 76016818 79782843 83907934 88232515
$$ packed form
35865A1850926L16044R9087l89603m16761J06081N17445M61821L08668M26085
35856A3279793O53389O69598M32185R8242j45193r2283L15122P77980Q98053O73512
35846A7560398M52900M10330L90055K75167J70590J70472K40226L72076N85413
35837B0627627P51419O92382M76926L56933M09566M97762N55468O30745O87868
35828B5686696O66592O76771Q10186Q65429O64561N16969Q28075J312820J274467
35819C3302566P47077O00727J216434J805385J570124R21118Q38139J430342J904172
35810D4336084J794028J496422J548108J958024K385376K563650K438638K200287
35802F0720617K221241K679976L263778L546159L585047L766025M125091M324581
$$ plain form
35794 88232515 92569362 97170745 102482419 108531408 114955357 121609730 128749394 136577046
35786 136577046 145029995 154163279 164365533 175922007 188606970 201996350 216034556
35779 216034556 231017732 247117073 264227106 282298791 301529903 322045835 343488225
35772 343488225 365057740 385959306 405729148 424097654 440587632 454355596 464494395
35765 464494395 470432246 471950107 468915385 461262326 449316444 433914167 416011260
35758 416011260 396279929 375225342 353508520 331845688 310610042 289810041 269522175
35751 269522175 250124600 232022280 215347544 200054316 186129933 173542901 162092219
35744 162092219 151494005 141600697 132426944 123980333 116153315 108784331 101798748 95303515
$$ packed form
35794H8232515M336847M601383N311674O048989O423949O654373P139664P827652
35786A36577046Q452949R133284J0202254J1556474J2684963J3389380J4038206
35779B16034556J4983176J6099341J7110033J8071685J9231112K0515932K1442390
35772C43488225K1569515K0901566J9769842J8368506J6489978J3767964J0138799
35765D64494395N937851J517861l034722p653059j1945882j5402277j7902907
35758D16011260j9731331k1054587k1716822k1662832k1235646k0800001k0287866
35751B69522175j9397575j8102320j6674736j5293228j3924383j2587032j1450682
35744A62092219j0598214r893308r173753q446611p827018p368984o985583o495233
$$ plain form
35736 95303515 89496974 84379889 79607454 74838245 70240683 66361732 63359658 60669416
35728 60669416 57690794 54552769 51821214 49609714 47442649 44996234 42513485 40340573
35720 40340573 38445961 36647878 35020895 33748761 32717891 31572179 30169196 28768504
35712 28768504 27708597 26992164 26242060 25078829 23564900 22217247 21470455 21179855 20822527
35703 20822527 20130209 19267205 18416324 17573004 16853569 16576768 16750557 16815516 16266405
35694 16266405 15286948 14399004 13723805 13044739 12406713 12081380 11976504 11660580 11070165
35685 11070165 10658155 10659512 10702741 10403122 9899024 9492920 9157921 8758782 8414959 8238678
35675 8238678 7997372 7468191 6901696 6693513 6782957 6820563 6743514 6684620 6482180 5888950
$$ packed form
35736I5303515n806541n117085m772435m769209m597562l878951l002074k690242
35728F0669416k978622l138025k731555k211500k167065k446415k482749k172912
35720D0340573j894612j798083j626983j272134j030870j145712j402983j400692
35712B8768504j059907p16433p50104j163231j513929j347653p46792k90600l57328
35703B0822527o92318q63004q50881q43320p19435k76801J73789O4959n49111
35694A6266405r79457q87944o75199o79066o38026l25333j04876l15924n90415
35685A1070165m12010J357M3229k99619n04098m06104l34999l99139l43823j76281
35675H238678k41306n29181n66495k08183Q9444L7606p7049n8894k02440n93230
$$ plain form
35665 5888950 5204171 5037214 5382614 5590732 5397615 5279405 5515462 5646505 5345094
35656 5345094 5136244 5554034 6101988 5894458 5035011 4476157 4611309 4881459 4844777 4771216
35646 4771216 4912804 4966325 4699166 4486371 4701563 5035614 4960728 4531535 4194480 4057256
35636 4057256 3878881 3616808 3466453 3437555 3356573 3253275 3326404 3549062 3700202 3758004
35626 3758004 3861488 3915355 3690987 3347748 3362792 3815576 4202445 4147714 3859309 3639943
35616 3639943 3393792 2978406 2665579 2778457 3102977 3152974 2906078 2783439 2903860 2857063
35606 2857063 2381970 1868359 1891596 2470523 3081665 3317259 3268622 3254844 3389111 3517251
35596 3517251 3487587 3372515 3414133 3768341 4298018 4651972 4619727 4395599 4368463 4613678
$$ packed form
35665E888950o84779j66957L45400K08118j93117j18210K36057J31043l01411
35656E345094k08850M17790N47954k07530q59447n58854J35152K70150l6682p3561
35646D771216J41588N3521k67159k12795K15192L34051p4886m29193l37055j37224
35636D057256j78375k62073j50355k8898q0982j03298P3129K22658J51140N7802
35626C758004J03484N3867k24368l43239J5044M52784L86869n4731k88405k19366
35616C639943k46151m15386l12827J12878L24520M9997k46896j22639J20421m6797
35606B857063m75093n13611K3237N78927O11142K35594m8637j3778J34267J28140
35596C517251k9664j15072M1618L54208N29677L53954l2245k24128k7136K45215
$$ plain form
35586 4613678 4768356 4551719 4229136 4277835 4687742 4974692 4914693 4824524 4933466 4931617
35576 4931617 4509954 3980970 3861112 4071318 4115530 3931424 3939612 4213762 4229403 3652417
35566 3652417 2871502 2469603 2555627 2863315 3132661 3138076 2726887 2151299 2028611 2628893
35556 2628893 3477497 3969535 4070210 4070420 4001161 3759423 3551237 3674570 3990129 4099731
35546 4099731 3978498 3969281 4187865 4380083 4373888 4262576 4123574 3954322 3918648 4253281
35536 4253281 4844888 5255581 5269334 5116432 5098272 5291987 5663312 6137011 6497586 6562363
35526 6562363 6526145 6785021 7334500 7719657 7709308 7628835 7832441 8217399 8513760 8719441
35516 8719441 8928702 8988446 8694311 8206041 7944153 8087373 8378927 8434088 8124980 7670207
$$ packed form
35586D613678J54678k16637l22583M8699M09907K86950n9999r0169J08942j849
35576D931617m21663n28984j19858K10206M4212j84106Q188K74150J5641n76986
35566C652417p80915m01899Q6024L07688K69346N415m11189n75588j22688O00282
35556B628893Q48604M92038J00675K10o9259k41738k08186J23333L15559J09602
35546D099731j21233r217K18584J92218o195j11312j39002j69252l5674L34633
35536D253281N91607M10693J3753j52902j8160J93715L71325M73699L60575O4777
35526F562363l6218K58876N49479L85157j0349q0473K03606L84958K96361K05681
35516H719441K09261N9744k94135m88270k61888J43220K91554N5161l09108m54773
$$ plain form
35506 7670207 7376778 7253954 6952590 6242511 5447534 5104416 5224382 5284723 5015330 4751574
35496 4751574 4822829 5027029 5016300 4838792 4729941 4655586 4458278 4232457 4151919 4107303
35486 4107303 3931575 3837535 4171689 4794222 5160731 5051095 4816641 4835753 5085299 5344168
35476 5344168 5485401 5442327 5190294 4915956 4938743 5290300 5594122 5535434 5244131 5019849
35466 5019849 4874499 4607439 4219266 3959932 3954423 4010370 3882904 3588008 3345627 3275504
35456 3275504 3247010 3036426 2584784 2067935 1706858 1530813 1371925 1105163 822499 683601
35446 683601 631648 416025 -27304 -361690 -198135 386991 878432 887126 508578 83384
35436 83384 -180916 -252928 -170074 -58534 -82594 -206252 -190292 5679 72124 -150942 -317608
$$ packed form
35506G670207k93429j22824l01364p10079p94977l43118J19966O0341k69393k63756
35496D751574P1255K04200j0729j77508j08851p4355j97308k25821q0538m4616
35486D107303j75728r4040L34154O22533L66509j09636k34454J9112K49546K58869
35476E344168J41233m3074k52033k74338K2787L51557L03822n8688k91303k24282
35466E019849j45350k67060l88173k59334n509N5947j27466k94896k42381p0123
35456C275504k8494k10584m51642n16849l61077j76045j58888k66762k82664j38898
35446F83601n1953k15623m43329l34386J63555N85126M91441Q694l78548m25194
35436H3384k64300p2012Q2854J11540k4060j23658J5960J95971O6445k23066j66666
$$ plain form
35425 -317608 -106078 154044 -91427 -715010 -1030360 -808107 -551628 -661983 -944510 -1144079
35415 -1144079 -1356987 -1587550 -1455566 -781290 -22005 325423 387840 535945 702451 603561
35405 603561 376381 441325 858522 1295317 1543201 1656233 1674650 1604396 1579717 1675036
35395 1675036 1654857 1279196 759243 539207 706636 962594 1076651 1030484 833176 556195
35385 556195 430744 547645 601047 307896 -89592 -166913 17102 85260 15285 105160
35375 105160 375939 583121 759287 1151016 1638252 1828225 1743331 1786406 1975020 1889246
35365 1889246 1509251 1400208 1811951 2243657 2232277 1995559 1920471 1931942 1796393 1643804
35355 1643804 1762131 2150040 2593866 2955621 3197130 3414683 3967122 5160878 6660033
$$ packed form
35425c17608K11530K60122k45471o23583l15350K22253K56479j10355k82527j99569
35415a144079k12908k30563J31984O74276P59285L47428O2417J48105J66506r8890
35405F03561k27180O4944M17197M36795K47884J13032J8417p0254k4679R5319
35395A675036k0179l75661n19953k20036J67429K55958J14057m6167j97308k76981
35385E56195j25451J16901N3402k93151l97488p7321J84015O8158o9975Q9875
35375A05160K70779K07182J76166L91729M87236J89973q4894M3075J88614q5774
35365A889246l79995j09043M11743M31706j1380k36718p5088J1471j35549j52589
35355A643804J18327L87909M43826L61755K41509K17553N52439J193756J499155
$$ plain form
35346 6660033 7675930 7942300 8037896 8555910 9473809 10541752 11674098 12657026 13123583
35337 13123583 13236316 13778648 15098676 16561152 17548357 18358545 19491732 20686513 21445410
35328 21445410 21982119 22776565 23597916 23881390 23786011 23957034 24418527 24598342 24336011
35319 24336011 23971796 23494392 22532088 21264386 20446711 20325658 20301931 19890424 19302976
35310 19302976 18843724 18411069 17899617 17514155 17390606 17386225 17445162 17684665 17980668 18016491
35300 18016491 17889166 18081552 18667969 19171593 19406417 19786754 20527637 21223055 21570621
35291 21570621 21844602 22233389 22372019 22038507 21689896 21716194 21716008 21162434 20311337 19757331
35281 19757331 19484307 19072136 18523572 18148649 17865576 17346576 16677125 16138884 15487462
$$ packed form
35346F660033J015897K66370R5596N18014R17899J067943J132346R82928M66557
35337A3123583J12733N42332J320028J462476R87205Q10188J133187J194781P58897
35328B1445410N36709P94446Q21351K83474r5379J71023M61493J79815k62331
35319B4336011l64215m77404r62304j267702q17675j21053k3727m11507n87448
35310A9302976m59252m32655n11452l85462j23549m381N8937K39503K96003L5823
35300A8016491j27325J92386N86417N03624K34824L80337P40883O95418L47566
35291B1570621K73981L88787J38630l33512l48611K6298j86n53574q51097n54006
35281A9757331k73024m12171n48564l74923k83073n19000o69451n38241o51422
$$ plain form
35272 15487462 14247545 12698070 11741597 11659363 11739372 11356658 10720985 10234845 9765580
35263 9765580 9039778 8289331 7959470 8024206 8056406 7843723 7555222 7365483 7222541 6978467
35253 6978467 6549160 5976932 5472940 5303346 5471257 5613339 5406000 4999918 4840300
35244 4840300 5091802 5461520 5601105 5455159 5137473 4695885 4191625 3859446 3910449 4178782
35234 4178782 4224754 3891633 3549363 3619160 4023257 4327783 4312397 4123201 3912166 3644947
35224 3644947 3327622 3135763 3175249 3317429 3404538 3445314 3485348 3456385 3294171 3067170
35214 3067170 2872984 2743017 2733513 2930709 3254824 3441352 3339623 3062478 2759851 2474866
35204 2474866 2313811 2443604 2741022 2770831 2365366 1914697 1789576 1816653 1717224 1729177
$$ packed form
35272A5487462j239917j549475r56473q2234Q0009l82714o35673m86140m69265
35263I765580p25802p50447l29861O4736L2200k12683k88501j89739j42942k44074
35253F978467m29307n72228n03992j69594J67911J42082k07339m06082j59618
35244D840300K51502L69718J39585j45946l17686m41588n04260l32179N1003K68333
35234D178782M5972l33121l42270O9797M04097L04526j5386j89196k11035k67219
35224C644947l17325j91859L9486J42180Q7109M0776M0034k8963j62214k27001
35214C067170j94186j29967r504J97196L24115J86528j01729k77145l02627k84985
35204B474866j61055J29793K97418K9809m05465m50669j25121K7077r9429J1953
$$ plain form
35194 1729177 2242855 3018512 3378802 3149635 2851774 2903343 3137531 3218650 3078584 2795388
35184 2795388 2442383 2208571 2298282 2562730 2584120 2263890 1962776 1912061 1888653 1685085
35174 1685085 1505414 1605888 1871312 2055006 2163719 2306777 2419825 2438895 2500298 2651499
35164 2651499 2612963 2195280 1738577 1714960 2026639 2126088 1769858 1238001 814832 469723
35154 469723 138199 -44205 41419 280790 473459 550483 568208 616121 769642 1013827
35144 1013827 1218628 1318187 1458675 1786836 2160769 2315458 2273942 2305049 2473779 2559939
35134 2559939 2484792 2475731 2665134 2840613 2793527 2647160 2614766 2668247 2684611 2697023 2740929
35123 2740929 2679796 2496732 2534218 3035453 3608888 3642310 3200895 2975345 3251980 3482434
$$ packed form
35194A729177N13678P75657L60290k29167k97861N1569K34188Q1119j40066k83196
35184B795388l53005k33812Q9711K64448K1390l20230l01114n0715k3408k03568
35174A685085j79671J00474K65424J83694J08713J43058J13048J9070O1403J51201
35164B651499l8536m17683m56703k3617L11679R9449l56230n31857m23169l45109
35154D69723l31524j82404Q5624K39371J92669P7024J7725M7913J53521K44185
35144A013827K04801R9559J40488L28161L73933J54689m1516L1107J68730Q6160
35134B559939p5147r061J89403J75479m7086j46367l2394N3481J6364J2412M3906
35123B740929o1133j83064L7486N01235N73435L3422m41415k25550K76635K30454
$$ plain form
35113 3482434 3126118 2445431 2090263 2241211 2578686 2840437 2959890 2827269 2395700
35104 2395700 1965040 1914917 2154701 2241902 2046994 1867468 1851403 1804123 1695947 1837340
35094 1837340 2284294 2552303 2295128 1854399 1686255 1606607 1172669 570445 463836 1000202
35084 1000202 1579073 1704275 1531445 1404547 1338936 1226425 1162842 1257637 1380604 1377177
35074 1377177 1340252 1435751 1629660 1785661 1861952 1834823 1622728 1280681 1067293 1095275
35064 1095275 1112424 887403 629278 712359 1110015 1434188 1475364 1378226 1301225 1237957
35054 1237957 1229850 1436505 1848293 2164339 2142619 1933624 1892997 2134136 2424753 2524368
35044 2524368 2495507 2598510 2917379 3211200 3213807 2989513 2831017 2847715 2888212 2899777
$$ packed form
35113C482434l56316o80687l55168J50948L37475K61751J19453j32621m31569
35104B395700m30660n0123K39784Q7201j94908j79526j6065m7280j08176J41393
35094A837340M46954K68009k57175m40729j68144p9648m33938o02224j06609N36366
35084A000202N78871J25202j72830j26898o5611j12511o3583R4795J22967l427
35074A377177l6925R5499J93909J56001P6291k7129k12095l42047k13388K7982
35064A095275J7149k25021k58125Q3081L97656L24173M1176r7138p7001o3268
35054A237957q107K06655M11788L16046k1720k08995m0627K41139K90617R9615
35044B524368k8861J03003L18869K93821K607k24294j58496J6698M0497J1565
$$ plain form
35034 2899777 3064521 3417788 3621377 3405904 3035832 2986565 3275165 3480094 3379286 3184433
35024 3184433 3106547 3059546 2907505 2690564 2472137 2251127 2164496 2459227 3044347 3365148
35014 3365148 3036892 2407733 2150885 2409882 2704144 2657784 2454142 2454304 2662393 2799750
35004 2799750 2762333 2745420 2896985 3038591 2863614 2356121 1870923 1755441 1996634 2327095
34994 2327095 2586019 2820792 3065900 3211506 3153154 2945555 2743448 2676585 2796649 3012501
34984 3012501 3053074 2681013 2037246 1598443 1651454 1959426 2119390 2110946 2246045 2626096
34974 2626096 2916609 2745786 2166130 1605674 1418768 1560933 1702963 1628938 1471987 1504866
34964 1504866 1735879 1846787 1573972 1022826 524335 294853 328757 501823 650863 653263
$$ packed form
35034B899777J64744L53267K03589k15473l70072m9267K88600K04929j00808j94853
35024C184433p7886m7001j52041k16941k18427k21010q6631K94731N85120L20801
35014C365148l28256o29159k56848K58997K94262m6360k03642J62K08089J37357
35004B799750l7417j6913J51565J41606j74977n07493m85198j15482K41193L30461
34994B327095K58924K34773K45108J45606n8352k07599k02107o6863J20064K15852
34984C012501M0573l72061o43767m38803N3011L07972J59964q444J35099L80051
34974B626096K90513j70823n79656n60456j86906J42165J42030p4025j56951L2879
34964A504866K31013J10908k72815n51146m98491k29482L3904J73066J49040K400
$$ plain form
34954 653263 567296 607684 848874 1049742 925422 505679 73753 -146505 -82203 262067
34944 262067 731953 997522 884862 659156 683875 873245 838436 544892 404248 644370
34934 644370 1001025 1173273 1192708 1167332 1068206 1010428 1318611 1958801 2297769 1900246
34924 1900246 1264449 1206481 1698188 1934086 1509374 888401 579348 461291 245576 109091
34914 109091 396424 953372 1230141 994488 589168 452645 639242 878631 930214 785440
34904 785440 611541 576721 711157 904290 1034047 1104960 1264646 1660296 2220940 2596230
34894 2596230 2449415 1879736 1398630 1346529 1488401 1394628 1065379 861014 900843 925909
34884 925909 789622 684093 748070 819375 779545 818142 1096228 1411735 1478541 1333529
$$ packed form
34954F53263q5967M0388K41190K00868j24320m19743m31926k20258O4302L44270
34944B62067M69886K65569j12660k25706K4719J89370l4809k93544j40644K40122
34934F44370L56655J72248J9435k5376r9126n7778L08183O40190L38968l97523
34924A900246o35797n7968M91707K35898m24712o20973l09053j18057k15715j36485
34914A09091K87333N56948K76769k35653m05320j36523J86597K39389N1583j44774
34904G85440j73899l4820J34436J93133J29757P0913J59686L95650N60644L75290
34894B596230j46815n69679m81106n2101J41872r3773l29249k04365L9829K5066
34884I25909j36287j05529O3977P1305l9830L8597K78086L15507O6806j45012
$$ plain form
34874 1333529 1210613 1208713 1334867 1654790 2103273 2352045 2202581 1934436 1916501 2061214
34864 2061214 2077414 2089232 2477777 3166507 3625072 3650892 3614979 3785916 3926837 3804490
34854 3804490 3627988 3653483 3736257 3639632 3477425 3469379 3518148 3433034 3361105 3554072 3844492
34843 3844492 3816967 3453003 3152949 3090076 2991807 2687035 2451148 2565013 2854195 2982762
34833 2982762 2997942 3217534 3629009 3756270 3254349 2419487 1897973 1946169 2180363 2126010
34823 2126010 1849693 1840595 2287383 2726839 2578355 1880603 1247366 1108201 1252130 1232129
34813 1232129 999149 889898 1066035 1259523 1176049 932544 880014 1093289 1296878 1314892
34803 1314892 1332633 1573439 1917780 2058465 1923506 1720128 1609727 1555256 1475007 1339016
$$ packed form
34874A333529j22916j900J26154L19923M48483K48772j49464k68145j7935J44713
34864B061214J6200J1818L88545O88730M58565K5820l5913J70937J40921j22347
34854C804490j76502K5495Q2774r6625j62207q046M8769q5114p1929J92967K90420
34843C844492k7525l63964l00054o2873r8269l04772k35887J13865K89182J28567
34833B982762J5180K19592M11475J27261n01921q34862n21514M8196K34194n4353
34823B126010k76317r098M46788M39456j48484o97752o33237j39165J43929k0001
34813A232129k32980j09251J76137J93488q3474k43505n2530K13275K03589J8014
34803A314892J7741K40806L44341J40685j34959k03378j10401n4471q0249j35991
$$ plain form
34793 1339016 1106577 774888 515897 555015 855073 1106717 1095363 907872 730682 632718
34783 632718 602180 602328 534937 349790 225366 393921 748068 927558 865942 877386 1066553
34772 1066553 1092209 773088 480918 551386 722876 659124 659836 1202071 1996052 2225215
34762 2225215 1694464 1048731 780934 713808 657692 886884 1559468 2201715 2279597 1956702
34752 1956702 1815463 2041832 2320061 2406478 2401357 2463394 2551118 2495182 2194931 1771128
34742 1771128 1567750 1836180 2334530 2483390 2078835 1588146 1514502 1747636 1866717 1836670
34732 1836670 1957148 2232380 2272271 1878432 1345505 1055567 1058463 1177108 1284639 1333455
34722 1333455 1295486 1218563 1220938 1327499 1411291 1358181 1174349 888500 507691 158677
$$ packed form
34793A339016k32439l31689k58991L9118L00058K51644j1354j87491j77190r7964
34783F32718l0538J48o7391j85147j24424J68555L54147J79490o1616J1444J89167
34772A066553K5656l19121k92170P0468J71490o3752P12N42235P93981K29163
34762B225215n30751o45733k67797o7126n6116K29192O72584O42247P7882l22895
34752A956702j41239K26369K78229Q6417n121O2037Q7724n5936l00251m23803
34742A771128k03378K68430M98350J48860m04555m90689p3644K33134J19081l0047
34732A836670J20478K75232L9891l93839n32927k89938K896J18645J07531M8816
34722A333455l7969p6923K375J06561Q3792n3110j83832k85849l80809l49014
$$ plain form
34712 158677 107548 472546 1001884 1302726 1261454 1090510 970651 829594 560308 306216
34702 306216 339179 684280 1059179 1238930 1302323 1401913 1465829 1339754 1118127 1071521
34692 1071521 1263503 1488448 1603616 1667760 1710323 1644995 1505246 1477802 1561557 1489425
34682 1489425 1193302 1054904 1403781 1998374 2341848 2340587 2286328 2310101 2267677 2148928
34672 2148928 2196292 2516031 2873048 2996092 2877842 2691069 2590339 2648333 2812790 2899764
34662 2899764 2812669 2771358 3102216 3774553 4375343 4592439 4505972 4366186 4329487 4467960
34652 4467960 4764052 4993450 4885350 4537181 4402621 4688700 5023122 4956226 4573277 4320675
34642 4320675 4375213 4500309 4468187 4327343 4221033 4165603 4084135 3934040 3752573 3634801
$$ packed form
34712A58677n1129L64998N29338L00842m1272j70944j19859j41057k69286k54092
34702C06216L2963L45101L74899J79751O3393R9590O3916j26075k21627m6606
34692A071521J91982K24945J15168O4144M2563o5328j39749k7444Q3755p2132
34682A489425k96123j38398L48877N94593L43474j261n4259K3773m2424j18749
34672B148928M7364L19739L57017J23044j18250j86773j00730N7994J64457Q6974
34662B899764q7095m1311L30858O72337O00790K17096q6467j39786l6699J38473
34652D467960K96092K29398j08100l48169j34560K86079L34422o6896l82949k52602
34642D320675N4538J25096l2122j40844j06310n5430q1468j50095j81467j17772
$$ plain form
34632 3634801 3647675 3716101 3676627 3529626 3516741 3791533 4119735 4129174 3818471 3581023
34622 3581023 3698911 4034246 4292277 4382632 4395649 4396336 4426231 4610736 5060203 5669372
34612 5669372 6171352 6419839 6500349 6531493 6482006 6265656 5929786 5639993 5502116 5475629
34602 5475629 5446122 5322048 5081827 4781893 4487977 4155503 3664310 3068201 2692792 2785335
34592 2785335 3129263 3261347 3070733 2888492 2916162 2902437 2573219 2076343 1721791 1522652
34582 1522652 1320186 1176462 1271857 1526816 1700879 1799443 2000684 2215676 2137502 1764213
34572 1764213 1461572 1406054 1357295 1138073 971213 1116818 1471510 1770637 1963060 2160143
34562 2160143 2388802 2588064 2716637 2743697 2680225 2666151 2803798 2889634 2648481 2286378
$$ packed form
34632C634801J2874O8426l9474j47001j2885K74792L28202R439l10703k37448
34622C581023J17888L35335K58031R0355J3017O87K9895J84505M49467O09169
34612E669372N01980K48487Q0510L1144m9487k16350l35870k89793j37877k6487
34602E475629k9507j24074k40221k99934k93916l32474m91193n96109l75409R2543
34592B785335L43928J32084j90614j82241K7670j3725l29218m96876l54552j99139
34582A522652k02466j43724R5395K54959J74063R8564K01241K14992p8174l73289
34572A764213l02641n5518m8759k19222j66860J45605L54692K99127J92423J97083
34562B160143K28659J99262J28573K7060o3472j4074J37647Q5836k41153l62103
$$ plain form
34552 2286378 2353565 2880067 3162689 2761869 2229717 2340353 2970824 3355978 3210195 2915431
34542 2915431 2680053 2231534 1494117 957575 1040993 1476041 1665930 1449950 1227684 1406092
34532 1406092 1918570 2307200 2226040 1823994 1541093 1530323 1516749 1349024 1360091 1847558
34522 1847558 2459932 2576076 2171346 1797748 1730904 1677057 1422506 1243189 1421478 1759417
34512 1759417 1869667 1689137 1458698 1381875 1476280 1601930 1552635 1314178 1234954 1624219
34502 1624219 2158407 2127045 1424812 843197 1084424 1868453 2382019 2317001 2062189 2055404
34492 2055404 2328021 2604642 2574401 2147464 1637951 1544343 1972107 2487941 2733500 2876151
34482 2876151 3161904 3365388 3138291 2666044 2454708 2583188 2692703 2679747 2849169 3284930
$$ packed form
34552B286378O7187N26502K82622m00820n32152J10636O30471L85154j45783k94764
34542B915431k35378m48519p37417n36542Q3418M35048J89889k15980k22266J78408
34532A406092N12478L88630q1160m02046k82901j0770j3574j67725J1067M87467
34522A847558O12374J16144m04730l73598o6844n3847k54551j79317J78289L37939
34512A759417J10250j80530k30439p6823R4405J25650m9295k38457p9224L89265
34502A624219N34188l1362p02233n81615K41227P84029N13566o5018k54812o785
34492B055404K72617K76621l0241m26937n09513r3608M27764N15834K45559J42651
34482B876151K85753K03484k27097m72247k11336J28480J09515j2956J69422M35761
$$ plain form
34472 3284930 3572554 3371795 2908513 2660392 2792425 3087892 3245835 3098938 2703857
34463 2703857 2341709 2297681 2562512 2876829 3090324 3298178 3590077 3871573 4018198 4049483
34453 4049483 4080522 4220231 4528098 4927720 5179902 5121507 4916386 4876169 5059050 5259805
34443 5259805 5345140 5331035 5185544 4905790 4784577 5193916 6026005 6749821 7130647 7460526
34433 7460526 7922534 8232821 8212202 8230493 8652919 9241606 9607819 9928298 10624665 11558209
34423 11558209 12203718 12549721 13156875 14238902 15300833 15898109 16233324 16715127 17344206
34414 17344206 17858184 18168651 18343914 18407560 18435502 18624845 18985532 19168524 18885319 18317778
34404 18317778 17836476 17514391 17247721 17159511 17443749 17890774 18038169 17843706 17780924 18134368
$$ packed form
34472C284930K87624k00759m63282k48121J32033K95467J57943j46897l95081
34463B703857l62148m4028K64831L14317K13495K07854K91899K81496J46625L1285
34453D049483L1039J39709L07867L99622K52182n8395k05121m0217J82881K00755
34443E259805Q5335j4105j45491k79754j21213M09339Q32089P23816L80826L29879
34433G460526M62008L10287k0619J8291M22426N88687L66213L20479O96367R33544
34423A1558209O45509L46003O07154J082027J061931N97276L35215M81803O29079
34414A7344206N13978L10467J75263O3646K7942J89343L60687J82992k83205n67541
34404A8317778m81302l22085k66670q8210K84238M47025J47395j94463o2782L53444
$$ plain form
34394 18134368 18591001 18752301 18726906 18910201 19378086 19814723 19949284 19793298 19484328
34385 19484328 19135417 18843424 18632013 18333331 17691987 16673598 15578400 14777847 14379551
34376 14379551 14181080 13914897 13508434 13095948 12760060 12310906 11462731 10275042 9235092
34367 9235092 8726376 8528969 8072910 7141759 6087587 5351261 5033132 5000281 5132717
34358 5132717 5282179 5201852 4771197 4204785 3830455 3704517 3616368 3425819 3208604 3074908
34348 3074908 3016568 2957783 2816512 2501013 2002038 1533089 1414303 1703196 2047042 2041487
34338 2041487 1696510 1416296 1507859 1834480 2031131 1966440 1828795 1754565 1583440 1143332
34328 1143332 633637 457349 691247 1002217 1141450 1210309 1292080 1169769 728645 371236
$$ packed form
34394A8134368M56633J61300k5395J83295M67885M36637J34561j55986l08970
34385A9484328l48911k91993k11411k98682o41344j018389j095198q00553l98296
34376A4379551j98471k66183m06463m12486l35888m49154q48175j187689j039950
34367I235092n08716j97407m56059r31151j054172p36326l18129l2851J32436
34358E132717J49462q0327m30655n66412l74330j25938q8149j90549k17215j33696
34348C074908n8340n8785j41271l15499m98975m68949j18786K88893L43846n555
34338B041487l44977k80214R1563L26621J96651o4691j37645p4230j71125m40108
34328A143332n09695j76288K33898L10970J39233O8859Q1771j22311m41124l57409
$$ plain form
34318 371236 579276 1169452 1465233 1233618 970071 1098646 1347365 1229603 804598 552763
34308 552763 670835 891386 953767 902956 882158 910902 957777 1027899 1081683 1020377 848120
34297 848120 735130 825693 1051951 1209106 1170526 981663 781855 679762 692157 774630
34287 774630 888650 1008162 1070324 999861 824662 688626 675788 688217 589052 408625
34277 408625 300733 335847 451716 580128 706994 830064 975944 1232203 1622610 1966975
34267 1966975 2031017 1832256 1631702 1597290 1670899 1824337 2195801 2795487 3286357 3343491
34257 3343491 3147987 3223027 3749427 4311111 4435999 4178656 3982399 4095391 4358970 4564385
34247 4564385 4788731 5236596 5848389 6256564 6198930 5871651 5728211 5920322 6090364 5832731
$$ packed form
34318C71236K08040N90176K95781k31615k63547J28575K48719j17762m25005k51835
34308E52763J18072K20551O2381n0811k0798K8744M6875P0122N3784o1306j72257
34297H48120j12990R0563K26258J57155l8580j88863j99808j02093J2395Q2473
34287G74630J14020J19512O2162p0463j75199j36036j2838J2429r9165j80427
34277D08625j07892L5114J15869J28412J26866J23070J45880K56259L90407L44365
34267A966975O4042j98761k00554l4412P3609J53438L71464N99686M90870N7134
34257C343491j95504P5040N26400N61684J24888k57343j96257J12992K63579K05415
34247D564385K24346M47865O11793M08175n7634l27279j43440J92111J70042k57633
$$ plain form
34237 5832731 5252977 4866585 4954894 5257075 5390088 5333862 5288331 5236635 4982955 4577595
34227 4577595 4343448 4389153 4420623 4221858 4041500 4220361 4632354 4843006 4743731 4674577
34217 4674577 4888186 5207498 5327625 5217069 5075742 5058333 5165831 5296536 5323956 5236697
34207 5236697 5238578 5552694 6090014 6523262 6763597 7107617 7755227 8438179 8780159 8832207
34197 8832207 8942633 9213704 9434916 9546032 9827221 10505106 11391833 12082461 12428408
34188 12428408 12709500 13350859 14499587 15893075 17184722 18372710 19776032 21592835
34180 21592835 23718678 26071432 28760929 31712166 34483545 36876690 39435713 42749380
34172 42749380 46378740 49151888 50587644 51334759 51959876 51999270 50711972 48245193 45404586
$$ packed form
34237E832731n79754l86392Q8309L02181J33013n6226m5531n1696k53680m05360
34227D577595k34147M5705L1470j98765j80358J78861M11993K10652r9275o9154
34217D674577K13609L19312J20127j10556j41327j7409J07498J30705K7420q7259
34207E236697J881L14116N37320M33248K40335L44020O47610O82952L41980N2048
34197H832207J10426K71071K21212J11116K81189O77885Q86727O90628L45947
34188A2428408K81092O41359J148728J393488J291647J187988J403322J816803
34180B1592835K125843K352754K689497K951237K771379K393145K559023L313667
34172D2749380L629360K773148J435756P47115O25117L9394j287298k466779k840607
$$ plain form
34163 45404586 42565578 39476736 36031378 32597872 29508492 26716330 24094180 21686628
34155 21686628 19525297 17519983 15678314 14152438 12918235 11658057 10138983 8535014
34147 8535014 7231237 6436298 6064365 5839666 5444671 4743335 3951985 3432348 3243230
34138 3243230 3072713 2684545 2221078 1952435 1932077 2040222 2170238 2208578 2020007 1645815
34128 1645815 1347726 1246664 1084585 600856 13483 -181534 145077 582296 656310 256856
34118 256856 -408511 -1040197 -1381690 -1354642 -1160586 -1114698 -1324068 -1633880 -1867589 -1948146
34108 -1948146 -1802458 -1386369 -861189 -525431 -485077 -583102 -718302 -989610 -1407777 -1727443
34098 -1727443 -1767048 -1683025 -1699855 -1755425 -1665441 -1461472 -1266711 -996415 -555139 -226718
$$ packed form
34163D5404586k839008l088842l445358l433506l089380k792162k622150k407552
34155B1686628k161331k005314j841669j525876j234203j260178j519074j603969
34147H535014j303777p94939l71933k24699l94995p01336p91350n19637j89118
34138C243230j70517l88168m63467k68643k0358J08145J30016L8340j88571l74192
34128A645815k98089j01062j62079m83729n87373j95017L26611M37219P4014l99454
34118B56856o65367o31686l41493K7048J94056M5888k09370l09812k33709q0557
34108a948146J45688M16089N25180L35758M0354r8025j35200k71308m18167l19666
34098a727443l9605Q4023j6830n5570Q9984K03969J94761K70296M41276L28421
$$ plain form
34088 -226718 -409361 -939580 -1159578 -821257 -483395 -732787 -1386462 -1838569 -1897016 -1804879
34078 -1804879 -1623379 -1170552 -596505 -460306 -992258 -1670673 -1834369 -1454976 -1013118
34069 -1013118 -835719 -897045 -1114909 -1433967 -1636000 -1458830 -1004443 -727365 -888553 -1267826
34059 -1267826 -1530785 -1602236 -1516026 -1219572 -827935 -795047 -1390150 -2138632 -2290380 -1867605
34049 -1867605 -1724234 -2366414 -3196204 -3315289 -2748514 -2363339 -2689147 -3315611 -3540128
34040 -3540128 -3214255 -2755040 -2576922 -2737798 -3012346 -3113310 -2881451 -2402190 -1956875
34031 -1956875 -1806592 -2005872 -2401334 -2761142 -2927327 -2924402 -2923890 -3040720 -3188922 -3221414
34021 -3221414 -3174876 -3249395 -3539238 -3889272 -4037181 -3847663 -3457348 -3248903 -3546084 -4184685
$$ packed form
34088b26718j82643n30219k19998L38321L37862k49392o53675m52107n8447R2137
34078a804879J81500M52827N74047J36199n31952o78415j63696L79393M41858
34069a013118J77399o1326k17864l19058k02033J77170M54387K77078j61188l79273
34059a267826k62959p1451Q6210K96454L91637L2888n95103p48482j51748M22775
34049a867605J43371o42180q29790j19085N66775L85175l25808o26464k24517
34040c540128L25873M59215J78118j60876k74548j00964K31859M79261M45315
34031a956875J50283j99280l95462l59808j66185K925N12j16830j48202l2492
34021c221414M6538p4519k89843l50034j47909J89518L90315K08445k97181o38601
$$ plain form
34011 -4184685 -4545657 -4261986 -3748842 -3691790 -4119508 -4436389 -4351088 -4213608 -4289092 -4287191
34001 -4287191 -3951559 -3607967 -3659268 -3930218 -4039615 -4108162 -4500335 -5070009 -5305658 -5155121
33991 -5155121 -5081469 -5267036 -5351731 -5081957 -4694440 -4495402 -4525087 -4788492 -5333838 -5907765
33981 -5907765 -6025511 -5659291 -5414952 -5715568 -6221652 -6404022 -6291285 -6238804 -6314153 -6395681
33971 -6395681 -6609529 -7143886 -7791103 -8181175 -8378219 -8758142 -9340458 -9742633 -9840659 -9993368
33961 -9993368 -10466941 -11050406 -11461877 -11815512 -12414007 -13271994 -14106726 -14720644 -15186737
33952 -15186737 -15656661 -16122624 -16431562 -16502529 -16457659 -16469706 -16516584 -16424118 -16160558 -15887155
33942 -15887155 -15624001 -15085770 -14037822 -12648319 -11270436 -10004645 -8696485 -7251356
$$ packed form
34011d184685l60972K83671N13144N7052m27718l16881Q5301J37480p5484J901
34001d287191L35632L43592n1301k70950j09397o8547l92173n69674k35649J50537
33991e155121P3652j85567q4695K69774L87517J99038k9685k63405n45346n73927
33981e907765j17746L66220K44339l00616n06084j82370J12737N2481p5349q1528
33971f395681k13848n34357o47217l90072j97044l79923n82316m02175r8026j52709
33961i993368m73573n83465m11471l53635n98495q57987q34732o13918m66093
33952a5186737m69924m65963l08938p0967M4870j2047m6878R2466K63560K73403
33942a5887155K63154N38231J047948J389503J377883J265791J308160J445129
$$ plain form
33934 -7251356 -5720246 -4171963 -2706662 -1494677 -571794 289936 1260117 2130879 2610579
33925 2610579 2811980 3107435 3581232 3985176 4192641 4338758 4536998 4807812 5244394
33916 5244394 5857153 6287955 6128771 5549792 5153698 5152536 5172766 4964634 4769735 4801916
33906 4801916 4885318 4858722 4850339 4874378 4653034 4169714 3893295 4050410 4183096 3926842
33896 3926842 3722527 4095170 4625883 4441995 3537991 2797981 2721794 2898622 2867134 2776977
33886 2776977 2917961 3182397 3360464 3533748 3803836 3958387 3776622 3439589 3293120
33877 3293120 3349421 3334664 3151665 3009055 3076990 3228907 3219481 3030210 2925124 3113344
33867 3113344 3415932 3423620 3028097 2596862 2481113 2574962 2620595 2735555 3214695 3874918
$$ packed form
33934g251356J531110J548283J465301J211985R22883Q61730R70181Q70762M79700
33925B610579K01401K95455M73797M03944K07465J46117J98240K70814M36582
33916E244394O12759M30802j59184n78979l96094j162K0230k08132j94899L2181
33906D801916Q3402k6596q383K4039k21344m83320k76419J57115J32686k56254
33896C926842k04315L72643N30713j83888r04004p40010p6187J76828l1488r0157
33886B776977J40984K64436J78067J73284K70088J54551j81765l37033j46469
33877C293120N6301j4757j82999j42610O7935J51917r426j89271j05086J88220
33867C113344L02588P688l95523m31235j15749R3849M5633J14960M79140O60223
$$ plain form
33857 3874918 4076457 3523918 2675723 2174649 2156794 2311640 2379336 2361764 2382630 2514078
33847 2514078 2672685 2641591 2329378 2003945 2044649 2433077 2751828 2740712 2552902 2375369
33837 2375369 2150060 1843420 1647615 1679095 1792062 1944413 2396598 3187364 3742438 3508872
33827 3508872 2798874 2471510 2824283 3305595 3360077 3055188 2720025 2426055 2107168 1854990
33817 1854990 1755466 1641431 1347396 1094159 1271179 1837582 2268144 2222691 2015802 2185256
33807 2185256 2727777 3072671 2846205 2357353 2132505 2202763 2178032 1926575 1789232 2052256
33797 2052256 2548447 2929076 3044270 2884587 2444073 1891361 1620199 1823847 2206382
33788 2206382 2409279 2523109 2825450 3197262 3244191 2918521 2575129 2424820 2369777 2395201
$$ packed form
33857C874918K01539n52539q48195n01074j7855J54846O7696j7572K0866J31448
33847B514078J58607l1094l12213l25433M0704L88428L18751j1116j87810j77533
33837B375369k25309l06640j95805L1480J12967J52351M52185P90766N55074k33566
33827C508872p09998l27364L52773M81312N4482l04889l35163k93970l18887k52178
33817A854990r9524j14035k94035k53237J77020N66403M30562m5453k06889J69454
33807B185256N42521L44894k26466m88852k24848P0258k4731k51457j37343K63024
33797B052256M96191L80629J15194j59683m40514n52712k71162K03648L82535
33788B206382K02897J13830L02341L71812M6929l25670l43392j50309n5043K5424
$$ plain form
33778 2395201 2642027 2981429 2988513 2542718 2052142 1857190 1791979 1594262 1376242 1359625
33768 1359625 1456945 1478622 1507720 1709476 1979616 2132265 2235594 2407922 2499450 2376079
33758 2376079 2296279 2524069 2755446 2509354 1994358 1932017 2469683 2933817 2850042 2569499
33748 2569499 2571953 2744677 2800416 2901624 3291520 3651738 3459541 2827392 2417467 2579590
33738 2579590 3072283 3596509 4083462 4406898 4329058 3915695 3607895 3672173 3881158 3921702
33728 3921702 3844565 3913167 4221030 4625453 4884265 4767519 4271916 3819268 3936595 4566842
33718 4566842 5002510 4740704 4119260 3811721 3958300 4181138 4272937 4408296 4694082 4925790
33708 4925790 4897128 4676883 4475047 4415874 4490645 4579861 4524234 4334773 4285804 4592030
$$ packed form
33778B395201K46826L39402P084m45795m90576j94952o5211j97717k18020j6617
33768A359625R7320K1677K9098K01756K70140J52649J03329J72328R1528j23371
33758B376079p9800K27790K31377k46092n14996o2341N37666M64134q3775k80543
33748B569499K454J72724N5739J01208L89896L60218j92197o32149m09925J62123
33738B579590M92693N24226M86953L23436p7840m13363l07800O4278K08985M0544
33728C921702p7137O8602L07863M04423K58812j16746m95603m52648J17327O30247
33718D566842M35668k61806o21444l07539J46579K22838R1799J35359K85786K31708
33708D925790k8662k20245k01836n9173P4771Q9216n5627j89461m8969L06226
$$ plain form
33698 4592030 5044282 5223891 5057845 4872592 4879341 4920049 4804613 4597116 4435157 4332321
33688 4332321 4310209 4477072 4802931 5038541 5028371 4886650 4703429 4350724 3816203 3442711
33678 3442711 3484554 3638311 3434190 2970721 2794043 3059247 3298557 3147760 2851133 2791114
33668 2791114 2886556 2820515 2628123 2641365 2928346 3176958 3175514 3077015 3063942 3017891 2714074
33657 2714074 2181410 1687823 1476360 1661780 2243391 2996282 3447338 3248110 2591067
33648 2591067 2018335 1788500 1680178 1458168 1207150 1056398 908176 706940 692181 1018130
33638 1018130 1327822 1145035 598806 301165 497031 786297 784245 625208 624125 807411
33628 807411 1016932 1184915 1269487 1175059 968654 934611 1183495 1444244 1478276 1439295
$$ packed form
33698D592030M52252J79609j66046j85253O749M0708j15436k07497j61959j02836
33688D332321k2112J66863L25859K35610j0170j41721j83221l52705n34521l73492
33678C442711M1843J53757k04121m63469j76678K65204K39310j50797k96627o0019
33668B791114R5442o6041j92392J3242K86981K48612j444r8499j3073m6051l03817
33657B714074n32664m93587k11463J85420N81611P52891M51056j99228o57043
33648B591067n72732k29835j08322k22010k51018j50752j48222k01236j4759L25949
33638A018130L09692j82787n46229k97641J95866K89266k052j59037j083J83286
33628H07411K09521J67983Q4572r4428k06405l4043K48884K60749L4032l8981
$$ plain form
33618 1439295 1545814 1666181 1577542 1402913 1383968 1399150 1163744 808462 779031 1164568
33608 1164568 1580103 1773218 1910331 2136494 2259802 2083150 1733221 1429516 1166125
33599 1166125 852225 599388 656573 1142553 1955791 2844478 3491885 3675918 3446629 3054595
33589 3054595 2678356 2360300 2200745 2373396 2860708 3377107 3656210 3645819 3372986 2874311
33579 2874311 2386018 2334473 2895336 3698399 4167820 4071175 3617352 3158201 2941382 3014212
33569 3014212 3191880 3208051 3023396 2875690 2925273 3027713 3012568 2993688 3168300 3447341
33559 3447341 3552592 3414722 3236031 3201191 3346131 3668786 4123599 4504378 4573964 4370818
33549 4370818 4205313 4294286 4549955 4769840 4875131 4902994 4917909 5019733 5316896 5786325
$$ packed form
33618A439295J06519J20367q8639j74629j8945J5182k35406l55282k9431L85537
33608A164568M15535J93115J37113K26163J23308j76652l49929l03705k63391
33599A166125l13900k52837N7185M85980Q13238Q88687O47407J84033k29289l92034
33589C054595l76239l18056j59555J72651M87312N16399K79103j0391k72833m98675
33579B874311m88293n1545N60863Q03063M69421r6645m53823m59151k16819P2830
33569C014212J77668J6171j84655j47706M9583J02440j5145j8880J74612K79041
33559C447341J05251j37870j78691l4840J44940L22655M54813L80779O9586k03146
33549D370818j65505Q8973K55669K19885J05291K7863J4915J01824K97163M69429
$$ plain form
33539 5786325 6235758 6493999 6589010 6672929 6822648 6984831 7083598 7111651 7120899 7170286 7279083
33528 7279083 7393045 7403189 7252648 7048776 7020178 7303340 7787917 8235084 8538405 8783242
33518 8783242 9048900 9284523 9438927 9570379 9709686 9743622 9603483 9471489 9594046 9940479
33508 9940479 10249250 10371863 10354985 10217415 9894992 9404217 8815428 8084913 7209104 6517320
33498 6517320 6394433 6623664 6462944 5604637 4640527 4246514 4281321 4129297 3649584 3247216
33488 3247216 3115810 2952272 2505314 2003885 1879702 2289051 2998165 3578369 3689700
33479 3689700 3325328 2781726 2294991 1812695 1250372 754860 434859 21694 -806429
33470 -806429 -1848420 -2550692 -2758011 -2889244 -3304114 -3890996 -4408626 -4865533 -5358300
$$ packed form
33539E786325M49433K58241R5011Q3919J49719J62183R8767K8053R248M9387J08797
33528G279083J13962J0144j50541k03872k8598K83162M84577M47167L03321K44837
33518H783242K65658K35623J54404J31452J39307L3936j40139j31994J22557L46433
33508I940479L08771J22613j6878j37570l22423m90775n88789p30515q75809o91784
33498F517320j22887K29231j60720q58307r64110l94013L4807j52024m79713m02368
33488C247216j31406j63538m46958n01429j24183M09349P09114N80204J11331
33479C689700l64372n43602m86735m82296n62323m95512l20001m13165q28123
33470h06429j041991p02272k07319j31233m14870n86882n17630m56907m92767
$$ plain form
33461 -5358300 -5818128 -6133528 -6328447 -6462272 -6539951 -6640739 -6917315 -7320531 -7531136 -7331706
33451 -7331706 -6880476 -6473460 -6201909 -5987146 -5788610 -5621172 -5502120 -5512816 -5770012 -6205841
33441 -6205841 -6524579 -6520425 -6306145 -6099750 -5943874 -5802465 -5781024 -6010663 -6359570 -6472690
33431 -6472690 -6148387 -5576403 -5157897 -5112063 -5272652 -5294957 -5064915 -4804507 -4711529 -4664648
33421 -4664648 -4465966 -4204386 -4083670 -4022177 -3818544 -3650161 -3911820 -4491049 -4733424 -4342723
33411 -4342723 -3826842 -3741206 -3939248 -3969321 -3811136 -3722438 -3666941 -3461952 -3302807 -3543614
33401 -3543614 -4015378 -4137153 -3763905 -3413698 -3517661 -3883024 -4084597 -4017377 -3832464 -3609071
33391 -3609071 -3338680 -3066735 -2863013 -2759095 -2806283 -3048156 -3357349 -3471298 -3293912 -3018627
$$ packed form
33461e358300m59828l15400j94919j33825p7679j00788k76576m03216k10605J99430
33451g331706M51230M07016K71551K14763J98536J67438J19052j0696k57196m35829
33441f205841l18738M154K14280K06395J55876J41409K1441k29639l48907j13120
33431f472690L24303N71984M18506M5834j60589k2305K30042K60408R2978M6881
33421d664648J98682K61580J20716O1493K03633J68383k61659n79229k42375L90701
33411d342723N15881Q5636j98042l0073J58185Q8698N5497K04989J59145k40807
33401c543614m71764j21775L73248L50207j03963l65363k01573O7220J84913K23393
33391c609071K70391K71945K03722J03918m7188k41873l09193j13949J77386K75285
$$ plain form
33381 -3018627 -2867004 -2851392 -2876755 -2914176 -2955153 -2923312 -2762237 -2536614 -2355918 -2262426
33371 -2262426 -2254372 -2340654 -2505248 -2673829 -2765323 -2745706 -2638898 -2547836 -2633196 -2959024 -3362434
33360 -3362434 -3588897 -3564223 -3429872 -3313348 -3181335 -2932859 -2539180 -2087404 -1759119 -1715006
33350 -1715006 -1893595 -2002769 -1868486 -1713573 -1878863 -2314839 -2596227 -2445770 -2013287
33341 -2013287 -1632437 -1551848 -1910879 -2664594 -3445810 -3803936 -3708625 -3535692 -3442632 -3132082
33331 -3132082 -2466998 -1921846 -1994916 -2432672 -2556510 -2256726 -2104099 -2402045 -2678232 -2407345
33321 -2407345 -1822507 -1571219 -1787066 -2001023 -1951670 -1973006 -2363756 -2781765 -2681060 -2151459
33311 -2151459 -1835020 -2006153 -2223243 -2068129 -1772711 -1756324 -1898706 -1773597 -1416304 -1302798
$$ packed form
33381c018627J51623J5612k5363l7421m0977L1841J61075K25623J80696R3492
33371b262426Q054q6282j64594j68581r1494J9617J06808R1062q5360l25828m03410
33360c362434k26463K4674J34351J16524J32013K48476L93679M51776L28285M4113
33350a715006j78589j09174J34283J54913j65290m35976k81388J50457M32483
33341b013287L80850Q0589l59031p53715p81216l58126R5311J72933R3060L10550
33331c132082O65084N45152p3070m37756j23838K99784J52627k97946k76187K70887
33321b407345N84838K51288k15847k13957M9353k1336l90750m18009J00705N29601
33311b151459L16439j71133k17090J55114K95418J6387j42382J25109L57293J13506
$$ plain form
33301 -1302798 -1584230 -1870640 -1865157 -1723653 -1633464 -1522806 -1422413 -1630071 -2163269 -2475859
33291 -2475859 -2165529 -1618241 -1444624 -1558917 -1409822 -948698 -696248 -853174 -1015961
33282 -1015961 -935072 -939334 -1302298 -1694724 -1672736 -1350688 -1168690 -1246170 -1380019 -1501115
33272 -1501115 -1711428 -1968005 -2131803 -2286732 -2616210 -2949133 -2829977 -2159124 -1427042
33263 -1427042 -1139471 -1279898 -1526238 -1736211 -1948711 -2089449 -2008154 -1770036 -1632236 -1695375
33253 -1695375 -1787564 -1745180 -1631895 -1607487 -1717478 -1883843 -1992997 -1943926 -1736655 -1568722
33243 -1568722 -1688974 -2054743 -2286228 -2107455 -1696892 -1411625 -1287131 -1083539 -784206
33234 -784206 -709994 -1022019 -1393651 -1409205 -1127244 -985518 -1201439 -1522176 -1614387 -1493717
$$ packed form
33301a302798k81432k86410N483J41504R0189J10658J00393k07658n33198l12590
33291b475859L10330N47288J73617j14293J49095M61124K52450j56926j62787
33282a015961Q0889m262l62964l92426K1988L22048J81998p7480j33849j21096
33272a501115k10313k56577j63798j54929l29478l32923J19156O70853P32082
33263a427042K87571j40427k46340k09973k12500j40738Q1295K38118J37800o3139
33253a695375r2189M2384J13285K4408j09991j66365j09154M9071K07271J67933
33243a568722j20252l65769k31485J78773M10563K85267J24494K03592K99333
33234g84206P4212l12025l71632j5554K81961J41726k15921l20737r2211J20670
$$ plain form
33224 -1493717 -1441045 -1604920 -1832910 -1883699 -1707403 -1482739 -1416550 -1542314 -1720976 -1823457
33214 -1823457 -1873777 -1977338 -2134180 -2208479 -2126590 -2032680 -2138461 -2421397 -2592386 -2434040
33204 -2434040 -2090960 -1917883 -2070071 -2351012 -2466605 -2330247 -2095795 -1977118 -2063417 -2237258
33194 -2237258 -2260278 -2025440 -1723743 -1638425 -1769230 -1834943 -1692322 -1532050 -1539167 -1593776
33184 -1593776 -1526374 -1472902 -1669309 -1994442 -2050652 -1702557 -1248761 -1013826 -1015732 -1091613
33174 -1091613 -1124632 -1077899 -1000228 -1046212 -1300320 -1575181 -1628787 -1585604 -1814266 -2313878
33164 -2313878 -2598971 -2379570 -1995591 -1893827 -1985027 -1888914 -1591632 -1427839 -1505930 -1576737
33154 -1576737 -1496450 -1452789 -1619231 -1852626 -1881702 -1643666 -1330207 -1190940 -1330876 -1613814
$$ packed form
33224a493717N2672j63875k27990n0789J76296K24664O6189j25764j78662j02481
33214a823457n0320j03561j56842p4299Q1889R3910j05781k82936j70989J58346
33204b434040L43080J73077j52188k80941j15593J36358K34452J18677q6299j73841
33194b237258k3020K34838L01697Q5318j30805o5713J42621J60272p117n4609
33184a593776O7402N3472j96407l25133n6210L48095M53796K34935j906p5881
33174a091613l3019M6733P7671m5984k54108k74861n3606M3183k28662m99612
33164b313878k85093K19401L83979J01764r1200R6113K97282J63793p8091p0807
33154a576737Q0287M3661j66442k33395k9076K38036L13459J39267j39936k82938
$$ plain form
33144 -1613814 -1755859 -1601182 -1295093 -1105605 -1120225 -1215521 -1254472 -1179546 -974809 -695927
33134 -695927 -503980 -525026 -705831 -922762 -1149431 -1364993 -1412007 -1183112 -889881 -883565
33124 -883565 -1207555 -1565929 -1742153 -1795511 -1813098 -1747399 -1596439 -1489406 -1452796 -1311021
33114 -1311021 -986730 -710189 -724245 -909802 -921834 -638471 -281106 -100439 -110431 -162676
33104 -162676 -145877 -30576 206465 588805 1059311 1481822 1793185 2097914 2507982 2928503
33094 2928503 3157663 3189712 3200987 3181993 2858504 2146683 1421674 1063912 948407 708263
33084 708263 331049 100878 55014 -61944 -321675 -526322 -625102 -764944 -852646 -563065
33074 -563065 35595 349637 39202 -485953 -677767 -573192 -523505 -559545 -512601 -512424 -818821
$$ packed form
33144a613814j42045J54677L06089J89488j4620r5296l8951P4926K04737K78882
33134f95927J91947k1046j80805k16931k26669k15562m7014K28895K93231O316
33124h83565l23990l58374j76224n3358j7587O5699J50960J07033L6610J41775
33114a311021L24291K76541j4056j85557j2032K83363L57365J80667r992n2245
33104a62676J6799J15301K37041L82340M70506M22511L11363L04729M10068M20521
33094B928503K29160L2049J1275j8994l23489p11821p25009l57762j15505k40144
33084G08263l77214k30171m5864j16958k59731k04647r8780j39842q7702K89581
33074e63065N98660L14042l10435n25155j91814J04575M9687l6040M6944J77l06397
$$ plain form
33063 -818821 -1268101 -1407072 -1170907 -967970 -1049894 -1221303 -1256932 -1203226 -1124066 -912347
33053 -912347 -560848 -327856 -388967 -526966 -410234 -52591 222135 202650 -13485 -226098
33043 -226098 -378143 -549647 -774490 -925557 -832805 -544705 -395314 -680352 -1273351 -1709315
33033 -1709315 -1699625 -1440437 -1329979 -1484667 -1665253 -1649780 -1536060 -1591057 -1852360 -2014100
33023 -2014100 -1797282 -1362781 -1191076 -1515436 -2028329 -2253152 -2089620 -1855320 -1869356 -2150772
33013 -2150772 -2492956 -2686567 -2660189 -2507328 -2390954 -2364619 -2311797 -2116005 -1841540 -1680684
33003 -1680684 -1766892 -2071679 -2394868 -2437701 -2063468 -1568791 -1480617 -1926835 -2426912 -2515283
32993 -2515283 -2327639 -2264554 -2317125 -2177857 -1889402 -1847114 -2120870 -2283101 -2064276 -1738081
$$ packed form
33063h18821m49280j38971K36165K02937q1924j71409l5629N3706P9160K11719
33053i12347L51499K32992o1111j37999J16732L57643K74726j9485k16135k12613
33043b26098j52045j71504k24843j51067R2752K88100J49391k85038n92999m35964
33033a709315R690K59188J10458j54688j80586J5473J13720n4997k61303j61740
33023b014100K16818M34501J71705l24360n12893k24823J63532K34300j4036k81416
33013b150772l42184j93611K6378J52861J16374K6335N2822J95792K74465J60856
33003a680684q6208l04787l23189m2833L74233M94677Q8174m46218n00077q8371
32993b515283J87644O3085n2571J39268K88455M2288k73756j62231K18825L26195
$$ plain form
32983 -1738081 -1641095 -1691348 -1637724 -1467010 -1297439 -1140359 -1023892 -1100322 -1383287 -1635352
32973 -1635352 -1761502 -2011644 -2486030 -2767380 -2467818 -1873236 -1545547 -1487492 -1282008 -955980
$$ packed form
32983a738081R6986n0253N3624J70714J69571J57080J16467p6430k82965k52065
32973a635352j26150k50142m74386k81350K99562N94582L27689N8055K05484L26028
$$ [...]
##END NTUPLES=NMR SPECTRUM
##END=
