##TITLE=31Pdec_LR-675-C3P
 EtOAc, 72 sc
 29.5.2019
##JCAMPDX= 6.0         $$ Bruker NMR JCAMP-DX V2.0
##DATA TYPE= NMR SPECTRUM
##DATA CLASS= NTUPLES
##ORIGIN= UXNMR, Bruker Analytische Messtechnik GmbH
##OWNER= root
$$ XWIN-NMR		Version 3.5
$$ Wed May 29 13:09:47 2019 Russian Standard Time (UT+4h)  she@DPX200
##.OBSERVE FREQUENCY= 81.013821
##.OBSERVE NUCLEUS= ^31P
##.ACQUISITION MODE= SIMULTANEOUS
##.ACQUISITION SCHEME= undefined
##.AVERAGES= 72
##.DIGITISER RES= 17
##SPECTROMETER/DATA SYSTEM= spect
##.PULSE SEQUENCE= zgpg30
##.SOLVENT NAME= DMSO
##.SHIFT REFERENCE= (INTERNAL, DMSO, 0, 182.463)
##AUDIT TRAIL= $$ (NUMBER, WHEN, WHO, WHERE, WHAT)
$$ ##TITLE= Audit trail, XWIN-NMR		Version 3.5
$$ ##JCAMPDX= 5.01
$$ ##ORIGIN= Bruker BioSpin GmbH
$$ ##OWNER= she
$$ F:/spectra/data/she/nmr/P31/1/pdata/1/auditp.txt
$$ ##AUDIT TRAIL=  $$ (NUMBER, WHEN, WHO, WHERE, WHAT)
(   1,<2019-05-29 13:08:55.82 +0400>,<she>,<DPX200>,
      <continue with go, POWCHK disabled, PULCHK disabled
       configuration hash MD5:
       00 E9 B6 7A A2 85 ED C7 34 08 36 98 17 FE 4E 26
       data hash MD5: 32K
       25 78 F3 BB DA BF E4 AC 85 8D B4 C7 E5 33 FE 2D>)
(   2,<2019-05-29 13:08:57.89 +0400>,<she>,<DPX200>,
      <Start of raw data processing
       efp BC_mod = 2 LB = 1 FT_mod = 6 PKNL = 1 PHC0 = -2319.769 PHC1 = 411.1991 SI = 64K 
       data hash MD5: 64K
       19 04 37 19 20 5D 1F 8A 27 F7 07 15 09 F8 6D 54>)
(   3,<2019-05-29 13:09:19.54 +0400>,<she>,<DPX200>,
      <pk PHC0 = 173.8512 PHC1 = -415 
       data hash MD5: 64K
       CF 66 35 6E 02 BA 1D 2B 55 75 8C 33 D9 38 8F C1>)
(   4,<2019-05-29 13:09:22.51 +0400>,<she>,<DPX200>,
      <abs ABSG = 5 
       data hash MD5: 64K
       CC 6A 1E F0 A1 63 CF E9 12 89 95 0B 41 7F B0 11>)
$$ ##END=
$$ 
$$ hash MD5
$$ 1F D2 08 30 E5 9D 09 06 90 BF 23 AF 91 0F 76 B7
##$RELAX= 
##$RELAX= 
##$RELAX= 
##$RELAX= 
##$RELAX= 
##$RELAX= 
##$RELAX= 
##$RELAX= 
$$ Bruker specific parameters
$$ --------------------------
##$DU= <F:/spectra>
##$EXPNO= 1
##$NAME= <P31>
##$PROCNO= 1
##$TYPE= <nmr>
##$USER= <she>
##$AMP= (0..31)
100 100 100 100 100 100 100 100 100 100 100 100 100 100 100 100 100 100 
100 100 100 100 100 100 100 100 100 100 100 100 100 100 
##$AQSEQ= 0
##$AQ_mod= 1
##$AUNM= <au_zg>
##$AUTOPOS= <>
##$BF1= 81.014009
##$BF2= 200.13
##$BF3= 200.13
##$BF4= 200.13
##$BF5= 200.13
##$BF6= 200.13
##$BF7= 200.13
##$BF8= 200.13
##$BYTORDA= 1
##$CFDGTYP= 0
##$CFRGTYP= 5
##$CHEMSTR= <none>
##$CNST= (0..31)
1 1 145 1 1 1 1 1 1 1 1 1 1 1 1 1 1 1 1 1 1 1 1 1 1 1 1 1 1 1 1 1 
##$CPDPRG= <waltz16>
##$CPDPRG1= <>
##$CPDPRG2= <waltz16>
##$CPDPRG3= <>
##$CPDPRG4= <mlev>
##$CPDPRG5= <mlev>
##$CPDPRG6= <mlev>
##$CPDPRG7= <mlev>
##$CPDPRG8= <mlev>
##$CPDPRGB= <>
##$CPDPRGT= <>
##$D= (0..31)
0 1 0 0 0 0 0 0 0 0 0 0.03 2e-05 3e-06 0 0 0 0 0 0 0 0 0 0 0 0 0 0 0 0 
0 0 
##$DATE= 1559120840
##$DBL= (0..7)
120 120 120 11 120 120 24 19 
##$DBP= (0..7)
150 150 150 150 150 150 150 150 
##$DBP07= 0
##$DBPNAM0= <>
##$DBPNAM1= <>
##$DBPNAM2= <>
$$ [...]
##$SUBNAM3= <"">
##$SUBNAM4= <"">
##$SUBNAM5= <"">
##$SUBNAM6= <"">
##$SUBNAM7= <"">
##$SUBNAM8= <"">
##$SUBNAM9= <"">
##$SW= 369.568048894756
##$SWIBOX= (0..15)
0 1 3 0 0 0 0 0 0 0 0 0 0 0 0 0 
##$SW_h= 29940.119760479
##$TD= 32768
##$TD0= 1
##$TE= 0
##$TE2= 300
##$TE3= 300
##$TEG= 300
##$TL= (0..7)
0 120 53 12 22 120 120 120 
##$TP= (0..7)
150 150 150 150 150 150 150 150 
##$TP07= 0
##$TPNAME0= <>
##$TPNAME1= <>
##$TPNAME2= <>
##$TPNAME3= <>
##$TPNAME4= <>
##$TPNAME5= <>
##$TPNAME6= <>
##$TPNAME7= <>
##$TPOAL= (0..7)
0.5 0.5 0.5 0.5 0.5 0.5 0.5 0.5 
##$TPOFFS= (0..7)
0 0 0 0 0 0 0 0 
##$TUNHIN= 0
##$TUNHOUT= 0
##$TUNXOUT= 0
##$USERA1= <user>
##$USERA2= <user>
##$USERA3= <user>
##$USERA4= <user>
##$USERA5= <user>
##$V9= 5
##$VALIST= <valist>
##$VCLIST= <CCCCCCCCCCCCCCC>
##$VD= 0
##$VDLIST= <DDDDDDDDDDDDDDD>
##$VPLIST= <PPPPPPPPPPPPPPP>
##$VTLIST= <TTTTTTTTTTTTTTT>
##$WBST= 1024
##$WBSW= 4
##$XGAIN= (0..3)
0 0 0 0 
##$XL= 0
##$YL= 0
##$YMAX_a= 30965
##$YMIN_a= -12665
##$ZGOPTNS= <>
##$ZL1= 120
##$ZL2= 120
##$ZL3= 120
##$ZL4= 120
##$ABSF1= 182.463
##$ABSF2= -187.1042
##$ABSG= 5
##$ABSL= 3
##$ALPHA= 0
##$AQORDER= 0
##$ASSFAC= 0
##$ASSFACI= 0
##$ASSFACX= 0
##$ASSWID= 0
##$AUNMP= <proc_1d>
##$AZFE= 0.1
##$AZFW= 0.5
##$BCFW= 0
##$BC_mod= 2
##$BYTORDP= 0
##$COROFFS= 0
##$CY= -3
##$DATMOD= 1
##$DC= 0
##$DFILT= <>
##$DTYPP= 0
##$F1P= 0
##$F2P= 0
##$FCOR= 1
##$FTSIZE= 65536
##$FT_mod= 6
##$GAMMA= 0
##$GB= 0
##$INTBC= 1
##$INTSCL= 5.30512e-09
##$ISEN= 30
##$LB= 1
##$LEV0= 0
##$LPBIN= 0
##$MAXI= 10000
##$MC2= 0
##$MEAN= 0
##$ME_mod= 0
##$MI= 50
##$NCOEF= 0
##$NC_proc= -8
##$NLEV= 6
##$NOISF1= 182.463
##$NOISF2= 159.3651
##$NSP= 0
##$NTH_PI= 0
##$NZP= 0
##$OFFSET= 182.463
##$PC= 4
##$PHC0= -2145.918
##$PHC1= -3.800903
##$PH_mod= 1
##$PKNL= yes
##$PPARMOD= 0
##$PSCAL= 0
##$PSIGN= 0
##$REVERSE= no
##$SF= 81.0140089999434
##$SI= 65536
##$SIGF1= 159.3651
##$SIGF2= -187.1042
##$SINO= 113.3802
##$SIOLD= 16384
##$SREGLST= <1H.CDCl3>
##$SSB= 0
##$STSI= 65536
##$STSR= 0
##$SW_p= 29940.119760479
##$SYMM= 0
##$S_DEV= 0
##$TDeff= 32768
##$TDoff= 0
##$TI= <>
##$TILT= no
##$TM1= 0
##$TM2= 0
##$TOPLEV= 0
##$USERP1= <user>
##$USERP2= <user>
##$USERP3= <user>
##$USERP4= <user>
##$USERP5= <user>
##$WDW= 1
##$XDIM= 65536
##$YMAX_p= 384554996
##$YMIN_p= -258629956
$$ End of Bruker specific parameters
$$ ---------------------------------
##NTUPLES= NMR SPECTRUM
##VAR_NAME=  FREQUENCY,     SPECTRUM/REAL,   SPECTRUM/IMAG
##SYMBOL=    X,             R,               I
##VAR_TYPE=  INDEPENDENT,   DEPENDENT,       DEPENDENT
##VAR_FORM=  AFFN,          ASDF,            ASDF
##VAR_DIM=   65536,         65536,           65536
##UNITS=     HZ,            ARBITRARY UNITS, ARBITRARY UNITS
##FACTOR=    0.456856943014862, 1,           1
##FIRST=     14782.0589164792, 0,            0
##LAST=      -15158.0608439998, 0,           0
##MIN=       -15158.0608439998, -258629956,  0
##MAX=       14782.0589164792, 384554996,    0
$$ Real data points
##PAGE= N=1
##DATA TABLE= (X++(R..R)), XYDATA
$$ [...]
37204B683197p551758l032079j708344n870316o149486Q30427N111658R74585
37196a4712116j932403N117482J4064897J2131902J371869n832547n456473m484930
37188B67681p149906q563099l135486O676352J1855952N622125q479832j7732120
37180b0638333j3078661l25795O744784L757125j237168k107232j993384l456450
37172c2335114j754611O016615J3477940J3517186P774402J621696l681987p674996
37164c038869o540453K51095N114807K115512l460270l342642N56725K77333m090252
37155a2157014m276886K581498Q861085O802883j927946r150959r047457k666886
37147b0981682M378704P802912Q289278Q427929P420685K801532l155693m887327
$$ y = [2683197, -4868561, -7900640, -9608984, -15479300, -21628786, -20798359, -15686701, -14712116, -16644519, -11527037, 2537860, 14669762, 16041631, 10209084, 4752611, 267681, -6882225, -15445324, -18580810, -11904458, -48506, 5573619, -2906213, -20638333, -33716994, -34042789, -27298005, -23540880, -24778048, -26885280, -28878664, -32335114, -34089725, -28073110, -14595170, -1077984, 6696418, 8318114, 4636127, -3038869, -9579322, -9328227, -4213420, -2097908, -5558178, -8900820, -8344095, -8066762, -12157014, -16433900, -13852402, -4991317, 1811566, -116380, -9267339, -18314796, -20981682, -16602978, -8800066, -510788, 7917141, 15337826, 18139358, 14983665, 10096338]
37139A0096338k535403k412421n861700n626317J908793Q881564P483906K393099
37131A4327859K689917O583738M726864l748093r325870o690311j679430j208183
37123E676491m011372n150663l784928j825421J182107O553179J1275391R473623
37115A9388407N39256p828414q180224l065384j182804l929484l147222M211044
37107c194825P665379j762578j4422865j2690874L296323J4471650R254103k278237
37099C38076n432882j5899M649886M027443R02m377541n467606j091594L737471
37090c631744J453103m350670j214109J1290331J6736022O087310p415768q715231
37082A0239244k485594n54331j004409L354481O861833M62291r006394q473592
$$ y = [10096338, 7560935, 5148514, -713186, -6339503, -4430710, 4450854, 11934760, 14327859, 17017776, 23601514, 28328378, 24580285, 15254415, 8564104, 6884674, 5676491, 1665119, -3485544, -7270472, -9095893, -7913786, -1360607, 9914784, 19388407, 19927663, 12099249, 3919025, 853641, -329163, -4258647, -7405869, -3194825, 4470554, 2707976, -11714889, -24405763, -21109440, -6637790, 2616313, 338076, -5094806, -5110705, -460819, 3566624, 3567526, -810015, -6277621, -7369215, -3631744, -2178641, -6529311, -7743420, 3546911, 20282933, 26370243, 18954475, 10239244, 7753650, 7199319, 6194910, 9549391, 16411224, 16873515, 7867121, -606471]
37074f06471r70011J425316P11384P223665J5349200R313297p433201j3255479
37066A1757700j764398R061766O161364k429266o836882q686328p462418M016690
37058C818228K0103746K0145280r30456j9727103j6738337k935718J859230j346033
37050D248837j561601j436291p810215j1868912k467008J0208697Q248526l453706
37042e891673m797684N174319O989230n309338j3574885n004849Q831509J1661471
37034a921900M769649o60565j144123p02543j397255k439473l414987l112386
37026a0023583J95595M383839M489908j13879m596428n156120j582192N049830
37018g353030J0835883Q410086l259464j1930215o384704N262335N754985m147477
$$ y = [-606471, -1576482, -151166, 560218, 7783883, 23133083, 32446380, 25013179, 11757700, 9993302, 19055068, 25216432, 22787166, 15950284, 7263956, -198462, 3818228, 23921974, 44067254, 43136798, 23409695, 6671358, 3735640, 5594870, 4248837, 2687236, 1250945, -6559270, -18428182, -20895190, -10686493, -2437967, -5891673, -10689357, -5515038, 1474192, -3835146, -17410031, -22414880, -13583371, -1921900, 2847749, 2187184, 1043061, 340518, -1056737, -3496210, -6911197, -10023583, -9827988, -5444149, -954241, -1068120, -5664548, -10820668, -12402860, -7353030, 3482853, 11892939, 8633475, -3296740, -9681444, -4419109, 1335876, -2811601]
37010b811601o010452O100747J4338889M117773j3771098j9855661j2444165m336401
37002c4671969j841823k92777M305829J0133182J3568808J1262172J966329q426689
36994c996938r723855q82252O748036N625151K194624L139162K613972m888990
36986H28910r364092O53380J5462963J4175732m354152j8405314j3175397K228805
36978a1949165J1552611J0612403L909230m872411j0896523p089540N771965J4992090
36970A2030660J0475042j714451p767892m081937O14807j018646n928204o235497
36962c626118m5445N618658L553493k666275j371783R929990J6513705N086584
36954C2992809j4046748j7443685j072103J3515022J0137952j281709m536953
$$ y = [-2811601, -8822053, -2721306, 11617583, 15735356, 1964258, -17891403, -30335568, -34671969, -36513792, -36806569, -32500740, -22367558, -8798750, 2463422, 4429751, -3996938, -13720793, -14603045, -7855009, -2229858, -35234, 3103928, 5717900, 828910, -8535182, -7881802, 7581161, 21756893, 17402741, -1002573, -14177970, -11949165, -396554, 10215849, 14125079, 9252668, -1643855, -8733395, -2961430, 12030660, 22505702, 20791251, 13023359, 8941422, 9556229, 8537583, 2609379, -3626118, -3671563, 1947095, 5500588, 2834313, 1462530, 11392520, 27906225, 32992809, 18946061, 1502376, 430273, 13945295, 24083247, 22801538, 18264585]
36947A8264585k300309o245959j3081429r256621M931057J3891680R236610j586652
36939A3852962j0068651j5227790j5033787m523295J1617396J8007025Q399000
36932G022860m123654n564624k9830N9109n251335n352946K172396P893450N988511
36923B813937K090285K420514L818199r7248q214178j3165239j1139867n699418
36915b7173015j799125L46298L451358P132546P391711L224498L1744K485007
36907d908978O418869L898671m022947o996076j31136Q171832P705839n00929
36899I635145q420053j2447179j3053948q040379L915851J5142924J4923889M280702
36891E936952m460830m528776k004993l418721n475875k750070K066417K861893
$$ y = [18264585, 15964276, 9718317, -3363112, -12619733, -7688676, 6203004, 15439614, 13852962, 3784311, -11443479, -26477266, -31000561, -19383165, -1376140, 7022860, 2899206, -2665418, -2695248, -2636139, -7887474, -13240420, -11068024, -3174574, 2813937, 4904222, 7324736, 11142935, 11045687, 2831509, -10333730, -21473597, -27173015, -28972140, -28625842, -25174484, -18041938, -10650227, -7425729, -7393985, -4908978, 1509891, 5408562, 1385615, -5610461, -5741597, 2430235, 10136074, 9635145, 1215092, -11232087, -24286035, -32326414, -28410563, -13267639, 1656250, 5936952, 1476122, -3052654, -5057647, -8476368, -13952243, -16702313, -14635896, -11774003]
36883a1774003O1511j158527N67508K228809K248434J645584J219290J607672
36875c353722L585982M901764J241232n210943m496892O273094J3360410L512192
36867A9813117j3454352j4581745L077217J6155650Q197588o891793o835392O240470
36859A1720760J1972344L794628m294892k705252L26138m074193r793756o911631
36851C4146J709748N570019J950923l527439p327649r576320q169989o84567Q743289
36842a1277839J2545901R470976M304441q10996o638358r570675m453268L957428
36834b472390L501500o947491j2095655p86085J6612975K1011104R034852n607017
36826B2251793j1672724j0556984p891874n481084l582673l057398k514268N38923
$$ y = [-11774003, -11712492, -12871019, -12303511, -10074702, -7826268, -6180684, -4961394, -3353722, 232260, 5134024, 6375256, 1164313, -3332579, 2940515, 16300925, 19813117, 6358765, -8222980, -5145763, 11009887, 19207475, 12315682, 5480290, 11720760, 23693104, 27487732, 23192840, 20487588, 20813726, 16739533, 6945777, 34146, 1743894, 7313913, 9264836, 5737397, -1590252, -11166572, -19336561, -20021128, -11277839, 1268062, 10739038, 15043479, 14232483, 7594125, -1976550, -6429818, -2472390, 1029110, -5918381, -18014036, -18800121, -2187146, 18823958, 27858810, 22251793, 10579069, 22085, -7869789, -13350873, -16933546, -19990944, -22505212, -21966289]
36818b1966289M013987L026716j100925q32983N802904J0778368P785608J660230
36810I167616K43655K461507J702034k740657n441523m349278k959614k929789
36802d846049j447468K242497L407090j637639q813522r840687k112889P091572
36794a5957095P564023k207580j1713307r513963K730311J1995795J0795757N758374
36786e47685N232132N979536J055145m780760n29292J1111045J3486269j65050
36778C0841340j5324515j6243632o630902r8618J279154N508773J2599335J2892488
36770B4823423L961745l997702l436613M58945M8854l169685l632128j771883
36762A3284956k101292n346688q343750q794779n710546J380170R381331J1831350
$$ y = [-21966289, -17952302, -14925586, -16026511, -16859494, -11056590, -278222, 7507386, 9167616, 9411271, 11872778, 13574812, 10834155, 5392632, 1043354, -1916260, -4846049, -6293517, -4051020, -643930, -2281569, -11095091, -20935778, -23048667, -15957095, -8393072, -10600652, -22313959, -31827922, -29097611, -17101816, -6306059, -547685, 4684447, 10663983, 11719128, 6938368, 6409076, 17520121, 31006390, 30841340, 15516825, -726807, -7357709, -7456327, -6177173, -668400, 11930935, 24823423, 28785168, 24787466, 21350853, 21809798, 21858652, 18688967, 15056839, 13284956, 11183664, 5836976, -2506774, -11301553, -17012099, -15631929, -6250598, 5580752]
36754E580752P006970J725696J766056L164101k23092n313375n090395j839456
36746F777257l871040r919580r271945J33002O250489J494089m519018m1594R671146
36737c297194J0132466k93182q776816p675698l627030m053407n094395L02462
36729b2382794Q963500J0812638L926451j479756L314292J2744816J3058913N81489
36721B9539549j1800476j0128584K488771J0044970N181039k159330j123474L629277
36713B5671742K61111j0707923j6158028r403103O51230K679510k449822n317618
36705a4772901j201947N810939R501147P678370K512966j952031k546989Q54770
36697E884324N417271P655001N380618j363575r177897j2124734p107946J392040
$$ y = [5580752, 12587722, 14313418, 16079474, 19243575, 19020483, 13707108, 8616713, 6777257, 2906217, -7013363, -16285308, -16152306, -9901817, -8407728, -12926746, -12968340, -3297194, 6835272, 6542090, -2234726, -9910424, -13537454, -17590861, -22685256, -22382794, -13419294, -2606656, 1319795, -159961, 3154331, 15899147, 28958060, 29539549, 17739073, 7610489, 10099260, 20144230, 25325269, 23165939, 22042465, 25671742, 25932853, 15224930, -933098, -10336201, -9684971, -7005461, -9455283, -14772901, -15974848, -10163909, -662762, 7015608, 9528574, 7576543, 5029554, 5884324, 11301595, 18956596, 24337214, 22973639, 13795742, 1671008, -5436938, -4044898]
36689d044898N277275K038338l256615n489281m783783k973046N25226O021698
36681f685086R921882P713380l81896r151551j3184479j0764316m162180K830729
36673b3863517Q146053J1825980J2454380O151467o818038j6963069j4016524
36666b3083268m81534J0431057J1369002P271836L322028l169470j2938306j6773187
36658b4051842p361993P297834J3143196Q636611L456538J905065l41843m136204
36650a452638m339775q87262j73587k388081K63061P833000P989696m456762j4908984
36641a2521332p828272J0071717J9105170J3700424N342410J049896m344008j2188061
36633A2387944j3008770l248636M725895N34992o725223k547229Q511215Q611673
$$ y = [-4044898, 1232377, 3270715, 14100, -5475181, -10258964, -13232010, -12706784, -6685086, 3236796, 10950176, 10568280, 1416729, -11767750, -22532066, -26694246, -23863517, -15717464, -3891484, 8562896, 14714363, 7896325, -9066744, -23083268, -23564802, -13133745, -1764743, 5507093, 8829121, 5659651, -7278655, -24051842, -31413835, -24116001, -10972805, -2336194, 1120344, 3025409, 2683566, -1452638, -5792413, -6679675, -6853262, -9241343, -8978282, -1145282, 6844414, 2387652, -12521332, -20349604, -10277887, 8827283, 22527707, 27870117, 28920013, 24576005, 12387944, -620826, -3869462, 856433, 1391425, -5333798, -7881027, 630188, 9241861]
36625I241861n047835j4431407o868851P471700J1921762N702422r5397q88871
36617G005384j478561m597012p241505p071956l949566L377808J3737699J8403119
36609A8185410R334438p412578j6502880j2955066o936293o470466o414128k34787
36601b9406350P352957Q128829L792459K427309N623391P460168M012499k983519
36593F407743j0004338j3407790r578842M78041Q496896O871311j811581q133962
36585b0682522p356827k720372J282547L796795O189304R542071J3128467J3529026
36577A6708489P713840j388753o750195o694607o366324p138727l472464M479967
36569b908774O168367k025138n984658N426556J8316795J1210173j0777100k0735212
$$ y = [9241861, 4194026, -10237381, -17106232, -9634532, 2287230, 7989652, 7894255, 7005384, 5526823, 929811, -6311694, -13383650, -17333216, -13955408, -217709, 18185410, 27519848, 20107270, 3604390, -9350676, -16286969, -22757435, -29171563, -29406350, -22053393, -13924564, -10132105, -7704796, -2081405, 5378763, 9391262, 6407743, -3596595, -17004385, -26583227, -26105186, -17608290, -10736979, -12548560, -20682522, -28039349, -30759721, -29477174, -25680379, -19491075, -9949004, 3179463, 16708489, 24422329, 23033576, 16283381, 9588774, 3222450, -3916277, -7388741, -2908774, 3259593, 1234455, -4750203, 676353, 18993148, 30203321, 19426221, -1308991]
36561a308991q794459N970414P113776K444035M101534O602325j25297j0087319
36553E916018j0558031l111214O13589j552911j742248K353583M820207L154674
36545a06333R20403q30549m468602p858585m955033M172011J1442207J0729094
36537I044613M306383j488364k547044J007833N093371M551508q77183n159290
36529A3931827l754267J96385J346929o7071j058797k524751o484461r588305
36521h002511o432076J995109Q994590R944456M846601l921138j1122892r685804
36513a3383665J263224J2575763J5563513J2186167Q043203J446602j0172778
36506B7522029j8518378j3099095M11341N378568j448285n916658n2418N961527
$$ y = [-1308991, -10103450, -4133036, 2980740, 5424775, 9526309, 16128634, 16003337, 5916018, -4642013, -7753227, -7139638, -8692549, -10434797, -8081214, -3261007, -106333, 814070, -16479, -4485081, -12343666, -17298699, -13126688, -1684481, 9044613, 13350996, 11862632, 9315588, 10323421, 15416792, 19968300, 19091117, 13931827, 10177560, 10373945, 11720874, 11653803, 10595006, 8070255, 1585794, -8002511, -14434587, -12439478, -3444888, 6499568, 11346169, 7425031, -3697861, -13383665, -12120441, 455322, 16018835, 28205002, 36248205, 37694807, 27522029, 9003651, -4095444, -3684103, 1694465, 246180, -5670478, -5722896, 238631]
36498B38631K473446l314919n65679O673567P023408O60476k564518r0616R18545
36489A1452341k832071o142608n523370m128154l743097n68148O547467J0830794
36481E893154O636869j223298m182648k738147m264282q810582p140596L318023
36473a2511507J0465290M413243m961400r30912J2346393J2136913q336685k4924222
36465a2302887j4400826J1675886K2170923Q382233q261203r143586J33790N622038
36457C876368N187686L768741J279761l604635n836265j006988N009705L028061
36449A1702434n788209j1493445q914226k480066J903602L653460N280794P404375
36441A268719P596636L347640l661870p010979k101294O819513J0246684M742099
$$ y = [238631, 2712077, -602842, -1168521, 5505046, 12528454, 13188930, 10624412, 10533796, 11452341, 8620270, 2477662, -3045708, -7173862, -10916959, -11485107, -4937640, 5893154, 12530023, 11306725, 7124077, 4385930, 121648, -8688934, -15829530, -12511507, -2046217, 2367026, -2594374, -3525286, 8821107, 20958020, 12621335, -12302887, -26703713, -15027827, 7143096, 15525329, 7264126, -1879460, -1745670, 3876368, 9064054, 12832795, 14112556, 10507921, 4671656, 3664668, 8674373, 11702434, 5914225, -5579220, -14493446, -16973512, -15069910, -11416450, -6135656, 1268719, 8865355, 12212995, 8551125, 1540146, -561148, 6258365, 16505049, 21247148]
36433B1247148l754791q689718r292880o391292J385660J2475185J8415105J1290347
36425C6684764n910937k0070368j9316658l696735J3640265J7250742N251716
36418B3832789p343735o420761L028586N018373l705623j0717389r198131o889107
36410a2394998q743471o477313M703137J3124687P935118j975986j945817M510057
36402a264586L319386m752544o035927P73219J907938o031108p871257M700082
36394a5254797J6407023R739664q518785j6537985p315200M578644N117633k361240
36386a4145043n940777k336770J345075O4566k009140Q81955O080483O012133
36378a0047518N97079j141306N372439J1822091P867831m165220j2432099j0839687
$$ y = [21247148, 17492357, 8802639, -490241, -6881533, -5495873, 6979312, 25394417, 36684764, 30773827, 10703459, -8613199, -12309934, 1330331, 18581073, 23832789, 16489054, 10068293, 13096879, 18115252, 14409629, 3692240, -5505891, -12394998, -21138469, -27615782, -22912645, -9787958, -1852840, -3828826, -5774643, -1264586, 2054800, -2697744, -8733671, -7960452, -6052514, -12083622, -19954879, -15254797, 1152226, 10891890, 2373105, -14164880, -21480080, -16901436, -11783803, -14145043, -20085820, -22422590, -21077515, -21012949, -23022089, -22140134, -16059651, -10047518, -9450439, -10591745, -5219306, 6602785, 14470616, 10305396, -2126703, -12966390]
36370a2966390m223382N98795K249732K754019L184097K603604q97444p257143
36362a3954112j1364577o988997L486666R016699M398132j566356Q20759P661424
36354h490362R302615O364855O139815P675045M328568j012767J635985J0828856
36346C6772610J2513035J299373j0342961r979016j361469L638640L90014p149733
36338B5780493j3214130j3474771p512632q95887J141762K107112P856182J3084293
36330A4872422O885972p350345j2705283l433253O474978N642202N23577j65878
36322A0744392l30604m511548o093184j165615j85280r786393j5721460l033398
36314c0083090J6585996J8766885J990993j2015381j0784454l413362l99220r53251
$$ y = [-12966390, -17189772, -16590977, -14341245, -11587226, -8403129, -5799525, -6696969, -13954112, -25318689, -32307686, -28821020, -19804321, -15406189, -16972545, -16151786, -8490362, 812253, 7177108, 13316923, 20991968, 25320536, 24307769, 25943754, 36772610, 49285645, 50585018, 40242057, 30263041, 28901572, 32540212, 32930226, 25780493, 12566363, -908408, -8421040, -9316927, -8175165, -6068053, 1788129, 14872422, 21758394, 14408049, 1702766, -1730487, 4744491, 10386693, 10910270, 10744392, 10413788, 5902240, -190944, -1356559, -1541839, -11328232, -27049692, -30083090, -13497094, 5269791, 7260784, -4754597, -15539051, -18952413, -19351633, -20304884]
36306b0304884k929177p244456q524594J683843J7410327K0198148M988185j0808881
36298e531489j1429383k025107M402459N939551P289410P505073L736944n17289
36290I370169j052189n30125k033039j992808J937713L305268l100928j0195623
36282d291562q340952q27329J873598n58341R31146Q166599J2222661P813429
36274A6989249O38221k418342j715880k44485J946394M868151N975364M000614
36266C0039286Q32302k790934q290183j3541687j2303820l477778M649474M925102
36258D1762J530048L084687R062126J1163296O879877K692745K247866J50538
36250C6852945p893209j5976879j5881420r297771m399226k928931P98799Q346128
$$ y = [-20304884, -23234061, -30478517, -39003111, -37319268, -19908941, 289207, 5277392, -5531489, -16960872, -18985979, -14583520, -8643969, -1354559, 6150514, 9887458, 9370169, 8317980, 7787855, 5754816, 3762008, 5699721, 9004989, 5904061, -4291562, -12632514, -13459843, -11586245, -12144586, -11213440, -3046841, 9175820, 16989249, 17627470, 15209128, 13493248, 13248763, 15195157, 20063308, 26038672, 30039286, 30871588, 28080654, 19790471, 6248784, -6055036, -9532814, -4883340, 41762, 1571810, 4656497, 13718623, 24881919, 31761796, 34454541, 36702407, 36852945, 28959736, 12982857, -2898563, -12196334, -16595560, -19524491, -18725692, -10379564]
36242a0379564J3020311R446482N55319p664114j2455051j2589587o718424K365042
36234b4419586P288028M868670Q64543J182445K956750P4825o426195r905475
36226b3515995p234367m19183Q044892J5211499J5876018P863658k458075o602088
36218F766359m505400k394140k333648j459167Q5617q31686k627436j83026N185717
36209b296810N449765k098604r880803r843453k269643P006315J2255434R597606
36201G919807k43924r383875r472950k277607K976310L173876L854121P115899
36193C661657P110574J329356l204250p01269M225545M186223n32242m743478
36185A1332116o139984n349092l109017j373995k505778m766678m112683j697708
$$ y = [-10379564, 2640747, 12087229, 12642548, 4978434, -7476617, -20066204, -26784628, -24419586, -17131558, -12262888, -11398345, -10215900, -7259150, -7184325, -13610520, -23515995, -30750362, -31169545, -23124653, -7913154, 7962864, 15826522, 13368447, 6766359, 2260959, -133181, -2466829, -3925996, -3840379, -4672065, -7299501, -7482527, -2296810, 3152955, 1054351, -8826452, -18669905, -20939548, -13933233, -1677799, 7919807, 7675883, -1707992, -11180942, -13458549, -10482239, -7308363, -3454242, 3661657, 10772231, 12101587, 8897337, 8196068, 12421613, 16607836, 16075594, 11332116, 5192132, -156960, -3265977, -4639972, -7145750, -11912428, -16025111, -17722819]
36177a7722819k055752k914509K922672J3192562J5701016O662438l080611n852076
36169F852921p245070j0732073p659044N659397J5444141R909137j396628l942026
36161F890755j851843o469272j2321028o713303M558487N266234k219982j430343
36153a4290295O601768L806266j0222461j2610015N000656J9808537J2735853
36146A0830309l376668p391535j651850l30808k206991K523217R056869M611164
36138A2063707o949713q362553M027334J4796524J2687601L829956j790915m145967
36130B6155974p836335j1781832j0447650j927167Q272532J1057699K992586p399362
36122I086445p491518K937671J0369052P091100K460264O336951J1246040M186464
$$ y = [-17722819, -19778571, -22693080, -19770408, -6577846, 9123170, 15785608, 12704997, 6852921, -392149, -11124222, -18783266, -13123869, 2320272, 12229409, 10832781, 6890755, 5038912, -1430360, -13751388, -20464691, -15906204, -10639970, -12859952, -14290295, -7688527, -3882261, -14104722, -26714737, -21714081, -1905544, 10830309, 7453641, 62106, -1589744, -1920552, -4127543, -1604326, 7452543, 12063707, 5113994, -3248559, 778775, 15575299, 28262900, 32092856, 30301941, 26155974, 18319639, 6537807, -3909843, -5837010, 2435522, 13493221, 16485807, 9086445, 1594927, 4532598, 14901650, 21992750, 24453014, 30789965, 42036005, 46222469]
36114D6222469j0704193j6905097r911669j372337N45609m50815j361674n319999
36106G42294j0455188q089550J668113O007949r78959p380466k250880O000789
36098a4735898L092380p462463r421427R34283R794424P193369J54812l43440
36090a0793960M451019N194322q23320o544921n357668J020537N818697N340208
36082a695086J820514j107970l409129o994603j0167779q030875l83853N056908
36074b4911873K055543m077482k166759R106410J7772968J3457015L19281q977373
36066B577730q363741k533736J507355J625142j41376q29476J222445M146268
36058g89389L284467k206336n444146n48113O070996K116582j1218248j6793673
$$ y = [46222469, 35518276, 18613179, 8701510, 7329173, 7874782, 7423967, 6062293, 742294, -9712894, -17802444, -16134331, -10126382, -11105341, -18485807, -20736687, -14735898, -11643518, -19105981, -28527408, -27593125, -17798701, -10605332, -10450520, -10793960, -6342941, -1148619, -1971939, -8516860, -13874528, -12853991, -7035294, -1695086, 125428, -982542, -4391671, -11386274, -21554053, -29584928, -29968781, -24911873, -22856330, -26933812, -29100571, -19994161, -2221193, 11235822, 11555103, 2577730, -5786011, -8319747, -6812392, -5187250, -5328626, -6158102, -4935657, -789389, 2495078, 288742, -5155404, -5703517, 367479, 2484061, -8734187, -25527860]
36050b5527860m646586J1862352J3251618R03837n907425K167104J2916006J0985423
36042A6004469l079076j6631970j9434858r996623N297944J4920544J0701638
36035b217932j775277p393849m67736P293253L233468q730201j4521286q645542
36027c3225102J718308Q086330Q106962L388274k747855n679385l361366L89408
36019b3324426O12774k059973l199448r66028L302655Q190899J1590938J0284597
36011D431988N097658K764348O677017R592420L060938q759020j3418065p372883
36003B074401k59934r54159o621252p976526o71058J0289014J4896188P550130
35995A8326804n695808j2298093q401352l369782m550308n458853J923645J0761080
$$ y = [-25527860, -30174446, -18312094, -5060476, -4156639, -10064064, -7896960, 5019046, 16004469, 12925393, -3706577, -23141435, -33138058, -27840114, -12919570, -2217932, -3993209, -11387058, -11854794, -4561541, -1328073, -10058274, -24579560, -33225102, -31506794, -23420464, -15313502, -11925228, -14673083, -20352468, -23713834, -23324426, -22711652, -24771625, -27971073, -28937101, -25634446, -17443547, -5852609, 4431988, 9529646, 12293994, 18971011, 28563431, 31624369, 22865349, 9447284, 2074401, 1814467, 860308, -5760944, -13737470, -14408528, -4119514, 10776674, 18326804, 12630996, 332903, -8068449, -11438231, -15988539, -21447392, -19523747, -8762667]
35987h762667Q613485j431448m237674L754746R994828O766492J473100J549142
35979A7720004K988872K31989m347678p287995r622669r718826j974329J0388439
35971a622193J3117735P46168j1980004r176639M436984J2088256P925206k34624
35963A5300889n335772o202216k007140O619622J2543264Q406804k349083q871855
35955A8104513o739122j374718J375633J122564m16709k673963n258052o935798
35947b795652n660165O16775R958022J3847863N533926q128784j2317519m157904
35939c103438L962193M781844N933762J1834543J1602607j524777j2638237n136323
35931A5712174J1407210J3425764j931638j4331033j0689610P50332P459265O831017
$$ y = [-8762667, -149182, -1580630, -5818304, -2063558, 7931270, 14697762, 16170862, 17720004, 20708876, 20940865, 16593187, 9305192, -317477, -10036303, -12010632, -1622193, 11495542, 12241710, 261706, -8914933, -4477949, 7610307, 15535513, 15300889, 9965117, 3762901, 1755761, 8375383, 20918647, 29325451, 26976368, 18104513, 11365391, 9990673, 11366306, 12488870, 12072161, 9398198, 4140146, -2795652, -8455817, -7839042, 2118980, 15966843, 21500769, 13371985, 1054466, -3103438, 858755, 5640599, 11574361, 23408904, 35011511, 33486734, 20848497, 15712174, 27119384, 40545148, 38613510, 24282477, 13592867, 14343199, 21802464, 28633481]
35923B8633481J463223n037491n994611J345992P086812Q72789r149338o392104
35915A2828753O546220J0331974L90484o022152K42685N296247k797934j3906781
35907A2909496j3648969m961664J683838N418281Q485932N417534o362923j5229493
35899f287968r428148M848555J2134839P950593l73723o081947o178844K84623
35891c132020P673995N648919n636101j1943116n589995K256096Q13423k435135
35883a2343934K605565Q748748N204601q68881K709058Q465392J009125j3009523
35875B520151j2145987M377887J3827310N378905n080294j977204Q376795J1656198
35867B6933761M705222p039864j7645872j9846211q922776P194716J3844562R355603
$$ y = [28633481, 30096704, 25059213, 19064602, 20410594, 27497406, 28370195, 19220857, 12828753, 19374973, 29706947, 30097431, 24075279, 24317964, 29614211, 26816277, 12909496, -739473, -5701137, -4017299, 1400982, 9886914, 15304448, 8941525, -6287968, -15716116, -10867561, 1267278, 9217871, 8844148, 2762201, -3416643, -3132020, 4541975, 10190894, 4554793, -7388323, -12978318, -10722222, -9908799, -12343934, -9738369, -989621, 4214980, 3346099, 6055157, 14520549, 15529674, 2520151, -9625836, -5247949, 8579361, 13958266, 8877972, 6900768, 15277563, 26933761, 31638983, 24599119, 6953247, -12892964, -21815740, -14621024, -776462, 8579141]
35859H579141N862328P959208O408617k501550q402398m765317O09525J112761
35851A4862315J831217N733611N034150l286136q469430l978380L00786l522047
35843H506086n819142K446547J0280439L568129r908475j2122223l220782J790405
35835d479016r57590j832626J694337J971838j665634j138632L719686L910834
35827A223197j187025j561190M875832P484344J438125l912052j186470M264459
35819A1439220O261437P179788Q008713K318798j0219197j6570933q690960J033405
35811G60271l028416j4444380j3175250L236878J4306907O151135q565637r449289
35803b4207781K805931R122261L78362j0082012o185936Q495342J6791399J1396359
$$ y = [8579141, 14441469, 22400677, 28809294, 26307744, 17905346, 13140029, 13749554, 14862315, 16693532, 22427143, 27461293, 24175157, 15705727, 11727347, 12028133, 8506086, 2686944, 5133491, 15413930, 18982059, 9073584, -3048639, -6269421, -4479016, -5436606, -7269232, -5574895, -3603057, -5268691, -6407323, -2687637, 1223197, 36172, -1525018, 3350814, 10835158, 12273283, 8361231, 7174761, 11439220, 17700657, 24880445, 32889158, 35207956, 24988759, 8417826, -273134, 760271, -2268145, -16712525, -29887775, -26650897, -12343990, -6192855, -14758492, -24207781, -21401850, -12279589, -11901227, -21983239, -28169175, -19673833, -2882434, 8513925]
35795H513925J582522l244326n296249r044636j0218308l391694N650782O133010
35787i314974j490474o189244l221925J46348j735008l440917J808814J0221217
35779a3216163J2451238O822112P08479k48647J427325O78200k021017j752947
35771D848580K342740L877754k141488j0203783j0244737k643043J220844l222669
35763a6165802m953486N624798J9187423J9060261N464626n724412p015797p050555
35755H427056j1716715j2478477j320844J3887256J9165454J3008920N612355
35748C4585005L068958J202395n034196j2535478j3151433m292705N689140N533089
35740A5064775m530496j1278031n695175M144502N302371p13834k733949L25985
$$ y = [8513925, 10096447, 6852121, 1555872, -7488764, -17707072, -21098766, -15447984, -9314974, -10805448, -16994692, -20216617, -20070269, -21805277, -25246194, -23437380, -13216163, -764925, 6057187, 6765666, 6517019, 7944344, 8622544, 6601527, 4848580, 7191320, 11069074, 8927586, -1276197, -11520934, -14163977, -12943133, -16165802, -21119288, -15494490, 3692933, 22753194, 28217820, 22493408, 15477611, 8427056, -3289659, -15768136, -17088980, -3201724, 15963730, 28972650, 34585005, 37653963, 38856358, 33822162, 21286684, 8135251, 3842546, 9531686, 15064775, 10534279, -743752, -6438927, -2294425, 3007946, 2294112, -439837, -113852]
35732a13852K18213j640629M901014J5780737J2097460q486956k0945704q672281
35724f861998R019625O081901q882952p027913J3173280K2531108O583037j3414477
35716B1201611j4100935j920692K581524m235516j0188184r110379n401950j593823
35708b2768344M162294Q999820N861746m495195j1010161o101185L901720P210436
35700a4238869K118537k128499J65636K769576j870787r002845p184548L874446
35692b5497353J1467593Q530448L722865O784281J3214633J2484853M121819m552113
35684C0277026j0582378j4141235j0771304J742390J2332760P414391p940748
35677H330902j4403951n338836N356891N545154J10703j979647j990089m047172
$$ y = [-113852, 104361, -1536268, 3364746, 19145483, 31242943, 22755987, 1810283, -6861998, 2157627, 8239528, -643424, -7671337, 5501943, 28033051, 34616088, 21201611, 7100676, 5179984, 7761508, 3525992, -6662192, -15772571, -21174521, -22768344, -18606050, -9606230, -3744484, -8239679, -19249840, -25351025, -21449305, -14238869, -12120332, -14248831, -14083195, -11313619, -13184406, -22187251, -29371799, -25497353, -14029760, -5499312, -1776447, 5007834, 18222467, 30707320, 34829139, 30277026, 19694648, 5553413, -5217891, -3475501, 8857259, 16271650, 8330902, -6073049, -11411885, -6054994, -509840, -399137, -2378784, -4368873, -8416045]
35669h416045m598775P49746P565892Q645082M025810j703475n984690o510276
35661f226731k86927R054711J0772769J443031p431071m634774M770872Q074569
35653A5536449L529396l22317M8413m33126m901484r663949j0155943n372726
35645a1735287K890442J0002703R889493J884389o431427q359389o271134n060227
35637a3190437k711064M403189J1136408Q526753k458964j1246178j1245226n366593
35629b2152112J101441N250760M883336p0572m629126m218717j989394l287159
35621b5111543m770855J418128J3087514J8137075J1250943R56584l081354j350773
35613A0535719N76175O97995k21109j828535k403972P29581N507010N228568j921392
$$ y = [-8416045, -13014820, -12265074, -4699182, 3945900, 7971710, 6268235, 283545, -6226731, -6513658, 2541053, 13313822, 14756853, 7325782, 2691008, 7461880, 15536449, 19065845, 18743528, 18791941, 18358815, 13457331, 3793382, -6362561, -11735287, -8844845, 1157858, 11047351, 12931740, 6500313, -1859076, -8130210, -13190437, -15901501, -11498312, -361904, 8164849, 5705885, -5540293, -16785519, -22152112, -21050671, -15799911, -10916575, -10987147, -15616273, -19834990, -21824384, -25111543, -29882398, -28464270, -15376756, 2760319, 14011262, 14967846, 11886492, 10535719, 11111894, 11809889, 11588780, 9760245, 7356273, 8085854, 13592864, 18821432, 16900040]
35604A6900040q483055o898968R39549O919335O007300o40807q353989j1707482
35596e318077p630378J281241Q338680R108350M564284j644879n921101n572372
35588b794252j372155J346935q81658l192192J246274R189248R911655P70304
35580A4224159q732341j0985504r214063q154394n048284L157446J1020596J1344497
35572b387888N930716J770928R3602k979031p106776o949758p89948O138493Q121420
35563A841758N042394J260923O51294K815644L382188n92344n404824m246518
35555D750515L133996Q782473O652365k90664n829455q244456q365258m995500
35547d405984K010525P525146N993918j048905o824025p123150k676610L874053
$$ y = [16900040, 8416985, 1518017, 2457566, 9376901, 15384201, 14743394, 6389405, -5318077, -12948455, -11667214, -3328534, 5779816, 10344100, 8699221, 2778120, -2794252, -4166407, -2819472, -3701130, -6893322, -5647048, 3542200, 13453855, 14224159, 5491818, -5493686, -14707749, -22862143, -27910427, -24752981, -13732385, -2387888, 3542828, 5313756, 5407358, 2428327, -4678449, -11628207, -12418155, -6279662, 1841758, 6884152, 8145075, 8796369, 11612013, 14994201, 14401857, 8997033, 4750515, 7884511, 16666984, 23319349, 23028685, 17199230, 8954774, 589516, -4405984, -2395459, 5129687, 11123605, 10074700, 3250675, -3872475, -6549085, -2675032]
35539b675032R105757Q887497J860999p748174j3704447j3284027p882156p98185
35531b6237768L922630M050908K665362M997872R911185J0171537M022276o58866
35523A2845136J329449L632027p94546o735286m478664M079909Q032337M003130
35515B1913492p74493j718662k635391o169235p815696l469281L523232O718378
35507I572344L800131k823842q939017j0634717o988413j611647J185705J290681
35499a5148775R21779j31310k882467m720776k257026K560086M849691M296992
35491a2511806M465094N767313N394308L334046K037920J097603j022830j470552
35483G091096K826735O817985K642083o830049j0109347m038628K147386K298109
$$ y = [-2675032, 6430725, 15318222, 17179221, 9431047, -4273400, -17557427, -25439583, -26237768, -22315138, -18264230, -15598868, -10600996, -689811, 9481726, 13504002, 12845136, 14174585, 17806612, 17012066, 10276780, 5798116, 9878025, 17910362, 21913492, 21138999, 19420337, 16784946, 10615711, 2800015, -669266, 2853966, 9572344, 13372475, 10548633, 1609616, -9025101, -16013514, -17625161, -16439456, -15148775, -14226996, -14358306, -17240773, -21961549, -24218575, -21658489, -16808798, -12511806, -8046712, -2279399, 3114909, 6448955, 8486875, 9584478, 8561648, 7091096, 9917831, 16735816, 19377899, 12547850, 2438503, -1600125, 547261, 2845370]
35475B845370J424073L590984L313646l178369p827912j979233Q691252J0750510
35467A7630321J206704r660530j2038038o095487J334565M164003J780941k15748
35459a893269M104218J2030311J3206795L084101r570591j3614360r228302m467625
35451f348722k426965J74057L780967L933335p28546m988734l844957J330055
35443i119510N409348N820387M602826M877982N970182L399528m305591j0699575
35435E955577q537063j345777k53517p034209r196727K126279J7283461J9889645
35427A8887669Q261689m524585q787813o569192l299035j264306k255248p607185
35419g158006j2944876j0175800J877482J4076171J7037001J0660365J927068
$$ y = [2845370, 4269443, 7860427, 11174073, 7995704, 167792, -1811441, 6879811, 17630321, 18837025, 9176495, -2861543, -8957030, -7622465, -3458462, -1677521, -1893269, 2210949, 14241260, 27448055, 30532156, 20961565, 7347205, -1881097, -6348722, -8775687, -8601630, -4820663, -887328, -1615874, -6604608, -10449565, -9119510, -3710162, 2110225, 6713051, 11591033, 17561215, 20960743, 16655152, 5955577, -2581486, -3927263, -4180780, -11214989, -20411716, -18285437, -1001976, 18887669, 27149358, 22624773, 13836960, 7267768, 3968733, 2704427, 449179, -7158006, -20102882, -30278682, -28401200, -14325029, 2711972, 13372337, 15299405]
35412A5299405k849966k150636P06061N36759l679259o150261j594933O004214
35404F121384P797276K741061j334382m10178k0455m816215r734641p396869O45668
35395f407351O306232N774924K479494R59480K348420M778770M716128n11172
35387B0444925q101012r914641j665923R606901J2280799L842337p047092j2096069
35379G350225j1494054r205149n881095k11837O218713R595644P994119K480829
35371F847395l845376o024571k26036R642992J2288005K122114j0741530j1500954
35363a437961o68799O358889J237185o209966l783705N786350J1310036R398169
35355B1990198M820125L15383l643589l152512M025418J0381133O765810l414132
$$ y = [15299405, 12449439, 10298803, 11004864, 11541623, 7862364, 1712103, 117170, 6121384, 13918660, 16659721, 15325339, 14915161, 14894706, 10078491, 343850, -7053019, -6407351, -101119, 5673805, 8153299, 9112779, 11461199, 16239969, 20956097, 20444925, 12343913, 2429272, 763349, 10370250, 22651049, 26493386, 19446294, 7350225, -4143829, -13348978, -19230073, -19441910, -13223197, -3627553, 4366566, 6847395, 3002019, -3022552, -3248588, 6394404, 18682409, 20804523, 10062993, -1437961, -2106760, 4252129, 5489314, -720652, -4504357, 1281993, 12592029, 21990198, 26810323, 27125706, 23482117, 20329605, 24355023, 34736156, 41501966, 38087834]
35347C8087834r276913r238259r549137q257185K594902J7468792J8555982K337088
35339D2723104j2591159j2650039p198508q333902r746885j085315J0606504J1706905
35331A3430705M173729o87363k174385o238149r187684m103981K539228j8419
35323b266319o182522k629953O906324P557314Q79491J953419R617978O728605
35315B2564337o579365q844878N044355J1434841k614976j5506787o877941P867305
35307F486891M482777q769605o696484R262152J4930558M623350k815821R38415
35299B2442233K134445o237088j0662414k303110O047579J264830q842581r505205
35291e661311j592038L391652J760952j513999l844153n449616l425173M329905
$$ y = [38087834, 28810921, 19572662, 10023525, 1766340, 4361242, 21830034, 40386016, 42723104, 30131945, 17481906, 10283398, 1949496, -7797389, -8882704, 1723800, 13430705, 17604434, 16917071, 14742686, 8504537, -683147, -4787128, -2247900, -2266319, -8448841, -11078794, -4172470, 3384844, 4264335, 6217754, 15835732, 22564337, 15984972, 7140094, 12184449, 23619290, 21004314, 5497527, -1380414, 6486891, 10969668, 2200063, -4496421, 4765731, 19696289, 24319639, 21503818, 22442233, 24576678, 18339590, 7677176, 5374066, 11421645, 12686475, 3843894, -5661311, -7253349, -3861697, -2100745, -3614744, -7458897, -12908513, -16333686, -12003781]
35283a2003781J2231415J2663569O191711r27268o374903j1376049j3390687p978147
35275b0964140K102982P340291K933683n233628p690900r91527J0175904J7107848
35267D780513J3511669J660871p914189o885178P63523L535069k651546r985962
35259c185230j0373768m918766J311473P099238J2001294J1563016L765161l789304
35251A3473114k519159L667343L900214j945938l584229O25452q6988q189672
35243E340137r304994M481599J6987135R949049p569981j1489980J066591R350116
35235A8809672K397659o972317o625346l377691o831190j1176629n943975N984004
35227a3735813J3130975J0907606K978324o244956j2669021j2492654p527810
$$ y = [-12003781, 227634, 12891203, 19082914, 18155646, 11780743, 404694, -12985993, -20964140, -18861158, -11520867, -8587184, -13820812, -21511712, -22503239, -12327335, 4780513, 18292182, 19953053, 12038864, 5153686, 5917209, 9452278, 6800732, -3185230, -13558998, -18477764, -17166291, -10067053, 1934241, 13497257, 17262418, 13473114, 10953955, 14621298, 18521512, 16575574, 12991345, 13616797, 13529809, 5340137, -3964857, 516742, 17503877, 27452926, 19882945, 8392965, 9459556, 18809672, 21207331, 14235014, 7609668, 4231977, -2599213, -13775842, -19719817, -13735813, -604838, 10302768, 13281092, 7036136, -5632885, -18125539, -25653349]
35220b5653349l939699j465139O631895J8382679K0453775Q021991n626218q522931
35212H283004n751228n178749k228343O936236J1326321K019149q890682n876462
35204F39246L742827K476886p028721p981576J46089K292683l658149m267821
35196a3638536L323315P340952N233942O786412J0369772K346192j3980550j6193991
35188h412492M23613J0670532j774581j8110680j4711380K182408J2346973J3512343
35180c873264J5059391J4456265L544651j1002565j5024321q733725l503208k771971
35172a1848747j939376o33554k13386L423866J0302581R256290m148559j3876021
35164i676906n943568P027006N643275k914214K159203J6755499J6551745j696906
$$ y = [-25653349, -29593048, -31058187, -24426292, -6043613, 14410162, 22432153, 16805935, 8283004, 2531776, -2646973, -4875316, 2060920, 13387241, 15406390, 6515708, 639246, 4382073, 6858959, -169762, -8151338, -8005249, -5712566, -9370715, -13638536, -10315221, -2974269, 2259673, 9046085, 19415857, 21762049, 7781499, -8412492, -7988879, 2681653, 907072, -17203608, -31914988, -29732580, -17385607, -3873264, 11186127, 25642392, 29187043, 18184478, 3160157, -5573568, -9076776, -11848747, -13788123, -14421677, -14635063, -11211197, -908616, 8347674, 4199115, -9676906, -15620474, -8593468, -2950193, -5864407, -3705204, 13050295, 29602040, 27905134]
35156B7905134j4546109j0808342n813384r074721p276456P301674J7882256J0337845
35148A5907897k285157j810496N782782L591849o801871j0039111k804555M103019
35140E644357M560439J758265k209227p054825p575843Q30746J2012077J5363842
35132B3329831R905643K657699l118732q154276r962236o133526j331567q00135
35124F392701r02452L444132P049795K671584l884701j810872M725735J836881
35116A9522803q990910r806316N233755J8078988J2601238k625169r003498l915666
35108B1095225J191572Q64527j77843P33141M62025k038864m152517o039827r842813
35099B094626j2018792n491407Q128947J6562920J1659542M66430l800677J693998
$$ y = [27905134, 13359025, 2550683, -3262701, -12337422, -19613878, -12312204, 5570052, 15907897, 13622740, 11812244, 17595026, 21186875, 14385004, 4345893, 1541338, 5644357, 10204796, 11963061, 9753834, 2699009, -4876834, -4046088, 7965989, 23329831, 33235474, 35893173, 32774441, 24620165, 14657929, 8524403, 7192836, 6392701, 5490249, 8934381, 15984176, 18655760, 14771059, 12960187, 17685922, 19522803, 10531893, 725577, 5959332, 24038320, 36639558, 34014389, 25010891, 21095225, 22286797, 23151324, 22973481, 23706622, 24168647, 22129783, 17977266, 11937439, 2094626, -9924166, -15415573, -7286626, 9276294, 20935836, 21402266, 17601589, 19295587]
35091A9295587P440414M786006m183804j0935357j0719124n851602o71016L339114
35083B500218O751491R076246Q646419M890068j017529p216479j1136462r511453
35075B982519j865371N709629M578271n735822j3863522q111638Q754748K0440961
35067A2889775J4657794k597851j2982850n941479R407968J4602539L419507j0504734
35059B2950669j0145727L944012J4660402R720729m862111j4947567j4880340
35052F440067q751158j239117M627530M236336m217381j2532252r354349L902932
35044a6887392J2907446R387916J511085L68588M604034N907102K936419N53112
35036B1288310l80297k735276m986519k842230J628868J421080m228892q186789
$$ y = [19295587, 26736001, 31522007, 27338203, 16402846, 5683722, -167880, -838896, 2500218, 9251709, 18327955, 26974374, 31864442, 30846913, 23630434, 12493972, 2982519, 1117148, 6826777, 11405048, 5669226, -8194296, -16305934, -7551186, 12889775, 27547569, 24949718, 11966868, 6025389, 15433357, 30035896, 33455403, 22950669, 12804942, 16748954, 31409356, 41130085, 36267974, 21320407, 6440067, -2311091, -3550208, 1077322, 5313658, 1096277, -11435975, -20790324, -16887392, -3979946, 5407970, 6919055, 7287643, 11891677, 17798779, 20735198, 21288310, 20908013, 18172737, 13186218, 10343988, 11972856, 13393936, 9165044, 978255]
35028I78255o235584k040757M03285K068023M261544N286001M438336L647180
35020A2806283K964943J49447l616496m038977j411853o75304j827339R92790
35012E343494P560860Q571458K65076p508617n453360J723026M915501N116897
35004B0534335P222123O942299k179254j3289128j2942742k091776M530747J287191
34996A0013795q81530N727603J1980146O274310p386139j5030286j0559219N4061
34988A92741Q406513J0470399O286182r32691o014079o102269l435375k046143
34980F825278l080483m620501m224142p90902L942515N659457K112943k703088
34972C121077k687104K309094O715840P074871M691632J083633l052295m526664
$$ y = [978255, -5257329, -7298086, -6894801, -4826778, -565234, 4720767, 9159103, 12806283, 15771226, 15920673, 12304177, 8265200, 6853347, 6178043, 4350704, 5343494, 12904354, 21475812, 21740888, 14232271, 8778911, 10501937, 15417438, 20534335, 27756458, 34698757, 32519503, 19230375, 6287633, 4195857, 8726604, 10013795, 9132265, 14859868, 26840014, 33114324, 25728185, 10697899, 138680, 192741, 8599254, 19069653, 25355835, 24423144, 18409065, 12306796, 8871421, 6825278, 3744795, -875706, -5099848, -5890750, -1948235, 3711222, 5824165, 3121077, 433973, 2743067, 9458907, 16533778, 21225410, 22309043, 19256748, 14730084]
34964A4730084p36469L191763j098609j1216436j3832132l025443J0157992J3046974
34956A1217724P946399M735893M006507q30317q202981q110562J447262R003865
34948B1213790N554139k362784k788597L530109M408434m779649j2841953q442652
34940C490837L030713P191624J674640k286329L04692Q19248m918213o136681
34932C170531L402415R101293l090322j8902623j2838246J0914779K1096217N716347
34924A8570391j1292233r083011P63866J7233m416815K960597J4871531J2088387
34916B4479946l923061j3558185r355932j796082K205218N838257Q693275O173453
34908A8756889K592887O211779J1012721K887970j4165327j8382173k097066J5548507
$$ y = [14730084, 13993615, 17185378, 16086769, 4870333, -8961799, -11987242, -1829250, 11217724, 19164123, 23900016, 27906523, 27076206, 18873225, 10762663, 12209925, 21213790, 26767929, 24405145, 21616548, 25146657, 29555091, 24775442, 11933489, 3490837, 6521550, 13713174, 15387814, 13101485, 13406177, 14225425, 9307212, 3170531, 6572946, 15674239, 12583917, -6318706, -19156952, -8242173, 12854044, 18570391, 7278158, -1804853, -1040987, -1023754, -5440569, -2479972, 12391559, 24479946, 20556885, 6998700, -2357232, -4153314, -1948096, 3890161, 12583436, 18756889, 21349776, 27561555, 38574276, 41462246, 27296919, 8914746, 6817680, 22366187]
34900B2366187J5765326L812619l695446j525758M104484P605026O783552J163862
34892E6379852n455869o900276k891871J169941L518472N993944N294695l160550
34884E3948338j2391086j0116278J72596J598393q482265j2154678K47832J4195882
34876B7018734J4728902Q020661N735836M825123r53422m274004K781738J0930973
34868F8814541P539243j402058j812641M025004K687993o341257j0359397l997550
34860E9153878N792586J2113673J1860635K590191j0460135j1824386L878948
34853G3105390J7725831J1009988n109936o583865N132523Q356595K08685j1551
34845A03833660J2023557J6009642K247614j1613283j0479100l314642j470314
$$ y = [22366187, 38131513, 41944132, 38248686, 36722928, 40827412, 48432438, 55215990, 56379852, 50923983, 44023707, 41131836, 42301777, 45820249, 51814193, 57108888, 53948338, 41557252, 31440974, 31613570, 33211963, 24729698, 12575020, 12822852, 27018734, 41747636, 49768297, 55504133, 60329256, 59375834, 55101830, 57883568, 68814541, 76353784, 74951726, 73139085, 77164089, 79852082, 73510825, 63151428, 59153878, 64946464, 77060137, 88920772, 91510963, 81050828, 69226442, 73105390, 90831221, 101841209, 96731273, 90147408, 95279931, 103636526, 103845211, 103833660, 115857217, 131866859, 134114473, 122501190, 112022090, 108707448, 107237134]
34838A07237134J146401J0471954J5636149P881266p42955M279788J6524719K0589256
34830A83023712J5805359J2119631J2440427J3340268J4027461J2981749O473842
34823B70212449J20160P012476K3373738K5064979L785232j4078152n811543J1080699
34815C20760038Q194159n865534j177855K0986498K9142854J2514836n698261
34808C78856735r503849j0001959j5848024j6108699n700016q8450r129891j9555054
34800B92920793j8746976j4707463j6947002j7879023j0347104n311830j3469494
34793A95511901k4463193k2729050j1217806k459927J395547L029754k397728
34786A36669498j5832903k2552252j1183367N594165Q418848n05120o144215p358434
$$ y = [107237134, 108383535, 118855489, 134491638, 142372904, 141629949, 145909737, 162434456, 183023712, 198829071, 210948702, 223389129, 236729397, 250756858, 263738607, 270212449, 270332609, 277345085, 300718823, 325783802, 329569034, 315490882, 309679339, 320760038, 328954197, 323088663, 321910808, 342897306, 372040160, 384554996, 378856735, 369352886, 359350927, 343502903, 327394204, 321694188, 321605738, 312475847, 292920793, 274173817, 259466354, 242519352, 224640329, 214293225, 208981395, 195511901, 171048708, 148319658, 137101852, 134641925, 136037472, 139067226, 136669498, 120836595, 98284343, 87100976, 92695141, 101113989, 100608869, 94464654, 87106220]
34778H7106220j2466736j6590024q444959M913114N285756o610803j2718127q514306
34770C1960135o996277j0662034o467128O323250J0442461J656750j118384J0279136
34762C5417909J4894687l245147k4531589k0581728L551926J8485194J2790576
34755C6781828K397208J222803M185827J624326n908418j1796985j1905098o190610
34747A0410881J216038L511469j214312n957317m263685J57863L66858j821857
34739B405938M73889O993890J0825208Q848948L836025j343827m421716k219812
34731B5398543M075767O395678L61005o922410q247206q376300j3266233j4956621
34723a5537777l263588J2557162J3156962o17264p162174K469302J0968668L260437
$$ y = [87106220, 74639484, 58049460, 49604501, 54517615, 59803371, 53192568, 40474441, 31960135, 24963858, 14301824, 7834696, 14157946, 24600407, 26257157, 25138773, 35417909, 50312596, 47067449, 22535860, 1954132, 5506058, 23991252, 36781828, 39179036, 40401839, 44587666, 46211992, 40303574, 28506589, 16601491, 10410881, 11626919, 15138388, 13924076, 7966759, 3703074, 3860937, 4227795, 2405938, 2879827, 9873717, 20698925, 29547873, 33383898, 32040071, 27618355, 25398543, 29474310, 35869988, 36230993, 29308583, 21061377, 12685077, -581156, -15537777, -18801365, -6244203, 6912759, 6295495, -866679, 1602623, 12571291, 15831728]
34715A5831728r820138r814658J199786O649272J350984m286975k443670L131015
34707A797344O051554N194486K691807P12152O73616J465657j28608l907850m712922
34698I837236o40351J928024k479681q673339p857600j200862K252652k60671
34690g094592k073951J365541O157002P511825O511756N575671K891587l495569
34682A7349270r358837p736183J384130Q932774O236340n018145j4413848j4255921
34674a6880420p101189n59639K790075O315322J0950016J1489021M038168o650318
34666D391036j1545975p754555j086028J572835l90098k428070j520871K46199
34658a8515527n14216k571582j045137N000841R862856Q959228N387997M194334
$$ y = [15831728, 6011590, -3803068, -2603282, 4045990, 5396974, 1109999, -1333671, 1797344, 7848898, 13043384, 15735191, 16447343, 17120959, 18586616, 18458008, 14550158, 9837236, 9196885, 11124909, 8645228, -28111, -7885711, -9086573, -6833921, -7094592, -9168543, -7803002, -1646000, 5865825, 12377581, 17953252, 20844839, 17349270, 7990433, 254250, 1638380, 10571154, 16807494, 11789349, -2624499, -16880420, -23981609, -24541248, -21751173, -15435851, -4485835, 7003186, 11041354, 4391036, -7154939, -14909494, -15995522, -14422687, -14812785, -17240855, -18761726, -18515527, -19029743, -21601325, -22646462, -17645621, -7782765, 1176463, 6564460, 10758794]
34650A0758794L987337Q98264k344786j11064M937901M478905j505662m428521
34642A6671168k334057k952407p644535o153280M880121J1633558L036934j0204870
34634F932632j0847994q61665M173211O33261r99757K495592K056372m781632
34626a199980o900888K149004J2438336J2074808L097078m733867p679417p882709
34618A362365o078757k067520J706062K879056K294434R19462j976643m711137
34610e672678l009585K446418M494877Q6834l746592k10291O424975O989975M69861
34601H273794n832262o684313l448033K46046K275943K297037J660528J918864
34593G07604J758474j359836m921376k327726O224907J0188995K199075j0059244
$$ y = [10758794, 14746131, 15644395, 13299609, 13188545, 18126446, 22605351, 21099689, 16671168, 14337111, 11384704, 3740169, -2413111, 2467010, 14100568, 17137502, 6932632, -3915362, -4777027, -603816, 29445, -970312, 1525280, 3581652, -1199980, -8100868, -5951864, 6486472, 18561280, 21658358, 16924491, 9245074, 1362365, -4716392, -6783912, -5077850, -2198794, 95640, 1015102, -961541, -5672678, -8682263, -6235845, -1740968, -1654134, -5400726, -5611017, 813958, 7803933, 8273794, 2441532, -4242781, -7690814, -7444768, -5168825, -2871788, -1211260, 707604, 2466078, 1106242, -3815134, -6142860, 82047, 10271042, 12470117, 2410873]
34585B410873j3199861n707902K080126L159920K19442k343082l729423k951919
34577b0061826J886697P765762P392944m20267o833989m060880M009702P413332
34569b908525L510578p63707O37609N317489O995399M077196L44373j689080l951773
34560A1569559p714289r029538l793228M250630O601037J982340j083360L281019
34552F064170R345093Q286935N58028o687899j0285204j1353509q203587J155942
34544a1120031J0192221Q498373k146334o736522K486722J3489757J0453505m135063
34536B0982628j3324495q705539N60201K386170l226468p245311l868685M494031
34528g947468J1379102J1979253O480747J32859j363975J794096L415515q06316
$$ y = [2410873, -10788988, -16496890, -14416764, -11256844, -11037402, -13380484, -17109907, -20061826, -18175129, -10409367, -3016423, -3436690, -10270679, -14331559, -10321857, -2908525, 602053, -161654, 475955, 5793444, 12788843, 16866039, 17210412, 15521332, 11569559, 3855270, -5174268, -8967496, -4716866, 1884171, 3866511, 2783151, 6064170, 15409263, 23696198, 24254226, 17566327, 7281123, -4072386, -12275973, -11120031, -927810, 7570563, 5424229, -1312293, 1174429, 14664186, 25117691, 20982628, 7658133, -1047406, -487205, 1898965, -1327503, -8572814, -12441499, -7947468, 3431634, 15410887, 21891634, 22024493, 20660518, 22454614, 25870129, 25063813]
34520B5063813p359713r389781n580376j226621o57012k016705j012153K538772
34512C60224M311618J082303n136214r065626p428348j657488M211803P272285
34504f049443O838699L145442k641195o898508n228377J869972P201729M354428
34496B592747l915955q535410n117348J880004O215504O436346M192752J023647
34488D772287n91349K399493Q670131J1791368Q041665J201003l865115p487913
34480B4931570j0283094p675321K913203J3274610J1949880p80219j3607728j8744243
34472A978658j7345546j1719728k528588N310583M716173k179052m154201L500911
34464b2420790J2216549J3393266R593319O856060M241001j717220q645376j1713274
$$ y = [25063813, 17704100, 8314319, 2733943, 1507322, 850310, -1166395, -2178548, 360224, 4671842, 5754145, 617931, -8447695, -15876043, -17533531, -13321728, -6049443, 789256, 3934698, 1293503, -5605005, -10833382, -8963410, -1761681, 2592747, -1323208, -9858618, -14975966, -13095962, -6880458, -444112, 3748640, 4772287, 4180938, 6580431, 15250562, 27041930, 35083595, 36284598, 32419483, 24931570, 14648476, 6973155, 9886358, 23160968, 35110848, 34330629, 20722901, 1978658, -15366888, -27086616, -29615204, -24304621, -19588448, -21767500, -25921701, -22420790, -10204241, 3189025, 12782344, 19638404, 23879405, 22162185, 13516809, 1803535]
34456A803535j0526078o808989l32855P547211J1945792J1238759R651575Q322452
34448C2841402J823762j0350696j8217675j5587990j0444887j0726022r470327
34441d0132433K333903J6386566J7097770O119431l27565L354744O530970K038046
34433A3401432m815012q793722j1025065j0202770k260113Q171775J0521693N499776
34425D97994M376440Q132094M997079o112622r593586J43331O164311k909226
34417E695815j1380095j879322J3671360J1843884m131772r791758J122124Q532755
34409A3682991k89955j2364586j2113818l873837k10585j491286M38724O299624
34401i922728Q415978K631941o039514q568642l29470J2703200J6343501L083680
$$ y = [1803535, -8722543, -15531532, -15864387, -8317176, 3628616, 14867375, 24518950, 32841402, 34665164, 24314468, 6096793, -9491197, -19936084, -30662106, -40132433, -37798530, -21411964, -4314194, 1805237, 1477672, 4832416, 11363386, 13401432, 8586420, -207302, -11232367, -21435137, -23695250, -15523475, -5001782, 497994, 4874434, 13006528, 18003607, 11890985, 2297399, 2440730, 8605041, 5695815, -5684280, -7563602, 6107758, 17951642, 13819870, 4028112, 5150236, 13682991, 13393036, 1028450, -11085368, -14959205, -15169790, -16661076, -16222352, -9922728, -1506750, 1125191, -4914323, -13482965, -13812435, -1109235, 15234266, 18317946]
34393A8317946j5138061j8024388l244467Q777797K294702j1911197j2444043
34386c1371711K285536J3384877R614676J965689N185516J5547326J6751173L479528
34378C6842610j1320824j3805735n573425J945768L500371L009184L131670R07981
34370A8637600m377281p059923l689839K48741j534318n675246m199851K535858
34362e114259O065118K757435j199729K93214M620463M889947j166530r577095
34354A568564j4572806j2726411n216776K501522N408455M076880K997877L950055
34346a2012640M327190K264690m36847j474332m94902K631957P945314J2083917
34338A4834347R189578j512418j2008058j3353032o093289M59654p55510o764065
$$ y = [18317946, 3179885, -14844503, -18088970, -9311173, -7016471, -18927668, -31371711, -29086175, -15701298, -6086622, -4120933, 1064583, 16611909, 33363082, 36842610, 25521786, 11716051, 6142626, 8088394, 11588765, 14597949, 17729619, 18637600, 14260319, 7200396, 3510557, 3759298, 2224980, -3450266, -7650117, -5114259, 950859, 3708294, 2508565, 2801779, 7422242, 12312189, 11145659, 1568564, -13004242, -25730653, -30947429, -28445907, -23037452, -18960572, -15962695, -12012640, -7685450, -5420760, -5857607, -7331939, -7826841, -5194884, 2750430, 14834347, 24023925, 22511507, 10503449, -2849583, -8942872, -8483218, -9238728, -16002793]
34330a6002793q500921j223349J0044769J5459885J0175920j277201r801511r586870
34322a0712071j818171O727402Q516731K231096l929582k14309J1143333J5617913
34314B7562342M090567j4025274k1687970j4544213l054093K759936K124375j418211
34306a8192541m379786k400730O001242J3493796J0740914R17770k398663N046967
34298H828969J1236131O202128l148638m962482m59235N19318m031992p548944
34290F635255p221345o102992m436953O80388O936068P776667K853287j287252
34282E833123k111960l381441m597820Q77107J1961123J5035237K528900j1971878
34274A4172391j0121173L853080P365930p614113k1324484j3688967P517828J8735402
$$ y = [-16002793, -24503714, -25727063, -15682294, -222409, 9953511, 8676310, -1125201, -10712071, -12530242, -5802840, 2713891, 4944987, 1015405, 801096, 11944429, 27562342, 31652909, 17627635, -4060335, -18604548, -21658641, -18898705, -16774330, -18192541, -22572327, -24973057, -18971815, -5478019, 5262895, 6180665, 3782002, 8828969, 20065100, 26267228, 23118590, 18156108, 17696873, 18216191, 14184199, 6635255, -586090, -6689082, -11126035, -10445647, -3509579, 4267088, 7120375, 5833123, 3721163, 339722, -4258098, -3380991, 8580132, 23615369, 26144269, 14172391, 4051218, 7904298, 15270228, 7656115, -13668369, -27357336, -19839508, -1104106]
34266a104106J2861901L622134O22269k105455r109895j2243348n897849L01760
34258a3052589l028137p563947o82517J1491038J2272635J495110m913741k020788
34250f002936k213574j0452844j3474476k642434J0269302J2101188P846452P518517
34242B949195P282485L1298o425285n74028J0454646Q978869n924400j7101225
34234c28445j4551236n520896J240304N727648Q860612Q217589M753107K574117
34226A0972800P00161l997673o578994k29672Q268277N492088n481744p330065
34218A815178K778043O874367m068346j4418898r507342J629634L892576K78380
34210a0726408J382011M492220J899939r37372M831935J2109959Q303158j535449
$$ y = [-1104106, 11757795, 15379929, 16002198, 13896743, 4786848, -7456500, -13354349, -13052589, -16080726, -23644673, -24327190, -12836152, -563517, 931593, -3982148, -6002936, -8216510, -18669354, -32143830, -34786264, -24516962, -12415774, -4569322, 2949195, 10231680, 10262978, 3837693, 3263665, 13718311, 22697180, 16772780, -328445, -14879681, -20400577, -19160273, -13432625, -4572013, 3645576, 8398683, 10972800, 11672961, 7675288, 1096294, 866622, 9134899, 14626987, 9145243, 1815178, 4593221, 11467588, 7399242, -7019656, -16526998, -14897364, -11004788, -10726408, -9344397, -4852177, -2952238, -3889610, 942325, 13052284, 21355442, 19819993]
34202A9819993k471917M337395M491919l921653q910461p402222p425943p679410
34194i162299J285692J3233616R397709q208098j3342142L298412J5902540L595278
34186A6000708j5625387j3922879L051849R133298N24440l722909K450767M928141
34178B818028k064712o631704k657852J19117m046246o593437j829631K559216
34170a8327221K72753l041285j613617J483861L770798P942365J0802992L110158
34162D400804j1692632j5230836j280084J1518776P358026k678678j086689O685923
34154b005390M414090n022201n921537J211750J973511l795994j849478P759012
34146c236237P876170m570797j0013711J252299J1703341N978291l518793R24671
$$ y = [19819993, 17348076, 21685471, 26177390, 22255737, 13345276, 5943054, -1482889, -9162299, -7876607, 5357009, 14754718, 6546620, -6795522, -3497110, 12405430, 16000708, 375321, -13547558, -10495709, -1362411, -837971, -4560880, -2110113, 2818028, 753316, -5878388, -8536240, -8417123, -12463369, -19056806, -20886437, -18327221, -18054468, -21095753, -22709370, -21225509, -17454711, -9512346, 1290646, 4400804, -7291828, -22522664, -23802748, -12283972, -4925946, -7604624, -8691313, -2005390, 2408700, -2613501, -8535038, -7323288, -5349777, -9145771, -10995249, -3236237, 4639933, 69136, -9944575, -8692276, 3011065, 8989356, 5470563, 6395234]
34138F395234J1341417Q022974o492804j1265069o26110Q370038L562841o345073
34130A2963448q582720l998256o15021k40417M89869K005711J482707k118148
34122A387173o356894p254576k583220M419243O223351J86418n392258o28144
34114i998907J1341407J6358807P011877q297043j6431377j3801650o185483P96194
34106a9206175N975268R343896R248000M469034k353932n596199k397049L535343
34098C018186O310586N003983K513272j368494q653442j4394422q972076O364124
34090a0178283J6063610J0160015j100206k466702M241002N746411p53547n622370
34082A6089930l955429l94065K229510N041207M300139m617749j3511211p952273
$$ y = [6395234, 17736651, 25759625, 19266821, 8001752, 7375642, 15745680, 19308521, 12963448, 4380728, 382472, -232549, -472966, 16903, 2022614, 3505321, 1387173, -4969721, -12224297, -14807517, -10388274, -4164923, -3978505, -9370763, -9998907, 1342500, 17701307, 24713184, 16416141, -15236, -13816886, -20002369, -19206175, -13230907, -3887011, 5360989, 9830023, 7476091, 1879892, -517157, 3018186, 9328772, 14332755, 16846027, 15477533, 6824091, -7570331, -16542407, -10178283, 5885327, 16045342, 14945136, 12478434, 16719436, 22465847, 21712300, 16089930, 12134501, 11740436, 13969946, 19011153, 23311292, 18693543, 5182332, -2769941]
34074b769941Q923232J5998702M101639r736119p361334N679522J2287944Q600927
34066C5724572K892911j245326o085879r391545o161409J462369O036526M543132
34058B7775351j008980q565928j4252069j1072797J795531J3225238J2713806
34051B0610152M451388J00393K311218M875161M607252K737188j590786q554366
34043B9547600j1751431n761980L434022O228091L972370M015782M004602m245161
34035B9443895j6429050j7196206k727496J1980624J3080534L724162m725898
34028A7150565p093340m945206j497140q79692n512069j0823448r159985p48271
34020b3508586O446327Q398000P904375N742000j67048n608034k581074O025032
$$ y = [-2769941, 6153291, 22151993, 26253632, 16517513, 9156179, 14835701, 27123645, 35724572, 38617483, 37372157, 31286278, 21894733, 15733324, 17195693, 23232219, 27775351, 26766371, 18200443, 3948374, -7124423, -5328892, 7896346, 20610152, 25061540, 25161933, 27473151, 32348312, 36955564, 39692752, 38101966, 29547600, 17796169, 12034189, 15468211, 21696302, 25668672, 29684454, 33689056, 29443895, 13014845, -4181361, -6908857, 5071767, 18152301, 21876463, 17150565, 10057225, 5112019, 3614879, 2735187, -2776882, -13600330, -22760315, -23508586, -17062259, -8664259, -759884, 4982116, 4815068, -792966, -3374040, 2650992]
34012B650992P392398q13995m742581L620446J2250181P368972n492227j1208517
34004A1025669p281825l116295k783552j726140J829157L742509K107939k4055
33996C773407j90505J212147L221214M267352K211031j565609j978198J613082
33988A2563921K276686m134377j1076034j0172761k830193L591331N909179M533263
33980F61015j363442r874086j2926715n943757L339962M617284m93949k515246
33972b4498934J646433P709766J2625731J4273479P782366o176168j4345443n881338
33964f864108R105191J1214203K4336o192158M42261O986095L035562l283270
33956A4468112j602385L297041J772629m183346o489658m711655l140963q62800
$$ y = [2650992, 10043390, 9229395, 4486814, 8107260, 20357441, 27726413, 22234186, 11025669, 3743844, 627549, -2156003, -3882143, -2052986, 1689523, 3797462, 3773407, 3582902, 4795049, 8016263, 12283615, 14494646, 12929037, 10950839, 12563921, 14840607, 10706230, -369804, -10542565, -13372758, -9781427, -3872248, 661015, -702427, -10576513, -23503228, -29446985, -26107023, -21489739, -21983688, -24498934, -22852501, -15142735, -2517004, 11756475, 19538841, 13362673, -982770, -6864108, 2241083, 13455286, 13479622, 7287464, 7729725, 14715820, 17751382, 14468112, 12865727, 16162768, 17935397, 13752051, 7262393, 2550738, -590225, -1453025]
33948a453025M367735P600405K895311n384451p531357k540241J910379J793147
33940A657903M7687j610624n028152q738024p180910K49442O030302M370093n61366
33931a0763649q04947M119427P338541N177906K188393L489406O227196L374605
33923B0346878n528172j3082715j4038890j0598203n693806J899198J0959562
33916a5736148J3552226N419475m699542n663038J68556K245137m54451j27244
33908e295029K929028m30373r719355j1460286m04764J0350905Q913132J212791
33900c903951j876118j620666l341677k439875O277887J3494375O569295q466833
33892D692437j2919114k310828Q566433Q667580L750105K614197L654252J551149
$$ y = [-1453025, 2914710, 10515115, 13410426, 8025975, 494618, -2045623, -135244, 1657903, 1705590, 94966, -4933186, -13671210, -20852120, -20602678, -14572376, -10202283, -10763649, -11568596, -7449169, -110628, 5067278, 7255671, 10745077, 16972273, 20346878, 14818706, 1735991, -12302899, -22901102, -28594908, -26695710, -15736148, -2183922, 3235553, -1463989, -7127027, -6958471, -4713334, -5167785, -5295029, -2366001, -2796374, -12515729, -23976015, -24380779, -14029874, -5116742, -3903951, -5780069, -7400735, -10742412, -13182287, -6904400, 6589975, 13159270, 4692437, -8226677, -10537505, -1971072, 6696508, 10446613, 13060810, 16715062, 18266211]
33884A8266211k672618n336357o897723q841105q704115l592636M203935Q675064
33876d899344N770205k829848r423132n632291P506284J7080367J2117202k253893
33868A7435550j1829337j1972744r334843o725427L79605J0114407J1381257J455851
33860I04319o083815n25215R276115Q845893L94670k626317J721541J917069o361233
33851G463027j2149814o287980M486624P319467l2311q928204j1614023p121496
33843b6864710J408263R287781J1620638P288550J310597p67490k27560k585979
33835D70090q011763r892566m582541K846145N958514N252151M294566J910634
33827a754770m731609j1635232j0941386k625495M607080N431302L185158J392625
$$ y = [18266211, 15593593, 10257236, 3359513, -5481592, -14185707, -17778343, -13574408, -4899344, 870861, -1958987, -11382119, -17014410, -9508126, 7572241, 19689443, 17435550, 5606213, -6366531, -15701374, -22426801, -22047196, -11932789, -551532, 904319, -5179496, -5704711, 3571404, 12417297, 12811967, 10185650, 11907191, 13824260, 7463027, -4686787, -10974767, -6488143, 831324, 799013, -8129191, -19743214, -26864710, -25456447, -16168666, -4548028, 2740522, 4051119, 3283629, 3056069, 470090, -7541673, -17434239, -22016780, -19170635, -13212121, -7959970, -3665404, -1754770, -6486379, -18121611, -29062997, -31688492, -27081412, -21650110, -18464952, -17072327]
33819a7072327j016165k864685P15909P324712N635397o754141j4424784n127981
33811c3584065R594001J0320457l60069k574348Q564169J5735347P543881n283650
33803I955723r108462o211358m714625l788899m16873L26842o062512j2919095
33795c2939259j1629794m512791J311973N483216R799006R902192L013372k844562
33787b2416647O68549Q425422J0383309P614893O853555N651739j591716q225524
33779G363580l803849N202660K883039q154161p827134Q170883J8099342O956598
33771B8890958j0117278j1684522j573274J197986o360102r524266j601990O277636
33763d494852K821034q713169j6828483j4586796l746863P930119J2247894P866400
$$ y = [-17072327, -18088492, -20953177, -20237268, -12912556, -7277159, -14031300, -28456084, -33584065, -23990064, -13669607, -14029676, -16604024, -8039855, 7695492, 15239373, 9955723, 847261, -5364097, -10078722, -13867621, -14284494, -13957652, -20020164, -32939259, -44569053, -49081844, -47769871, -42286655, -32487649, -22585457, -19572085, -22416647, -21748098, -13322676, -2939367, 4675526, 11529081, 17180820, 15589104, 7363580, 3559731, 8762391, 11645430, 3491269, -4335865, 3835018, 21934360, 28890958, 18773680, 7089158, 5515884, 6713870, 353768, -9170498, -10772488, -4494852, -1673818, -10386987, -27215470, -41802266, -45549129, -37619010, -25371116, -17504716]
33755a7504716J899808Q46003K545587J922216P57736M010773Q817066O699925
33747I994398k554306q240676l220970N948128P814622J40643r172734j1867203
33739a1158098n870553N344778J5230201J6817289P583423o696034j5667768j4264789
33731h681551p585368l759977l424964n29275O211450R104216L126668l904497
33723i443298j069739Q578494J1034874K006967o488520m235677K855581L523508
33715F762190k356121o792038o491952l232403K989576J0836445J2246226J859071
33707A5820994j0920022j1598648j232941N417848K622909L13104M668214O852353
33699A1943811r13240j0221298q454158K016200P819199L214694n174913r264737
$$ y = [-17504716, -15604908, -14758905, -12213318, -10291102, -9533366, -5522593, 3294473, 9994398, 7440092, -800584, -4021554, 1926574, 9741196, 9881839, 709105, -11158098, -17028651, -11683873, 3546328, 20363617, 27947040, 21251006, 5583238, -8681551, -16266919, -20026896, -23451860, -23981135, -17769685, -8665469, -5538801, -9443298, -10513037, -1934543, 9100331, 11107298, 4618778, 383101, 3238682, 6762190, 4406069, -2385969, -8877921, -12110324, -9120748, 1715697, 13961923, 15820994, 4900972, -6697676, -7930617, -2512769, 110140, 423244, 5091458, 11943811, 11030571, 809273, -7644885, -5628685, 2190514, 5405208, 230295, -9034442]
33691i034442o228876L381915J5295352K0102640J0901839o200386j6009743j1040542
33683A167757L07508M571839j234466p503976m345192N778520R573721r56931
33675G358780j6002642j7707742l156588J0697611R537086M75363k56728Q334103
33667g20757J2071362L687209p604488j0364418m643761J951328M271219K375754
33659A023448o430J981345P963294R056849j260179j3804205j2239233L416518
33651c868593J4558167R911415K48963r32215J918298k246491r787288q639757
33643A162499L51110N263784L637237M446276R427215R120998Q46932n045020
33635B9211031k719011l40844m224004o797612q32956N673144J773128p381607
$$ y = [-9034442, -15263318, -11881403, 3413949, 23516589, 34418428, 28218042, 12208299, 1167757, 1475265, 6047104, 4812638, -2691338, -7036530, -1258010, 8315711, 7358780, -8643862, -26351604, -29508192, -18810581, -9273495, -8798132, -9054860, -720757, 11350605, 15037814, 7433326, -2931092, -7574853, -5623525, -1352306, 1023448, 1017018, 2998363, 10961657, 20018506, 18758327, 4954122, -7285111, -3868593, 10689574, 20600989, 20849952, 19917737, 21836035, 19589544, 9802256, 1162499, 1513609, 6777393, 10414630, 14860906, 24288121, 33409119, 34256051, 29211031, 26492020, 26151176, 21927172, 15129560, 14296604, 19969748, 21742876, 14361269]
33627A4361269p905293R26155O155860J272644n933023o870035k617248J709448
33619A099777M031708L555733n74068n499614n635074m35953L970575L047773
33611C560857j410491o144356r752797r351888j364376J0652414J6074800J0302217
33603A2566380J680142m82307J070753k010614q915786j0792259n118131L35214
33595a1666608n44430l724552j862964N193869J0526268Q651111J354858m552639
33587C374913m630373j694815j786834n181527n491151K4456M722308K582394
33579h080629j244184J335530N929232M37962j3849581j8932312m124575J6950279
33571b1578278K2638939R638547o810857j4129498j2340843m883510P510613K0164902
$$ y = [14361269, 6455976, 7382131, 13537991, 14810635, 8877612, 2007577, -609671, 1099777, 5131485, 8687218, 8113150, 2613536, -3021538, -3457491, 513084, 3560857, 2150366, -3993990, -13746787, -23098675, -24463051, -13810637, 2264163, 12566380, 14246522, 13764215, 14834968, 12824354, 3908568, -6883691, -12001822, -11666608, -12211038, -15935590, -17798554, -12604685, -2078417, 6572694, 7927552, 3374913, -1255460, -2950275, -4737109, -9918636, -15409787, -15385331, -10663023, -8080629, -9324813, -7989283, -2060051, -1622089, -15471670, -34403982, -38528557, -21578278, 1060661, 10699208, 3888351, -10241147, -22581990, -27465500, -19954887, 210015]
33563B10015K2114791Q224727j0948380j8442528r075853O198047J3659771J0290680
33555B2231270K780175k929408o634649q885076o830570M00908N823014J873753
33547G829417o642719o149431N946931J5023962R830274m09591j031256L856734
33539B8254321j316896j5344635j9016871n513257P604038O123078R41830P065042
33531H796650J5537916P212954j3288359k0778800o909647P420336L501231r874100
33523h381819j3676228o942244k886481m892883k757285P983137J6827967J3145234
33515a580602J708737l503279J936104O910759l47264j5135117j9869783o130298
33507c6010743J2950459J8164924Q029768j752653j443204J275403l353598j0795281
$$ y = [210015, 22324806, 30549533, 19601153, 1158625, -7917228, -1719181, 11940590, 22231270, 25011445, 22082037, 15447388, 6562312, -268258, 132650, 5955664, 7829417, 1186698, -4962733, 984198, 16008160, 25838434, 25428843, 24397587, 28254321, 26937425, 11592790, -7424081, -12937338, -5333300, 789778, 1731608, 8796650, 24334566, 31547520, 18259161, -2519639, -9429286, -2008950, 1492281, -8381819, -22058047, -29000291, -31886772, -36779655, -39536940, -31553803, -14725836, -1580602, 128135, -3375144, -1439040, 5471719, 5124455, -10010662, -29880445, -36010743, -23060284, -4895360, 3134408, 1381755, -61449, 1213954, -2139644, -12934925]
33499a2934925r623695P54522R209460Q032416J523468j060111L583016R864040
33491I348191R342456J42851r502648j0012642k636991K532910J376040L71728
33483I61895L142017K322252p410433j6814241j3598114j003415O861943N060305
33475b0477791J372902J439358K459699K210287K976959M452411K548095k464497
33467e482577n290601m439913l053679p16428N313609J0564974P446174J69964
33459D511523J150694R148325P581681q166782j9120915j0486459M661537N786338
33451d934058l749894n481590K615608N618853l87602k421371M774622Q956662
33443D991230K440863l624282K222595J2228458J1037883j564498j1867624j1774299
$$ y = [-12934925, -22558620, -21804098, -12594638, -4562222, -3038754, -4098865, -515849, 9348191, 18690647, 18833498, 9330850, -681792, -3318783, -785873, 590167, 961895, 4103912, 6426164, -984269, -17798510, -31396624, -32400039, -25538096, -20477791, -19104889, -17665531, -15205832, -12995545, -10018586, -5566175, -3018080, -5482577, -10773178, -15213091, -18266770, -18983198, -13669589, -3104615, 4341559, 4511523, 5662217, 14810542, 22392223, 14225441, -4895474, -15381933, -10720396, -4934058, -8683952, -14165542, -11549934, -5931081, -6318683, -8740054, -3965432, 4991230, 7432093, 3807811, 6030406, 18258864, 29296747, 27732249, 15864625, 4090326]
33435D090326o196452k419312j338526n04281O27813J212077J460457J947372
33427a120526J438292k230389p698689q155204J793928J6221085K0515606Q478961
33419B9243064p999235j2918709o033603n52869l580497q790052q604833l820815
33411b3057549R96553L389186K268558r21137O96679J1911255K3739942K0701193
33403C9724680L233514r657637o361358J573667p96340q474254o971740K399061
33395A4669593M500524n037019j3096805r048555J100097M953195n45717q268659
33387a0773346j0431456n556207J216927L704560K108064K567557O894466Q107986
33379b161449J763108m503374j808493M746364L427393m709095p482812k138950
$$ y = [4090326, -2106126, -4525438, -5863964, -6368245, -5740432, -4528355, -3067898, -1120526, 317766, -1912623, -9611312, -17766516, -15972588, 248497, 20764103, 29243064, 21243829, 8325120, 2291517, 1738648, -1841849, -10631901, -19236734, -23057549, -22060996, -18671810, -16403252, -17324389, -16627710, -4716455, 19023487, 39724680, 42958194, 33300557, 26939199, 28512866, 27716526, 19242272, 12270532, 14669593, 19170117, 14133098, 1036293, -8012262, -6912165, -1958970, -2504687, -10773346, -21204802, -26761009, -25544082, -21839522, -19731458, -17163901, -10269435, -2161449, -398341, -4901715, -6710208, -1963844, 1463549, -3245546, -10728358, -12867308]
33371a2867308Q23445k949831l944978L150971Q328405L271476l001071J343913
33363e844978J0011953P460838o133777j4412159q779018J370739M933764L264935
33355h127703K863633L665480J875608j457616j754431J930485O037544P094406
33347A2127406M011376j921495o490381m883987J908105N773822R73441p181506
33339D316781q530044j917522L545494J993237j392571Q9870L449943J194528
33331B749716n579563p669213j593176M886265L975207j698940m212937j301618
33323a0444259K757594M060932K160587j390445l410522n98538N229293O844728
33315E209370J606091k487939J942993Q236554L799115r739386j6514383q845877
$$ y = [-12867308, -12043863, -14993694, -18938672, -15787701, -7459296, -4187820, -7188891, -5844978, 4166975, 11627813, 5494036, -8918123, -17697141, -16326402, -11392638, -8127703, -5264070, -1598590, 277018, -1180598, -2935029, -1004544, 5033000, 12127406, 16138782, 14217287, 7726906, 2842919, 4751024, 10524846, 11498287, 4316781, -4213263, -6130785, -2585291, -592054, -1984625, -1894755, 1555188, 2749716, -2829847, -10499060, -12092236, -7205971, -3230764, -4929704, -9142641, -10444259, -7686665, -3625733, -1465146, -2855591, -6266113, -6864651, -1635358, 5209370, 6815461, 4327522, 6270515, 14507069, 18306184, 8566798, -7947585, -16793462]
33307a6793462K084122L336223k474733m780822j430747K134119M014094N821259
33299h089947N224383r98697p943455o707819J842051O454207Q44071p912298
33291a7287504r550288l145050M310495P415516O445707M445067L520850L216376
33283f28831J244891l323722p658150p668765k852372L026186N646532L097528
33275i116703l258434q593320p387189K62767P032160O901468L116617K763614
33267h279020N515640M298198l304343j0903489j1342754l424259R201142J9500203
33259A261318J8152435K266198j5416649j6229595Q50927J4885870R068857p721543
33251G117818j4888316q103577n26818J63045Q86972O941239J0223086J811114
$$ y = [-16793462, -14709340, -11373117, -13847850, -18628672, -20059419, -17925300, -13911206, -8089947, -2865564, -3864261, -11807716, -18515535, -16673484, -10219277, -9375206, -17287504, -26837792, -29982842, -25672347, -18256831, -11811124, -7366057, -3845207, -628831, 616060, -2707662, -10365812, -18034577, -20886949, -17860763, -12214231, -9116703, -12375137, -20968457, -28355646, -28092879, -21060719, -14159251, -11042634, -8279020, -2763380, 1534818, -1769525, -12673014, -24015768, -27440027, -18238885, 1261318, 19413753, 21679951, 6263302, -9966293, -9115366, 5770504, 14839361, 7117818, -7770498, -15874075, -16400893, -16237848, -15350876, -8409637, 1813449, 3624563]
33243C624563j1872459j5497257m876809Q008204J0922671N486766J788111L533550
33235A117340M812848J031491l667548l378758J73675J177892k56552P88872L711860
33226E511120K123132l976856n054513L449652J1354928O404772q592885j9639553
33218h420203j8938261j0209787K52385Q662419J1504134P717299L248684M875315
33210a308015R299680P187107j662251p323606n585041l575949n571511m691306
33202a3230892M073537J2622019J1094081K939204j625384j406585k486188m875557
33194G104235k987696K029223K221313m041142r377451r570845q186997o333407
33186b9142767J136766J3414726J7883189N916382j1813577j6355900m281859
$$ y = [3624563, -8247896, -23745153, -28621962, -20613758, -9691087, -4204321, -2416210, 1117340, 5930188, 6961679, 3294131, -84627, 89048, 1266940, 1010388, 1799260, 5511120, 7634252, 3657396, -1397117, 2052535, 13407463, 19812235, 11219350, -8420203, -27358464, -37568251, -37315866, -28653447, -17149313, -9432014, -6183330, -1308015, 7991665, 15178772, 13516521, 6192915, 607874, -2968075, -8539586, -13230892, -9157355, 3464664, 14558745, 17497949, 15872565, 14465980, 11979792, 7104235, 4116539, 6145762, 8367075, 4325933, -5051518, -14622363, -22809360, -29142767, -28006001, -14591275, 3291914, 9208296, -2605281, -18961181, -23243040]
33179b3243040R206713J0756392L291416k430209k633652j436944j850281k624070
33171a0963675k835340l658372m478416k093222L499422O408146K406130l192702
33163a4908029j313439P245253J1021905L803922n474294n106470K113285L081978
33155D64111n826067j3282224r423430J248001P927253P114547K342136l431149
33147a2866822p739948n446567N667842J7838611J9753501R965891k498548j0193978
33139A4479982j2814826j1228336m780272L390668O654221M144766K452811M328337
33131F627351L859937j629639l971951K383597P141835k290572j7855089j7272089
33123b3006620M352286K4235686K0774546J233513j0212475m797257L312169n8165
$$ y = [-23243040, -14036327, -3279935, 11481, -2418728, -5052380, -6489324, -8339605, -10963675, -13799015, -17457387, -21935803, -24029025, -20529603, -14121457, -11715327, -14908029, -16221468, -8976215, 2045690, 5849612, 375318, -4731152, -2617867, 464111, -5361956, -18644180, -28067610, -26819609, -18892356, -11777809, -9435673, -12866822, -20606770, -26053337, -20385495, -2546884, 17206617, 27172508, 24673960, 14479982, 1665156, -9563180, -14343452, -10952784, -4298563, -153797, 2299014, 6627351, 10487288, 8857649, 4885698, 7269295, 14411130, 12120558, -5734531, -23006620, -18654334, 5581352, 26355898, 27589411, 17376936, 12579679, 15891848, 15833683]
33115A5833683j0848674j5105906p758558K606809N043707j516922p320187k496299
33107b1562347J0883673J9040216J1406053n928755j5926627j0184875J750234
33100a0522428N078237k022877p547064k195164Q432593J1327956L187179n373610
33092C64822m234364K793062M373100j465715n099723p69490M745648L563126
33084D270466j197604k311859j150462l603168p244210m017988N229738J0513920
33076D88833Q294866N842148O876833M521866n498010j5150667j5602728r732471
33068a9959330m497737Q38936Q343146J0896800J689442j0200966q890879M245803
33060a7534785J0791639K361215p379723m555576M211748L963079m740151p597723
$$ y = [15833683, 4985009, -10120897, -17879455, -15272646, -10228939, -11745861, -19066048, -21562347, -10678674, 8361542, 19767595, 13838840, -2087787, -12272662, -10522428, -5444191, -7467068, -15014132, -17209296, -8776703, 2551253, 5738432, 364822, -3869542, -1076480, 3296620, 1830905, -3268818, -4038308, 707340, 4270466, 3072862, 761003, -389459, -3992627, -11236837, -15254825, -10025087, 488833, 8783699, 14625847, 21502680, 26024546, 20526536, 5375869, -10226859, -19959330, -24457067, -23618131, -15274985, -4378185, -2688743, -12889709, -21780588, -17534785, -6743146, -4381931, -11761654, -16317230, -12105482, -8142403, -12882554, -20480277]
33052b0480277J201437J1325277J1912279M442973l473521q723746j1356015q752172
33044b3903765Q59984J1261677J2724800M830210k099087j373582R60983k899572
33036C61648q376034m858636O240951J1256412M076094m834691m599996P17173
33028a7079J187170k578630k914622L9175q42552n414620m731597M193458J1850780
33019G71483Q523584l354536j2714779j1450428o74838J0656267J2620411L804930
33011H182094o124045p204295j012989L214403J730313j430311l161778l866424
33003i673032k405869K618927P028404N579394J557894J873325L926502j53263
32995A0352282o735816l626278P973101J1572830J249411q069043n260094n98186
$$ y = [-20480277, -19278840, -7953563, 3958716, 8401689, 4928168, -3795578, -15151593, -23903765, -23043781, -11782104, 942696, 5772906, 3673819, 2300237, 3261220, 361648, -8014386, -12873022, -6632071, 4624341, 8700435, 3865744, -734252, -17079, 1170091, -1408539, -4323161, -4283986, -5126538, -10541158, -15272755, -11079297, 771483, 9295067, 5940531, -6774248, -18224676, -18899514, -8243247, 4377164, 8182094, 2058049, -5146246, -6159235, -2944832, -1214519, -2644830, -5806608, -9673032, -12078901, -9459974, -2431570, 3147824, 4705718, 6579043, 10505545, 10352282, 3616466, -9812, 7963289, 19536119, 20785530, 12716487, 7456393, 6858207]
32987F858207n712299j1845741n015186R399885J5632294J1922480P285649J617736
32979C0143025j0489508k1018982j5779681J19177N665826l906957q761832M636377
32971a9392555K2110011K2011715M024522j3542146j6814263o867039P059263
32964a410492J6050009J5628681P321331l618846j2386242j5123110q958507K614137
32956A16961Q237786J514042p349465l501666J0350753J6105775N421816r872195
32948B1023807j5135564q908250J584519R269872P865823m610882j8308459j8481584
32940b5700718m573632Q324326J0640680Q293345P189891K945485n928414r426274
32932h235311j912310N970971L592203k680142k122885J138663k766072r007155
$$ y = [6858207, 1145908, -10699833, -15715019, -6315134, 9317160, 21239640, 28525289, 30143025, 19653517, -1365465, -17145146, -17025969, -11360143, -15267100, -24028932, -19392555, 2717456, 24729171, 28753693, 15211547, -1602716, -8469755, -1410492, 14639517, 30268198, 37589529, 33970683, 21584441, 6461331, -2497176, 116961, 8354747, 9868789, 2519324, -982342, 9368411, 25474186, 30896002, 21023807, 5888243, -3020007, -1435488, 7834384, 15700207, 11089325, -7219134, -25700718, -30274350, -21950024, -11309344, -3015999, 4173892, 7119377, 1190963, -8235311, -10147621, -4176650, -584447, -3264589, -5387474, -4248811, -7014883, -16022038]
32924a6022038m102059J0991859K0038610J3908320P33446p455270p607064l740699
32916F745105o90251j230636l754621l316278Q89083K834133l81850j808372M328639
32907C614952J0797763O739823n229330j2117855q488349j102142K972881L348202
32899E35945K093365J010079K555223O339646O410968r69923r553823j0659860
32891b238380n396445j282117j07466J904606M859027N350038L408406Q34953
32883G332622m001136j1011497j2738885m214832O172078P218315J760973J47225
32875i335137J561384k513751q916799m634152J0711304K0970281J6091197M136032
32867B8070359m036621q724114j3938605j7212985j3925344m936432M380609Q356993
$$ y = [-16022038, -20124097, -9132238, 10906372, 24814692, 25548138, 18092868, 10485804, 6745105, 6054854, 4824218, 1069597, -2246681, -1357598, 1476535, 1094685, -713687, 3614952, 14412715, 21152538, 15923208, 3805353, -4682996, -5785138, -2812257, 535945, 2629310, 3639389, 6194612, 12534258, 18945226, 17975303, 8421480, -2238380, -7634825, -8916942, -9024408, -7119802, -2260775, 3089263, 6497669, 7332622, 3331486, -7680011, -20418896, -24633728, -18461650, -11243335, -9482362, -9335137, -7773753, -10287504, -19204303, -23838455, -13127151, 7843130, 23934327, 28070359, 24033738, 15309624, 1371019, -15841966, -29767310, -34703742, -30323133, -21966140]
32859b1966140M902166M06788N692707J8661286J9692870j318406k2778169j7533560
32851a4240458N220768J1151752o975905j8921735n539996J3194110J3259479
32844b851985K223165l32883M134427K731364k587698j817585J382428l133697
32836b52464j0882944q778002K987179J2097034J2656009Q236007J691044n055096
32828A2698767p039017l791719l377143q248126p848628K307204P716479k380570
32820i962753j2915551m593520J3581568J7362434N175676k580084J646656M414019
32812A2128445j544305o399675l442297P25545R33706L02773j194502p625713
32804f116023j3710699q259849N913367J3226038R453756O104264P309523K792808
$$ y = [-21966140, -17063974, -16657186, -10964479, 7696807, 27389677, 26071271, 3293102, -14240458, -9019690, 2132062, -4843843, -23765578, -29305574, -16111464, -2851985, -628820, -961703, 3172724, 5904088, 3316390, 1498805, 2881233, -252464, -11135408, -19913410, -16926231, -4829197, 7826812, 16062819, 17753863, 12698767, 5659750, 1868031, -1509112, -9757238, -17605866, -15298662, -7582183, -9962753, -22878304, -27471824, -13890256, 3472178, 8647854, 6067770, 7714426, 12128445, 10584140, 4184465, 742168, 1467713, 2401419, 2704192, 1509690, -6116023, -19826722, -28086571, -22173204, -8947166, 506590, 6610854, 13920377, 16713185]
32796A6713185r785729j5815780o682029N931351Q936878N145179J617984l480581
32788B580458j0877745j1604718j401013Q236921O035940k175819m171843P31459
32780a2646360N789367R674893J3462181J2804311M939370k915864l093084J63427
32772B8178241k070795q834835j1580814p091209L45995O358137R002585O927759
32764B1235064Q70139n365513q604173p870712k198052O753335J0728761L353088
32756A8901937p430854p483231K235694O952832K397144K44134M871317M812340
32748B5501313l976205p237044K165802Q078630k556561j5128472r570417P509384
32740D786430J4818032Q881864K262930j240565o766566j0822530o024401J779378
$$ y = [16713185, 6927456, -8888324, -15570353, -9639002, -702124, 4443055, 6061039, 2580458, -8297287, -19902005, -21303018, -13066097, -7030157, -9205976, -13377819, -12646360, -6856993, 2817900, 16280081, 29084392, 34023762, 31107898, 28014814, 28178241, 26107446, 17272611, 5691797, -1399412, -1053417, 5304720, 14307305, 21235064, 22105203, 16739690, 8135517, 264805, -1933247, 4820088, 15548849, 18901937, 11471083, 3987852, 6223546, 13176378, 15573522, 15817656, 20688973, 25501313, 21525108, 14288064, 16453866, 24532496, 21975935, 6847463, -2722954, 4786430, 19604462, 28486326, 30749256, 29508691, 22742125, 11919595, 5895194, 7674572]
32732G674572K213604N24049P323982J4570641O535314r668423j1817101K00594
32724A7557232L607675p738186j2355681J736879J6047285J1221905m449861j1094255
32716A4532993m633402N492057J1440476Q109818o986271k4233467k5785285q871356
32708c0934437Q221217J2092139J0409372J2429517J1529261J340619p490832
32701A7596856m045424L085338Q78926n130422k152783N444849L550236o519801
32693A2707775j0536071n185290l33303K53926K200640N305855K489960n091048
32685A812444p577970k523451K650020M874227P607772Q384681K98963j1802881
32677C723805j3348795k997256K853357m317479j0937170l311382R968790J1526478
$$ y = [7674572, 9888176, 10412225, 17736207, 32306848, 38842162, 29173739, 17356638, 17557232, 21164907, 13426721, 1071040, 2807919, 18855204, 30077109, 25627248, 14532993, 9899591, 15391648, 26832124, 34941942, 27955671, 3722204, -22063081, -30934437, -22713220, -10621081, -211709, 12217808, 23747069, 25087688, 17596856, 13551432, 16636770, 17515696, 12385274, 10232491, 15677340, 19227576, 12707775, 2171704, -3013586, -3346889, -3092963, -892323, 4413532, 6903492, 1812444, -5765526, -8288977, -5638957, -764730, 6843042, 15227723, 15526686, 3723805, -9624990, -12622246, -9768889, -14086368, -25023538, -28334920, -18366130, -6839652]
32669f839652J683301l872398J454882P554821M819123k677113m834077R57956
32661a753157Q281358J0065035N143206k182162o764071o409960k291045K448377
32653F537581L852684m20950p322325r501485l967820K617452K350725k340062
32645h194200k550752K453720L292302m545135j2291052r591040J654972J0880908
32637a8890277J1655647N305945m146121j2168838j3336500n550652N384115J0316910
32629b1429771O431245p27675m395782k572093K492306P150402Q280681N148822
32621C78135L90995k026246j98423M318728P365651M760969l136891r155693n888626
32612c191401L872423Q655967L622398j913506J465871P755923M273405p140846
$$ y = [-6839652, -5156351, -9028749, -7573867, -19046, 4800077, 2122964, -2711113, -1753157, 6528201, 16593236, 21736442, 19554280, 12790209, 6380249, 4089204, 6537581, 10390265, 9969315, 2646990, -6854495, -10822315, -8204863, -5854138, -8194200, -10744952, -8291232, -4998930, -9544065, -21835117, -31426157, -29771185, -18890277, -7234630, -1928685, -6074806, -18243644, -31580144, -37130796, -31746681, -21429771, -14998526, -15726201, -20121983, -22694076, -20201770, -13051368, -4770687, 378135, 769130, -1257116, -1455539, 2863189, 10228840, 14989809, 11852918, 2697225, -3191401, 681022, 9336989, 12959387, 11045881, 12511752, 20267675, 24541080, 17400234]
32604A7400234j0570010L49676J1737137Q812567m029660j1507767q704031l496985
32596h839j849470j786382j076986o31677O82136N236603Q896745L725227q066231
32587E121126j2648516l183041Q812558R135605Q12414k362033K500820M995058
32579A3183991M0376m328106j693956J506892l100340j1467062j2593869m300242
32571b2752316M913446Q108053O409894L432222M35876j205074R36957N261040
32563E540098M973662l039334j1218577r356510R13101O297234q55820j1192441
32555a7938587r932215L564670J5279318J5089472P547032J562762k143321o718047
32547F311084q800250k305126R433511J4905862R108194m94060m661959k502399
$$ y = [17400234, 6830224, 7179900, 18917037, 27729604, 23699944, 12192177, 3488146, -8839, -1858309, -3644691, -4721677, -5353354, -4671218, 565385, 9462130, 13187357, 5121126, -7527390, -10710431, -1897873, 7237732, 8050146, 5688113, 8188933, 13183991, 13224367, 8896261, 7202305, 8709197, 5608857, -5858205, -18452074, -22752316, -17838870, -9730817, -3320923, 111299, 547175, -657899, 279058, 5540098, 10513760, 7474426, -3744151, -13100661, -12187560, -5890326, -6746146, -17938587, -27870802, -24306132, -9026814, 6062658, 13609690, 15172452, 13029131, 6311084, -2489166, -4794292, 4639219, 19545081, 28653275, 28159215, 23497256, 20994857]
32539B0994857J484848M186513M241843Q84434l639127m571960j189979Q48360
32531B3239789k669663p678413o862853O35071Q032521Q348563J117061p142007
32523A7020069q678956k727048K809419J257838l176176j759428M465951N922822
32515A5134491M91895k922256k25630M64625o110447j1535046p653076j064740
32507a3420184j683144n233044j059433Q621778J2102143P235657K507345J197258
32499A0268376r22968l138489r312N652514M916063j108687k573782J28833m126287
32490I086261j5041182j6926926m173207P748703P110551L783990Q523033J1551539
32482A1662762L64063j4609926j3916536k90799O299952M63593l909274J87343
$$ y = [20994857, 22479705, 26666218, 30908061, 31792495, 28153368, 23581408, 22391429, 23239789, 20570126, 12891713, 6028860, 6663931, 14696452, 23045015, 24162076, 17020069, 8341113, 5614065, 8423484, 9681322, 6505146, 4745718, 9211669, 15134491, 15626386, 12704130, 12478500, 12943125, 6832678, -4702368, -12355444, -13420184, -15103328, -20336372, -21395805, -12774027, -671884, 6563773, 9071118, 10268376, 9345408, 6206919, 6197607, 11850121, 16766184, 15657497, 13083715, 13212548, 9086261, -5954921, -22881847, -27055054, -19306351, -12195800, -8411810, 111223, 11662762, 12026825, -2583101, -16499637, -16790436, -10490484, -10026891, -13936165, -13748822]
32474a3748822L921252K542807L360596P817386N087851p240808j3594561l696505
32466a5550804R220883P903497k738348n181503K825050P464311K642488k698375
32458C887199k232001j644490n478076p511869k125091M177055K128644n079629
32450a3878258n947977J977750Q328640M919841l065148m850988J855917R531553
32442a128670J1204668P223110K067567j136931j700271k88536J123940O2506
32434A7427383l857586p988595q990512n163067K880654J1136096J2487680L164316
32426B1096369r698775j2889595l163424P319112O977583K35881j232359K582452
32418A1227244J917691l754028l181721O540366J1371065O40141j5015206j7897504
$$ y = [-13748822, -9827570, -7284763, -3924167, 3893219, 8981070, 1740262, -11854299, -15550804, -6329921, 1573576, -1164772, -6346275, -3521225, 3943086, 6585574, 3887199, 1655198, 10708, -5467368, -12979237, -15104328, -10927273, -8798629, -13878258, -19826235, -17848485, -9519845, -4600004, -7665152, -12516140, -10660223, -1128670, 10075998, 17299108, 19366675, 18229744, 16529473, 16240937, 17364877, 17427383, 13569797, 5581202, -3409310, -8572377, -5691723, 5444373, 17932053, 21096369, 11397594, -1492001, -4655425, 2663687, 9641270, 9877151, 8644792, 11227244, 13144935, 9390907, 6209186, 12749552, 24120617, 24760758, 9745552, -8151952]
32410h151952q062578m12297j003897j220657L833669N982992j030554q754958
32402a8820232n551535N717002J1123835M348739n917742p263620K866610J5200855
$$ y = [-8151952, -16214530, -16626827, -17630724, -18851381, -15017712, -9034720, -10065274, -18820232, -24371767, -18654765, -7530930, -3182191, -9099933, -16363553, -13496943, 1703912]
$$ [...]
##END NTUPLES=NMR SPECTRUM
##END=
