##TITLE=31Pdec_LR-675-C2P
 EtOAc, 72 sc
 29.5.2019
##JCAMPDX= 6.0         $$ Bruker NMR JCAMP-DX V2.0
##DATA TYPE= NMR SPECTRUM
##DATA CLASS= NTUPLES
##ORIGIN= UXNMR, Bruker Analytische Messtechnik GmbH
##OWNER= root
$$ XWIN-NMR		Version 3.5
$$ Wed May 29 13:04:14 2019 Russian Standard Time (UT+4h)  she@DPX200
##.OBSERVE FREQUENCY= 81.013821
##.OBSERVE NUCLEUS= ^31P
##.ACQUISITION MODE= SIMULTANEOUS
##.ACQUISITION SCHEME= undefined
##.AVERAGES= 72
##.DIGITISER RES= 17
##SPECTROMETER/DATA SYSTEM= spect
##.PULSE SEQUENCE= zgpg30
##.SOLVENT NAME= DMSO
##.SHIFT REFERENCE= (INTERNAL, DMSO, 0, 182.463)
##AUDIT TRAIL= $$ (NUMBER, WHEN, WHO, WHERE, WHAT)
$$ ##TITLE= Audit trail, XWIN-NMR		Version 3.5
$$ ##JCAMPDX= 5.01
$$ ##ORIGIN= Bruker BioSpin GmbH
$$ ##OWNER= she
$$ F:/spectra/data/she/nmr/P31/1/pdata/1/auditp.txt
$$ ##AUDIT TRAIL=  $$ (NUMBER, WHEN, WHO, WHERE, WHAT)
(   1,<2019-05-29 13:03:16.53 +0400>,<she>,<DPX200>,
      <continue with go, POWCHK disabled, PULCHK disabled
       configuration hash MD5:
       00 E9 B6 7A A2 85 ED C7 34 08 36 98 17 FE 4E 26
       data hash MD5: 32K
       EF C3 21 82 C6 B9 5F 9B DC 4A 8C F1 2A 6B 15 35>)
(   2,<2019-05-29 13:03:18.06 +0400>,<she>,<DPX200>,
      <Start of raw data processing
       efp BC_mod = 2 LB = 1 FT_mod = 6 PKNL = 1 PHC0 = -2302.896 PHC1 = 405.3991 SI = 64K 
       data hash MD5: 64K
       F2 FE 2A 9B 68 E8 6D 3E 54 EF 6F 9C A3 C8 25 34>)
(   3,<2019-05-29 13:03:46.10 +0400>,<she>,<DPX200>,
      <pk PHC0 = -16.87332 PHC1 = 5.800001 
       data hash MD5: 64K
       F4 54 D1 1D D9 04 6B 8E AF D0 29 9E A5 FA A1 3D>)
$$ ##END=
$$ 
$$ hash MD5
$$ AD AF 27 2C D5 7F 3A 8D E1 9E EC 7F 33 FB AF E0
##$RELAX= 
##$RELAX= 
##$RELAX= 
##$RELAX= 
##$RELAX= 
##$RELAX= 
##$RELAX= 
##$RELAX= 
$$ Bruker specific parameters
$$ --------------------------
##$DU= <F:/spectra>
##$EXPNO= 1
##$NAME= <P31>
##$PROCNO= 1
##$TYPE= <nmr>
##$USER= <she>
##$AMP= (0..31)
100 100 100 100 100 100 100 100 100 100 100 100 100 100 100 100 100 100 
100 100 100 100 100 100 100 100 100 100 100 100 100 100 
##$AQSEQ= 0
##$AQ_mod= 1
##$AUNM= <au_zg>
##$AUTOPOS= <>
##$BF1= 81.014009
##$BF2= 200.13
##$BF3= 200.13
##$BF4= 200.13
##$BF5= 200.13
##$BF6= 200.13
##$BF7= 200.13
##$BF8= 200.13
##$BYTORDA= 1
##$CFDGTYP= 0
##$CFRGTYP= 5
##$CHEMSTR= <none>
##$CNST= (0..31)
1 1 145 1 1 1 1 1 1 1 1 1 1 1 1 1 1 1 1 1 1 1 1 1 1 1 1 1 1 1 1 1 
##$CPDPRG= <waltz16>
##$CPDPRG1= <>
##$CPDPRG2= <waltz16>
##$CPDPRG3= <>
##$CPDPRG4= <mlev>
##$CPDPRG5= <mlev>
##$CPDPRG6= <mlev>
##$CPDPRG7= <mlev>
##$CPDPRG8= <mlev>
##$CPDPRGB= <>
##$CPDPRGT= <>
##$D= (0..31)
0 1 0 0 0 0 0 0 0 0 0 0.03 2e-05 3e-06 0 0 0 0 0 0 0 0 0 0 0 0 0 0 0 0 
0 0 
##$DATE= 1559120505
##$DBL= (0..7)
120 120 120 11 120 120 24 19 
##$DBP= (0..7)
150 150 150 150 150 150 150 150 
##$DBP07= 0
##$DBPNAM0= <>
##$DBPNAM1= <>
##$DBPNAM2= <>
##$DBPNAM3= <>
##$DBPNAM4= <>
##$DBPNAM5= <>
##$DBPNAM6= <>
##$DBPNAM7= <>
##$DBPOAL= (0..7)
0.5 0.5 0.5 0.5 0.5 0.5 0.5 0.5 
##$DBPOFFS= (0..7)
$$ [...]
##$SUBNAM2= <"">
##$SUBNAM3= <"">
##$SUBNAM4= <"">
##$SUBNAM5= <"">
##$SUBNAM6= <"">
##$SUBNAM7= <"">
##$SUBNAM8= <"">
##$SUBNAM9= <"">
##$SW= 369.568048894756
##$SWIBOX= (0..15)
0 1 3 0 0 0 0 0 0 0 0 0 0 0 0 0 
##$SW_h= 29940.119760479
##$TD= 32768
##$TD0= 1
##$TE= 0
##$TE2= 300
##$TE3= 300
##$TEG= 300
##$TL= (0..7)
0 120 53 12 22 120 120 120 
##$TP= (0..7)
150 150 150 150 150 150 150 150 
##$TP07= 0
##$TPNAME0= <>
##$TPNAME1= <>
##$TPNAME2= <>
##$TPNAME3= <>
##$TPNAME4= <>
##$TPNAME5= <>
##$TPNAME6= <>
##$TPNAME7= <>
##$TPOAL= (0..7)
0.5 0.5 0.5 0.5 0.5 0.5 0.5 0.5 
##$TPOFFS= (0..7)
0 0 0 0 0 0 0 0 
##$TUNHIN= 0
##$TUNHOUT= 0
##$TUNXOUT= 0
##$USERA1= <user>
##$USERA2= <user>
##$USERA3= <user>
##$USERA4= <user>
##$USERA5= <user>
##$V9= 5
##$VALIST= <valist>
##$VCLIST= <CCCCCCCCCCCCCCC>
##$VD= 0
##$VDLIST= <DDDDDDDDDDDDDDD>
##$VPLIST= <PPPPPPPPPPPPPPP>
##$VTLIST= <TTTTTTTTTTTTTTT>
##$WBST= 1024
##$WBSW= 4
##$XGAIN= (0..3)
0 0 0 0 
##$XL= 0
##$YL= 0
##$YMAX_a= 19293
##$YMIN_a= -41843
##$ZGOPTNS= <>
##$ZL1= 120
##$ZL2= 120
##$ZL3= 120
##$ZL4= 120
##$ABSF1= 0
##$ABSF2= 0
##$ABSG= 0
##$ABSL= 0
##$ALPHA= 0
##$AQORDER= 0
##$ASSFAC= 0
##$ASSFACI= 0
##$ASSFACX= 0
##$ASSWID= 0
##$AUNMP= <proc_1d>
##$AZFE= 0.1
##$AZFW= 0.5
##$BCFW= 0
##$BC_mod= 2
##$BYTORDP= 0
##$COROFFS= 0
##$CY= -3
##$DATMOD= 1
##$DC= 0
##$DFILT= <>
##$DTYPP= 0
##$F1P= 0
##$F2P= 0
##$FCOR= 1
##$FTSIZE= 65536
##$FT_mod= 6
##$GAMMA= 0
##$GB= 0
##$INTBC= 1
##$INTSCL= 5.30512e-09
##$ISEN= 30
##$LB= 1
##$LEV0= 0
##$LPBIN= 0
##$MAXI= 10000
##$MC2= 0
##$MEAN= 0
##$ME_mod= 0
##$MI= 50
##$NCOEF= 0
##$NC_proc= -9
##$NLEV= 6
##$NOISF1= 182.463
##$NOISF2= 159.3651
##$NSP= 0
##$NTH_PI= 0
##$NZP= 0
##$OFFSET= 182.463
##$PC= 4
##$PHC0= -2319.769
##$PHC1= 411.1991
##$PH_mod= 1
##$PKNL= yes
##$PPARMOD= 0
##$PSCAL= 0
##$PSIGN= 0
##$REVERSE= no
##$SF= 81.0140089999434
##$SI= 65536
##$SIGF1= 159.3651
##$SIGF2= -187.1042
##$SINO= 113.3802
##$SIOLD= 16384
##$SREGLST= <1H.CDCl3>
##$SSB= 0
##$STSI= 65536
##$STSR= 0
##$SW_p= 29940.119760479
##$SYMM= 0
##$S_DEV= 0
##$TDeff= 32768
##$TDoff= 0
##$TI= <>
##$TILT= no
##$TM1= 0
##$TM2= 0
##$TOPLEV= 0
##$USERP1= <user>
##$USERP2= <user>
##$USERP3= <user>
##$USERP4= <user>
##$USERP5= <user>
##$WDW= 1
##$XDIM= 65536
##$YMAX_p= 456084450
##$YMIN_p= -121442088
$$ End of Bruker specific parameters
$$ ---------------------------------
##NTUPLES= NMR SPECTRUM
##VAR_NAME=  FREQUENCY,     SPECTRUM/REAL,   SPECTRUM/IMAG
##SYMBOL=    X,             R,               I
##VAR_TYPE=  INDEPENDENT,   DEPENDENT,       DEPENDENT
##VAR_FORM=  AFFN,          ASDF,            ASDF
##VAR_DIM=   65536,         65536,           65536
##UNITS=     HZ,            ARBITRARY UNITS, ARBITRARY UNITS
##FACTOR=    0.456856943014862, 1,           1
##FIRST=     14782.0589164792, 0,            0
##LAST=      -15158.0608439998, 0,           0
##MIN=       -15158.0608439998, -121442088,  0
##MAX=       14782.0589164792, 456084450,    0
$$ Real data points
##PAGE= N=1
##DATA TABLE= (X++(R..R)), XYDATA
$$ [...]
41412C2813107J4858391o009675j7250284j1454462Q49056O759274K057099p183578
41404A5438928j0209350l106743N505518O002641K051285L948000J0090609Q235220
41396C7956108l380108j0317660l367168O721108N758299j924723j257800Q003825
41388C8191881Q670933p798291k5883363k6008657j0929004J252863N381456J2376756
41380d745426K2409220J6771049j0902734l4047510k4805192N294909K0046054
41373i979630P680042r704204j3182914o596183K880306J6160681K7160166K1996195
41365C6414459L211996q426879n812450n004072j3032970j3660270P78528J1763191
41357F231533O961489K086775R132517J1670605k147461j0906485L584474J7911433
$$ plain form
41412 32813107 47671498 41661823 24411539 12957077 13806133 20565407 22622506 15438928
41404 15438928 5229578 2122835 7628353 13630994 15682279 19630279 29720888 37956108
41396 37956108 34576000 24258340 20891172 27612280 33370579 31445856 30188056 38191881
41388 38191881 46862814 39064523 13181160 -12827497 -23756501 -22503638 -17122182 -4745426
41380 -4745426 17663794 34434843 23532109 -10515401 -35320593 -30025684 -9979630
41373 -9979630 -2299588 -12003792 -25186706 -31782889 -28902583 -12741902 14418264 36414459
41365 36414459 39626455 31199576 25387126 20383054 7350084 -6310186 -5531658 6231533
41357 6231533 13193022 15279797 24412314 36082919 33935458 23028973 26613447 44524880
41349D4524880L390182k1813754k0272862J813390O520705j0538370j5581018
41342a1956847M225249K3662597K5627873K1038603J5640857j266251k4569537
41335E2402544k9239326j1366241K985313K268314N605914K0218531K1754554
41328F4629603k416782k6267719k5625629j3727047j1178972j0712493K46528
41321b5052511R571262L885462j421992J1962135K8344196J9994543p692475k4631110
41313A4959510k0098554r628131n271087n408772q606341j3791842j1357427M925009
41305e4277635K2292798K3771412J1493785j641344j2665020k1828194j8439297
41298e1293495K902312K3191275K1809829Q959659Q674694J8640981J6938260
$$ plain form
41349 44524880 47915062 26101308 5828446 7641836 14162541 3624171 -11956847
41342 -11956847 -7731598 15930999 41558872 62597475 78238332 76972081 52402544
41335 52402544 23163218 11796977 14782290 17050604 22656518 42875049 64629603
41328 64629603 62212821 35945102 10319473 -3407574 -14586546 -25299039 -25052511
41321 -25052511 -15481249 -11595787 -13017779 -1055644 27288552 47283095 39590620 14959510
41313 14959510 -5139044 -14767175 -20038262 -25447034 -34053375 -47845217 -59202644 -54277635
41305 -54277635 -31984837 -8213425 3280360 1639016 -11026004 -32854198 -51293495
41298 -51293495 -48391183 -25199908 -3390079 5569580 14244274 32885255 49823515
41291D9823515K247805n686674l574847q003185j8376997j1647778J5727907L2510102
41283E3019848J5537824j7117070l2764687k3781802n108273R372552J1507802
41276A0666194l512137k5906206l0116600l250105L3268770M6284981K8866761
41269E6301658J910133j5241037j9863800j5494561m169856P764460R430075j708604
41261A8928468j3528873j2478867j39086R167041O591804j613195n504787o113349
41253d690844j0294693j4200492n302255J5555009K8110880J8539895J79177m777171
41245B3119506M176532R261313K779076n657635q854036j1024870j4091980j1045241
41237a1337335N77372J0674857R268252r32574j0073104j2736231r751119l687909
$$ plain form
41291 49823515 52071320 46384646 42809799 34806614 16429617 4781839 20509746 53019848
41283 53019848 68557672 51440602 18675915 -5105887 -10214160 -841608 10666194
41276 10666194 7154057 -18752149 -48868749 -52118854 -18850084 27434897 56301658
41269 56301658 58211791 42970754 23106954 7612393 3442537 11206997 20637072 18928468
41261 18928468 5399595 -7079272 -7218358 1948683 8540487 6927292 1422505 -4690844
41253 -4690844 -14985537 -29186029 -34488284 -18933275 9177605 27717500 27896677 23119506
41245 23119506 27296038 36557351 39336427 33678792 24824756 13799886 -292094 -11337335
41237 -11337335 -10759963 -85106 9183146 8250572 -1822532 -14558763 -24309882 -27997791
41229b7997791L634539J0981505J5366462J0668918m662363j7209668r158310
41222a8376708J3450655K0030874k086867k2738970j0433469J7341771J8935399
41215A6122685n614475j4767172O761425K4535801J2902726m647392R65234J5114178
41207E1373010P150395j7196883k7530850j8118684j0035855j1332781q668495
41200c4360143J540522L583601r322299j9598169p873953K1467340M3856094L8014525
41192C7307518O284599k4130103k5955724k766272J4771997Q943906m562502n648924
41184D244495J377183M727703R491351K1163511K4108773N960380j2566603n948054
41176E2558739J1211881N729368j7051112k1154946k096613O026820q925357j7513559
$$ plain form
41229 -27997791 -24363252 -13381747 1984715 12653633 7991270 -9218398 -18376708
41222 -18376708 -4926053 15104821 13017954 -9721016 -20154485 -2812714 16122685
41215 16122685 10508210 -4258962 2502463 27038264 39940990 35293598 36258832 51373010
41207 51373010 58523405 41326522 13795672 -4323012 -14358867 -25691648 -34360143
41200 -34360143 -32819621 -29236020 -38558319 -58156488 -66030441 -44563101 -707007 37307518
41192 37307518 43592117 19462014 -6493710 -9259982 5512015 14455921 9893419 4244495
41184 4244495 5621678 10349381 19840732 41004243 65113016 71073396 58506793 52558739
41176 52558739 63770620 69499988 52448876 31293930 29197317 35224137 26298780 8785221
41168H785221l822061O205208n993500j6204654o16300K1040500J8160009l399559
41160B4154864j8412628k1346501j7406382j66980K8009141L7438750J0577876
41153D2848140k0813113j7363657Q053395J4635212K20915n121549N08366q074901
41145A4892808k4844375j3528960K4544740L9775011J0376110k1575567j6149929
41138A3489838P416654J1424747j365370o310061l747474q203837j2911123l270053
41130c476679R880789O283764n989106l008123J2742483J5673672p93195j5799048
41122A5514557j4983058o739053k791352m328347q710170j1714657m786644J2344966
41114b6193758K1236351P165397j3628532j2919341O970450J5972279J349359
$$ plain form
41168 8785221 4963160 11168368 5174868 -11029786 -11646086 9394414 27554423 24154864
41160 24154864 5742236 -15604265 -33010647 -33177627 -5168486 32270264 42848140
41153 42848140 22035027 4671370 12724765 27359977 27580892 22459343 22967709 14892808
41145 14892808 -9951567 -23480527 1064213 40839224 51215334 29639767 13489838
41138 13489838 20906492 32331239 30965869 24655808 20908334 12704497 -206626 -3476679
41130 -3476679 6404110 12687874 6698768 3690645 16433128 32106800 31313605 15514557
41122 15514557 531499 -6207554 -8998906 -13327253 -22037423 -33752080 -38538724 -26193758
41114 -26193758 -4957407 2207990 -11420542 -24339883 -17369433 -1397154 -47795
41107d7795j7542174k3065965j9994680j4566972k97561K1671334L1718243J9003534
41099c122036J635184R47550R557499N233278j2235434j9631675n353446J2345197
41091a0623883R785156r003106j4804513R247251M0569019L8856669l477207m5769814
41083A4779572m4237791k976996L3989352L4849883Q360141j5539746j6266105
41076A2958310M854069K6556669K3000519q193646l6474691l3047628q861050
41069a9207448L316550k203121k501219Q709408J0328755m176291j0763998L144223
41061a3353141J4721583N933798m031217N106210J4501861k091363k7380764k2429231
41053b9022264J0694961K9033105J1052398j7603627k6120283j4385523K564668
$$ plain form
41107 -47795 -17589969 -40655934 -60650614 -75217586 -75515147 -53843813 -22125570 -3122036
41099 -3122036 -1486852 -539302 9018197 14251475 2016041 -17615634 -22969080 -10623883
41091 -10623883 -838727 -9841833 -24646346 -15399095 25169924 64026593 60549386 14779572
41083 14779572 -29458219 -32435215 1554137 36404020 44764161 29224415 12958310
41076 12958310 17812379 44369048 67369567 59175921 22701230 -10346398 -19207448
41069 -19207448 -15890898 -18094019 -20595238 -11885830 -1557075 -5733366 -16497364 -13353141
41061 -13353141 1368442 7302240 3271023 8377233 22879094 20787731 -6593033 -29022264
41053 -29022264 -18327303 10705802 21758200 4154573 -21965710 -36351233 -33786565
41046c3786565J7978834K7278689K0238688m066732k7389156l0596556j4073508
41039d4416306P305613K0624712K0864090J0569377Q4779l79961N865416N108594
41031B5626314n856721j2449667l281007J0976751J0298265p828755k4457671
41024f972491k1422218j5897K3089049L2301502K3649892M815232j0472468j1663885
41016C3308716j836556K343993j0507786k7438400k3296771L264358K1702173
41009b460273J0221255j1331949j0802360O406900P139084j4111803k5253750
41002d0192896q570789J2727532J5397806J1167419J8251246K5612189J3894204
40995D8286711q178307j7106829r991991r96263M191111O319782o61335j6288515
$$ plain form
41046 -33786565 -15807731 11470958 31709646 27642914 253758 -30342798 -44416306
41039 -44416306 -37110693 -16485981 4378109 14947486 15032265 14652304 20517720 25626314
41031 25626314 19769593 7319926 4038919 15015670 25313935 17485180 -6972491
41024 -6972491 -28394709 -28410606 -5321557 26979945 50629837 55445069 44972601 33308716
41016 33308716 31472160 33816153 23308367 -4130033 -27426804 -24162446 -2460273
41009 -2460273 7760982 -3570967 -14373327 -7966427 -827343 -14939146 -40192896
41002 -40192896 -48763685 -36036153 -20638347 -9470928 8780318 34392507 48286711
40995 48286711 40108404 23001575 13009584 12013321 16204432 22524214 21862879 5574364
40987E574364k2165228r147042J515715p450016j4217018O982705L4670705K8486891
40979B4251076m054416j8577133n715557J158823p910060j958264K8368930M4468979
40971F0032378K0715986j3501680k1817719j2762255j2512601j8541233j3600882
40964a1988006k87555R529051J8179690K7283341K1552585l871580k1575841q467290
40956C0354395J4711426J2969544r964082k2384504j5730422r020736r190439
40949h254818k985874J1614399J8391268J2315140Q848405J6340595K1268665
40942G7537780J0163792j0114314k2729523k0654627j0222803k436405l821959
40935A7721941j0825553j3122673n837711M724344J0325555R609303M683700k618978
$$ plain form
40987 5574364 -16590864 -25737906 -24222191 -31672207 -45889225 -38906520 -4235815 24251076
40979 24251076 20196660 1619527 -4096030 -2937207 -10847267 -12805531 15563399 60032378
40971 60032378 80748364 67246684 45428965 32666710 20154109 1612876 -11988006
40964 -11988006 -12275561 -2746510 15433180 42716521 64269106 60397526 38821685 30354395
40956 30354395 45065821 58035365 48071283 25686779 9956357 935621 -8254818
40949 -8254818 -11240692 373707 18764975 31080115 39928520 56269115 77537780
40942 77537780 87701572 77587258 54857735 34203108 23980305 21543900 17721941
40935 17721941 6896388 -6226285 -12063996 -7339652 2985903 12595206 17278906 14659928
40927A4659928p479458m766660J914783M753220O085387J3131583J8643994Q316885
40919E5259662j0246187j2915955J06566K37666k0217580k9382713p033307J9652231
40911d539617J9420608M618353K577109Q218807L398192j848774R251672J7569421
40903E8665771n904776m3871442m9810660j5497543K2022168L6651286L4122194
40896C6376998K0526097n532717k8308112k4779660l000050O915918J12350l343409
40888a032585k318487j2509702k2026657j266115L7310797M3678552P182818k4431328
40880B4587293j9987073n131468n506037m468986J1711238J7784250l404789k2157880
40872f573452j0620324R012371O198386m637013L623071J7864086J0274284j0204644
$$ plain form
40927 14659928 7180470 2413810 4328593 9081813 15167200 28298783 46942777 55259662
40919 55259662 45013475 32097520 32204086 32441752 12224172 -17158541 -24191848 -4539617
40911 -4539617 14880991 19499344 22076453 30295260 33693452 31844678 41096350 58665771
40903 58665771 52760995 8889553 -40921107 -56418650 -34396482 2254804 36376998
40896 36376998 56903095 51370378 23062266 -1717394 -4717444 2198474 2310824 -1032585
40888 -1032585 -3351072 -15860774 -37887431 -39153546 -1842749 41835803 49018621 24587293
40880 24587293 4600220 -531248 -6037285 -10506271 1204967 18989217 15584428 -6573452
40872 -6573452 -17193776 -8181405 -1983019 -6620032 -2996961 14867125 25141409 14936765
40864A4936765j6889024j1812995j0383866m435568J5389901K5973879P714136
40857B0493228j1352784R87834J9220236J108439l2014446k5598053J1107499
40850a6048047J6305019j6014518k1479138K3158914N4303091K3646093k3951018
40843C9920396k4903705O014711J1551857j3690442k6358528j0812616N008234
40836a3270093L669255k07797N435108J2168815J3255603J3999904J4496731O776709
40828E6324235n338976n162595J0842361K3105693J3356460j2382743l1885212
40821D8859223l0639529j3700140J608464K921480n166822q039637r22355M770763
40813c08553j134273j1924216j3345881k672281R732966J4206405J0399883M798396
$$ plain form
40864 14936765 -1952259 -13765254 -24149120 -28584688 -13194787 12779092 20493228
40857 20493228 9140444 10128278 29348514 30456953 -1557493 -27155546 -16048047
40850 -16048047 256972 -15757546 -37236684 -14077770 40225321 63871414 39920396
40843 39920396 15016691 21031402 32583259 18892817 -7465711 -18278327 -13270093
40836 -13270093 -9600838 -9808635 -4373527 7795288 21050891 35050795 49547526 56324235
40828 56324235 50985259 45822664 56665025 79770718 93127178 80744435 48859223
40821 48859223 18219694 4519554 6128018 9049498 3882676 -4156961 -5079316 -308553
40813 -308553 -1442826 -13367042 -26712923 -29385204 -19652238 -5445833 4954050 9752446
40805I752446M118230Q219885P971513l937139j9143673k0149557l978040J1424861
40797e721474R963788l740440j4631301j5973771j0422029k338955K945367J308060
40789c8610755k144531K043577R105231J827622j9580962k7770786m936305K7060446
40781e3006463L4809144J8971326O979818R252766J1330231O584943O095539J1205629
40773E2222933N316263j5240474k6747703j1036887J5494272K3818965J0316341
40766E4143710m789657q123618n088160n411119j1089950j7360171j6305562k828857
40758a6853384J5356540K0228693N652665j0240288p172205R610065J8986621
40751C5568707J5847639J3914846J7219746J0628019j3520309l7590122l9970077
$$ plain form
40805 9752446 13870676 22090561 30062074 26124935 6981262 -13168295 -17146335 -5721474
40797 -5721474 4242314 501874 -14129427 -30103198 -40525227 -42864182 -39918815 -38610755
40789 -38610755 -40755286 -38711709 -29606478 -27778856 -47359818 -75130604 -80066909 -53006463
40781 -53006463 -18197319 774007 7753825 17006591 28336822 34921765 41017304 52222933
40773 52222933 57539196 42298722 15551019 4514132 20008404 43827369 54143710
40766 54143710 49354053 41230435 36142275 30731156 19641206 2281035 -14024527 -16853384
40758 -16853384 -1496844 18731849 24384514 14144226 6972021 16582086 35568707
40751 35568707 51416346 65331192 82550938 93178957 79658648 42068526 2098449
40744B098449k1795926k21485J4322603K0800725J6984005K947525r442198p303673
40736A8390025L752181O116566l240184q514399p76606Q167189N332820l816355
40728B5411237o045781l87206M172569L759113J021299l022656p679127p754624
40720I474824q81846M417504p39122j0537352j1901781m016764K590744M017899
40712g575894N099084M817835k557362r746789o4551K3875258L5298044K0112711
40704F9258336J40385J155893J3254270P685665j5751329k6960582j1979192O552770
40696D3356216M806056r278112j3503787m970317J971266P60208k715164n109807
40688A5316559q213339q472356M22750J3657786J7709253Q777318l258281j0959625
$$ plain form
40744 2098449 -19697477 -19918962 -5596359 15204366 32188371 35135896 25693698 18390025
40736 18390025 22142206 28258772 25018588 16504189 15727583 23894772 29227592 25411237
40728 25411237 19365456 18978250 23150819 26909932 27931231 24908575 17229448 9474824
40720 9474824 8592978 13010482 12271360 1734008 -10167773 -14184537 -11593793 -7575894
40712 -7575894 -2476810 2341025 -216337 -9963126 -10027677 13847581 49145625 69258336
40704 69258336 69398721 70554614 83808884 91494549 75743220 48782638 36803446 43356216
40696 43356216 48162272 38884160 25380373 20410056 22381322 23141530 20426366 15316559
40688 15316559 7103220 -1369136 -946386 12711400 30420653 39197971 35939690 24980065
40680B4980065j6118463j7610921q216215Q900622J5748329L764505r924504n607769
40672d084351R552086J3312989K999124l058641K380231M766140n105497j4168149
40664F593932q569423M683858J1395967J1836107J2756784Q815259q669152k9836210
40656I007122l2975072j3572841R614926J9418684J6269683O796622p259334k1355502
40648a4055712k3400952q259273J1184151J8028706J1144309K254511r47792J661492
40640b390560J1194676K7698515L8736999K4932398j4182771m9005142m7071969
40633a0087854r702665K8981803M0227564K6920958Q395998p087424k1935279
40626E5713101l0474358k0646466L562572J9186957J2515168k603422n283415
$$ plain form
40680 24980065 8861602 -8749319 -16965534 -8064912 7683417 11447922 1523418 -4084351
40672 -4084351 5467735 18780724 21779848 18721207 21101438 25867578 20762081 6593932
40664 6593932 -1975491 2708367 14104334 25940441 38697225 47512484 38843332 9007122
40656 9007122 -23967950 -37540791 -27925865 -8507181 7762502 14559124 7299790 -14055712
40648 -14055712 -37456664 -45715937 -34531786 -16503080 -5358771 -3104260 -4052052 -2390560
40640 -2390560 8804116 36502631 75239630 100172028 85989257 36984115 -10087854
40633 -10087854 -19790519 9191284 49418848 76339806 84735804 77648380 55713101
40626 55713101 25238743 4592277 8154849 27341806 39856974 37253552 31970137
40619C1970137L960690Q187925J98456j0799415j5793631j5502188j2743144o755492
40611a7276662J967726Q785748R268884K523267q372282j5275392r227266P546937
40603b0059040J9531382J6213079O026650J847167R15570n751977j1372644j426198
40595E923989J8563037K5708838J3293941O2476l09505K281781l342057q932641
40587E3249859l445073N305455K890977q049537j2428026m563682P453125J3584478
40579E3997576P764416j0855483l2204213l8118862k1318693M895043K3809560
40572a2030656L2335209L2237089J8656269p424229k7546126k5698424j1607361
40565a078229n203846n951489L46632J0428542N977254j2431277k0709375p327281
$$ plain form
40619 31970137 35930827 44118752 44317208 33517793 17724162 2221974 -10521170 -17276662
40611 -17276662 -15308936 -6523188 2745696 5268963 -3103319 -18378711 -27605977 -20059040
40603 -20059040 -527658 15685421 21712071 23559238 24474808 18722831 7350187 5923989
40595 5923989 24487026 50195864 63489805 63552281 63242776 65524557 62182500 53249859
40587 53249859 49804786 55110241 58001218 49951681 37523655 32959973 40413098 53997576
40579 53997576 61761992 50906509 18702296 -19416566 -40735259 -35840216 -12030656
40572 -12030656 20304553 52541642 71197911 63773682 36227556 10529132 -1078229
40565 -1078229 -6282075 -12233564 -11886932 -1458390 4518864 -7912413 -28621788 -35949069
40557c5949069J0100294J4231742J1116474J0005690K270164j8232707l0724369
40550c7181781j1559539K3824021L2527786K145033k9202060k3880657N599799
40543c7727398J9200874P611341j013118R055280J6121798o03448k3930321k4291669
40535c5576661n219688O652502P428519J6668054L2607523K5907804q740653l1332062
40527H395338j1522568K4043953L0341174Q087352o328984p36182K618998p045168
40519D7853913j1931897j129666R496725N322111m094765l575525N053687J1067357
40511E8061940J0855978O184949j240859o849706o279906m439822q651468j2662254
40503C4978852m400294J0049681J0919478l867498j3855669p655616L239559Q133693
$$ plain form
40557 -35949069 -25848775 -11617033 -500559 9505131 11775295 -6457412 -37181781
40550 -37181781 -48741320 -24917299 7610487 9755520 -19446540 -43327197 -37727398
40543 -37727398 -18526524 -10915183 -11928301 -2873021 13248777 12645329 -11284992 -35576661
40535 -35576661 -40796349 -34143847 -26715328 -10047274 22560249 48468053 39727400 8395338
40527 8395338 -3127230 20916723 51257897 59345249 53016265 52280083 54899081 47853913
40519 47853913 35922016 34792350 44289075 49611186 45516421 41940896 46994583 58061940
40511 58061940 68917918 75102867 73862008 67012302 60732396 56292574 47641106 34978852
40503 34978852 30578558 40628239 51547717 47680219 33824550 26168934 29408493 37542186
40495C7542186R883604O377615j2451661l6461755l4067214J230085L0835293
40488B888153K2438506l346497p412304P598511P099099j7203092l5560101k5471301
40480d8969026J319487K0189192J9484594L136444j4287220j5487518J310681
40473c3303366J6369725J5107861J0152450J7481638K4435198R391273j7210696
40466D2424083k5078904j2270530n011713r639748m129656J5476015K0887911
40459B2657458N972j7737591p766162R818475M919887j4240895j9332211q834150
40451c0509217k930899m376586J031091J0902786P001449r458698j4208913J478853
40443d1070134J5452272R421400l372814j130526J2241987J5162645K668183o758460
$$ plain form
40495 37542186 47425790 53803405 41351744 4889989 -29177225 -27947140 2888153
40488 2888153 25326659 21980162 14567858 22166369 29265468 12062376 -23497725 -48969026
40480 -48969026 -47649539 -27460347 -7975753 -4839309 -19126529 -34614047 -33303366
40473 -33303366 -16933641 -1825780 8326670 25808308 50243506 59634779 42424083
40466 42424083 17345179 5074649 62936 -9576812 -13706468 1769547 22657458
40459 22657458 22663430 4925839 -2840323 6978152 11898039 -2342856 -21675067 -30509217
40451 -30509217 -33440116 -37816702 -36785611 -25882825 -18881376 -28340074 -42548987 -41070134
40443 -41070134 -25617862 -16196462 -19569276 -20699802 -8457815 6704830 9373013 2614553
40435B614553M72012J3355253J2576631k264576j2594626o497989O423763J0363167
40427B4448188M714017J115086M512302Q742044R002011O412174K96187j0356160
40419D8885849j6051139l853342J8527630K2976629k558640l2295911l3489584
40412B141492q827289J0252096O771264m592320l639829Q926994J6329625O660306
40404C4022339j5191705l0969635k4633172j14448J9672208J8664153P314384
40397H764124O580170J8206192K4977833J7095482K042779j1391319k1756831
40390D4518430k5223146j5112775K518326R455067O72271n842262M093843J8195321
40382C3275075J6676707K808899l412334L875180J0398779N619380m370880j0527677
$$ plain form
40435 2614553 3086565 16441818 29018449 26753873 14159247 7661258 14085021 24448188
40427 24448188 29162205 30277291 34789593 43531637 52533648 58945822 59242009 48885849
40419 48885849 32834710 28981368 47508998 70485627 67926987 35631076 2141492
40412 2141492 -6685797 3566299 10337563 5745243 2105414 11032408 27362033 34022339
40404 34022339 18830634 -12139001 -36772173 -36886621 -17214413 1449740 8764124
40397 8764124 15344294 33550486 58528319 75623801 77666580 66275261 44518430
40390 44518430 19295284 4182509 6700835 16155902 16828173 10985911 15079754 33275075
40382 33275075 49951782 52760681 49348347 53223527 63622306 69241686 64870806 54343129
40374E4343129j2880524j3751758j0787322l185877L973530P121360P778987M437085
40366C7048610q446737k6032570k9299959q214066J9817419K9932668K2430561
40359C7235926J7197013J8513681Q906291j6563637l4407420k6136963p499435
40352b754544l249008q201769q3031J8142000K0309501J346332j2376644n235735
40344G897102M875093P02467m850921M892122J6925025Q773197j2634592k0675898
40336E903595q913736N443763J1313373R931592k759570k8710226m4430083k0507138
40328g2728430K8706031N0111324K1315313j7312952k0725729R03163Q937857
40321g93423k334735q360185l858819q327312k2998594k1093074Q014069L5366639
$$ plain form
40374 54343129 41462605 27710847 16923525 13737648 17711178 24832538 32611525 37048610
40366 37048610 28601873 2569303 -26730656 -34944722 -15127303 14805365 37235926
40359 37235926 54432939 72946620 81852911 65289274 30881854 4744891 -2754544
40352 -2754544 -6003552 -14205321 -14288352 3853648 24163149 25509481 13132837 7897102
40344 7897102 12772195 13474662 8623741 13515863 30440888 39214085 26579493 5903595
40336 5903595 -3010141 2433622 13746995 23678587 20919017 -7791209 -52221292 -72728430
40328 -72728430 -44022399 6088925 27404238 10091286 -10634443 -9731280 -793423
40321 -793423 -3128158 -11488343 -15347162 -23674474 -46673068 -67766142 -59752073 -24385434
40313b4385434L0561432K924821j3385988k671186J9773527L0469846J9942567
40306F3229585l225173k0618229j9222642m335248O607192N566826J124253J108979
40298C0235543M72077n594095r224617l160862M223233K748688M07658J0180108
40290C0287733K2677656J5818626p546341j7773099k769852J1419085J535176
40283E3648984j3927818l424721K3983652K6967584p003279m1204170m0411259
40276a371027j5345683Q49613j29246j259232M801252N968170m703703j5777371
40268b6967227j4466553l104354P555939J2008178J1612863R387678P568109N894338
40260I488971M88746j0814630k1433454k0304376m857238J4909467K6057932K2550405
$$ plain form
40313 -24385434 6175998 9100819 -4285169 -6956355 12817172 43287018 63229585
40306 63229585 60004412 39386183 20163541 15828293 22435485 28002311 29126564 30235543
40298 30235543 30707620 25113525 15888908 12728046 16951279 19699967 20107625 30287733
40290 30287733 52965389 68784015 61237674 43464575 40694723 52113808 53648984
40283 53648984 39721166 36296445 60280097 87247681 80244402 39040232 -1371027
40276 -1371027 -16716710 -15867097 -15996343 -17255575 -12454323 -6486153 -11189856 -26967227
40268 -26967227 -41433780 -44538134 -36982195 -24974017 -13361154 -3973476 3594633 9488971
40260 9488971 9977717 -836913 -22270367 -42574743 -47431981 -32522514 -6464582 16085823
40252A6085823P234022r809570j6361012q960282J797288L844617m16361K74643
40244f310832O857525Q971318L491978l28891J902004J956783m249794o025117
40236F264974M728262J6379442J1617891p572681k2179413k0322620p616487M758676
40228a3941956J1034882R564776J149757p758678p663522L064031J3748973J2998423
40220B2196686L643376M59165R903789J7725284O711382j4366842j5858069J0228711
40212D0643482L0409261J2215004k6326605l8055009j2844443J1068718O702563
40205B3812971o824204n246560n26794j2949434k7873906j6296708J5067939K9785830
40197a050866J3530472j0741209j9236970j2237740p42262Q295160J0308335N953475
$$ plain form
40252 16085823 23319845 13510275 -2850737 -11811019 -10013731 -6169114 -6585475 -6310832
40244 -6310832 546693 9518011 13009989 12681098 14583102 16539885 12290091 6264974
40236 6264974 10993236 27372678 38990569 31417888 9238475 -11084145 -18700632 -13941956
40228 -13941956 -2907074 6657702 7807459 48781 -7614741 -4550710 9198263 22196686
40220 22196686 25840062 26299227 36203016 53928300 60639682 46272840 30414771 40643482
40212 40643482 71052743 83267747 56941142 18886133 6041690 17110408 23812971
40205 23812971 16988767 11742207 11215413 -1734021 -29607927 -45904635 -30836696 -1050866
40197 -1050866 12479606 1738397 -17498573 -29736313 -30478575 -22183415 -11875080 -5921605
40189e921605O146090J6463471K0513103R84297k7107109l1758148j2043598k89182
40181c3012681j1368149k1442609q719674J4039721K4608253K4002829K4384241
40174A2491931K4340694J7380003J0115585J1264906J2783426O26067k2023885
40167F6978727l7010155l2314999j1460648J2006589K2729460J4751512J13081
40160C5793567l426183L972721O711618J663922L140762J3793234J4694860k442846
40152G3901655j6211988p016854J1634861J4041500n36672j1995957q935202L707444
40144E8588787J5749847J6165167l90853j9134958j5335867P812355J5444913
40137G8899391o924560k6568843j5308620K589530p786512k9103286j9463244
$$ plain form
40189 -5921605 224485 16687956 37201059 38185356 11078247 -20679901 -32723499 -33012681
40181 -33012681 -44380830 -65823439 -74543113 -60503392 -35895139 -11892310 12491931
40174 12491931 36832625 54212628 64328213 75593119 88376545 89002612 66978727
40167 66978727 29968572 -2346427 -13807075 -1800486 20928974 35680486 35793567
40160 35793567 32367384 36340105 43051723 44715645 47856407 61649641 76344501 73901655
40152 73901655 57689667 50672813 62307674 76349174 75812502 63816545 54881343 58588787
40144 58588787 74338634 90503801 90112948 70977990 55642123 63454478 78899391
40137 78899391 71974831 45405988 30097368 32686898 24900386 -4202900 -23666144
40130b3666144J4096635K4730165L297899r280747O677929J9930598O674714r660516
40122C2800533k548534J2427883O172746j7861704l3641512k8412060o950814
40115c8013462K1314377M1033247L5714177J1176606m018183L062469J0870860
40108H1140091j571298k2627528k9341166j9830827m897587J2038214K5343652
40101D0253551J8212079j1574833l4124540k2271386R201706K4354429J4073303
40094C8124309j908350r748896j1318223o911724N505843J7430890J8012274J0551084
40086E9737207K336075j1932404l4243655m2942978j7910757K0889595L2232757
40079H165840R827547j1776767r799663K27545j459351q135900m286582Q568621
$$ plain form
40130 -23666144 -9569509 15160656 18458555 9177808 15855737 35786335 42461049 32800533
40122 32800533 30251999 42679882 48852628 30990924 -2650588 -31062648 -38013462
40115 -38013462 -16699085 24334162 60048339 71224945 67206762 70269231 81140091
40108 81140091 79568793 56941265 27600099 7769272 2871685 14909899 40253551
40101 40253551 58465630 46890797 12766257 -9505129 -303423 24051006 38124309
40094 38124309 36215959 26467063 15148840 8237116 13742959 31173849 49186123 59737207
40086 59737207 62073282 50140878 15897223 -27045755 -44956512 -24066917 8165840
40079 8165840 17993387 6216620 -3583043 -3355498 -4814849 -12950749 -17237331 -8668710
40071h668710J8591229J9978201J1924208l561482j4886465q622980Q262295J2021567
40063C5037863l392151j5284488p211278N654596K671455r253892r941360N15823
40055a203432O219465N286523J0354963K1173079K0803926M182293r907184n507986
40047E1401647O898964O625497o861689j4920511q029056K039655K002687l696161
40039C5461033k783588M171980O283132K194671J753789N651705K99643j7970652
40031C5061713k8852560j3736534J4406937K5096224J0056202r166699j2757220
40024B0108063m107737L566573O024695O263011N509403L551985J183651j841056
40016D0258588n466870n643465j13511L465572l169146j2231872p806163P361717
$$ plain form
40071 -8668710 9922519 29900720 41824928 38263446 23376981 14754001 23016296 35037863
40063 35037863 31645712 16361224 9149946 14804542 17475997 8222105 -1719255 -1203432
40055 -1203432 5016033 10302556 20657519 41830598 62634524 66816817 56909633 51401647
40047 51401647 58300611 64926108 58064419 43143908 35114852 37154507 39157194 35461033
40039 35461033 32677445 36849425 43132557 45327228 47081017 52732722 53032365 35061713
40031 35061713 6209153 -7527381 6879556 31975780 42031982 32865283 20108063
40024 20108063 16000326 19566899 25591594 31854605 37364008 40915993 42099644 40258588
40016 40258588 34791718 29148253 29034742 32500314 29331168 17099296 9293133 16654850
40008A6654850J0764603o544899k2460273j2692368J5103750L1138553K0512208
40001E2476424l392500j9095995j8660452r521440l114245l110932k613572M899223
39993b133489J2609967O767701j1810154k3925027j6146057J774540J2351995
39986b0510524J3292251J3714671J5692917J3280135N855325l04527k313895k409278
39978C6297075j291371P38467j640266j2619388k4775147k5059419j1797299L200109
39970c6947239J0258299J1471038J3606919J8383304K1087270J4204405n910820
39963D6153176l0354382l9631516k3538940L469504J7453165J3738724P857435
39956d852834Q480906O377203m191344j0400274o2339J6620820K1041249J4370458
$$ plain form
40008 16654850 27419453 20874554 -1585719 -14278087 825663 31964216 52476424
40001 52476424 49083924 29987929 11327477 1806037 -1308208 -4419140 -7032712 -2133489
39993 -2133489 10476478 17244179 5434025 -18491002 -34637059 -32862519 -20510524
39986 -20510524 -7218273 6496398 22189315 35469450 41324775 41020248 38706353 36297075
39978 36297075 35005704 35744171 34103905 21484517 -3290630 -28350049 -40147348 -36947239
39970 -36947239 -26688940 -15217902 -1610983 16772321 37859591 52063996 46153176
39963 46153176 15798794 -23832722 -47371662 -43902158 -26448993 -12710269 -4852834
39956 -4852834 3628072 10005275 5813931 -4586343 -4648682 11972138 33013387 47383845
39948D7383845J2750666J6535661O256277k3282637m4325333k8639788J1674404
39941a646905L6012686K5978005M045412l481421j558827q886292k0247805j1742756
39933A8472097J7242589L2648154Q928626l2661635m7026432j9901375J8043788
39926d254188L1571650J8666684J785018m580441m076572k376808K763346J1173030
39918E0671719J2029223l402443k5086288l1440754j5075762O907253J2629610
39911G232558j37619j4273388j4288127j705833Q920064N546995q909275j8151690
39903c5766315r033931J2919756K9168105K9503617J9964098Q548870m252289
39896E1051911j4832855j1421137P468844K2167434J6237524J261733k629627
$$ plain form
39948 47383845 60134511 76670172 82926449 59643812 15318479 -13321309 -1646905
39941 -1646905 34365781 60343786 64389198 60907777 59348950 50462658 30214853 18472097
39933 18472097 35714686 68362840 77291466 44629831 -2396601 -22297976 -4254188
39926 -4254188 27317462 45984146 47769164 43188723 39112151 36735343 39498689 50671719
39918 50671719 62700942 59298499 34212211 2771457 -12304305 -5397052 7232558
39911 7232558 7094939 -7178449 -21466576 -23172409 -14252345 -8705350 -17614625 -35766315
39903 -35766315 -44800246 -31880490 -2712385 26791232 46755330 55304200 51051911
39896 51051911 36219056 24797919 32266763 54434197 70671721 71933454 69303827
39889F9303827j176250j4473247l5853668l4637095n356872J7600380Q845689
39882D252764j1871176j2033921P541525K2263384K2340070J6585686R433483
39875E8511815k54154m492341M642171J4216000L129247k3157031l3081783j0217557
39867I296367K3649742L4781506J4670285j5863280l0744344k1036432Q66912
39860A5620756J5197891J4356342O980289K172406j041277l158759L400889J8428755
39852G1957292K3246830N133390j7140460j5983991K271603N180187j4672493
39845E9992358k7028945j1858373R610980J0097557j678339N04902J5427313J6903726
39837G1971179l736855k4535401k5746011j4010174n499265k261752K130917N321207
$$ plain form
39889 69303827 68127577 53654330 17800662 -16836433 -22193305 -4592925 4252764
39882 4252764 -7618412 -19652333 -12110808 10152576 32492646 49078332 58511815
39875 58511815 58257661 53765320 58407491 72623491 75752738 52595707 19513924 9296367
39867 9296367 32946109 67727615 82397900 66534620 35790276 14753844 15620756
39860 15620756 30818647 45174989 52155278 54327684 53286407 50127648 53528537 71957292
39852 71957292 95204122 100337512 83197052 67213061 69484664 74664851 59992358
39845 59992358 32963413 21105040 30716020 40813577 39135238 39640140 55067453 71971179
39837 71971179 68234324 43698923 17952912 3942738 -1556527 -3818279 -1687362 3633845
39829C633845N46793o330473o71364J7395977K7542550J5643462n193921j2178074
39821D0388795l819126K594209Q89257L432799J5367396K1830436J0942291p538376
39813H4087681j8799928k2245799k0449240o765083J6585107K5059895K396207
39806E9868840k7817305l0656918j1109865l320287j3265707j1745754J0247968
39799b7799028K0804724k75475k3977900j4309374J7824827L3081030J9590963
39792B4939767J472023L73668J3475442K5629425K4352523O777381j3662011j4713430
39784F8644788O262883K1474915P308699k0709124k8133987q915611J0106628
39777E6039191Q157074q037742k1007492k0889346o772873J2435117J9200661
$$ plain form
39829 3633845 4180638 -2149835 -2821199 14574778 42117328 57760790 52566869 40388795
39821 40388795 36569669 39163878 40053135 43485934 58853330 80683766 91626057 84087681
39813 84087681 65287753 43041954 22592714 15827631 32412738 57472633 59868840
39806 59868840 32051535 1394617 -9715248 -13035535 -26301242 -38046996 -27799028
39799 -27799028 -6994304 -7269779 -31247679 -45557053 -27732226 5348804 24939767
39792 24939767 26411790 26785458 40260900 65890325 90242848 97020229 83358218 68644788
39784 68644788 74907671 96382586 103691285 82982161 54848174 45932563 56039191
39777 56039191 64196265 56158523 35151031 14261685 7488812 19923929 39124590
39770C9124590O999134m188859O933812K5548710J6538204j9174728l6655400
39763C5125463r952646K6567542K4776226j0656524l3078018j9917367N253426
39756A8118102J5923892J5145335J4090355O024295j6520183l5337116k4286522
39749f841842R960739K9417829J3071731j5425778j9712975L602557K6217344
39742D0289605K6792443J1687581q14069j947052M096554P261870j10368j4204672
39734G3051892j9954645r633324K152184m381724k4404010l3130272k0711258
39727c7011157k828056O728857J1665351J4151723N186616j2106193j4028200
39720b8241059Q475480K7765095J7895775l594774k799146J5841807J8270816
$$ plain form
39770 39124590 46123724 41934865 48868677 74417387 90955591 71780863 35125463
39763 35125463 25172817 51740359 76516585 65860061 32782043 12864676 18118102
39756 18118102 34041994 49187329 63277684 69301979 52781796 17444680 -6841842
39749 -6841842 3118897 32536726 45608457 30182679 10469704 14072261 40289605
39742 40289605 67082048 78769629 77955560 76008508 80105062 87366932 87256564 73051892
39734 73051892 53097247 43463923 45616107 41234383 16830373 -16299899 -37011157
39727 -37011157 -39839213 -33110356 -21445005 -7293282 -2106666 -14212859 -28241059
39720 -28241059 -19765579 7999516 25895291 22300517 19501371 35343178 53613994
39713E3613994j534294j1892786L333614J8485420Q300857j3027220j6472819
39706D0806766k192626M374631q771378k5176749k2816687m48877K0658606J8376507
39698B4810193n794783k5894080k0486129K052735J7144190J7302165J5822797
39691B4957088J9804974J9808106J0089881k82333m146190p202613j3406836j4817465
39683C4804612o227736L465988N006594K347234K911538N382584O325233P873422
39675F1889469R705468M581830q693120j8919254j8326116j2997855q080167L475861
39667A2636116K4383785L8444952K9367848N304053j2132801j6950598k0192029
39660F0861326k6267568k5185618j0210771R104766J5833157K955422j8309799
$$ plain form
39713 53613994 52079700 40186914 43520528 62005948 70306805 57279585 40806766
39706 40806766 38614140 42988771 34217393 9040644 -13776043 -14224920 6433686 24810193
39698 24810193 19015410 -6878670 -27364799 -25312064 -8167874 9134291 24957088
39691 24957088 44762062 64570168 74660049 74377716 70231526 63028913 49622077 34804612
39683 34804612 28576876 32042864 37049458 39396692 42308230 47690814 54016047 61889469
39675 61889469 71594937 76176767 67483647 48564393 30238277 17240422 9160255 12636116
39667 12636116 37019901 75464853 104832701 110136754 98003953 81053355 60861326
39660 60861326 34593758 9408140 -802631 8302135 24135292 27090714 8780915
39653H780915k6056806q874764J8447235K8725396J4621003m136545r322473m519125
39645A7664836P49129R189070K3837418L3184064K5788551Q980381l258041j0502758
39637A05632650j7891817k0002652j1792324m671044j0480590j8825835j3002201
39630H966187k11633p98024j2879039j4322345J505195J7301510J9729709J2431509
39622C1723069R55867j1871356j5421947p41635J8334320J8477626K266243o072577
39614C7649610o22057J092489m923261k546391P042373O98228j9726547j7210294
39606A454150J9781139M5885909K1489125k6170611m3459383k5107813n287235
39599a1414719M682392J9896472L3970344K0494453j4236755k7579104k622083
$$ plain form
39653 8780915 -17275891 -26150655 -7703420 21021976 35642979 31506434 22183961 17664836
39645 17664836 18413965 27603035 51440453 84624517 110413068 119393449 116135408 105632650
39637 105632650 87740833 67738181 55945857 51274813 40794223 21968388 8966187
39630 8966187 8754554 7956530 -4922509 -19244854 -17739659 -438149 19291560 31723069
39622 31723069 32678936 20807580 5385633 4643998 22978318 41455944 43722187 37649610
39614 37649610 37027553 38120042 33196781 30650390 37692763 38390991 18664444 1454150
39606 1454150 21235289 67121198 88610323 62439712 18980329 -6127484 -11414719
39599 -11414719 -6732327 13164145 47134489 67628942 53392187 25813083 23191000
39592B3191000K5255295K0699752n571998k2058995j9960272r997357J985151
39585A3542576J3347617J4200135M43475j2452720p013874J1411659K2038587
39578E5517455J5548711J631918n766896j254331R456958J3089478J071221j6568654
39570G2725860j8708855q53367J5597162J0602906q883924k1607587k0273178
39563B8599017j3632864p997515j764083N144524R641403J1621536J1484359N212260
39555D8308637o927323j1647908K456753K3212931K5151904M452758j3160953
39548G1846799p518550P742319N919681j2977535k1726885n760045J4221572J0497636
39540F2244992j1602233j9660321j24203K0539146J1681078j8517108l4589964
$$ plain form
39592 23191000 48446295 69146047 63574049 41515054 21554782 11557425 13542576
39585 13542576 26890193 41090328 41533803 29081083 22067209 33478868 55517455
39578 55517455 71066166 72698084 66931188 65676857 75133815 88223293 89294514 72725860
39570 72725860 54017005 53163638 68760800 79363706 70479782 48872195 28599017
39563 28599017 14966153 6968638 5204555 10349079 19990482 31612018 43096377 48308637
39555 48308637 41381314 29733406 32190159 55403090 80554994 85007752 71846799
39548 71846799 64328249 72070568 77990249 65012714 43285829 37525784 51747356 62244992
39540 62244992 50642759 30982438 30858235 51397381 63078459 44561351 9971387
39533I971387k2088229k046014M522894L270832P421331J2624237Q367501L25894
39525B2369833J070732O627567K456095j0972432j7480296r289228M806375J5173247
39517A4761893J9476570J5324128J300093j3434634j6438846r884219n037503
39510F067482J15671J6533658L5889726L2926839N047309j6337706r090993Q422029
39502G9574015Q319718o038614j3377207j0046200n662395J460147J4830068J7891404
39494H6950936m807654l1880765k7298477L061140J6209878j065401j1548069
39487B9621588J0146171L4066639K1460051j5329135l3126149j8792357L622582
39480C1669390J4739585J6582898J2814779J766188j0455281j3151023p723309
$$ plain form
39533 9971387 -12116842 -14162856 -9639962 -6369130 1052201 13676438 22043939 22369833
39525 22369833 23440565 30068132 32524227 21551795 4071499 -5217729 -411354 14761893
39517 14761893 34238463 49562591 50862684 37428050 20989204 11104985 6067482
39510 6067482 6183153 22716811 58606537 91533376 96580685 80242979 71151986 79574015
39502 79574015 87893733 81855119 68477912 58431712 52769317 54229464 69059532 86950936
39494 86950936 82143282 50262517 22964040 26025180 42235058 41169657 29621588
39487 29621588 39767759 73834398 95294449 79965314 46839165 28046808 31669390
39480 31669390 46408975 62991873 75806652 77572840 67117559 53966536 46243227
39473D6243227k571944M304114J6547638J9929635o04967k6646686k1281009J5997361
39465E1917369M1258239K5792610n634313j5067648l963460J65235r148295j4163025
39457G1156712q939190q757256k0820397k8741996j5645560J0882406K7040587
39450B6175306K0651120L591888l610127M153851J2993424J2248635J0795353
39443H6999450J9309768K4483534L841962l2685035m3826371j2431725K5253422
39436G0945005K6485069k202791k1757107j7250888p218508m972709l047934L415967
39428D4396104O173520J763018k219762k124643L4658R021734K7341001L5380913
39420A19766543J0170204l2317594m6135591j7426876J4174031J2550728o934810
$$ plain form
39473 46243227 43671283 47975397 64523035 84452670 83847703 57201017 35920008 51917369
39465 51917369 93175608 118968218 113333905 98266257 94302797 94468032 85319737 71156712
39457 71156712 62217522 53460266 32639869 3897873 -11747687 -865281 26175306
39450 26175306 46826426 50418314 46808187 50962038 63955462 76204097 86999450
39443 86999450 106309218 130792752 134634714 101949679 58123308 45691583 70945005
39436 70945005 97430074 95227283 73470176 56219288 49000780 44028071 40980137 44396104
39428 44396104 50569624 52332642 50112880 47988237 48022895 57044629 84385630 119766543
39420 119766543 129936747 97619153 51483562 34056686 48230717 60781445 53846635
39413E3846635r390600O193698J4525026O854365l289656o385132l392195N572569
39405F4534710J6856802J6723611K16225j4241091j0844524l575571j1319389
39398E8350773k0142592m206515K5053139L0065910O284724j0506662k316588
39391H2582189O416154l559592j3425234m231922O381559l966203j9905376j2802457
39383C7489118R072876J1650982j0480230k5309570j1176680J5256186K5966795
39376E2469477J5068389k847779j2118175o858689N762459R490856k606387j3770940
39368D4589211l009839K0335325K2388239p067334l3887032k3709034J0326814
39361B9966350K7288043J5774218L202612P980869J2967927k94372j6857298j2186535
$$ plain form
39413 53846635 44456035 50649733 65174759 72029124 68739468 62354336 58962141 64534710
39405 64534710 81391512 98115123 98331348 84090257 73245733 69670162 58350773
39398 58350773 38208181 34001666 59054805 89120715 95405439 84898777 82582189
39391 82582189 88998343 85438751 72013517 67781595 74163154 70196951 50291575 37489118
39383 37489118 46561994 58212976 47732746 22423176 11246496 26502682 52469477
39376 52469477 67537866 64690087 52571912 45713223 51475682 60966538 58360151 44589211
39368 44589211 41579372 61914697 84302936 77235602 43348570 19639536 29966350
39361 29966350 57254393 73028611 76231223 84212092 97180019 96885647 80028349 67841814
39353F7841814N431203O811736r148381j2072573P872311J8411526m223229l1125691
39345D9798716j9363390K1448914L9809766J7042596q203347j180640J9349018
39338A18701633J6938648m088142j0246227L707821O765048j5472633l3672537
39331H2633611j7971077J5086722K4643786L883890j2731537k665426J2878829
39324A05758798N917353j2488089j0758187J0746068J9619671M320572q212905
39317A14903281K33020Q700443l300103j6144758k946119K1062444K1420935J642796
39309A45571939n783788K377553k054413k1963834k4898731j93833K0199321J4878253
39301A28132467L335416K379158l863807k3103571k6986696P10265K6386114J7467569
$$ plain form
39353 67841814 73273017 80084753 70936372 58863799 66736110 85147636 80924407 49798716
39345 49798716 30435326 51884240 91694006 108736602 100533255 99352615 118701633
39338 118701633 135640281 131552139 121305912 125013733 131778781 116306148 82633611
39331 82633611 64662534 79749256 104393042 108276932 95545395 92879969 105758798
39324 105758798 111676151 99188062 88429875 99175943 118795614 123116186 114903281
39317 114903281 115136301 123836744 120536641 104391883 101445764 122508208 143929143 145571939
39309 145571939 139788151 142165704 140111291 118147457 93248726 93054893 113254214 128132467
39301 128132467 131467883 133847041 129983234 106879663 79892967 80603232 106989346 124456915
39293A24456915l585680q71221J1702014J000572j8522187q749623J8782904J7931706
39285A42145400j0809320k0184244J62792P222301j4286537k0791197J2720545
39278I6179740M4003477L0852415k345508j0403042p0331o241061k3084352j3644276
39270A15247062K2763158M2840067K1941641j4254538k9494644j9667901m403404
39263A34971441L893038Q868546J6697874K4128675K1658951P543319o186504
39256B11575340q625182o118995j0431014j5244901n093207J2493880J0467039
39249A89022960j4055985k6893863l683650L3117954M3861214K1106163r709059
39242B32765734k4868840j9998419n255618J773002j0277943k8605453k6263912
$$ plain form
39293 124456915 120871235 120000014 131702028 132702600 114180413 105430790 124213694 142145400
39285 142145400 131336080 111151836 111314628 118536929 104250392 83459195 96179740
39278 96179740 140183217 171035632 168690124 158287082 158216751 151975690 128891338 115247062
39270 115247062 138010220 180850287 202791928 188537390 159042746 139374845 134971441
39263 134971441 138864479 147733025 164430899 188559574 210218525 217761844 211575340
39256 211575340 202950158 196831163 186400149 171155248 166062041 178555921 189022960
39249 189022960 174966975 148073112 144389462 177507416 221368630 242474793 232765734
39242 232765734 207896894 187898475 182642857 184415859 174137916 145532463 119268551
39235A19268551M04127K3712211K4765203J7391186J7034436J3711284j644619
39228B14642379j0980519J890411J8860892J5240254n0888m553097l350586j3527249
39220B18171597k3801751j0613596J5250657J9625367j076110j5748512q021324
39213A93786328O448994J3185012J5024771J3102189M238621j213489R123155
39206B53695581K0405175P052018k1221508k7204594l209788J8686837J9538383
39199B67742104J5793590J8258418J1207266r946973j9887127n551415P451576
39192B85067439l919493k2860025k3669929j3128814j1934817j6726846j0556534
39185A82270981M257032J1317594P892271M914198P374084J1927417J5523518
$$ plain form
39235 119268551 119672678 143384889 168150092 185541278 202575714 216286998 214642379
39228 214642379 203661860 205552271 224413163 239653417 239602529 235049432 231698846 218171597
39220 218171597 194369846 183756250 199006907 218632274 217556164 201807652 193786328
39213 193786328 200235322 213420334 228445105 241547294 245785915 244572426 253695581
39206 253695581 274100756 281152774 259931266 232726672 229516884 248203721 267742104
39199 267742104 283535694 301794112 313001378 303054405 283167278 277615863 285067439
39192 285067439 281147946 258287921 234617992 221489178 209554361 192827515 182270981
39185 182270981 186528013 197845607 205737878 210652076 218026160 229953577 245477095
39178B45477095J3742599J638778j3869816j7066625p589498k969982p980467
39171B11382084m542938J5194867L0960414K6321041J3805847R033090M834950
39164C06989355o688377j1239176K398153J6399993J1157976j476670p61534O460904
39156C23240624K452845o277114l574282K278151n885068j7230513q233434J4165557
39148C00936766K1485910R827604O95792j55797p066172j8236054j3649631N766325
39140B99604743J3075395j419666j4475057q831659K067791K192694r95303M458717
39132B95677655J1323168P048845k918303k650387J0455129K1108163J3501560
39125C53545830j0469030k9747107k5260101m821667M868238l189857n700895
$$ plain form
39178 245477095 259219694 260858472 246988656 229922031 222332533 219362551 211382084
39171 211382084 206839146 222034013 252994427 279315468 293121315 302154405 306989355
39164 306989355 300300978 289061802 291459955 307859948 319017924 317541254 316779720 323240624
39156 323240624 325693469 319416355 315842073 318120224 312235156 295004643 286771209 300936766
39148 300936766 322422676 332250280 332946072 332790275 325724103 307488049 293838418 299604743
39140 299604743 312680138 311260472 296785415 287953756 290021547 292214241 291218938 295677655
39132 295677655 307000823 314049668 311131365 308480978 318936107 340044270 353545830
39125 353545830 343076800 313329693 288069592 283247925 288116163 284926306 279225411
39118B79225411R336575J6723366l733743k4972995j1900227J7103935J6984819
39111B98767141p186086p356725K3166195L4297233L375335k5574264j6186023
39104C03302806J078346j3834107l8311409k4546558J8555411L6251777J0604965
39097B93101231j7047687r359986J9533177L0285082P507559k7818392m2546448
39090B53654536k3686864P606711J8101814K277179j2026106m103748J2003362
39083B53826884J3779499M641506J829310N463228L125912n011529q409962o665019
39075B62579829p457666r588130o096012J270025O552147J1088453J5319350R531639
39067B83199635r392694k3038419j4345721L756874N449754r073118j5747208
$$ plain form
39118 279225411 288561986 305285352 301551609 276578614 264678387 281782322 298767141
39111 298767141 291581055 284224330 307390525 341687758 345063093 319488829 303302806
39104 303302806 304381152 290547045 252235636 227689078 246244489 282496266 293101231
39097 293101231 276053544 266693558 286226735 316511817 324019376 296200984 253654536
39090 253654536 229967672 237574383 255676197 257953376 245927270 241823522 253826884
39083 253826884 267606383 272247889 274077199 279540427 282666339 277654810 269244848 262579829
39075 262579829 255122163 245534033 239438021 240708046 247260193 258348646 273667996 283199635
39067 283199635 273806941 250768522 236422801 240179675 245629429 236556311 220809103
39060B20809103m326838R235064Q409239n142713j9297179k3079322j2445083
39053A74162271L023070N546448o236809j0112319O000521J9918138Q775162j0691878
39045A90384604q380328O566832P11691k2258245k2277445R507940L1400350J6068831
39037B01724230q591346r009666J247835q102423k8957039k8846455m540822J5223289
39029A30147603J4790735P465888O133738N003967l813781j5389396k0899691
39022A23439063j8676377j1209265o71247Q661692J0901529N461961k57708K235241
39014A19884889J3253684K2662985J9213876N208347k758846M606720J2508295
39007A94579950Q16320k3336411l1040610j2637637P720768P362216n085328q638625
$$ plain form
39060 220809103 216482265 225717329 234126568 228983855 209686676 186607354 174162271
39053 174162271 177185341 182731789 176494980 166382661 172383182 192301320 201076482 190384604
39045 190384604 182004276 188571108 189282799 167024554 144747109 154255049 185655399 201724230
39037 201724230 193132884 184123218 185371053 177268630 148311591 119465136 114924314 130147603
39029 130147603 144938338 152404226 158537964 163541931 159728150 144338754 123439063
39022 123439063 104762686 93553421 92882174 101543866 112445395 117907356 117649648 119884889
39014 119884889 133138573 155801558 175015434 180223781 177464935 182071655 194579950
39007 194579950 195396270 172059859 141019249 128381612 136102380 143464596 138379268 129740643
38999A29740643r00586P001248J1655066J4235500Q001400r735358k1570932r062997
38991A29363984J5741732K0963798j180303k2094949j5093134J0402540K2615685
38984A60719353N714118k4321697l8250931k3489154L618213J6186870P899141
38977A08075913j180258N938952J8902318J6714274m58165j2957726j0953916
38970A24081392m172990k422588l915096o003202j0810874j4432085o314161J1638213
38962H7648609J9050040K542526k1917293k5789212l475972K0893733K2809867
38955A01762298M615761j0371191o524623O802718Q584904o408390k0457764j6050237
38947F1953476J292633J1435596N915568n145650j0492932r534370m876364M296272
$$ plain form
38999 129740643 128840057 135841305 147496371 161731871 169733271 159997913 138426981 129363984
38991 129363984 145105716 166069514 164889211 142794262 127701128 138103668 160719353
38984 160719353 166433471 142111774 103860843 80371689 83989902 100176772 108075913
38977 108075913 106895655 112834607 131736925 148451199 147993034 135035308 124081392
38970 124081392 119908402 117485814 113570718 107567516 96756642 82324557 76010396 87648609
38962 87648609 106698649 109241175 87323882 61534670 58058698 78952431 101762298
38955 101762298 106378059 96006868 89482245 96284963 104869867 98461477 78003713 61953476
38947 61953476 63246109 74681705 80597273 75451623 64958691 55424321 50547957 54844229
38939E4844229J5142522J7076301L497216j6860829k7261048k0254406m408142
38932B1775843M799451L14780p876765k079531J9370036L2206481J2837620k5300742
38924E6047173l9060549p786546L6289361M4816118J2163084k0373441j8319234
38917F3775966N916549J5046142l090039k2922243j8346549K145835R118388n295432
38909D6348617j6441993m162349J6752353J9401282O232770L711135J8359644
38902I0201459K5419745R019179j1659531j2363120O2315K358266q364281j5940900
38894G8733132j4997510j5157316j7810199j2125449K376792R126043k558476
38887B7587017k1866253k9854288j7963501Q920131L5780259M2614022K1192882
$$ plain form
38939 54844229 69986751 87063052 90560268 73699439 46438391 26183985 21775843
38932 21775843 26575294 26890074 19013309 16933778 36303814 68510295 81347915 56047173
38924 56047173 16986624 9200078 45489439 90305557 102468641 82095200 63775966
38917 63775966 69692515 84738657 81648618 58726375 40379826 42525661 51644049 46348617
38909 46348617 29906624 25744275 42496628 61897910 68130680 71841815 90201459
38902 90201459 115621204 124640383 112980852 100617732 100680047 103038313 94674032 78733132
38894 78733132 63735622 48578306 30768107 18642658 21019450 30145493 27587017
38887 27587017 5720764 -24133524 -42097025 -33176894 2603365 45217387 66410269
38880F6410269r531899j9584388m475119R613785L095488j1846872j3685825k645540
38872A7349899N639270N108560J397116k170650m511154j8979J1425947J4198412
38864D8418421l958109k5991792k0745235J3182952M0051926L2034898L533960
38857H6527021j2587389q809468n082049j3887022k2836148j5687190L356570
38850A0994325J5512433J1550037R84459k454387K751976P699590O813652L317012
38842E7169097J482236N40408o96649L99248L985690K270112j0879132k6531678
38834B7739332k6842577p266791J5340978K1745990J1682391P4892l801135m367750
38826C4305330o299104k813887J3754578L2987721L0819109j97758l4186531l8695352
$$ plain form
38880 66410269 56878370 37293982 32818863 42432648 45528136 33681264 19995439 17349899
38872 17349899 22989169 28097729 29494845 27324195 22813041 22794062 34220009 48418421
38864 48418421 44460312 18468520 -2276715 10906237 50958163 82993061 86527021
38857 86527021 73939632 65130164 60048115 46161093 23324945 7637755 10994325
38850 10994325 26506758 38056795 39041254 36586867 39338843 47038433 53852085 57169097
38842 57169097 58651333 59191741 58495092 58894340 62880030 65150142 54271010 27739332
38834 27739332 896755 -6370036 8970942 30716932 42399323 42474215 38673080 34305330
38826 34305330 28006226 25192339 38946917 71934638 102753747 102555989 68369458 29674106
38818B9674106j5002035M423228R75613o914832L269273K0898017J9716710J095086
38810E8135166q514635j723713j214671j7733438k6634942o703520K0532088J8992436
38802C5134771p206772j9411693k310099J6499026J2287588k056772m561233k082525
38794B6292291j2759097k6106313j3430814K4052868M8687928L6248363O747864
38787H9733090q223742p004281p563551j3189091j3230190q199886p717751p228737
38779A7375861O186247K3613959J8392719j1490551l2371307k0904380K875610
38772C678158P597826n077408j1299709l537313P804669J8734549K9791441K8848565
38764G6540778N672945k1115319k2376479k606218N410832q543528j9858441j2922274
$$ plain form
38818 29674106 14672071 19095299 20070912 13156080 16425353 37323370 57040080 58135166
38810 58135166 49620531 47896818 46682147 28948709 2313767 -4389753 16142335 35134771
38802 35134771 27927999 8516306 6206207 22705233 34992821 32936049 28374816 26292291
38794 26292291 13533194 -12573119 -26003933 -1951065 46736863 82985226 89733090
38787 89733090 81509348 74505067 66941516 53752425 40522235 32322349 24604598 17375861
38779 17375861 23562108 47176067 65568786 54078235 21706928 802548 3678158
38772 3678158 11275984 6198576 -5101133 -8638446 -833777 17900772 47692213 76540778
38764 76540778 82213723 61098404 38721925 36115707 41526539 32983011 13124570 202296
38756B02296j797022L455766J4031660K8705434K0844376j4431171l5288997j0797680
38748D924662K5919939K4779768l772793r012077J4253997J7359609j9136391
38741E5316714m8836983k8884149J6743678L5438999J8632103R53849K431830
38734E1796041O505803n315841k3720076k5686456n946819J4832123J3176393
38727B5641168q190306k0674000n805942J6559239J2083145j9020551l8942252
38720c8349499k2944352J0131994K9213363L0284867K6435353J8204871j034030
38713E1942567k1148926k3063316p600715N784532Q590996J0784997J7229122
38706D2519257J7610819O183320o549917j1057681j2666389j7139582j5255687
$$ plain form
38756 202296 -1594726 1861040 15892700 44598134 65442510 51011339 15722342 4924662
38748 4924662 30844601 55624369 51851576 42839499 57093496 74453105 55316714
38741 55316714 6479731 -22404418 -5660740 29778259 48410362 49364211 51796041
38734 51796041 58301844 52986003 29265927 3579471 -2367348 12464775 25641168
38727 25641168 17450862 -3223138 -9029080 7530159 19613304 592753 -38349499
38720 -38349499 -61293851 -51161857 -21948494 8336373 34771726 52976597 51942567
38713 51942567 30793641 7730325 129610 5914142 14505138 25290135 42519257
38706 42519257 60130076 66313396 59763479 48705798 36039409 18899827 3644140
38699C644140L103165K6554275L0680875R599361j4499126j8876465p519555j694972
38691C0991698q766587j3574647l268694J2008459J3329727n2725j1798149j3253339
38683E615743j0981614q258989K611818K1339655K9864007J5775935o476299j3984079
38675C5506177o344566r08873l566634m256622L69491Q28565n025114m704774
38667A1897650P989323J9591737J4519047l784931j7596294j4078996M770027
38660B3307563K3591866K2863867k447748l0343293l0925831l011739K2389249
38653B5423934K1133637K029886j4526495k3816218k7323763j6376576J0501607
38646b2953988K8581574J4628525j4022561j9037462K730815J5852390L036696
$$ plain form
38699 3644140 6747305 33301580 63982455 73581816 59082690 40206225 32686670 30991698
38691 30991698 22225111 8650464 5381770 17390229 30719956 30667231 18869082 5615743
38683 5615743 -5365871 -13624860 -11013042 10326613 40190620 55966555 49490256 35506177
38675 35506177 29161611 28252738 24686104 20429482 20798973 21627538 16602424 11897650
38667 11897650 19886973 39478710 53997757 50212826 32616532 18537536 23307563
38660 23307563 46899429 69763296 67315548 36972255 6046424 3034685 25423934
38653 25423934 46557571 48587457 34060962 10244744 -17079019 -33455595 -22953988
38646 -22953988 5627586 20256111 6233550 -12803912 -10073097 5779293 8815989
38639H815989j0063183k05058J6368271J4779318K625617J791270Q511112L253358
38631D5876694j1098571j3219488r55458N621532q67734n843546k225901j272412
38623A6015116o109483j350750J7774432K9806330J8065484j990454o532003K77501
38615F5956173l793357k1335755l0508952j7179350O456194J8851255J2804702
38608C1250910j244736q351195l359941M984078N545269J20807m68867L901632
38600C2377957J229806q740882p874608R429088J7606472m832442l5517903l3664872
38592b9987384K19646K2732246R176577j5075217j6436281K490443J9174005K7823292
38584B0117327L4090463K8999743j253027m2751805n8772412l3871815O243344
$$ plain form
38639 8815989 -1247194 -1452252 14916019 29695337 32320954 34112224 42623336 45876694
38631 45876694 34778123 21558635 20603177 26224709 25356975 19513429 17287528 16015116
38623 16015116 9905633 8554883 26329315 56135645 74201129 72210675 65678672 65956173
38615 65956173 62162816 40827061 10318109 -6861241 -405047 18446208 31250910
38608 31250910 30006174 21654979 18295038 23279116 28824385 28945192 28476325 32377957
38600 32377957 33607763 24866881 16992273 26421361 44027833 39195391 3677488 -29987384
38592 -29987384 -29767738 -7035492 2141085 -12934132 -29370413 -26879970 -7705965 20117327
38584 20117327 54207790 83207533 81954506 39202701 -19569711 -53441526 -47198182
38577d7198182K7730770K6452210K1377259K1636550J6906851q93484k1527721
38570D4484253k8920981k1327040j0263416l395855J821469Q007781J1478670
38563A884881R187185L983507p70968m282312l124365O570639J6674070J0159117
38555D0281754j3201511k7590000j3069996J4044063K1849252O114546r064542
38548A9363566r383535m187646j558050M361222J4292438J6072015O770059J281327
38540D7011396O015981M350700j5191997l4262719k8749521m676627J1803867
38533a3698920J2198074J1113367J6810630J8121707N032854j3823521k1904017
38526A3850174j4066907R47830J2241897J5894677J3756677O844688o210750k2204962
$$ plain form
38577 -47198182 -19467412 6984798 28362057 49998607 66905458 66011974 44484253
38570 44484253 15563272 -5763768 -16027184 -19423039 -17601570 -9593789 1884881
38563 1884881 11072066 15055573 14284605 10002293 6877928 13448567 30122637 40281754
38555 40281754 27080243 -509757 -13579753 464310 22313562 28428108 19363566
38548 19363566 9980031 5792385 4234335 8595557 22887995 38960010 45730069 47011396
38540 47011396 53027377 57378077 42186080 7923361 -20826160 -25502787 -13698920
38533 -13698920 -1500846 9612521 26423151 44544858 49577712 35754191 13850174
38526 13850174 -216733 731097 12972994 28867671 42624348 49469036 43258286 21053324
38518B1053324k9895667k1100039k860622J0509671J5340904J7368684J5589302
38511B6005557M017310r891272q718772O958800J4154563R59446j4869109j3938093
38503D678430l442842q22256n298239m715152J927954P711889J2580653J6754382
38495B9374819J1071581o347134j5778160j423242J8708010J4688597r920389
38488D0374082k2951330j2410447r97246o709376j6150959r311414R268127J9249844
38480C61281J3031418K655070K441478J1777905J5046995k53749k4436246l2836570
38472a2212418j7379287J379064M199142K26138P065737J8599697J6776682M728291
38464B3383046J30123K143899m764708j7081513j4847504P30010O109727k419442
$$ plain form
38518 21053324 -8842343 -29942382 -32803004 -22293333 -6952429 10416255 26005557
38511 26005557 30022867 20131595 11412823 18371623 32526186 33485632 18616523 4678430
38503 4678430 1235588 413332 -4884907 -9600059 -7672105 39784 12620437 29374819
38495 29374819 40446400 34099266 18321106 16897864 35605874 50294471 40374082
38488 40374082 17422752 5012305 4015059 -2694317 -18845276 -28156690 -18888563 361281
38480 361281 13392699 16047769 18489247 30267152 45314147 45060398 20624152 -12212418
38472 -12212418 -29591705 -28212641 -24013499 -23787361 -16721624 1878073 18654755 23383046
38464 23383046 23513169 25657068 20892360 3810847 -11036657 -10306647 -4196920 -6616362
38456f616362l33652K0132140L1399635J4735197q784545j3897903r006468j1702943
38448A5925099j2309960M965080K3134748J2206056k0357312l5225393j7631511
38441b9293193M429763N138343n129456m519888M485599M301346n176620n271250
38433c1035356J1151435K6054675K0224279k73760j2845015q442677L39236J118601
38425F291418l347295p328185j2985609j7514130n669143K5224441M5187446K3478043
38417E3336986k3116829m2616199j3402653K8224176L5846766O140044k8500067
38410A5912224m1683919l1563466j0830110N696901R405537M079867M57839K474687
38402d6050440O557082J2880788K3134175K7634817J3482625j1372232k2194550
$$ plain form
38456 -6616362 -6950014 13182126 44581761 59316958 50532413 36634510 27628042 15925099
38448 15925099 3615139 8580219 31714967 43921023 23563711 -11661682 -29293193
38441 -29293193 -24863430 -19725087 -24854543 -29374431 -24888832 -20587486 -25764106 -31035356
38433 -31035356 -19883921 6170754 26395033 26121273 13276258 4833581 5172817 6291418
38425 6291418 2944123 -4384062 -17369671 -34883801 -40552944 -15328503 29858943 53336986
38417 53336986 30220157 -12396042 -25798695 2425481 38272247 44412291 15912224
38410 15912224 -25771695 -57335161 -68165271 -62468370 -53062833 -48982966 -48525127 -46050440
38402 -46050440 -39493358 -26612570 -3478395 24156422 37639047 26266815 4072265
38395D072265j1149854L108603N885048M727092Q402030R853225K208607p998346
38387A9108670j4929948k1184261k2276951p043081J5670486J8270380k600575
38380a4985280j3990340K482663J8681813N567586j9102408k2473310j0171927
38373e3991203q467526j2552949K956314L2211462M1091204K0493553k457964
38366A9282891q649282p166920p040036j584966J1222124J9656879J6994331Q244546
38358E0959567l831873j8173410k2903068q045789J1559771J2857448J096049
38351B3518695m83623N676802m739010k7840369k7099041P977915L8253544L1120339
38343D6385252O060641k103992L499038k937035k1402324k7052415j1263669P837129
$$ plain form
38395 4072265 -7077589 -3968986 1916062 6643154 15045184 24898409 27107016 19108670
38387 19108670 4178722 -17005539 -39282490 -46325571 -30655085 -12384705 -14985280
38380 -14985280 -28975620 -26492957 -7811144 -2243558 -21345966 -43819276 -53991203
38373 -53991203 -62458729 -75011678 -72055364 -39843902 1247302 21740855 19282891
38366 19282891 10633609 3466689 -3573347 -5158313 6063811 25720690 42715021 50959567
38358 50959567 47127694 28954284 6051216 -1994573 9565198 22422646 23518695
38351 23518695 23035072 28711874 23972864 -3867505 -30966546 -22988631 15264913 46385252
38343 46385252 52445893 50341901 53840939 50903904 29501580 2449165 -8814504 -977375
38335i77375J4837358J3848394J3010023J0088610P85095q429232m968960J1654533
38327D9848446K1691050M799870k9141916m2558513j6170163K0604518K5863381
38320C4936673J384880j5161269q177817M91404l182765l092758J0234057J6193022
38312C3625427J37084j6421716q906765R896618J1523267l910080j5094026j7331426
38304f481617k1389889k3513205r520662J3222701J9288549M454109o532220Q18417
38296b9653817R493344K025373q938440l92941K3614236L5402036K1283240k092548
38288E0740483j2263595q027751l824734n993487o881032r55872N454507M971629
38280B3220148O78575P9180M001972Q379076J1132231J0263614J957399j0954797
$$ plain form
38335 -977375 13859983 27708377 40718400 50807010 51592105 43162873 38193913 49848446
38327 49848446 71539496 76339366 47197450 4638937 -11531226 9073292 34936673
38320 34936673 36321553 21160284 12982467 13473871 10291106 7198348 17432405 33625427
38312 33625427 33762511 17340795 8434030 18330648 29853915 25943835 10849809 -6481617
38304 -6481617 -27871506 -51384711 -60905373 -47682672 -28394123 -23940014 -30472234 -29653817
38296 -29653817 -20160473 -18135100 -27073540 -27466481 -3852245 31549791 52833031 50740483
38288 50740483 38476888 30449137 26624403 20630916 13749884 12794012 18248519 23220148
38280 23220148 23898723 23977903 27979875 36358951 47491182 57754796 59712195 48757398
38272D8757398j6207646q114788J676354J673587o21894O262728J3037184K010600
38264D8473523k0306586k7513576j1426638P074762R184047r52647j1032955j5754181
38256b2254251j1949083J558127J4034622J2101723K206574K347695R668416L627500
38248A1341323j3941027j4689754Q769677K5465512J5015297P27965P634490J7836958
38240E8160441K167581k6185054k9143244l366357J5651714P029456j0704140
38233A3610397j2393014J574976J2926249Q545910r325984k5891880k6595215
38226c7548561j3648975l703146k702946M070679K5505914M3187804L3895117
38219D9055886K712261k3698716k8185570j2914950J0620244K6121319J9573134
$$ plain form
38272 48757398 32549752 24434964 26111318 27784905 27163011 33425739 46462923 48473523
38264 48473523 28166937 653361 -10773277 -3698515 5485532 4532885 -6500070 -22254251
38256 -22254251 -34203334 -32645207 -18610585 -6508862 -4302288 -1954593 7713823 11341323
38248 11341323 -2599704 -17289458 -8519781 16945731 31961028 32688993 40323483 58160441
38240 58160441 60328022 34142968 4999724 1633367 17285081 24314537 13610397
38233 13610397 1217383 2792359 15718608 24264518 14938534 -10953346 -37548561
38226 -37548561 -51197536 -54900682 -57603628 -53532949 -28027035 15160769 49055886
38219 49055886 51768147 28069431 -116139 -13031089 -2410845 23710474 43283608
38212D3283608k110963j2852480k817618O049704k421575r424235L999319J7142359
38204D0848119J083199k8536430l2573052j0735793K661136J70329R322787L4797403
38196A7037698M1749232J3022485j9242502k1483718m138395M416999M50290l926820
38188B7885269q603687j7665345k0106853l724041K1111174L1576073K0077784
38181E0550374j954377k0184280k5873114j7285909l661306L60218o590142q142410
38173c2780946P325497K8549699L4079393J6590210j0612658k5332740j4378980
38166C439475J1231751K1875196L606677j8388395j1033228J6629498K3826974
38159E1187948k7323j9272180r600222N251247k303067j6025243o197159J6440619
$$ plain form
38212 43283608 41172645 28320165 25502547 31552251 29130676 19706441 23705760 40848119
38204 40848119 41931318 13394888 -19178164 -29913957 -27252821 -27082492 -17759705 17037698
38196 17037698 58786930 71809415 52566913 31083195 26944800 31361799 31812089 27885269
38188 27885269 19281582 1616237 -18490616 -22214657 -1103483 30472590 50550374
38181 50550374 48595997 28411717 2538603 -14747306 -18408612 -18048394 -24638536 -32780946
38173 -32780946 -25455449 3094250 37173643 53763853 43151195 17818455 3439475
38166 3439475 14671226 36546422 40153099 21764704 10731476 27360974 51187948
38159 51187948 51160625 31888445 22288223 27539470 25236403 9211160 3014001 19454620
38151A9454620J6831503p023790k2770796j6234757p173468q491558n592130J0892942
38143b0107434K2040025J0042342j0637472j3735450L77761R013178L408425j354757
38135i53382O429735J7257849J7130351P766981p55425p349534j5757374j8850465
38127D918736m991856J8192525K4560003L491855k1192089k0690308K44345J1645753
38119A6178964O28243j3722055j0190934O209664J3752589K297233j6112342k1554039
38111b2512677p009010J4154890K1664664J0111437o630044j4015655j1524820
38104a5761215m661304N624235J5878276J4822137l67955j2432196n491478R931072
38096G541572J1208960m285744k0162516k6659808k4546123j1218598J2459854
$$ plain form
38151 19454620 36286123 29262333 6491537 -9743220 -16916688 -25408246 -31000376 -20107434
38143 -20107434 1932591 11974933 1337461 -12397989 -12020228 -3007050 401375 -953382
38135 -953382 5476353 22734202 39864553 47631534 46876109 39526575 23769201 4918736
38127 4918736 -73120 18119405 42679408 46171263 24979174 4288866 4533211 16178964
38119 16178964 16807207 3085152 -7105782 -896118 12856471 15153704 -958638 -22512677
38111 -22512677 -29521687 -15366797 6297867 16409304 9779260 -4236395 -15761215
38104 -15761215 -20422519 -14798284 1079992 15902129 15534174 3101978 -2389500 7541572
38096 7541572 18750532 14464788 -5697728 -32357536 -56903659 -68122257 -55662403
38089e5662403K7304179J5291421r171078j5986594m760748j140078q405822j280903
38081e3812026K4420593L5988300J4573816j3585722j8198180o559191r52119
38074a8124529k275845j656998l804974j2123502j1994101M372968J6386417N912342
38066b3308222r225131k277689J8404105K4207431J2222599L345543L179957j660063
38058B4888530j1826727j1865728Q7820P128573J643445n281461o025311o020470
38050g271329o943872j116384J0493288J2227188m886821k6712258k9178179l725913
38042e7114280L2580494N0298189L4340569L95694k1258988j9765516j0637759
38035H838403p416950m702922L459171R278963P852539P558851R531503j19750
$$ plain form
38089 -55662403 -28358224 -13066803 -22237881 -38224475 -42985223 -44125301 -52531123 -53812026
38081 -53812026 -29391433 6596867 21170683 7584961 -10613219 -17172410 -18124529
38074 -18124529 -20400374 -22057372 -25862346 -37985848 -49979949 -45606981 -29220564 -23308222
38066 -23308222 -32533353 -34811042 -16406937 7800494 20023093 23368636 26548593 24888530
38058 24888530 13061803 1196075 1283895 8412468 10055913 4774452 -1250859 -7271329
38050 -7271329 -14215201 -15331585 -4838297 7388891 2502070 -24210188 -53388367 -57114280
38042 -57114280 -24533786 25764403 60104972 60500666 39241678 19476162 8838403
38035 8838403 1421453 -3281469 177702 9456665 17309204 24868055 34399558 34279808
38027C4279808j9635612k0081111R413382L1721640J2535592k1125437j6915210
38020A0193052K1904982M0166538J3574711j9997799k1329783n37830R725230
38013E3699101k15248j6760865k5177815j6638911Q820073L4594050L7786314
38006G6106699J5366884j2502278k7688684k8469767k0176653r295420n421362
37999a2080581j0749545j1103524L141891J4868150L880511j5809078j3630878
37992d1483054Q751410K1811493J7583007J4841130J5624257J969706j8478930
37985B0619019j2787502J7750232K8027317l28912k8169814k5522457j8338026
37978a8750143l1277987l3182040Q438257N7202241N3705195Q289615j4865229
$$ plain form
38027 34279808 14644196 -5436915 3976467 35698107 48233699 27108262 10193052
38020 10193052 32098034 72264572 85839283 65841484 44511701 43973871 53699101
38013 53699101 53483853 36722988 11545173 -5093738 3726335 38320385 76106699
38006 76106699 91473583 78971305 51282621 22812854 2636201 -6659219 -12080581
37999 -12080581 -22830126 -33933650 -30791759 -15923609 -12043098 -27852176 -41483054
37992 -41483054 -32731644 -10920151 6662856 21503986 37128243 39097949 20619019
37985 20619019 7831517 25581749 53609066 53280154 25110340 -412117 -18750143
37978 -18750143 -50028130 -83210170 -74771913 -17569672 36135523 44425138 29559909
37971B9559909M308402K1686561P829231j2316296j2161839m459414o867152p885603
37963A9693799N012871J4411020M68932k1293322j9624265N874906K4025523J4715106
37955D3284570q582742k0681992j3726267R21127J0393843J2301659J0922646
37948C4832844P629736l06578j2081430k0380934j9615444j3096643p561146l914146
37940c4493741J312760P580414R242944L213617n700015q755919l005468L625266
37932b6980142J329773n640677o66258J9959385L4057576K1289974m785222j4293778
37924B4270631n640011m454550j7282330k0239789m396002L448785j2548050k2563253
37916e9404569L970270M3162338M6300636J1464355j5802231j0137713N376399
$$ plain form
37971 29559909 33868311 55554872 63384103 51067807 38905968 34446554 27579402 19693799
37963 19693799 24706670 39117690 39586622 18293300 -1330965 4543941 28569464 43284570
37955 43284570 34701828 14019836 293569 1214696 11608539 23910198 34832844
37948 34832844 42462580 42156002 30074572 9693638 -9921806 -23018449 -30579595 -34493741
37940 -34493741 -33180981 -25600567 -16357623 -13144006 -18844021 -27599940 -30605408 -26980142
37932 -26980142 -25650369 -31291046 -31957304 -11997919 22059657 43349631 38564409 24270631
37924 24270631 18630620 14176070 -3106260 -23346049 -27742051 -24293266 -36841316 -59404569
37916 -59404569 -55434299 -12271961 34028675 45493030 29690799 19553086 24929485
37909B4929485M595801m492339l445342L298412n77087j4450773k1249915j0280148
37901b1671906J1469149K6887936K2651448R58246j9837493k2088675p431525
37894i062820P194562J0432130N385035m04526l704460l932665j343551K119767
37886F683472N399490R418236J1179933L760157j0494117j6161962n451368O675515
37878A1009356K403636j2579809j9307604j4052932p245300q11901J0548216J9147465
37870a0888873J0461972r491387j7303804o720676L222810M40808l116534M242158
37862b9153526J4129243J4629743Q924243N436524M622260N923934J2616405J9771908
37854E6900734J3597216n978248j8264285j0156485M071689N560256j586487k163298
$$ plain form
37909 24929485 29525286 25032947 21587605 24886017 24308930 9858157 -11391758 -21671906
37901 -21671906 -10202757 16685179 39336627 40294873 20457380 -1631295 -9062820
37894 -9062820 -1868258 8563872 13948907 13544381 9839921 5907256 4563705 6683472
37886 6683472 12082962 21501198 32681131 36441288 25947171 9785209 4333841 11009356
37878 11009356 13412992 833183 -18474421 -32527353 -39772653 -40584554 -30036338 -10888873
37870 -10888873 -426901 -9918288 -27222092 -33942768 -30719958 -30279150 -33395684 -29153526
37862 -29153526 -15024283 -394540 8529703 13966227 18588487 24512421 37128826 56900734
37854 56900734 70497950 64519702 46255417 36098932 40170621 45730877 44144390 41981092
37846D1981092L533268L309476n535648j5087521j9928016j7263348l045432J6875406
37838D839277K1853508J034532k5201978k7963301p718060J0880375J6129202
37831f146445J7315318J8155056R661162n578815q386780O322751J6180977L845252
37823E1368476j5681704j8223142n963914J368869N68752N783528J8080611J8788531
37815E6090007r18770k3505624k8529265j8261525p948853j635714P504773J8549039
37807A344068K0329752Q555054o358914j2059115o922313K890678J1756850J6039270
37799C5575330J3078871L829332o221766j2012901j2993982j1036806p158544
37792C059534j808468L798893P370913N572456l009834j2219093j1017318J560815
$$ plain form
37846 41981092 45514360 48823836 43288188 28200667 8272651 -8990697 -12036129 4839277
37838 4839277 26692785 27727317 2525339 -25437962 -33156022 -22275647 -6146445
37831 -6146445 11168873 29323929 38985091 33406276 25019496 31342247 47523224 51368476
37823 51368476 35686772 17463630 11499716 12868585 13437337 19220865 37301476 56090007
37815 56090007 55171237 31665613 3136348 -15125177 -23074030 -24709744 -17204971 1344068
37807 1344068 21673820 30228874 23869960 11810845 4888532 7779210 19536060 35575330
37799 35575330 48654201 52483533 46261767 34248866 21254884 10218078 3059534
37792 3059534 1251066 5049959 12420872 17993328 14983494 2764401 -8252917 -6692102
37784f692102J0254117L312069p204030j019693J7033344K0406209J179863j6037609
37776B1232168j1273783J745164P83698r355660q759472L276754J0443870Q566770
37768A6659509Q348122J1925645R401214o50632o970788l825909L029547Q811257
37760D6727965J2202101P083849j0193104k6391558k3795838p269456J329243
37753c06798l350359m509523N545175J2080278L699662r804965j5127346j2590661
37745b4364537o472310M207566J6085142J9157271J2169060M455795k198518j3797656
37737I241813k2596474j1579233J1588671J5414661o270591j7867807L689953
37730a8379007K9143641K0678517j1053655k8103851k2052865j1892073j826182
$$ plain form
37784 -6692102 3562015 6874084 -329946 -1349639 15683705 36089914 37269777 21232168
37776 21232168 9958385 11703549 12487247 3131587 -5627885 -2351131 8092739 16659509
37768 16659509 25007631 36933276 46334490 45683858 38713070 34887161 37916708 46727965
37760 46727965 58930066 66013915 55820811 29429253 5633415 -1636041 -306798
37753 -306798 -3657157 -8166680 -2621505 9458773 13158435 3353470 -11773876 -24364537
37745 -24364537 -30836847 -26629281 -10544139 8613132 20782192 25237987 23039469 9241813
37737 9241813 -13354661 -24933894 -13345223 2069438 -4201153 -22068960 -18379007
37730 -18379007 10764634 31443151 20389496 -7714355 -29767220 -41659293 -43485475
37723d3485475J7019358L2263370K0834656p659187j8401652m574865N328439
37716A324644k146461p526513m26782P21286j2229816j5771469L993015K1157489
37708a0904607R952388j1032033p059950J8446360L1549306J9525053K234866
37701E2711383n226769j0806116k1741272k7502023j7402667K67517Q203061J912888
37693a9583998o615234m750598O057197J3007833Q905107J548657N78057Q96347
37685D3368p675308j7845113j2180121M821849P063867j0575549j7349889N822609
37677d7874287K9942404J8987859j2807215k2374807m481980N966284l952371
37670c6594113o849205J1177974K2772403P215296j1297164k848779J9430302
$$ plain form
37723 -43485475 -26466117 5797253 26631909 18972722 571070 -4003795 1324644
37716 1324644 -821817 -8348330 -8775112 -8053826 -20283642 -36055111 -32062096 -10904607
37708 -10904607 -952219 -11984252 -19044202 -597842 30951464 50476517 52711383
37701 52711383 47484614 36678498 14937226 -12564797 -29967464 -29699947 -21496886 -19583998
37693 -19583998 -26199232 -30949830 -24892633 -11884800 -2979693 -1431036 -852979 43368
37685 43368 -7631940 -25477053 -37657174 -32835325 -25771458 -36347007 -53696896 -47874287
37677 -47874287 -17931883 1055976 -11751239 -34126046 -38608026 -32641742 -36594113
37670 -36594113 -43443318 -32265344 -9492941 -2277645 -13574809 -16423588 3006714
37663C006714K2799698O078944o562024p711029q254647p425090L726010J4755677
37655B0414253O488339j2619089j5015471K58468N787531o012333j0332552M074317
37647f956537J4063530M285090n600841J168684O632230o988567k0050904p404975
37639b0852290J6537544K2243626J5090393J9844881K9715034J6577577j4265432
37632H4891333k6618543j2713798m547542j7545306k6684473j3572009L380263
37625a3410075N632770M449258J1147894J1789721j669124o665355J2369460K9373351
37617E3017900J4659519j4684908j9672542J664179J7502544J2664489k99280
37610F4851901j1407400j9377247j5624918J992301Q186409j6703233m0462185
$$ plain form
37663 3006714 25806412 31885356 25323332 17612303 9357656 1932566 5658576 20414253
37655 20414253 26902592 14283503 -731968 -473500 5314031 -698302 -11030854 -6956537
37647 -6956537 7106993 11392083 5791242 6959926 13592156 6603589 -13447315 -20852290
37639 -20852290 -4314746 17928880 33019273 52864154 82579188 99156765 84891333
37632 84891333 58272790 45558992 41011450 23466144 -3218329 -16790338 -13410075
37625 -13410075 -7777305 -3328047 7819847 19609568 17940444 11275089 23644549 53017900
37617 53017900 67677419 52992511 33319969 34984148 52486692 65151181 64851901
37610 64851901 53444501 34067254 18442336 20434637 28621046 11917813 -28544372
37603b8544372j4934289M1774822N5856987N416686m0243533k0774400K7155449
37596B5707350K9724661j3465997l7412588j3083929J9078557J9561755J658567
37589C1768376l786284L950431O983841J921244k908961p232526j4255931j6727926
37581b87736o991072N398980M058221r009187j5316091p633901J66453l694410
37573c3308743r746426k133583J5438064K2034977P089303j5413174k3780103
37566c9819685j2095734P362212J9120239J6856348N645580k349930K008670J3657548
37558A0385248J6129622J573168j6506631j8713468m358746R509285J1731941
37551I750419P866409O339317N906199J691498n763774j3206494j9078270k0138890
$$ plain form
37603 -28544372 -43478661 -1703839 54153148 59569834 19326301 -1448099 25707350
37596 25707350 55432011 41966014 4553426 -8530503 10548054 30109809 31768376
37589 31768376 27982092 31932523 38916364 40837608 37928647 30696121 16440190 -287736
37581 -287736 -7278808 -1879828 2178393 -6830794 -22146885 -29780786 -29614333 -33308743
37573 -33308743 -43055169 -45188752 -29750688 -7715711 -626408 -16039582 -39819685
37566 -39819685 -51915419 -44553207 -25432968 -8576620 -2931040 -5280970 -3272300 10385248
37558 10385248 26514870 28088038 11581407 -7132061 -11490807 -1981522 9750419
37551 9750419 17616828 23956145 29862344 31553842 25790068 12583574 -6494696 -26633586
37543b6633586j0945428O911874K0421643J6862196j898236k0317193k3132508
37536c8731238q635410Q491721R696953o096228j7509814p129458J1686752J1091237
37528c7135485r080592j7742798J944135K7117735L0352286J8663248J4746661
37521B8865190J6283929L833154j8665296k4043647n282983J0958934M429193
37514A6378474r933435q654917M334158Q271517L43593j527574J1702172K5596095
37506D6510083K1967065K779773j2623234j0983124p1066K439115p437799j4938469
37498B7642344q734951Q09621l244858j6747667j8228328p36170J7300906J8599414
37490A6660311Q421621M71733l771342q759122r935512j169844R763988Q935713
$$ plain form
37543 -26633586 -37579014 -30667140 -10245497 6616699 4718463 -15598730 -38731238
37536 -38731238 -47366648 -38874927 -29177974 -35274202 -52784016 -59913474 -48226722 -37135485
37528 -37135485 -46216077 -63958875 -62014740 -34897005 -4544719 14118529 28865190
37521 28865190 45149119 48982273 30316977 6273330 990347 11949281 16378474
37514 16378474 6445039 -2209878 2124280 10395797 10739390 9211816 20913988 46510083
37506 46510083 68477148 71256921 58633687 47650563 47579497 50018612 42580813 27642344
37498 27642344 18907393 19717014 16472156 -275511 -18503839 -19240009 -1939103 16660311
37490 16660311 25081932 25553665 21782323 13023201 3087689 1917845 11681833 20617546
37482B0617546l304150j2851796j1367193m169134k1683k582673r785516j3197438
37474c6662037k608573J8807625L0344537J7994457l361713q481065K612157P907384
37466B6552772M1944m961173O69654K471062p267346j1222388L841107J9674981
37458B9800613J1872770j0706910j7728410k285029J1759351P501325l938570
37451B6275140o478450l129966n138685j0188292n837461R250533J8935536P793041
37443C1481396j8243028l4706570k5346517k344035Q735513K716220q12757R343678
37435b9176100J7500080Q700204l804910m20002R752473L981037j2321380j2219665
37427a8008263M847613Q284044j1194294k0652444L179331L2475699K8324347
$$ plain form
37482 20617546 17313396 4461600 -6905593 -11074727 -11096410 -13679083 -23464599 -36662037
37474 -36662037 -39270610 -20462985 9881552 27876009 24514296 16033231 18645388 26552772
37466 26552772 26594716 21633543 22303197 24774259 17506913 6284525 10125632 29800613
37458 29800613 41673383 30966473 13238063 10953034 22712385 30213710 26275140
37451 26275140 19796690 16666724 11528039 1339747 -4497714 4752819 23688355 31481396
37443 31481396 13238368 -21468202 -46814719 -49158754 -40423241 -37707021 -38519778 -29176100
37435 -29176100 -11676020 -2975816 -6780726 -7200728 2551745 6532782 -5788598 -18008263
37427 -18008263 -13160650 -4876606 -16070900 -36723344 -33544013 -1068314 27256033
37420B7256033r8236j1107677O151474J9590159N143262k1624965l3141933k5074671
37412c2906554j1566564j602537N815599J0823540Q935538j924507j4939377j6944411
37404e4309273j177761K0817072K7437015J3156051k137596M18486J2147842J1389362
37396B7741198k896793j1534374o484151m9627J21237L017825J2257999J2611572
37388C4784886n961442k5933160k3258311k682294P894638l565555j8703346j7076961
37380e4501545k581197P818288R654883J1214845J3785854Q208165o075220j3525416
37372b6001343l875948R728066Q133932m598575p037289N713437J4274405O907872
37364C244557j164719O720136K0885632K1062403P782646k183123l751641n552648
$$ plain form
37420 27256033 27157797 16050120 22201594 41791753 46935015 25310050 -7831883 -32906554
37412 -32906554 -44473118 -46075655 -40260056 -29436516 -20500978 -22425485 -37364862 -54309273
37404 -54309273 -55487034 -34669962 -7232947 5923104 3785508 4203994 16351836 27741198
37396 27741198 24844405 13310031 6825880 6776253 6897490 9915315 22173314 34784886
37388 34784886 28823444 2890284 -20368027 -23050321 -15155683 -18721238 -37424584 -54501545
37380 -54501545 -57082742 -49264454 -39609571 -28394726 -14608872 -6400707 -12475927 -26001343
37372 -26001343 -29877291 -20149225 -12015293 -16613868 -23651157 -17937720 -3663315 3244557
37364 3244557 2079838 8799974 29685606 50748009 58530655 56347532 52595891 47043243
37356D7043243q638573n447614R26708j195089q613708m354127J2267220J9056802
37348E1044862M177308j4590225j7064250r077157p387362j1133892p721364K437148
37340i314932O946859L002674L92438L818117O757908L661493l350339j0511297
37332A402921j5268693j3479905l580470O635833P192600J37289l171368N05256
37324a9626537K370747k375544n637476N66196J0694297J2731380L466459r604058
37316g414536j7319139j3890832K152468K3649126L4240991K2389832k669465
37309D1138445j7923609j2894165p36015J995310k213856O67163J2254687J8633885
37301D0921845J1188815j758371q049015o951207o197838j0752317j8966861k4228312
$$ plain form
37356 47043243 38404670 32957056 33883764 32688675 24074967 19720840 31988060 51044862
37348 51044862 55222170 40631945 23567695 14490538 7103176 -4030716 -11752080 -9314932
37340 -9314932 -2368073 634601 1027039 4845156 11603064 15264557 11914218 1402921
37332 1402921 -13865772 -27345677 -30926147 -24290314 -17097714 -16960425 -20131793 -19626537
37324 -19626537 -17255790 -19631334 -25268810 -24702614 -14008317 -1276937 2189522 -7414536
37316 -7414536 -24733675 -38624507 -36472039 -12822913 21418078 43807910 41138445
37309 41138445 23214836 10320671 9584656 11579966 9366110 10033273 22287960 40921845
37301 40921845 52110660 50352289 42303274 35352067 29154229 18401912 -564949 -24793261
37293b4793261j8143226M50007J7798851J6693219q06707j3456550q518042L826165
37285b6949544J0624489J4768179K1308710K0790590M203089j6325047k0951659
37278G468807r125571L979377J0130964R540329m73895j6962986k0847738k53886
37270a6544599K3114476J9663051j592967n578703J1785236J8140267J865943
37263E0852704p927140N157486J2915779q623960l3896544k6675488K026717J3643194
37255G472748J585051q642771p348122p549551q060137Q314527L3941919L2974817
37247E2688481n419518m1884619l6574488j416730K1195721J6311513O035607
37240A0935967P382570Q812469l746289j9021206j5846557L436399J5020117R013297
$$ plain form
37293 -24793261 -42936487 -42486480 -24687629 -7994410 -8801117 -22257667 -30775709 -26949544
37285 -26949544 -16325055 -1556876 19751834 40542424 44745513 28420466 7468807
37278 7468807 -1656764 2322613 12453577 21993906 21520011 4557025 -16290713 -16544599
37270 -16544599 6569877 26232928 24639961 19061258 30846494 48986761 50852704
37263 50852704 42925564 48083050 60998829 52374869 18478325 -8197163 -6170446 7472748
37255 7472748 9057799 415028 -6933094 -14482645 -22542782 -14228255 19713664 52688481
37247 52688481 47268963 5384344 -31190144 -32606874 -11411153 4900360 10935967
37240 10935967 18318537 27131006 23384717 4363511 -11483046 -8046647 6973470 15986767
37232A5986767K891908J1095870J9764533R520087j0089748j3649279j060225
37225C4459913L106659p252837q680061R100689J9882571J155029k6720280k8506457
37217c454774n556297R333277P81309j2678084j0240991N642139J9054765J9870942
37209B2752286R105414m885138j3672103j7234904k1383502k3384379j1592103
37202f0294429J2557493K6877192J6965165p77193k280923R333397J2326738J306688
37194A6014128q439323p564747l080073l005961p112410j1741645j1195724L25061
37186c5800694J5924429J5757949m337418j7682383k605864K0204182J5854733
37179G314934q995204j4736765Q209199K3741856O641603k0320261k3341415m204209
$$ plain form
37232 15986767 18878675 29974545 49739078 59259165 49169417 35520138 34459913
37225 34459913 37566572 30313735 21633674 30734363 50616934 51771963 25051683 -3454774
37217 -3454774 -9011071 322206 1103515 -11574569 -21815560 -16173421 2881344 22752286
37209 22752286 31857700 26972562 13300459 -3934445 -25317947 -48702326 -60294429
37202 -60294429 -47736936 -20859744 -3894579 -4671772 -6952695 2380702 14707440 16014128
37194 16014128 7574805 10058 -3070015 -6075976 -13188386 -24930031 -36125755 -35800694
37186 -35800694 -19876265 -4118316 -8455734 -26138117 -28743981 -8539799 7314934
37179 7314934 -1680270 -16417035 -8207836 15534020 22175623 1855362 -21486053 -25690262
37171b5690262J1251631J1795451O100478J027267n355385j2476960j2485912
37164b5833692J476488K5161249M0882978L0367656k612202k9335922k8233629
37157A1872926j2179689o940253j1517232n030889J1794181J3988738m088764
37150b100982j4637133M08146J9511843J4249499q916226k1326212j2879298R56948
37142b4733415N464276J941794j081231P42135N248762O932669L435719m20492
37134b469783K50226J055457n198387j4504760j5545870o731257K969750R202866
37126c0971758J4518631J6497623R171347l063100q201823m259158L9017J174515
37118e094706K411310K216896k158782l803331K441527M383955q658177j9473690
$$ plain form
37171 -25690262 -14438631 -2643180 3457298 4484565 -870820 -13347780 -25833692
37164 -25833692 -24357204 804045 41687023 72054679 69442477 40106555 11872926
37157 11872926 -306763 -7247016 -18764248 -23795137 -12000956 1987782 -2100982
37150 -2100982 -16738115 -16329969 3181874 17431373 8515147 -12811065 -25690363 -24733415
37142 -24733415 -19269139 -17327345 -18408576 -17666441 -12417679 -5485010 -2049291 -2469783
37134 -2469783 -2219557 -1164100 -6362487 -20867247 -36413117 -43144374 -40174624 -30971758
37126 -30971758 -16453127 44496 9215843 6152743 -2049080 -6308238 -6269221 -5094706
37118 -5094706 -2683396 -466500 -2625282 -6428613 -3987086 396869 -8261308 -27734998
37110b7734998n129348K0395956K1508115k161460j4023949m53792R773911k228932
37102e4497j5584404j0226812J586334O085959J3678754K9301206L1693886R430713
37094F5911139j3966325j7837851j5348841j8901479j0053799K1136743M0892246
37087E1831833J8583252j8714717k4291681k414129O915756l388646n165532P649602
37079C1005738J0478888k813571q706807J690516P315905m133504j5963031j2170197
37071F703937l75947M953825J280644o219668j0567474l782549J2001850J8374816
37063B2369434L526125j6169863j7896460o026630k79792r81264N841701J7410886
37055G794137J8243618Q935327J830228m763432j7894625k4583893r165287J2290199
$$ plain form
37110 -27734998 -32864346 -12468390 9039725 6878265 -7145684 -7599476 2174435 -54497
37102 -54497 -15638901 -25865713 -24279379 -18193420 -4514666 24786540 56480426 65911139
37094 65911139 51944814 34106963 18758122 -143357 -10197156 10939587 51831833
37087 51831833 70415085 51700368 27408687 24994558 31910314 28521668 23356136 31005738
37079 31005738 41484626 38671055 29964248 31654764 38970669 34837165 18874134 6703937
37071 6703937 6327990 11281815 12562459 6342791 -4224683 -8007232 3994618 22369434
37063 22369434 25895559 9725696 -8170764 -14197394 -14477186 -15458450 -9616749 7794137
37055 7794137 26037755 34973082 36803310 32039878 14145253 -10438640 -19603927 -7313728
37047g313728J2358706j00477N558543K4360796K0129899j0631419k8789433j6275044
37039g02157j543550n728857r780042K918235J3941213O786229o70155R770631
37031A4991547K1497497J2455899o175198j0249549p79379M788185J581683m894152
37023C3216533j2367262j4620403j240711J8331517J5796162j1411583k5689313
37016B014940m386647K1578303J6583873k203313K300551K1061841J5560087j2858610
37008E9651025k3026782k119911J6576141J1808766L251064O754860M386232j6176691
37000F1104704k9310815j1050023J6184663J5063520q228924j6072964j077304
36993B6612857O072229o878674j1449826J0664303L1071486J8081558j0255866
$$ plain form
37047 -7313728 5044978 4944501 10503044 34863840 54993739 44362320 15572887 -702157
37039 -702157 -2245707 -7974564 -17754606 -14836371 -895158 5891071 5220916 14991547
37031 14991547 36489044 48944943 42769745 32520196 31740817 36529002 38110685 33216533
37023 33216533 20849271 6228868 4988157 23319674 39115836 27704253 2014940
37016 2014940 -2371707 19206596 35790469 33587156 35887707 56949548 72509635 59651025
37008 59651025 36624243 34504332 51080473 62889239 66140303 72895163 77281395 61104704
37000 61104704 31793889 20743866 36928529 51992049 43763125 27690161 26612857
36993 26612857 32685086 25806412 14356586 25020889 56092375 74173933 63918067
36986F3918067j3626825N968612R394513j3931308k9900796j7678478j679434
36979B464351o808416j8755750j4699695k089082K733022O427107J6292369J2929555
36971a506539j5672902l6365215j3341533K8389088L2877538k253328k4247778
36964c2120669p308145J7289052K0401225J2876343J0063527N465969k245547
36957B4421755J689813J3729184P406660j8494577k8652726q458152J0115176
36950A757133L584867n988608K174134Q019385n908470j3197204J0305465L4286031
36942C5032733J7497448k2222724l2323797l680296K3590868K3116391P837815
36935D8848438k739340l789299L520487J2164282O885706j2634988j9061555M107101
$$ plain form
36986 63918067 50291242 56259854 65654367 51723059 21822263 4143785 2464351
36979 2464351 -4344065 -23099815 -37799510 -39888592 -37155570 -30728463 -14436094 -1506539
36971 -1506539 -17179441 -53544656 -66886189 -38497101 -5619563 -7872891 -32120669
36964 -32120669 -39428814 -22139762 -1738537 11137806 21201333 26667302 24421755
36957 24421755 26111568 39840752 47247412 28752835 100109 -8358043 1757133
36950 1757133 5342000 -646608 1527526 9546911 3638441 -9558763 746702 35032733
36942 35032733 52530181 30307457 -2016340 -5696636 17894232 41010623 48848438
36935 48848438 46109098 42319799 45840286 58004568 64890274 52255286 33193731 37300832
36927C7300832K8080840J6704602j6614774k8142362q568366J0913465R553124
36920D9227361m675992k1891640l6865904l3224065l15618L5760165L6227870
36913B4242177M766575j8127863j5088171p317337q878706o812022N727135J4417800
36905g070412J2059803R039877P820073o96579r783502j103572J7019205J3480656
36897D0765549j3356381k6722686r702250O801350m653336k4769898k1904157
36890e3541809n40349J2537635Q680890j173677q196620q213568J523943J2259904
36882c6663651Q405876m826152j480447K2891655L6189407J6951087j0869446
36875C0598329j5634128m869232m102636j1227745p409592K519086j172805j2332827
$$ plain form
36927 37300832 65381672 82086274 65471500 37329138 28760772 39674237 49227361
36920 49227361 44551369 22659729 -14206175 -47430240 -47745858 -11985693 24242177
36913 24242177 29008752 10880889 -4207282 -11524619 -20403325 -27215347 -21488212 -7070412
36905 -7070412 4989391 14029268 21849341 21152762 11369260 10265688 27284893 40765549
36897 40765549 27409168 686482 -9015768 -2214418 -6867754 -31637652 -53541809
36890 -53541809 -54082158 -41544523 -32863633 -34037310 -42233930 -50447498 -48923555 -36663651
36882 -36663651 -28257775 -33083927 -34564374 -11672719 24516688 41467775 30598329
36875 30598329 14964201 10094969 5992333 -5235412 -12645004 -10125918 -11298723 -23631550
36867b3631550n031559K0401259L2940326J7919399k668709o782368k220186n506283
36859B5420329j2095152o211465J0916228J9567320N888657k1348560l7924907
36852a5787550k6190218N985644K8340957J8191394j1515130k4488064n531651
36845c0994618J9641846J9026506k551959j2926763p21543J0019349Q37360r696422
36837g366244L212856K5242648K0172445j1999791l0182477j3983082N385106
36830i518539l068165j9432344p381020K3272216L0256818N820090j3248315n262700
36822A438041P580312K955470n092154M177736J8560167J0842619j7487606l6637623
36814a3663038k8923430q550420J501935j140411R40414J8637629L7763879L3241988
$$ plain form
36867 -23631550 -28663109 -8261850 24678476 42597875 39929166 33146798 30926612 25420329
36859 25420329 13325177 7113712 18029940 37597260 43485917 22137357 -15787550
36852 -15787550 -41977768 -35992124 -7651167 10540227 -974903 -25462967 -30994618
36845 -30994618 -11352772 7673734 5121775 -7804988 -8526531 1492818 2330178 -7366244
36837 -7366244 -4153388 21089260 41261705 29261914 -920563 -14903645 -9518539
36830 -9518539 -12586704 -32019048 -39400068 -16127852 14128966 19949056 6700741 1438041
36822 1438041 9018353 11973823 6881669 11059405 29619572 40462191 22974585 -13663038
36814 -13663038 -42586468 -51136888 -49634953 -50775364 -49834950 -31197321 6566558 39808546
$$ [...]
##END NTUPLES=NMR SPECTRUM
##END=
