##TITLE=31Pdec_LR-675-C1P
 EtOAc, 72 sc
 29.5.2019
##JCAMPDX= 6.0         $$ Bruker NMR JCAMP-DX V2.0
##DATA TYPE= NMR SPECTRUM
##DATA CLASS= NTUPLES
##ORIGIN= UXNMR, Bruker Analytische Messtechnik GmbH
##OWNER= root
$$ XWIN-NMR		Version 3.5
$$ Wed May 29 12:58:38 2019 Russian Standard Time (UT+4h)  she@DPX200
##.OBSERVE FREQUENCY= 81.013821
##.OBSERVE NUCLEUS= ^31P
##.ACQUISITION MODE= SIMULTANEOUS
##.ACQUISITION SCHEME= undefined
##.AVERAGES= 72
##.DIGITISER RES= 17
##SPECTROMETER/DATA SYSTEM= spect
##.PULSE SEQUENCE= zgpg30
##.SOLVENT NAME= DMSO
##.SHIFT REFERENCE= (INTERNAL, DMSO, 0, 182.463)
##AUDIT TRAIL= $$ (NUMBER, WHEN, WHO, WHERE, WHAT)
$$ ##TITLE= Audit trail, XWIN-NMR		Version 3.5
$$ ##JCAMPDX= 5.01
$$ ##ORIGIN= Bruker BioSpin GmbH
$$ ##OWNER= she
$$ F:/spectra/data/she/nmr/P31/1/pdata/1/auditp.txt
$$ ##AUDIT TRAIL=  $$ (NUMBER, WHEN, WHO, WHERE, WHAT)
(   1,<2019-05-29 12:57:41.65 +0400>,<she>,<DPX200>,
      <continue with go, POWCHK disabled, PULCHK disabled
       configuration hash MD5:
       00 E9 B6 7A A2 85 ED C7 34 08 36 98 17 FE 4E 26
       data hash MD5: 32K
       FF D5 13 29 4F 4B CF F7 24 67 F3 65 B1 F5 62 63>)
(   2,<2019-05-29 12:57:43.23 +0400>,<she>,<DPX200>,
      <Start of raw data processing
       efp BC_mod = 2 LB = 1 FT_mod = 6 PKNL = 1 PHC0 = -1811.851 PHC1 = 19.39899 SI = 64K 
       data hash MD5: 64K
       D2 A7 68 41 11 95 52 20 1D DB A4 C9 8F BA FC D9>)
(   3,<2019-05-29 12:58:08.67 +0400>,<she>,<DPX200>,
      <pk PHC0 = -491.045 PHC1 = 386.0001 
       data hash MD5: 64K
       94 5C 76 C1 A2 03 3F 38 22 08 79 E4 43 8F DA 38>)
(   4,<2019-05-29 12:58:12.17 +0400>,<she>,<DPX200>,
      <abs ABSG = 5 
       data hash MD5: 64K
       9D 6B DF 57 17 D1 0F 51 7A B9 2B EE 0C A7 6E 67>)
$$ ##END=
$$ 
$$ hash MD5
$$ 72 FE B2 AB 14 AE A5 BF E8 91 BA BD 25 BC DE 81
##$RELAX= 
##$RELAX= 
##$RELAX= 
##$RELAX= 
##$RELAX= 
##$RELAX= 
##$RELAX= 
##$RELAX= 
$$ Bruker specific parameters
$$ --------------------------
##$DU= <F:/spectra>
##$EXPNO= 1
##$NAME= <P31>
##$PROCNO= 1
##$TYPE= <nmr>
##$USER= <she>
##$AMP= (0..31)
100 100 100 100 100 100 100 100 100 100 100 100 100 100 100 100 100 100 
100 100 100 100 100 100 100 100 100 100 100 100 100 100 
##$AQSEQ= 0
##$AQ_mod= 1
##$AUNM= <au_zg>
##$AUTOPOS= <>
##$BF1= 81.014009
##$BF2= 200.13
##$BF3= 200.13
##$BF4= 200.13
##$BF5= 200.13
##$BF6= 200.13
##$BF7= 200.13
##$BF8= 200.13
##$BYTORDA= 1
##$CFDGTYP= 0
##$CFRGTYP= 5
##$CHEMSTR= <none>
##$CNST= (0..31)
1 1 145 1 1 1 1 1 1 1 1 1 1 1 1 1 1 1 1 1 1 1 1 1 1 1 1 1 1 1 1 1 
##$CPDPRG= <waltz16>
##$CPDPRG1= <>
##$CPDPRG2= <waltz16>
##$CPDPRG3= <>
##$CPDPRG4= <mlev>
##$CPDPRG5= <mlev>
##$CPDPRG6= <mlev>
##$CPDPRG7= <mlev>
##$CPDPRG8= <mlev>
##$CPDPRGB= <>
##$CPDPRGT= <>
##$D= (0..31)
0 1 0 0 0 0 0 0 0 0 0 0.03 2e-05 3e-06 0 0 0 0 0 0 0 0 0 0 0 0 0 0 0 0 
0 0 
##$DATE= 1559120158
##$DBL= (0..7)
120 120 120 11 120 120 24 19 
##$DBP= (0..7)
150 150 150 150 150 150 150 150 
##$DBP07= 0
##$DBPNAM0= <>
##$DBPNAM1= <>
$$ [...]
##$SUBNAM3= <"">
##$SUBNAM4= <"">
##$SUBNAM5= <"">
##$SUBNAM6= <"">
##$SUBNAM7= <"">
##$SUBNAM8= <"">
##$SUBNAM9= <"">
##$SW= 369.568048894756
##$SWIBOX= (0..15)
0 1 3 0 0 0 0 0 0 0 0 0 0 0 0 0 
##$SW_h= 29940.119760479
##$TD= 32768
##$TD0= 1
##$TE= 0
##$TE2= 300
##$TE3= 300
##$TEG= 300
##$TL= (0..7)
0 120 53 12 22 120 120 120 
##$TP= (0..7)
150 150 150 150 150 150 150 150 
##$TP07= 0
##$TPNAME0= <>
##$TPNAME1= <>
##$TPNAME2= <>
##$TPNAME3= <>
##$TPNAME4= <>
##$TPNAME5= <>
##$TPNAME6= <>
##$TPNAME7= <>
##$TPOAL= (0..7)
0.5 0.5 0.5 0.5 0.5 0.5 0.5 0.5 
##$TPOFFS= (0..7)
0 0 0 0 0 0 0 0 
##$TUNHIN= 0
##$TUNHOUT= 0
##$TUNXOUT= 0
##$USERA1= <user>
##$USERA2= <user>
##$USERA3= <user>
##$USERA4= <user>
##$USERA5= <user>
##$V9= 5
##$VALIST= <valist>
##$VCLIST= <CCCCCCCCCCCCCCC>
##$VD= 0
##$VDLIST= <DDDDDDDDDDDDDDD>
##$VPLIST= <PPPPPPPPPPPPPPP>
##$VTLIST= <TTTTTTTTTTTTTTT>
##$WBST= 1024
##$WBSW= 4
##$XGAIN= (0..3)
0 0 0 0 
##$XL= 0
##$YL= 0
##$YMAX_a= 27133
##$YMIN_a= -62957
##$ZGOPTNS= <>
##$ZL1= 120
##$ZL2= 120
##$ZL3= 120
##$ZL4= 120
##$ABSF1= 182.463
##$ABSF2= -187.1042
##$ABSG= 5
##$ABSL= 3
##$ALPHA= 0
##$AQORDER= 0
##$ASSFAC= 0
##$ASSFACI= 0
##$ASSFACX= 0
##$ASSWID= 0
##$AUNMP= <proc_1d>
##$AZFE= 0.1
##$AZFW= 0.5
##$BCFW= 0
##$BC_mod= 2
##$BYTORDP= 0
##$COROFFS= 0
##$CY= -3
##$DATMOD= 1
##$DC= 0
##$DFILT= <>
##$DTYPP= 0
##$F1P= 0
##$F2P= 0
##$FCOR= 1
##$FTSIZE= 65536
##$FT_mod= 6
##$GAMMA= 0
##$GB= 0
##$INTBC= 1
##$INTSCL= 5.30512e-09
##$ISEN= 30
##$LB= 1
##$LEV0= 0
##$LPBIN= 0
##$MAXI= 10000
##$MC2= 0
##$MEAN= 0
##$ME_mod= 0
##$MI= 50
##$NCOEF= 0
##$NC_proc= -7
##$NLEV= 6
##$NOISF1= 182.463
##$NOISF2= 159.3651
##$NSP= 0
##$NTH_PI= 0
##$NZP= 0
##$OFFSET= 182.463
##$PC= 4
##$PHC0= -2302.896
##$PHC1= 405.3991
##$PH_mod= 1
##$PKNL= yes
##$PPARMOD= 0
##$PSCAL= 0
##$PSIGN= 0
##$REVERSE= no
##$SF= 81.0140089999434
##$SI= 65536
##$SIGF1= 159.3651
##$SIGF2= -187.1042
##$SINO= 113.3802
##$SIOLD= 16384
##$SREGLST= <1H.CDCl3>
##$SSB= 0
##$STSI= 65536
##$STSR= 0
##$SW_p= 29940.119760479
##$SYMM= 0
##$S_DEV= 0
##$TDeff= 32768
##$TDoff= 0
##$TI= <>
##$TILT= no
##$TM1= 0
##$TM2= 0
##$TOPLEV= 0
##$USERP1= <user>
##$USERP2= <user>
##$USERP3= <user>
##$USERP4= <user>
##$USERP5= <user>
##$WDW= 1
##$XDIM= 65536
##$YMAX_p= 276348141
##$YMIN_p= -31193846
$$ End of Bruker specific parameters
$$ ---------------------------------
##NTUPLES= NMR SPECTRUM
##VAR_NAME=  FREQUENCY,     SPECTRUM/REAL,   SPECTRUM/IMAG
##SYMBOL=    X,             R,               I
##VAR_TYPE=  INDEPENDENT,   DEPENDENT,       DEPENDENT
##VAR_FORM=  AFFN,          ASDF,            ASDF
##VAR_DIM=   65536,         65536,           65536
##UNITS=     HZ,            ARBITRARY UNITS, ARBITRARY UNITS
##FACTOR=    0.456856943014862, 1,           1
##FIRST=     14782.0589164792, 0,            0
##LAST=      -15158.0608439998, 0,           0
##MIN=       -15158.0608439998, -31193846,   0
##MAX=       14782.0589164792, 276348141,    0
$$ Real data points
##PAGE= N=1
##DATA TABLE= (X++(R..R)), XYDATA
$$ [...]
##PAGE= N=2
##DATA TABLE= (X++(I..I)), XYDATA
5154a432213j087455k080206l157337k776189j046784P34716K446538M565041
$$ -1432213 -2519668 -4599874 -7757211 -10533400 -11580184 -10845468 -8398930 -3833889
5146c833889N611639L483701n29443k607044j732498n17912k29073P36498K381345
$$ -3833889 1777750 5261451 4732008 2124964 392466 -125446 -354519 381979 2763324
5137B763324J906427r55591k040903R11747M228285L959605J589664J57380j447671
$$ 2763324 4669751 3714160 1673257 2585004 6813289 10772894 12362558 12519938 11072267
5128A1072267n252721q280567n900225K17147L428494J475086q36745O72246L905213
$$ 11072267 5819546 -2461021 -8361246 -8144099 -4715605 -3240519 -4077264 -3405018 500195
5119E00195M493738J821416j341533k794602k310255p15068O03842M24832o38850
$$ 500195 4993933 6815349 5473816 2679214 368959 -346109 257733 682565 43715
5110D3715k48284K463433M744060L141545j586645m550153k849593m1480j901439
$$ 43715 -204569 2258864 7002924 10144469 8557824 4007671 1158078 1116598 -784841
5101g84841p857976j0192327m003736N136559P785476L153926o79190Q23654K727049
$$ -784841 -8642817 -18835144 -22838880 -17702321 -9916845 -6762919 -7442109 -6618455 -3891406
5092c891406j55370m394227l589172J438517M397517L135173J283393J322579
$$ -3891406 -4046776 -8441003 -12030175 -10591658 -6194141 -3058968 -1775575 -452996
5084d52996J866699J758319J500717L26645k966394n702338l297078L117507O440319
$$ -452996 1413703 3172022 4672739 4999384 2032990 -3669348 -6966426 -3848919 2591400
5075B591400L213636j526863j957457O82133J864457J414834K346650M393795
$$ 2591400 5805036 4278173 2320716 3002849 4867306 6282140 8628790 13022585
5067A3022585L964654J30263l602595m115225k327970j241624k290776m305252
$$ 13022585 16987239 17117502 13514907 9399682 7071712 5830088 3539312 -765940
5059g65940m905907k641751J522481M907961N652856L998845J038096k325684
$$ -765940 -5671847 -8313598 -6791117 -1883156 3769700 7768545 8806641 6480957
5051F480957m608790l855137R021M144317N440827L333545n84023m153573n219677
$$ 6480957 1872167 -1982970 -1973949 2170368 7611195 10944740 10360717 6207144 987467
5042I87467k918695L15824N30893k208065k854993J459032O175431N065554p97207
$$ 987467 -1931228 -1615404 -1084511 -3292576 -6147569 -4688537 1486894 6552448 5755241
5033E755241m476630k793562L41100P14489o00480k63533K060093L773307K886125
$$ 5755241 1278611 -1514951 -1173851 -459362 -1059842 -1323375 736718 4510025 7396150
5024G396150j16413k787184k544980N16400K617496K81649m544734o152963k507490
$$ 7396150 7279737 4492553 1947573 2463973 5081469 5363118 818384 -5334579 -7842069
5015g842069K008825K571432l14369k824319k825373n79619L050244O245663O041031
$$ -7842069 -5833244 -3261812 -3576181 -6400500 -9225873 -9805492 -6755248 -509585 5531446
5006E531446J715800k813383l158617l12625Q12695j581822l954473k876173K98622
$$ 5531446 7247246 4433863 1275246 962621 1775316 193494 -3760979 -6637152 -6338530
4997f338530J853105Q60941p2481J392364M266933N280471K620689j665547l456609
$$ -6338530 -4485425 -3624484 -3696965 -2304601 1962332 7242803 9863492 8197945 4741336
4988D741336j003824K921270L851336K50857n004154p293930m309985J683641
$$ 4741336 3737512 6658782 10510118 10760975 5756821 -1537109 -5847094 -4163453
4980d163453N579408M609531J632907J310462L297420K707686j836429n171146
$$ -4163453 1415955 6025486 7658393 8968855 12266275 14973961 13137532 7966386
4972G966386l335720J82393M35137p64304J194133M427567K961768k532953m685239
$$ 7966386 4630666 4813059 5248196 4483892 5678025 10105592 13067360 10534407 5849168
4963E849168j041517K363383J325317o61675m47864j156559m784326o287791k048346
$$ 5849168 4807651 7171034 8496351 7834676 7386812 6230253 1445927 -4841864 -6890210
4954f890210K003818j002525o961643o627798j26662L985422K479316N32811J315386
$$ -6890210 -4886392 -5888917 -12850560 -19478358 -19605020 -15619598 -13140282 -12607471 -11292085
4945a1292085K096000J774398L054263N125487L165358k070593l140157J810745
$$ -11292085 -9196085 -7421687 -4367424 758063 3923421 1852828 -1287329 523416
4937E23416M719331P88075k916965P01867O226139M283210l001725n407334m69838
$$ 523416 5242747 6030822 3113857 3815724 10041863 14325073 11323348 5916014 5446176
4928E446176M098693L032510n13086k335504k723626k855998j919713N6689J084211
$$ 5446176 9544869 12577379 12064293 9728789 7005163 4149165 2229452 2286141 3370352
4919C370352L42664j162838l108154n124333m507465K96927M826891L357296j761575
$$ 3370352 3713016 2550178 -557976 -5682309 -10189774 -9892847 -5065956 -1708660 -3470235
4910c470235k522018K247633M521054l64657o360770o080915j002917K827597
$$ -3470235 -5992253 -3744620 776434 411777 -5948993 -12029908 -13032825 -10205228
4902a0205228L811998L692229J882074k516782n870355l807893J321750K639156
$$ -10205228 -6393230 -2701001 -818927 -3335709 -9206064 -13013957 -11692207 -9053051
4894i053051j767476o408769n854619p05516M510587O405461N100101L482669
$$ -9053051 -10820527 -17229296 -23083915 -23789431 -19278844 -12873383 -7773282 -4290613
4886d290613M076641N590543M170625m73234l186117o60208K537516q832o685564
$$ -4290613 -213972 5376571 9547196 9073962 5887845 5227637 7765153 7756321 1070757
4877A070757r774579o455078j775741p6512N23739L033255O171691P062047N536938
$$ 1070757 -8703822 -15158900 -16934641 -17011153 -16487414 -13454159 -7282468 -220421 5316517
4868E316517K920016l12973l091411l109792l95619J375778n9242k105618j950468
$$ 5316517 8236533 7923560 4832149 1722357 1326738 2702516 2643274 537656 -1412812
4859a412812j349868k684712l311102N94480O307895P070843K335607r70320R31017
$$ -1412812 -2762680 -5447392 -8758494 -8164014 -1856119 5214724 7550331 6580011 7511028
4850G511028L052051J89448m324996l944091M31199J739711k098646m849307j442936
$$ 7511028 10563079 10752527 6427531 2483440 2914639 4654350 2555704 -2293603 -3736539
4841c736539M491645O016311K451590o44319K62348K526320J978338j336097l835958
$$ -3736539 755106 6771417 9223007 8578688 8841036 11367356 13345694 12009597 8173639
4832H173639l323267j274103l30757r47460j348810k73417J412625K178219J789037
$$ 8173639 4850372 3576269 3245512 2298052 949242 675825 2088450 4266669 6055706
4823F055706P44169j286065m462898o480647m055695K078157O216492M148068
$$ 6055706 6799875 5513810 1050912 -5429735 -9485430 -7407273 -1190781 2957287
4815B957287j133737l207009p40021J473364K33206j453184K98384L546553K996365
$$ 2957287 1823550 -1383459 -2123480 -650116 -416910 -1870094 -1571710 1974843 4971208
4806D971208k002278n995728m766043q47487M50746j578665k708901k27207L633063
$$ 4971208 2968930 -3026798 -7792841 -8640328 -8189582 -9768247 -12477148 -12704355 -9071292
4797i071292N661894N957207N833296L987597j207793o583017o340322n01103
$$ -9071292 -3409398 2547809 8381105 12368702 11160909 4577892 -1762430 -2263533
4789b263533L560461Q96495l676272k270626M746209R256479O251916p07551n109338
$$ -2263533 1296928 2193423 -1482849 -3753475 992734 10249213 16501129 15793578 10684240
4780A0684240m395458o50935K002415J61179n308188q291377l840875M344913
$$ 10684240 6288782 5637847 7640262 7801441 2493253 -5798124 -9638999 -5294086
4772e294086P560032L720245l56808J35470J496120l88747k081344J093632N685136
$$ -5294086 2265946 5986191 5629383 5764853 7260973 6872226 4790882 5884514 11569650
4763A1569650M629130j549976n609006m453181j775452o1070K424868N327890
$$ 11569650 16198780 14648804 9039798 4586617 2811165 2750095 5174963 10502853
4755A0502853M303489j367451n420013l156540J380341J586545j912122l034932
$$ 10502853 14806342 13438891 8018878 4862338 6242679 7829224 5917102 2882170
4747B882170J02256K775902J001772l077249m638992k439741J45629n20481m068450
$$ 2882170 2984426 5760328 6762100 3684851 -954141 -3393882 -3248253 -3768734 -7837184
4738g837184o473516m674335k21604K741997K648200J656519J602959J532616
$$ -7837184 -14310700 -18985035 -19206639 -16464642 -13816442 -12159923 -10556964 -9024348
4730i024348L88123n83585j26305O44528O02468J205017L623437N076758K070380
$$ -9024348 -8636225 -9219810 -9346115 -8701587 -8099119 -6894102 -3270665 1806093 3876473
4721C876473l394808n248339j600655K533077K347435n99676j854927o39671M59147
$$ 3876473 481665 -4766674 -6367329 -3834252 -1486817 -2086493 -3941420 -4581091 -4121944
4712d121944M31661O41390J364322J225959L37960N77275J817883J223827j849183
$$ -4121944 -3690283 -3048893 -1684571 -458612 -120652 456623 2274506 3498333 1649150
4703A649150l344649m2485M500671L805548k039481n293751q88038N743161M932539
$$ 1649150 -1695499 -1737984 2762687 6568235 4528754 -764997 -1653035 4090126 9022665
4694I022665m417880j2428861r693116J812567J1472140J1977291N664531o05673
$$ 9022665 4604785 -7824076 -17517192 -15704625 -4232485 7744806 13409337 12803664
4686A2803664l348523l492891k272417K43976K846576K913170j15585l141728
$$ 12803664 9455141 5962250 3689833 3933809 6780385 9693555 9577970 6436242
4678F436242k916806K22426L321403M022793J694119k672798n995802m700042
$$ 6436242 3519436 3741862 7063265 11086058 12780177 10107379 4111577 -588465
4670e88465P17477M585516K528073k586940m657963k746982r65445q79476L51178
$$ -588465 129012 4714528 7242601 4655661 -2302 -2749284 -3714729 -4594205 -4243027
4661d243027L522353M861719K429886P5975J415283L761323K369611j852960l443981
$$ -4243027 -720674 4141045 6570931 6646906 8062189 11823512 14193123 12340163 8896182
4652H896182k58971L541719K712668k963196q167683p238251n09518N095524L930450
$$ 8896182 8637211 12178930 14891598 11928402 3760719 -3477532 -3987050 1108474 5038924
4643E038924q39542j500526K895738N408002K605284r5519J733989L373260j163927
$$ 5038924 4199382 2698856 5594594 11002596 13607880 13512361 15246350 18619610 17455683
4634A7455683q536051j0691407o310816m44573L976565O731283N548193n86108
$$ 17455683 8919632 -1771775 -8082591 -8527164 -4550599 2180684 7728877 7142769
4626G142769n481369k480658L853980K751374n819832r826907l018488O323992
$$ 7142769 1661400 -819258 3034722 5786096 -33736 -9860643 -12879131 -6555139
4618f555139Q585830N180282K102277l25078m086822o429431l946526N02048J690947
$$ -6555139 2030691 7210973 9313250 8988172 4901350 -1528081 -5474607 -4972559 -3281612
4609c281612l08763j846182j743784o04069K209879N672316N141497q49779n724630
$$ -3281612 -3590375 -5436557 -7180341 -7784410 -5574531 97785 5239282 4389503 -1335127
4600a335127l417699J685647J019360m481547n650584N88851O935942P120081
$$ -1335127 -4752826 -3067179 -2047819 -6529366 -12179950 -11591099 -4655157 2464924
4592B464924L633178J197808m64042k926266l620242J50560M788296L898036k420208
$$ 2464924 6098102 7295910 6831868 3905602 285360 435920 5224216 9122252 6702044
4583F702044o879885m698366K47097J648512o6228N17221M024516M518567m12291
$$ 6702044 -177841 -4876207 -4629110 -2980598 -3046826 -2529605 1494911 6013478 5601187
4574E601187m112222p58066M259674J863980n779984p780702j606391L301000
$$ 5601187 1488965 730899 4990573 6854553 1074569 -6706133 -8312524 -5011524
4566e011524J426261n92102K995862O527393L626117q16460L92964L287699J53670
$$ -5011524 -3585263 -4177365 -1181503 5345890 8972007 8155547 8548511 11836210 11989880
4557A1989880n159869k913478M311744L628851p025678j3653738o489506N953418
$$ 11989880 6830011 3916533 8228277 11857128 4831450 -8822288 -15311794 -9358376
4549i358376R636860L341224k900309k162492L274873P272692O253483J517081
$$ -9358376 278484 3619708 719399 -1443093 1831780 9104472 15357955 16875036
4541A6875036k330364k327993o84906j074559k744024k563741j386832k291033
$$ 16875036 14544672 12216679 11531773 10457214 7713190 5149449 3762617 1471584
4533A471584l467306m15329M672965M424696j182733l167995K020525N828030
$$ 1471584 -1995722 -2411051 2261914 6686610 5503877 2335882 4356407 10184437
4525A0184437J057155o558929p843605m205023l155800m779608k638340L904129
$$ 10184437 11241592 4682663 -3160942 -7365965 -10521765 -15301373 -17939713 -14035584
4517a4035584P744359N003616M11587j64724K822187M835583L415831J12295j917414
$$ -14035584 -6291225 -1287609 -876022 -1040746 1781441 6617024 10032855 10145150 8227736
4508H227736j111688J075535K040967J255809K30798m38687j272605j326835N34387
$$ 8227736 7116048 8191583 10232550 11488359 11719157 11280470 10007865 8681030 9215417
4499I215417J473867k720384r333264r575052j199378O330546M502803k446891
$$ 9215417 10689284 7968900 -1364364 -10939416 -12138794 -5808248 -1305445 -3752336
4491c752336m943451j919109O76486J019667J974357K958232P37529k418710p56832
$$ -3752336 -8695787 -10614896 -9938410 -8918743 -6944386 -3986154 -3248625 -5667335 -6424167
4482f424167M265063M646788q60711l479316J664570O980581L932580l670519
$$ -6424167 -2159104 2487684 1626973 -1852343 -187773 6792808 10725388 7054869
4474G054869n664120o90527K910212Q9397m754575n831833l833187k633496k561339
$$ 7054869 1390749 700222 3610434 3699831 -1054744 -6886577 -10719764 -13353260 -15914599
4465a5914599j223543J258385K355784J873850K173499L097972J417672k555188
$$ -15914599 -17138142 -15879757 -13523973 -11650123 -9476624 -6378652 -4960980 -7516168
4457g516168k826069L471766R505869P375092J67760k699306m53135j247425o831147
$$ -7516168 -10342237 -6870471 2635398 10010490 10178250 7478944 7025809 5778384 -1052763
4448a052763q455263k306892K341521j944259p569288l918395N127136P739668
$$ -1052763 -9508026 -11814918 -9473397 -11417656 -18986944 -22905339 -17778203 -10038535
4440a0038535L068442O17426L272369M209657P99189j050877J377125K902308
$$ -10038535 -6970093 -6352667 -3080298 1129359 1928548 877671 2254796 5157104
4432E157104Q84806J69484L328901N143273J795933k416743k702783r58866l10438
$$ 5157104 6041910 6211394 9540295 14683568 16479501 14062758 11359975 10401109 10090671
4423A0090671O48671K797843K265666k701160o458155l950871R84025J762127
$$ 10090671 10739342 13537185 15802851 13101691 6643536 2692665 3676690 5438817
4415E438817r17639j919229q23518j070675k416458j320537K149718L974589K609426
$$ 5438817 4521178 2601949 1778431 707756 -1708702 -3029239 -879521 3095068 5704494
4406E704494P64657N56413Q05342m00367k955076m548234k307367L655018P883303
$$ 5704494 6469151 7025564 7830906 7430539 4475463 -72771 -2380138 1274880 9158183
4397I158183M584425l604097p045797k236640K455037q38282p195616o365086
$$ 9158183 13742608 10138511 3092714 856074 3311111 2472829 -4722787 -11087873
4389a1087873J589889O849885M448117l08078j547940k78042R9358l02600M11385
$$ -11087873 -9497984 -2648099 1800018 1491940 -56000 -334042 -234684 -537284 -125899
4380a25899J974300K415771O24487k601397m758375l363481Q82198M069014M241221
$$ -125899 1848401 4264172 4888659 2287262 -2471113 -5834594 -4952396 -883382 3357839
4371C357839M142363N829920N813583M27377o597549q139883m013617q20804j730252
$$ 3357839 7500202 13330122 19143705 19571082 12973533 4833650 820033 -771 -1731023
4362a731023l015206j638843K05544K25128k9386P71137N20300k091169l874728
$$ -1731023 -4746229 -6385072 -6179528 -5954400 -5983786 -5212649 -4692349 -6783518 -10658246
4353a0658246j353255L712158O313363M453814Q50313j117658j275439j962997
$$ -10658246 -12011501 -8299343 -1985980 2467834 3318147 2200489 925050 -1037947
4345a037947l982967m475237o82612M612092N158204R6889l768239j650439K045029
$$ -1037947 -5020914 -9496151 -10178763 -5566671 -408467 -311578 -4079817 -5730256 -3685227
4336c685227J056232k785797l490953j054210J60150M11439L041620N509795J828310
$$ -3685227 -2628995 -5414792 -8905745 -9959955 -9799805 -9388366 -6346746 -836951 991359
4327I91359n870264q130016k123591M616691O460682N989719N349347J783232
$$ 991359 -4878905 -13008921 -15132512 -10515821 -4055139 1934580 7283927 9067159
4319I067159l726353l740987L429551Q197824L616947l827487n341693l352230
$$ 9067159 5340806 1599819 5029370 13227194 16844141 13016654 7674961 4322731
4311D322731m418143o086278k075425M644067N743215J603331K83218L696386
$$ 4322731 -95412 -6181690 -8257115 -3613048 2130167 3733498 4016716 7713102
4303G713102N215564J171029m332478o811921o029419k850737J712735M441223
$$ 7713102 12928666 14099695 9767217 2955296 -3074123 -5924860 -4212125 229098
4295B29098L222631J543408L305863N105139J275160n304150o340847j070034
$$ 229098 3451729 4995137 8301000 13406139 14681299 9377149 3036302 1966268
4287A966268L254928L435110L123707L352368Q03513l065210k082535K781386
$$ 1966268 5221196 8656306 11780013 15132381 15935894 12870684 10788149 13569535
4279A3569535K635617m295957p954427k424538M021900K368365l164856l668908
$$ 13569535 16205152 11909195 3954768 1530230 5552130 7920495 4755639 1086731
4271A086731l05528k97248l597909l977188m34386J857463O34363j313774k286087
$$ 1086731 781203 483955 -3113954 -7091142 -7525528 -5668065 -5033702 -6347476 -8633563
4262h633563l213578l557898j466807K208168M595537M827100L796669J630004
$$ -8633563 -11847141 -15405039 -16871846 -14663678 -10068141 -5241041 -1444372 185632
4254A85632j053494j754017K88759J849579P94204j11045J428643K371945J3185
$$ 185632 -867862 -2621879 -2333120 -483541 310663 199618 1628261 4000206 4013391
4245D013391k033839J23978K922140J056007k757899k031987K315049L885418
$$ 4013391 1979552 2103530 5025670 6081677 3323778 1291791 3606840 7492258
4237G492258J936724J315179K336047L99827m157744n392982k065354M30419j05812
$$ 7492258 9428982 10744161 13080208 13480035 9322291 3929309 1863955 2294374 2188562
4228B188562J6631J476092k0168l974279l349570L095566O494469J781699l274977
$$ 2188562 2205193 3681285 3661117 -313162 -3662732 -567166 5927303 7709002 4434025
4219D434025n74917M753323K674773n436411q877797l351666M499135P583357
$$ 4434025 3859108 8612431 11287204 5850793 -3027004 -6378670 -1879535 5703822
4211E703822N736833K163017j294490l912947n157970n114198l819175q06256
$$ 5703822 11440655 13603672 12309182 8396235 3238265 -1875933 -5695108 -6501364
4203f501364K873938M110973J760396q44637k43747K247977K833581O00840k060688
$$ -6501364 -3627426 483547 2243943 1399306 1155559 3403536 6237117 6837957 4777269
4194D777269k792271j111651J138528L33329m637371q252259m085812M086541
$$ 4777269 1984998 873347 2011875 2345204 -2292167 -10544426 -14630238 -10543697
4186a0543697M609847n014578j2139434o568586M340468P577364M106549M257744
$$ -10543697 -5933850 -10948428 -23087862 -29656448 -25315980 -17738616 -13632067 -9374323
4178i374323Q354944O607306k269083o868650q81189P144736P033549J77224o070501
$$ -9374323 -1019379 5587927 3318844 -3549806 -4430995 2713741 9747290 9924514 3854013
4169C854013q761048q180751l618681L328414P006567N090447K560177L131018
$$ 3854013 -4907035 -13087786 -16706467 -13378053 -6371486 -1281039 1279138 4410156
4161D410156K592892l009987q242486n450819K576175N722330R35197m402403
$$ 4410156 7003048 3993061 -4249425 -9700244 -7124069 -1401739 -466542 -4868945
4153d868945l714744J058241M520953N007680M132370K836287P70022j787816
$$ -4868945 -8583689 -7525448 -3004495 2003185 6135555 8971842 9741864 7954048
4145G954048l248038k095278J029028K977554J323210k003605k745521m68788
$$ 7954048 4706010 2610732 3639760 6617314 7940524 5936919 3191398 2722610
4137B722610P67502p61196j280054J853368M615439K060576l504764n510930k503690
$$ 2722610 3490112 2728916 1448862 3302230 7917669 9978245 6473481 962551 -1541139
4128a541139Q97052J534712Q43435M59373j67716r36535l54168J111860Q37917
$$ -1541139 -644087 890625 1734060 2193433 2025717 1089182 735014 1846874 2684791
4119B684791j427862k472859o91312J196867O90430k43062J562969M847117M945658
$$ 2684791 1256929 -1215930 -1907242 -710375 -19945 -263007 1299962 6147079 11092737
4110A1092737K91302m762249m781698K26003M596283L453930j850944n757614
$$ 11092737 11384039 6621790 1840092 2066095 6662378 10116308 8265364 2507750
4102B507750m945823r72108K833096M397923K874048j067045m019339k417447
$$ 2507750 -2438073 -3410181 -577085 3820838 6694886 5627841 1608502 -808945
4094h08945K263500M576610K985697K050479M196647M981396J115833k574416
$$ -808945 1454555 6031165 9016862 11067341 15263988 20245384 21361217 18786801
4086A8786801r73847J567317j844606p541542n893283K139072M967494j232963
$$ 18786801 17812954 19380271 17535665 9994123 4100840 6239912 11207406 9974443
4078I974443o020354j503831N195879L989955k406743m290517n38578J859779
$$ 9974443 3954089 2450258 7646137 11636092 9229349 4938832 4400254 6260033
4070F260033M11499p79326k21507r57223k899618j790811K494621M210834J001238
$$ 6260033 6671532 5892206 5670699 4713476 1813858 23047 2517668 6728502 7729740
4061G729740j850678q2722K578954J036763k199761q86955M331144N741093m04383
$$ 7729740 5879062 5796340 8375294 9412057 7212296 6325341 10656485 16397578 15993195
4052A5993195q029914q988703l178618K566492L782962K354846J306604L11105
$$ 15993195 7963281 -1025422 -4204040 -1637548 2145414 4500260 5806864 6117969
4044F117969j352809j419916J502315L376558l28993o241755o199387N07446N116256
$$ 6117969 4765160 3345244 4847559 8224117 7895124 1653369 -4546018 -4038572 1077684
4035A077684K444417j133555J951396Q036528P542575p35744q420036r268130
$$ 1077684 3522101 2388546 4339942 12376470 19919045 19183301 10763265 1495135
4027A495135m995866K41759M373115N691970K751436k361207n220752m527932
$$ 1495135 -3500731 -3258972 1114143 6806113 9557549 7196342 1975590 -2552342
4019b552342k402048L93480M286021O356969K647915m061103n721049l32248M890372
$$ -2552342 -4954390 -4560910 -274889 6082080 8729995 4668892 -1052157 -1384405 3505967
4010C505967M271359P43722j200092k470718m539745m400741m17711K591503P81247
$$ 3505967 7777326 8521048 7320956 4850238 310493 -4090248 -4507959 -1916456 -1135209
4001a135209j407056J256746M660729J436991n941840p605067r39644N916507
$$ -1135209 -2542265 -1285519 3375210 4812201 -1129639 -8734706 -9674350 -3757843
3993c757843N758030K8874n924466q505283n904627R86942O585674N573865P26090
$$ -3757843 2000187 2029061 -3895405 -12400688 -18305315 -17318373 -10732699 -5158834 -4432744
3984d432744k65379L726052N896480K721527j063863j072780M34462Q7952j395374
$$ -4432744 -4698123 -972071 4924409 7645936 6582073 5509293 5943755 6031707 4636333
3975D636333k905613n326632o868985l068200M504262P100982J660914k959663
$$ 4636333 1730720 -3595912 -10464897 -13533097 -9028835 -1927853 -266939 -3226602
3967c226602M53366N311439J938444n666202n299081M058662J0088143M855593
$$ -3226602 -2773236 2538203 4476647 -1189555 -6488636 -2429974 7658169 12513762
3959A2513762n375360j0368388p935605k678986J180683K473945K445133L392903
$$ 12513762 7138402 -3229986 -11165591 -13844577 -12663894 -10189949 -7744816 -4351913
3951d351913N460668N258604R07240l547418l579475j569558k249681l221871
$$ -4351913 1108755 6367359 7274599 3727181 147706 -1421852 -3671533 -6893404
3943f893404J214296P793569O456107l405177r584950m408555M237250N535644
$$ -6893404 -5679108 2114461 8570568 5165391 -4419559 -8828114 -4590864 944780
3935I44780J018259p82445J484019K268292j65623k041222j480655k69573J002918
$$ 944780 1963039 1180594 2664613 4932905 4767282 2726060 1245405 975832 1978750
3926A978750L213903M536964J887270l180136n098159j641195L256386M712461
$$ 1978750 5192653 9729617 11616887 8436751 3338592 1697397 4953783 9666244
3918I666244J861155k631189n301797m091113r5669K972468K601765j24329l025971
$$ 9666244 11527399 8896210 3594413 -496700 -592369 2380099 4981864 4857535 1831564
3909A831564n463840o714181m729504N43874N295617O485821N659066M965649
$$ 1831564 -3632276 -10346457 -15075961 -14532087 -9236470 -2750649 2908417 7874066
3901G874066K970138j229728l539920m98173L613537K229065k908355m264505
$$ 7874066 10844204 9614476 6074556 5576383 9189920 11418985 8510630 4246125
3893D246125p48887Q92059k332545n044317k984022N21565J360712J226566K672548
$$ 4246125 3497238 4389297 2056752 -2987565 -5971587 -5450022 -4089310 -2862744 -190196
3884a90196L210411j7760l753764k726268K149234M995141L069678q76205l441099
$$ -190196 3020215 3002455 -751309 -3477577 -1328343 3666798 6736476 5860271 2419172
3875B419172l674935j769349J579690M206808L848801J138246p55591J08571K427641
$$ 2419172 -1255763 -3025112 -1445422 2761386 6610187 7748433 6992842 7101413 9529054
3866I529054L440442J614811k154221m948755l910982Q36102N575307O298777
$$ 9529054 12969496 14584307 12430086 7481331 3570349 4406451 9981758 16280535
3858A6280535K559582k413654m973090m066595j758140j207751l429235n833016
$$ 16280535 18840117 16426463 11453373 7386778 5628638 4420887 991652 -4841364
3850d841364m944956o51307L666448N420226N310103M835518L657055J260355
$$ -4841364 -9786320 -10437627 -6771179 -1350953 3959150 8794668 12451723 13712078
3842A3712078o68581l32366N39816j595915o145049p325467j477373O588603Q256092
$$ 13712078 13043497 12711131 13250947 11655032 5509983 -1815484 -3292857 3295746 11551838
3833A1551838J996175m477419m620666j421647j399904l777040k271654L359685
$$ 11551838 13548013 9070594 4449928 3028281 1628377 -2148663 -4420317 -1060632
3825a060632N613606J222472k813545L7698N376421M724561j612277n955268m861708
$$ -1060632 4552974 5775446 2961901 2999599 8376020 13100581 11488304 5533036 671328
3816F71328j793532N63344L201841N806134N532755K044784j378532k692044k783882
$$ 671328 -1122204 -558860 2642981 8449115 13981870 16026654 14648122 11956078 9172196
3807I172196k354118j438374j374362k623594k069201K136169N225692K227225
$$ 9172196 6818078 5379704 4005342 1381748 -687453 1448716 6674408 8901633
3799H901633k598519j517798L141512J998795m874344o841375n97275L730668
$$ 8901633 6303114 4785316 7926828 9925623 5051279 -1790096 -2387371 1343297
3791A343297m15475n357797l074252J573745R13117k122850j357995L01577k308474
$$ 1343297 927822 -4429975 -7504227 -5930482 -5017365 -7140215 -8498210 -8196633 -10505107
3782a0505107m468813Q89836Q651027P983516K50113l096493P23457K651739j772964
$$ -10505107 -14973920 -14084084 -5433057 2550459 2800572 -295921 427536 3079275 1306311
3773A306311n735211l914241m95345J01181Q04883M686124P867524N617130P2683
$$ 1306311 -4428900 -8343141 -8838486 -8737305 -7932422 -3246298 4621226 10238356 10311039
3764A0311039l475552m057017m157912m245310k291873K351198P076966P905100
$$ 10311039 6835487 2778470 -1379442 -5624752 -7916625 -5565427 1511539 9416639
3756I416639L207294l673634o874639m620743j169891k33872j13703J416941K058887
$$ 9416639 12623933 8950299 2075660 -2545083 -3714974 -3948846 -4062549 -2645608 -586721
3747e86721j48021j621584O63951K479080n67822l851139j035782L555048J154124
$$ -586721 -734742 -2356326 -1692375 786705 218883 -3632256 -4668038 -1112990 41134
3738D1134n691320o297257L22332M380750K630436K388382N750511M712858k853211
$$ 41134 -5650186 -11947443 -11625111 -7244361 -4613925 -2225543 3524968 8237826 5384615
3729E384615o791636j518496M047224K190340n05350L666884Q566811M845887
$$ 5384615 -1407021 -2925517 1121707 3312047 2806697 6473581 15040392 19886279
3721A9886279l467421o135069l450524k636582l229936J58373M407513J391182
$$ 19886279 16418858 10283789 6833265 4196683 966747 1125120 5532633 6923815
3713F923815o609126q494040j788187L786376J931213k110546j927910J173362
$$ 6923815 314689 -8179351 -9967538 -6181162 -4249949 -6360495 -8288405 -7115043
3705g115043L205457L449908J931928k149107o209399m784384K301424P611763
$$ -7115043 -3909586 -459678 1472250 -676857 -6886256 -11670640 -9369216 -1757453
3697a757453N368474j305855n419151m575356j495735Q69014J831141K146280
$$ -1757453 3611021 2305166 -3113985 -7689341 -9185076 -8316062 -6484921 -4338641
3689d338641K559465K727950J732578K91518O37255K545806K274359j689316m972634
$$ -4338641 -1779176 948774 2681352 2972870 3610125 6155931 8430290 6740974 1768340
3680A768340l370695N89690J937953R47405P98315O71234j796395l624001k91453
$$ 1768340 -1602355 -1012665 925288 1872693 2671008 3342242 1545847 -2078154 -2369607
3671b369607M790946L567642l543477o847202j620824N348704O654710L913613
$$ -2369607 2421339 5988981 2445504 -4401698 -6022522 -673818 5980892 9894505
3663I894505K194898J485163q99144m019944m662470k274355J164474M049987
$$ 9894505 12089403 13574566 12675422 8655478 3993008 1718653 2883127 6933114
3655F933114N400153M361790J320768k285250n698943q148240p426614k944192
$$ 6933114 12333267 16695057 18015825 15730575 10031632 1883392 -5543222 -8487414
3647h487414J147588R54262n15778J831771N275541K911300l110796k682736N660082
$$ -8487414 -7339826 -6385564 -6901342 -5069571 205970 3117270 6474 -2676262 2983820
3638B983820J0561927N179517k302940k721854k45765k951842p621698n690024
$$ 2983820 13545747 18725264 16422324 13700470 13454705 10502863 2881165 -2808859
3630b808859J281833M243847J551133m38913R9595j162882m058076k962966J990222
$$ -2808859 -1527026 2716821 4267954 3829041 3928636 2765754 -1292322 -4255288 -2265066
3621b265066L305680j275384m077302M08813O951264Q088818M325284N17057j979407
$$ -2265066 1040614 -234770 -4312072 -3903259 3048005 11136823 15462107 15979164 13999757
3612A3999757l775109k997466J292701M662288K534578k311144l316420J81290
$$ 13999757 10224648 7227182 8519883 13182171 15716749 13405605 10089185 10270475
3604A0270475K649515J295028n24920J53104J172952m49945l412888m510177l543453
$$ 10270475 12919990 14215018 13690098 13843202 15016154 14566209 11153321 6643144 3099691
3595C099691k333649m38375L976989Q972354Q886683J776105o338418q181941
$$ 3099691 766042 327667 4304656 13277010 22163693 23939798 17601380 9419439
3587I419439m523248k514413m904171n868517l3111Q307090R642681J800765o551711
$$ 9419439 4896191 2381778 -2522393 -8390910 -8424021 -116931 9525750 11326515 4774804
3578D774804o265622J454576P019715M112111l315538o633818l322197O08094
$$ 4774804 -1490818 -36242 6983473 11095584 7780046 1146228 -2175969 -1567875
3570a567875o15475m579791m562481N74415N020155M656156K051320Q36366k01482
$$ -1567875 -2183350 -6763141 -11325622 -10751207 -5731052 -1074896 976424 1812790 1611308
3561A611308l546118o862372n489143K57042M837986M595247J556904k48890N84892
$$ 1611308 -1934810 -8797182 -14286325 -14029283 -9191297 -4596050 -3039146 -3288036 -2703144
3552b703144K565364L583824K878243J724757J785170K113860l41706n704132
$$ -2703144 -137780 3446044 6324287 8049044 9834214 11948074 11606368 5902236
3544E902236r196199p081389k186986L06146M24525J832373M206660L393805n28186
$$ 5902236 -3293963 -10375352 -12562338 -12256192 -11831667 -9999294 -5792634 -2398829 -2927015
3535b927015j779827K280031O308619M403310j697632n533081m067844N69831
$$ -2927015 -4706842 -2426811 3881808 8285118 6587486 1054405 -3013439 -2443608
3527b443608N058669P004437M830676p96963n974530o662326k705279K484764
$$ -2443608 2615061 9619498 14450174 13653211 7678681 1016355 -1688924 795840
3519G95840N188973L359244k401139p875173p596220j070494N081881M424056
$$ 795840 5984813 9344057 6942918 -932255 -8528475 -9598969 -4517088 -93032
3511i3032j093456l765228l34808M414373M936564K118658J027281L572954O087343
$$ -93032 -1186488 -4951716 -5286524 -872151 4064413 6183071 7210352 10783306 16870649
3502A6870649M136387j889640o954934o925894k896097Q32388K058785J985168
$$ 16870649 21007036 19117396 12162462 5236568 2340471 3172859 5231644 7216812
3494G216812J730141P05090p56120p04743M42697j188583o662571j0046027n325334
$$ 7216812 8946953 9652043 8895923 8191180 8633877 7445294 782723 -9263304 -14588638
3485a4588638M320544R516943O409510J83801l091494k535609M46414M990603
$$ -14588638 -10268094 -751151 5658359 5842160 2750666 215057 661471 5652074
3477E652074Q200147N438262k829768q903272o963663q18947J918150J13437j531727
$$ 5652074 13852221 19290483 16460715 7557443 593780 -225167 1692983 1806420 274693
3468B74693p08324P58852J825830K923497K458783j370336n295338l735167K292360
$$ 274693 -433631 325221 2151051 5074548 7533331 6162995 867657 -2867510 -575150
3459e75150N302124K203741j309867k69842J864400k76128m789549n723019k203338
$$ -575150 4726974 6930715 5620848 5351006 7215406 6939278 2149729 -3573290 -5776628
3450e776628J529020L088387L307830K209070n39044j949515J362428O352700
$$ -5776628 -4247608 -1159221 2148609 4357679 3818635 1869120 3231548 9584248
3442I584248N847670q87445n936043l920749J94049r16241n397589m948609K320382
$$ 9584248 15431918 14544473 8608430 4687681 4881730 3965489 -1432100 -6380709 -4060327
3433d060327Q155737N049577l549172p393522k124540N711110O908967K83819
$$ -4060327 4095410 9144987 5595815 -1797707 -3922247 1788863 8697830 8981649
3425H981649p060705q927750o251025l371470j487269J117087M191318N047038
$$ 8981649 1920944 -7006806 -13257831 -16629301 -18116570 -16999483 -12808165 -7761127
3417g761127L185022J746845K911644M545613L345310m99613l704497l835850
$$ -7761127 -4576105 -2829260 82384 4627997 7973307 7473694 3769197 -66653
3409f6653j275923J909382L613723K736936p4776k691892l137374j094570K001396
$$ -66653 -1342576 566806 4180529 6917465 6842689 4150797 1013423 -81147 1920249
3400A920249L884526K908059l04788k819755k270073K42220J401912k43576k889207
$$ 1920249 5804775 8712834 8408046 5588291 3318218 3560438 4962350 4718774 1829567
3391A829567m034820k810522J40569L170446L952503J436461k158728l341085
$$ 1829567 -2205253 -5015775 -4875206 -1704760 2247743 3684204 1525476 -1815609
3383a815609j636568K80576Q72999J319480K193444J839910l45698j957215j039608
$$ -1815609 -3452177 -3171601 -2298602 -979122 1214322 3054232 2708534 751319 -288289
3374b88289Q97298J600400J634489K624877L678979K499754p22200l064327k406480
$$ -288289 609009 2209409 3843898 6468775 10147754 12647508 11925308 8860981 6454501
3365F454501L65613K432976J412026k538178o193752o040201k345895J012997
$$ 6454501 6820114 9253090 10665116 8126938 1933186 -4107015 -6452910 -5439913
3357e439913J499597O24678N99609P67548n50342k608358l183291j964489q22329
$$ -5439913 -3940316 -3315638 -2716029 -1948481 -2498823 -5107181 -8290472 -10254961 -11077290
3348a1077290j012465j407671N40820N948794J1724989J1948873M803359l052490
$$ -11077290 -12089755 -13497426 -12956606 -7007812 4717177 16666050 21469409 18416919
3340A8416919l547755J751239L630940r08019m331605j364825K033457j066638
$$ 18416919 14869164 16620403 20251343 19343324 15011719 13646894 15680351 14613713
3332A4613713o198612m346748L161195O525715K494419k186432k530505j431151
$$ 14613713 8415101 4068353 7229548 13755263 16249682 14063250 11532745 10101594
3324A0101594k199006k991349j694497L5004N96899R01267N90588k574795o878629
$$ 10101594 7902588 4911239 3216742 3251746 3848645 4749912 5340500 2765705 -4112924
3315d112924o103445J323791P822131O035044j130869m723908j385629L849543
$$ -4112924 -10216369 -8892578 -1070447 4964597 3833728 -890180 -2275809 1573734
3307A573734M930781J053006l923746n632483l031141O53821J643346M23460N79098
$$ 1573734 6504515 7557521 3633775 -1998708 -5029849 -4376028 -2732682 -2309222 -1730124
3298a730124K665746K993244j07463k949293k108826K63653K40199j711581k334608
$$ -1730124 935622 3928866 3821403 872110 -1236716 -973063 -732864 -2444445 -4779053
3289d779053j280547r66669j780997j511496M27991J664281N85264j077887o34180
$$ -4779053 -6059600 -7026269 -8807266 -10318762 -9890771 -8226490 -7641226 -8719113 -9353293
3280i353293J891772L617885K180358j271920l040383j194695J852143K149207
$$ -9353293 -7461521 -3843636 -1663278 -2935198 -5975581 -7170276 -5318133 -3168926
3272c168926j125558n248596p415375o760504l756059O8184K496951L174831M733520
$$ -3168926 -4294484 -9543080 -16958455 -23718959 -27475018 -27406834 -24909883 -21735052 -17001532
3263a7001532Q444380J0390805O367868o35975l524748j436341n26529l509547
$$ -17001532 -8557152 1833653 8201521 7565546 4040798 2604457 2077928 -1431619
3255a431619n595433l438029r04108j590561k169938J018845M254605K250480
$$ -1431619 -7027052 -10465081 -11369189 -12959750 -15129688 -14110843 -9856238 -7605758
3247g605758k278611k352044K251537N117296L572673J934048L594705N821617
$$ -7605758 -9884369 -12236413 -9984876 -4867580 -1294907 639141 4233846 10055463
3239A0055463M528859J93587l255942l319831j282133n14572k440448m053203
$$ 10055463 14584322 14777909 11521967 8202136 6920003 6405431 3964983 -88220
3231h8220j367988M000340N262893k10313n887119m399528K346484O316777M271957
$$ -88220 -1456208 2544132 7807025 7596712 1709593 -2689935 -343451 5973326 10245283
3222A0245283J43121k125895k556870k205706j218315l33818o05542j452776j829338
$$ 10245283 10388404 8262509 5705639 3499933 2281618 1947800 1342258 -110518 -1939856
3213a939856k332531l145940j959434K071720M827183K882371J38943K214520
$$ -1939856 -4272387 -7418327 -9377761 -7306041 -2478858 403513 542456 2756976
3205B756976O271897M692168j725621l778936J211976M331036o47841o802519
$$ 2756976 9028873 13721041 11995420 8216484 9428460 13759496 13111655 6309136
3197F309136m778090K799747N902755J896968k757067l660518l111754l415126
$$ 6309136 1531046 4330793 10233548 12130516 9373449 5712931 2601177 -813949
3189h13949k887427n74122P79765n10994j509515O94927L716762L217056J0603
$$ -813949 -3701376 -4275498 -3495733 -4006727 -5516242 -4821315 -1104553 2112503 2123106
3180B123106n20102L489213O915780M594777j134434l561510j026566J331730
$$ 2123106 1603004 5092217 12007997 16602774 15468340 11906830 10880264 12211994
3172A2211994j76318k532589j556543J325414J958870L68827j28312O87766k30673
$$ 12211994 12035676 9503087 7946544 9271958 11230828 11599655 11471343 12159109 11928436
3163A1928436k925181l214822O23943M235184K859611k217267n642792m750408
$$ 11928436 9003255 5788433 6412376 10647560 13507171 11289904 5647112 896704
3155H96704j752745K62486J266965L144503N316689L740124l478668j0676010
$$ 896704 -856041 -593555 673410 3817913 9134602 12874726 9396058 -1279952
3147a279952r406112R1589P340156N008869j260732k003600J777612J687061l421368
$$ -1279952 -10686064 -10594475 -3254319 1754550 493818 -1509782 267830 1954891 -1466477
3138a466477n861827k369416J206789J055526J475646N048738N884980q4885n515698
$$ -1466477 -7328304 -9697720 -8490931 -7435405 -5959759 -911021 4973959 4889074 -626624
3129f26624j620949O993545P674276j742081r581640o676162K380494P429949
$$ -626624 -2247573 4745972 12420248 10678167 1096527 -5579635 -3199141 4230808
3121D230808N546806J156175k056644m022588n052274m524190k826588j295713
$$ 4230808 9777614 10933789 8877145 4854557 -197717 -4721907 -7548495 -8844208
3113h844208J58296K555914M474228K593196k454059m324642Q12429O780225M299850
$$ -8844208 -8685912 -6129998 -1655770 937426 -1516633 -5841275 -5028846 1751379 6051229
3104F051229m999115r041123k170031O424138O519284J564218J025710L964658
$$ 6051229 1052114 -7989009 -10159040 -3734902 2784382 4348600 5374310 9338968
3096I338968J787241n285842p427373j835733K421341j00768k686642N62262L996782
$$ 9338968 11126209 5840367 -1587006 -3422739 -1001398 -1102166 -3788808 -3226546 770236
3087G70236J027010l477232j480148M081393M356352m19906k082213J216536K670080
$$ 770236 1797246 -1679986 -3160134 921259 5277611 4857705 2775492 3992028 6662108
3078F662108r21664m217990k891248k53300r79995l911237m648429j738701K480693
$$ 6662108 5740444 1522454 -1368794 -1622094 -2602089 -6513326 -11161755 -12900456 -10419763
3069a0419763N029547M661040K445184M69733o60724j863706k551322o62656K616018
$$ -10419763 -5390216 -729176 1716008 2185741 1525017 -338689 -2890011 -3552667 -936649
3060i36649K511348j775185m093145o14412L215617J484012j710617O54902N264074
$$ -936649 1574699 -200486 -4293631 -4908043 -1692426 -208414 -1919031 -1264129 3999945
3051C999945L282418l740158n216638P16966L704832j202409m991775m7877P024437
$$ 3999945 7282363 3542205 -1674433 -957467 2747365 1544956 -3446819 -3494696 3529741
3042C529741O563351R84971j240411j69266k008457o114482n482679Q60849N847329
$$ 3529741 10093092 11078063 9837652 9668386 7659929 1545447 -3937232 -3076383 2770946
3033B770946N375384K859880J415598o13013l757493m155296j90040L039026O67294
$$ 2770946 8146330 11006210 12421808 11808795 8051302 3896006 3705966 6744992 7412286
3024G412286m138262m259340J370984O384715N277840m64912n136190n188984
$$ 7412286 3274024 -985316 385668 6770383 12048223 11583311 6447121 1258137
3016A258137j813086J319569J672616k19968j593915l06142K805647M562287K746397
$$ 1258137 -554949 764620 2437236 2217268 623353 317211 3122858 7685145 10431542
3007A0431542j381507m273987l755164r68041J387673J900715Q94233j142560
$$ 10431542 9050035 4776048 1020884 52843 1440516 3341231 4235464 3092904
2999C092904m064745o802713o986394l148254K804520O400645M746082k12335
$$ 3092904 -971841 -7774554 -14760948 -17909202 -15104682 -8704037 -3957955 -4170290
2991d170290l349779j743096K230234L865337J486145k395285m685895m623981
$$ -4170290 -7520069 -9263165 -7032931 -3167594 -1681449 -4076734 -8762629 -13386610
2983a3386610l105576j177135K18042Q00527J826481M474057O901685N516534
$$ -13386610 -16492186 -17669321 -17451279 -16650752 -14824271 -10350214 -3448529 2068005
2975B068005K81361m033510l687152m88275J564585J505739P06091m41150j861792
$$ 2068005 2349366 -1684144 -5371296 -5859571 -4294986 -2789247 -2083156 -2524306 -4386098
2966d386098j828381Q29849L860749M130300J919845r2323p15399l63958R07076
$$ -4386098 -6214479 -5384630 -1523881 2606419 4526264 4433941 3718542 3354584 4261660
2957D261660K479255K256353j80898j819842r12819l15490k042198k417070J541161
$$ 4261660 6740915 8997268 8816370 6996528 6083709 5768219 3726021 1308951 2850112
2948B850112M812142J251418n073834m776862J767282M464097n70178n554330
$$ 2850112 7662254 8913672 3839838 -937024 830258 5294355 4724177 -830153
2940h30153m240626n40120L80180L62454K046603K717766Q11445J126117O348463
$$ -830153 -5070779 -5610899 -5230719 -4868265 -2821662 -103896 707549 1833666 8182129
2931H182129R902053N103760l911307q329029o999658m609443k058418K254984
$$ 8182129 18084182 23187942 19276635 10947606 3947948 -661495 -2719913 -464929
2923d64929M979861J514869m482580m837421M10956L242026Q61408p94615J496908
$$ -464929 4514932 6029801 1547221 -3290200 -2879244 362782 1224190 429575 1926483
2914A926483K597593j371613n617062m162173R03359L225601J541000k7599R24766
$$ 1926483 4524076 3152463 -2464599 -6626772 -5723413 -2497812 -956812 -984411 -59645
2905e9645K192723R20583k345389m116240j831022K695663M520741J544863k132530
$$ -59645 2133078 3053661 708272 -3407968 -5238990 -2543327 1977414 3522277 1389747
2896A389747j345252K924901N008150K541192j150073k788443k899081k766803
$$ 1389747 44495 2969396 7977546 10518738 9368665 6580222 3681141 914338
2888I14338j715900O51250K585013K521830J126672k76151j327112j919932j921788
$$ 914338 -801562 -150312 2434701 4956531 6083203 5807052 4479940 2560008 638220
2879F38220k017000k713644k658679o10652J341437R3870k990652l120781O71222
$$ 638220 -1378780 -4092424 -6751103 -7361755 -6020318 -5926448 -8917100 -12037881 -11366659
2870a1366659L649995K275078j039413k070489j40271K808120N209161N702051
$$ -11366659 -7716664 -5441586 -6480999 -8551488 -8691759 -5883639 -674478 5027573
2862E027573L029931j405871l464051j110218K778952M312335L018481P43538
$$ 5027573 8057504 6651633 3187582 2077364 4856316 9168651 12187132 12930670
2854A2930670j302356k484237k125924q88314p16024j953319k633131j555516
$$ 12930670 11628314 9144077 7018153 6129839 5413815 3460496 827365 -728151
2846g28151N08804L138094O235955P201170K841702m516208q019293n457356j942968
$$ -728151 -219347 2918747 9154702 16355872 19197574 14681366 6662073 1204717 -738251
2837g38251j014145L10452L766470M543589j07388l793013n00053M530143K827519
$$ -738251 -1752396 -1441944 2324526 6868115 6760727 2967714 2467661 6997804 9825323
2828I825323k989857l689542Q22676K217288q03497o47968L996708M182034l598155
$$ 9825323 6835466 3145924 3968600 6185888 5382391 4734423 8731131 12913165 9315010
2819I315010r683158o085524J163941K805883P53517J939660M622158J953018
$$ 9315010 -368148 -6453672 -5289731 -2483848 -1730331 209329 4831487 6784505
2811F784505m773487p445515m085420n10394N05109K188902N041841M314789j090539
$$ 6784505 2011018 -5434497 -9519917 -10030311 -9525202 -7336300 -2294459 2020330 929791
2802I29791m915722k534270K246988L265591L48371k120498j606500P84105K560079
$$ 929791 -3985931 -6520201 -4273213 -1007622 -659251 -2779749 -4386249 -3602144 -1042065
2793a042065J838880q26751j920385Q76679M160493K843252j327601j448005L119874
$$ -1042065 796815 -29936 -1950321 -1073642 3086851 5930103 4602502 3154497 6274371
2784F274371M520030q51151n146285r70232O025997N068816l326044q483381n571599
$$ 6274371 10794401 9943250 4796965 3826733 9852730 14921546 11595502 3112121 -2459478
2775b459478q76012l57060j950366k032416j724439k387760j028224M406716R303838
$$ -2459478 -3335490 -3692550 -5642916 -7675332 -9399771 -11787531 -12815755 -8409039 894799
2766H94799P487290r8781o323439o255757j188664M415942O713792M208527j081263
$$ 894799 8382089 8283308 1959869 -4295888 -5484552 -1068610 5645182 9853709 8772446
2757H772446m477889l154867M27149J484310j276076m696029n375032k896497
$$ 8772446 4294557 1139690 1566839 3051149 1775073 -2920956 -8295988 -11192485
2749a1192485O41484K517884J316089j393461k026876O03585K902318R63420l347626
$$ -11192485 -10551001 -8033117 -6717028 -8110489 -10137365 -9533780 -6631462 -5668042 -9015668
2740i015668m094369M71344M654834K334456m833027q888006m812184L922242
$$ -9015668 -13110037 -12638693 -7983859 -5649403 -10482430 -19370436 -24182620 -20260378
2732b0260378R648937Q805955M561182J812845J644685J752528P88735o2248K64093
$$ -20260378 -10611441 -1805486 2755696 4568541 6213226 7965754 8754489 8692241 8956334
2723H956334Q22465M03386m82796o27010J6724O51198Q11803J25652j964333m788686
$$ 8956334 9778799 10182185 9699389 9072379 9089103 9740301 10552104 10677756 8713423 3924737
2713C924737n725063k757965K435162N537755M006696m76120l995699m038134
$$ 3924737 -1800326 -4558291 -2123129 3414626 7421322 6945202 2949503 -1088631
2705a088631j108669K442374M622832M787972K932974p19369m546079n336053
$$ -1088631 -2197300 245074 4867906 9655878 12588852 11869483 7323404 1987351
2697A987351j624153L172619L772335l16313m000889l483764q34866J69556l31073
$$ 1987351 363198 3535817 7308152 6991839 2990950 -492814 -1327680 -1158124 -1489197
2688a489197J49111J538229J559602o8281j238197r92869n31207n94020l01400
$$ -1489197 -1340086 198143 1757745 1689464 451267 -541602 -1072809 -1666829 -1968229
2679a968229J057555K804646L529703J887773k401067p011814p990554m319131
$$ -1968229 -910674 1893972 5423675 7311448 4910381 -2101433 -10091987 -14411118
2671a4411118Q2918J412769J183762K964763N658307M775741L4039l354128j962270
$$ -14411118 -14328200 -12915431 -11731669 -8766906 -3108599 1667142 1701181 -1652947 -3615217
2662c615217J694697L750384L572693J844094j773576o126543p231264l171950
$$ -3615217 -1920520 1829864 5402557 7246651 5473075 -653468 -7884732 -11056682
2654a1056682J998102K983097L05983j034368J046109L565997L688728K335831
$$ -11056682 -9058580 -6075483 -5769500 -6803868 -5757759 -2191762 1496966 3832797
2646C832797J517873J120341K25688m92752n204O22720m97956k585779k509360
$$ 3832797 5350670 6471011 6696699 6203947 6198743 6821463 6323507 3737728 1228368
2637A228368N29340K879583J029392l070000m025999j31829M427369N247219K790147
$$ 1228368 1757708 4637291 5666683 2596683 -1429316 -1561145 2866224 8113443 10903590
2628A0903590K35599j123552j822303j600036p9056J045787k6763j421184M73180
$$ 10903590 11139189 10015637 8193334 6593298 6514242 7560029 7533266 6112082 6585262
2619F585262M663433N109411j081670q051999p527658K78496O122240L162015
$$ 6585262 11248695 16358106 15276436 7224437 -303221 -24725 6097515 9259530
2611I259530m399459o981615j960967L911152M412575J213780r58355j665382
$$ 9259530 4860071 -2121544 -4082511 -171359 4241216 5454996 4496641 2831259
2603B831259k633853k240396J198666L085189k151604r876926q974076J248767
$$ 2831259 197406 -2042990 -844324 2240865 89261 -9787665 -18761741 -17512974
2595a7512974P974958L361602l798240k243157M883857P235915M215430K883105
$$ -17512974 -9538016 -6176414 -9974654 -12217811 -7333954 -98039 4117391 7000496
2587G000496L620314Q28136m139205l935992O13679K60261o385723q791434j388092
$$ 7000496 10620810 11448946 7309741 3373749 3987428 4247689 -2138034 -10929468 -12317560
2578a2317560O757854N891027k6874q73344M318958P884743N451621J48320l222667
$$ -12317560 -5559706 331321 304447 -568897 3750061 11634804 17086425 17234745 14012078
2569A4012078l001426o84929P85575j16412j316159j57634J614944Q1526l873816
$$ 14012078 11010652 10325723 11111298 10994886 9678727 9521093 11136037 11217563 7343747
2560G343747n274491k857596L0494K329213N561468P017232J900253o102212o695457
$$ 7343747 2069256 -788340 -757846 1571367 7132835 14150067 16050320 9948108 3252651
2551C252651J234540O288549J875470l785859j595583M475563N426484Q02965
$$ 3252651 4487191 10775740 12651210 8865351 7269768 11745331 17171815 17974780
2543A7974780l869132n864670m262464K123542R018910P563845k085204p787981
$$ 17974780 14105648 8240978 3978514 6102056 15120966 22684811 20599607 12811626
2535A2811626l459063J455096o48573k205075L590726P757962J823489m395371
$$ 12811626 9352563 10807659 10159086 7954011 11544737 19302699 21126188 16730817
2527A6730817N37300P978932M848500j516239J882401O430478j521545q003334
$$ 16730817 17268117 25247049 30095549 28579310 30461711 36892189 35370644 27367310
2519B7367310P700108K5217276J468708n6171244q2255323m0301153K3304346
$$ 27367310 35067418 60284694 61753402 5582158 -76673165 -116974318 -93669972
2512i3669972M2997206J8334512k626348J053223Q199384M192197O21333M792422
$$ -93669972 -50672766 -32338254 -34964602 -33911379 -25711995 -21519798 -20898465 -16106043
2504a6106043N658854k061945p297729m209468j545156l229564p07701P713363
$$ -16106043 -10447189 -12509134 -19806863 -24016331 -25561487 -28791051 -29498752 -21785389
2496b1785389R938033J607770l878415K550694J0125124O832983r95469j275866
$$ -21785389 -11847356 -10239586 -14118001 -11567307 -1442183 5390800 4395331 3119465
2488C119465L397059K506116l531683n776007k979092j958832m176697l876101
$$ 3119465 6516524 9022640 5490957 -285050 -3264142 -5222974 -9399671 -13275772
2480a3275772O26494L845436K633406Q11565J993246L753318K088140j884794
$$ -13275772 -12649278 -8803842 -6170436 -5358871 -3365625 387693 2475833 591039
2472E91039l042638P44252N133368M344862q98362l523104M4944L921413J082705
$$ 591039 -2451599 -1707347 3426021 7770883 6872521 3349417 3394361 7315774 8398479
2463H398479n556309p171840k518627Q83719n39061j438127K035776N312521L535002
$$ 8398479 2842170 -4329670 -6848297 -5964578 -6503639 -7941766 -5905990 -593469 2941533
2454B941533m47716j644924p66008j024557j950722j714315j368408j872916j156219
$$ 2941533 2493817 848893 82885 -941672 -2892394 -4606709 -5975117 -7848033 -9004252
2445i004252J170185J013187l015491m828206K45678O657452O405335J596058
$$ -9004252 -7834067 -6820880 -9836371 -14664577 -14418899 -7761447 -1356112 239946
2437B39946M77194L557912L368513k309571o389321l532490K475759N266601L819475
$$ 239946 717140 4275052 7643565 5333994 -1055327 -4587817 -2112058 3154543 6974018
2428F974018R57369j351439k418645j995258r93298n90931k12512Q78693R32581
$$ 6974018 7931387 6579948 4161303 2166045 1172747 581816 369304 1247997 2180578
2419B180578j339310k609908O33558M532369K011667n108226o556178J145346
$$ 2180578 841268 -1768640 -1135082 3397287 5408954 300728 -6255450 -5110104
2411e110104Q174012N136996l688840p353726l251304K100001L947535L631450
$$ -5110104 3063908 8200904 4512064 -2841662 -6092966 -3992965 -45430 3586020
2403C586020L335322K859617J704624p0641k768241n461656m990354l18411M070263
$$ 3586020 6921342 9780959 11485583 11414942 8646701 3185045 -1805309 -2123720 1946543
2394A946543L593290M00653l59092Q22696p65019m977712o294993k907716O71802
$$ 1946543 5539833 5940486 5581394 6404090 5639071 661359 -5633634 -8541350 -7869548
2385g869548J566723K145120L362173J808206k702332l744173J704525O054886
$$ -7869548 -6302825 -4157705 -795532 1012674 -1689658 -5433831 -3729306 2325580
2377B325580J570725o443159o142687K987734Q630382L436967m678929m520912
$$ 2325580 3896305 -2546854 -8689541 -5701807 2928575 6365542 1686613 -2834299
2369b834299K826934O816711K311824m995053p529247m694642j190973j06161
$$ -2834299 -7365 6809346 9121170 4126117 -3403130 -8097772 -9288745 -9394906
2361i394906l72005K34283J866881K717475J480104p60931j380148O22542K687730
$$ -9394906 -9766911 -9532628 -7665747 -4948272 -3468168 -4229099 -5609247 -4986705 -2298975
2352b298975J437847k153427k585053K837369Q360020N958572k804412o925670
$$ -2298975 -861128 -3014555 -5599608 -2762239 5597781 11556353 8751941 1826271
2344A826271q99966O318915L471518o119228q764995m89604P255563M704551k849869
$$ 1826271 926305 7245220 10716738 4597510 -4167485 -4657089 2598474 7303025 4453156
2335D453156m735441m99137K178240M03311j730104j612560p15346N80064L392702
$$ 4453156 -282285 -781422 1396818 1800129 70025 -1542535 -2257881 -1677817 1714885
2326A714885N338011J990039n337626r206347n419081J845491N870121M358303
$$ 1714885 7052896 9042935 3705309 -5501038 -10920119 -9074628 -3204507 1153796
2318A153796m91861m784549m823470k30386M032124K781674j865299k769339J973253
$$ 1153796 661935 -4122614 -8946084 -9176470 -5144346 -2362672 -4227971 -6997310 -5024057
2309e024057O504373O103578K752530k49553l197399o218491o099249j258049
$$ -5024057 1480316 7583894 10336424 10086871 6889472 670981 -5428268 -6686317
2301f686317M170540N443232L225806R57146n23412k014857k584661j032046J343543
$$ -6686317 -2515777 2927455 6153261 7110407 6586995 4572138 1987477 955431 2298974
2292B298974K487856K206942R89589j135171k767037j574394J413011J817008
$$ 2298974 4786830 6993772 7983361 6848190 4081153 2506759 3919770 5736778
2284E736778j531461m310822l442237j297071l43443Q85946K787934J694158l154677
$$ 5736778 4205317 -105505 -3547742 -4844813 -5188256 -4302310 -1514376 179782 -2974895
2275b974895n623118j822923K422036N97635l125975l47762P354044J0289446
$$ -2974895 -8598013 -10420936 -7998900 -7401265 -10527240 -10875002 -3520958 6768488
2267F768488N177548j369394l739408l356787l013162k474467j246903p4020J247686
$$ 6768488 11946036 10576642 6837234 3480447 467285 -2007182 -3254085 -3328105 -2080419
2258b080419L014146L119071J88434k300816n65035K744660K652279N72402J619795
$$ -2080419 933727 4052798 4241232 1940416 1375381 4120041 6772320 7344722 8964517
2249H964517N081076N666740K892684O90168j073399n328488r009088n977711
$$ 8964517 14045593 19712333 22605017 23295185 22221786 16893298 7884210 1906499
2241A906499J190931L289678q75648l387817j950094k854342o676612n223546
$$ 1906499 3097430 6387108 5511460 2123643 173549 -2680793 -9357405 -14580951
2233a4580951K268980M508480k737411p174127K99955R753474Q552632J643206
$$ -14580951 -12311971 -7803491 -10540902 -17715029 -17415074 -7661600 891032 2534238
2225B534238Q83365M046398J126951n509626n066059J577121L372885q41541j334369
$$ 2534238 3417603 7464001 8590952 3081326 -1984733 -407612 2965273 2123732 789363
2216G89363K870845J037947q854893j3465975m763361O902445Q976004M070499
$$ 789363 3660208 4698155 -4156738 -17622713 -22386074 -15483629 -6507625 -2437126
2208b437126J645348K262186Q70999j427178K8434L354856K592433j927518m075966
$$ -2437126 -791778 1470408 2341407 914229 942663 4297519 6889952 4962434 886468
2199H86468j591567J752807K836710K053694K50681j763187j395654K777895O710963
$$ 886468 -705099 1047708 3884418 5938112 6188793 4425606 3029952 5807847 12518810
2190A2518810M729705k156338o602209m353271Q48321K896682L35469l601953
$$ 12518810 17248515 15092177 8489968 4136697 4985018 7881700 8217169 4615216
2182D615216n154110k877601J600478M647721L940258J030961q58816j133615
$$ 4615216 -538894 -3416495 -1816017 2831704 6771962 7802923 6944107 5810492
2174E810492j658238k884346l367619l164908l746608l533069J761625J1342852
$$ 5810492 4152254 1267908 -2099711 -5264619 -9011227 -12544296 -10782671 560181
2166E60181J6282091R594049k958667q483366l265418L080797J699289l841717
$$ 560181 16842272 26436321 23477654 14994288 11728870 14809667 16508956 12667239
2158A2667239m685465l06388K168624o5066k208821j197451o99208l565270n606323
$$ 12667239 7981774 7675386 9844010 9778944 7570123 6372672 5673464 2108194 -3498129
2149c498129k117308L641402M594004L33737k634443o48705K864138L811493K894233
$$ -3498129 -5615437 -1974035 2619969 2953706 319263 -329442 2534696 6346189 9240422
2140I240422K383836J675561n72093k587658j542414J693727L217651J400386
$$ 9240422 11624258 13299819 12727726 10140068 8597654 10291381 13509032 14909418
2132A4909418j244466j952919j081321n48613q41341j169629j356344j709603
$$ 14909418 13664952 11712033 10630712 10082099 9240758 8071129 6714785 5005182
2124E005182j623695j91980J947478L188956L330796L314156K516560r24382o137933
$$ 5005182 3381487 3189507 5136985 8325941 11656737 14970893 17487453 16563071 10425138
2115A0425138q840082o529080j784256J737063L723087M884597L560594j051056
$$ 10425138 1585056 -4944024 -6728280 -4991217 -1268130 3616467 7177061 6126005
2107F126005m929930l783827R3820J022850j295512k235328n18835Q03469J309398
$$ 6126005 1196075 -2587752 -2493932 -1471082 -2766594 -5001922 -5520757 -4717288 -3407890
2098c407890L465993N470614K478385l325677l419706K942774N546012l28169
$$ -3407890 58103 5528717 8007102 4681425 1261719 4204493 9750505 9422336
2090I422336m809558O62880P989318M636614n748543q557079o46447O153111L708670
$$ 9422336 4612778 5275658 13264976 17901590 12153047 3595968 2949521 9102632 12811302
2081A2811302k812787n947281n569282m229352j989798L33657J71932j421868
$$ 12811302 9998515 4051234 -1518048 -5747400 -7737198 -7403541 -7231609 -8653477
2073h653477q1987L850702M683052J095004j080558J136960K852964L57214k254475
$$ -8653477 -8735464 -4884762 -201710 893294 -187264 949696 3802660 4159874 1905399
2064A905399o50445K143907J471975j196580k027183j439939j255974O0640L218574
$$ 1905399 1254954 3398861 4870836 3674256 1647073 207134 -1048840 -988200 2230374
2055B230374L645809j763745o982057l790591N338561R174520K868091n640222
$$ 2230374 5876183 4112438 -2869619 -6660210 -1321649 7852871 10720962 5080740
2047E080740o314262P73490O664712M410796l536769q453877n208577J853830
$$ 5080740 -1233522 -460032 6204680 10615476 7078707 -1375170 -6583747 -4729917
2039d729917M511027J309387j339365O93645L404191J917199j591763k112482
$$ -4729917 -218890 1090497 -248868 444777 3848968 5766167 4174404 2061922
2031B061922K2098Q80348R9225L85846J677642J652141Q58224J607325K695905
$$ 2061922 2084020 2964368 3063593 3449439 5127081 6779222 7637446 9244771 11940676
2022A1940676J180140j289649n25378J815002n40885p137188q573050N1623J0057097
$$ 11940676 13120816 11831167 11305789 13120791 12579906 5442718 -3130332 -3078709 6978388
2013F978388R854742M59173o697592n458498j161042o26630k652462j886359K193458
$$ 6978388 16833130 17292303 10594711 5136213 3975171 3348541 696079 -1190280 1003178
2004A003178N001858M057136J876818J015729M1873l086865o077200m450133J677852
$$ 1003178 6005036 10062172 11938990 12954719 12996592 9909727 3832527 -617606 1060246
1995A060246O562161N914614K217639O30987J572445P72852l536119p038743m847245
$$ 1060246 7622407 13537021 15754660 16385647 17958092 18730944 15194825 8156082 3308837
1986C308837J404544M904433K130715k741450l553251k09313K156654J254306
$$ 3308837 4713381 9617814 11748529 9007079 5453828 5244515 7401169 8655475
1978H655475M77133K445773M362403L085080O90328M8281j566386p477889j2395132
$$ 8655475 9132608 11578381 15940784 19025864 19716192 19764473 18198087 10720198 -1674934
1969a674934p250515N863228J3025055O696044l827334o237533k094245j397495
$$ -1674934 -8925449 -3062221 9962834 16658878 12831544 6594011 4499766 3102271
1961C102271n580704o525225j109369L640077J929875k574788l556059q62614
$$ 3102271 -2478433 -9003658 -10113027 -6472950 -4543075 -7117863 -10673922 -11536536
1953a1536536J716722K885092L476357K803786K5208k490185j442541K197022
$$ -11536536 -9819814 -6934722 -3458365 -654579 -629371 -3119556 -4562097 -2365075
1945b365075L923705J990447k46061N06240K636816K240071j061502l877567m229427
$$ -2365075 1558630 3549077 3303016 3809256 6446072 8686143 7624641 3747074 -482353
1936d82353l559462k648047O77005O820602J0564298O742704j564086n867842
$$ -482353 -4041815 -6689862 -6012857 807745 11372043 18114747 16550661 10682819
1928A0682819l400490Q6705j67464j532624j08173K078439P23447l403209n676161
$$ 10682819 7282329 7369034 7201570 5668946 5560773 7639212 8362659 4959450 -716711
1919g16711m152492p55099K385207M085324L286757N54906j295771j183170j940746
$$ -716711 -4869203 -5624302 -3239095 846229 4132986 4687892 3392121 2208951 268205
1910B68205n008206o171726j701170M019173L528745k300745m924482n54129M951358
$$ 268205 -4740001 -10911727 -12612897 -8593724 -5064979 -7365724 -12290206 -12844335 -7892977
1901g892977N565335L304187L488951O301684P287048M048986r65381l620721
$$ -7892977 -2327642 976545 4465496 10767180 18054228 22103214 21137833 17517112
1893A7517112k169748J323917K917526P80051k896475m885572m749801l909419
$$ 17517112 15347364 16671281 19588807 20368858 17472383 12586811 7837010 3927591
1885C927591k416446L38003K664873J920829j280932l463915k969098j258555
$$ 3927591 1511145 1849148 4514021 6434850 5153918 1690003 -1279095 -2537650
1877b537650K67895J542944K105799J522226J385362L285986M988224K779617
$$ -2537650 -2269755 -726811 1378988 2901214 4286576 7572562 12560786 15340403
1869A5340403k215120m651578k676952l26447q34096k347989k547796k886521
$$ 15340403 13125283 8473705 5796753 5470306 4636210 2288221 -259575 -3146096
1861c146096m817000n470424j384680N313330Q371376M812834j602694m555658
$$ -3146096 -7963096 -13433520 -14818200 -9504870 -1133494 3679340 2076646 -2479012
1853b479012j655135L378798M896772J767774j442832p20962J913819J702171
$$ -2479012 -4134147 -755349 4141423 5909197 4466365 3745403 5659222 7361393
1845G361393j714897m024957k411155J517825M564758M512291P00105m524094
$$ 7361393 5646496 1621539 -789616 728209 5292967 9805258 10505363 5981269
1837E981269o242978k833938M24040j509192n029708l218535K466371M322208
$$ 5981269 -261709 -3095647 -2671607 -4180799 -9210507 -12429042 -9962671 -5640463
1829e640463J460747Q27622M142956M602105k44791l295368p28535P58315l314268
$$ -5640463 -4179716 -3352094 790862 5392967 5148176 1852808 1124273 1882588 -1431680
1820a431680n620976L43415P194671M860097k146583j721967N924164Q932040
$$ -1431680 -7052656 -6709241 485430 5345527 3198944 1476977 7401141 16333181
1812A6333181K728893m639533o510869n018923k786022J667541P021926P375223
$$ 16333181 19062074 14422541 7911672 2892749 106727 1774268 8796194 16171417
1804A6171417J424475m364653n167633l253997j495087P61166K441507k42812
$$ 16171417 17595892 13231239 8063606 4809609 3314522 4075688 6517195 6274383
1796F274383n621422n755060J284486O470963L101629k845103k825480J080217
$$ 6274383 652961 -5102099 -3817613 2653350 5754979 2909876 84396 1164613
1788A164613J738396l83146JJ997863Q90263j337493J187657N979831M200998
$$ 1164613 2903009 2519863 2519864 4517727 5407990 4070497 5258154 11237985 15438983
1779A5438983m034739p686412j552249N395999L980432j878722l195038j69358
$$ 15438983 11404244 3717832 2165583 7561582 11542014 9663292 6468254 6298896
1771F298896M66757k058904k154320J475584L333653K01747m051372m634504j701104
$$ 6298896 6765653 4706749 2552429 4028013 7361666 7563413 3512041 -1122463 -2823567
1762b823567J934794M736644N940823M546178J130813j732738k622473k676696
$$ -2823567 -888773 3847871 9788694 14334872 15465685 13732947 11110474 8433778
1754H433778k656983j311154J571370L138621J101500k366098l035809q7983L090424
$$ 8433778 5776795 4465641 6037011 9175632 10277132 7911034 4875225 4787242 7877666
1745G877666L254869P19880j616735j651161l29755n31386l149151m892373j865894
$$ 7877666 11132535 11852415 10235680 8584519 8254764 7723378 4574227 -318146 -2184040
1736b184040M673367Q667632O355990P89362k165432n24020K576560K920235o90261
$$ -2184040 2489327 11156959 17512949 18302311 16136879 15612859 18189419 21109654 20419393
1727B0419393n249374o048153j838419K842284K961373j59483j259886J15648
$$ 20419393 15170019 9121866 7283447 10125731 13087104 12927621 11667735 11783383
1719A1783383p97791m581619m962572Q54649O038860M054582q89597m02250N109837
$$ 11783383 10985592 6403973 1441401 2296050 8334910 12389492 11499895 11097645 16207482
1710A6207482P738889M132741j078519l042113j647471Q37624K079378M12338
$$ 16207482 23946371 28079112 27000593 23958480 22311009 23148633 25228011 25640349
1702B5640349k745397l149905N037J711943p47548k488605N40357L912097K833911
$$ 25640349 22894952 19745047 19750084 21462027 20714479 18225874 18766231 22678328 25512239
1693B5512239J297906M124762O809278L966505N23666K114073K869217k045571
$$ 25512239 26810145 30934907 37744185 41710690 42234356 44348429 47217646 45172075
1685D5172075j913764J1373956K1600956J2180707K028758J8894070L9096400
$$ 45172075 43258311 54632267 76233223 88413930 90442688 109336758 148433158
1678A48433158M452252q3827605j39314057r5837783J2762M9625543K8860422
$$ 148433158 152885410 69057805 -70256252 -166094035 -166081273 -116455730 -87595308
1671h7595308j189050L833599K0576469J6139915J089011l29627P321920P373383
$$ -87595308 -88784358 -84950759 -64374290 -48234375 -47145364 -47474991 -40153071 -32779688
1663c2779688L094385N429741Q271946J276487p353937m066458N509858O567104
$$ -32779688 -29685303 -24255562 -15983616 -14707129 -22061066 -26127524 -20617666 -14050562
1655a4050562L54005q88754L139809K666391k424699l446388m38944j391383n546573
$$ -14050562 -13696557 -14585311 -11445502 -8779111 -11203810 -14650198 -15089142 -16480525 -22027098
1646b2027098m004440L088725N515424O56214k087031K508732P545338O376639
$$ -22027098 -26031538 -22942813 -17427389 -16771175 -18858206 -16349474 -8804136 -2427497
1638b427497K132549J46599j99322j145118j273192O71436K192643J275501k27078
$$ -2427497 -294948 -148349 -347671 -1492789 -2765981 -2094545 98098 1373599 1146521
1629A146521n12711j008210k854253l941350k276746N20480J575573O81175J5289
$$ 1146521 633810 -374400 -3228653 -7170003 -9446749 -8926269 -7350696 -6669521 -6654232
1620f654232J081396K899664K779596o99549m979492n507645j600821K180038
$$ -6654232 -5572836 -2673172 106424 -593125 -5572617 -11080262 -12681083 -10501045
1612a0501045K435531J568417K971106M798915K942646j979113n280864m637779
$$ -10501045 -8065514 -6497097 -3525991 1272924 4215570 2236457 -3044407 -7682186
1604g682186j753617J237595L195263L037863J111550J52719J386163J626472
$$ -7682186 -9435803 -8198208 -5002945 -1965082 -853532 -700813 685350 2311822
1596B311822j766194n390885m187442O22417L418109K563714J140393L26874j635539
$$ 2311822 545628 -4845257 -9032699 -8410282 -4992173 -2428459 -1288066 -961192 -2596731
1587b596731l941644l097874O49389K528609M81900j916384j545888n0770o5682
$$ -2596731 -6538375 -9636249 -8986860 -6458251 -5976351 -7892735 -9438623 -9489393 -9555075
1578i555075j281168k261196k526701j252202K271941N311765L126910l901247
$$ -9555075 -10836243 -13097439 -15624140 -16876342 -14604401 -9292636 -6165726 -10066973
1570a0066973q627076n715760J469125N851919N528632L731380K217080l57026
$$ -10066973 -18694049 -24409809 -22940684 -17088765 -11560133 -7828753 -5611673 -5968699
1562e968699l761787m641291j434088K302661K216459q13431k050168J19673K154276
$$ -5968699 -9730486 -14371777 -15805865 -13503204 -11286745 -12100176 -14150344 -14030671 -11876395
1553a1876395J477783Q64493L472226O532703N046665K14108j910249m2853R29790
$$ -11876395 -10398612 -9534119 -6061893 470810 5517475 5731583 3821334 3778481 4708271
1544D708271m93254P20866O027240P821529N16016r030826j0189081l639616O25296
$$ 4708271 4215017 4935883 10963123 18784652 19300668 10269842 80761 -3558855 -2933559
1535b933559j962009o134349o226797k339592K901079O888600O300866L94665
$$ -2933559 -4895568 -11029917 -17256714 -19596306 -16695227 -9806627 -3505761 -3111096
1527c111096m912182k880421L936885O245858J129665m563555m979238j985031
$$ -3111096 -8023278 -10903699 -6966814 -720956 408709 -4154846 -9134084 -11119115
1519a1119115O97707K694905L551677J093051l240112l646126J564816O277774
$$ -11119115 -10421408 -7726503 -4174826 -3081775 -6321887 -9968013 -8403197 -2125423
1511b125423N249118J350451R6757J572929K038954r4529l439334n616247l954016
$$ -2125423 3123695 4474146 4570903 6143832 8182786 8088257 4648923 -967324 -4921340
1502d921340J735106N742926J671092p021131r015846j100575O083884L658277
$$ -4921340 -3186234 2556692 4227784 -2793347 -11809193 -12909768 -6825884 -3167607
1494c167607k597774k799105J346070J799062n97946J457792O756638O019053
$$ -3167607 -5765381 -8564486 -7218416 -5419354 -6017300 -4559508 2197130 8216183
1486H216183j944099o644176k052496M032633K355381m178130o224887j983287
$$ 8216183 6272084 -372092 -2424588 1608045 3963426 -214704 -6439591 -8422878
1478h422878J931697J226685r14950L35469M603245O746857K933681m333275p905788
$$ -8422878 -6491181 -5264496 -6179446 -5843977 -1240732 5506125 8439806 4106531 -3799257
1469c799257l866387L297670N983072L064484J74153M51443N27042k101690l328297
$$ -3799257 -7665644 -4367974 1615098 4679582 4853735 5305178 5832220 3730530 402233
1460D02233J144590P509973Q105337K397640k419546k015410k41470j934964n529058
$$ 402233 1546823 9056796 17162133 19559773 17140227 15124817 14883347 12948383 7419325
1451G419325o474120m541859l295538l984628m247525k458412L06909K636782
$$ 7419325 945205 -3596654 -6892192 -10876820 -15124345 -17582757 -17275848 -14639066
1443a4639066L777952K425474j519191l788632N48327Q542662J0179158J544328
$$ -14639066 -10861114 -8435640 -9954831 -13743463 -13195136 -4652474 5526684 7071012
1435G071012p933331p104118J904926P377750M375755p38819j911307r69189j327810
$$ 7071012 -862319 -7966437 -6061511 1316239 5691994 4953175 3041868 2072679 744869
1426G44869j716868j80232J536156J811455K384808L685440K020984l735600p606299
$$ 744869 -971999 -1152231 383925 2195380 4580188 8265628 10286612 6551012 -1055287
1417a055287m700673K09453n81406n385556n617295N07082N222058L360295m29179
$$ -1055287 -5755960 -5546507 -6127913 -11513469 -17130764 -16623682 -11401624 -8041329 -8470508
1408h470508K53528M321928O263341M311450J139664j128307k455751k597867
$$ -8470508 -8216980 -3895052 2368289 6679739 7819403 6691096 4235345 1637478
1400A637478r55277J130792P29727k796134n678978l379291L286847P327917L134793
$$ 1637478 682201 1812993 2542720 -253414 -5932392 -9311683 -6024836 1303081 4437874
1391D437874n560835q721057k391813N693778O236794P45250j673300J823329
$$ 4437874 -1122961 -9844018 -12235831 -6542053 -305259 439991 -1233309 590020
1383E90020M208472J41333n592156n303386N65642M987412M533070K430962J863223
$$ 590020 4798492 4939825 -652331 -5955717 -5390075 -402663 4130407 6561369 8424592
1374H424592J545041l70589k177512j519617J51010k28724j887322j330406Q41492
$$ 8424592 9969633 9599044 7421532 5901915 6052925 5824201 3936879 2606473 3447965
1365C447965o14467o576110r085200j812221Q196452P716415l559386j0635428
$$ 3447965 2833498 -3742612 -12827812 -14640033 -6443581 1272834 -2286552 -12921980
1357a2921980l913374O706448O213436l783200q455199j845484O185240N908581
$$ -12921980 -16835354 -10128906 -3915470 -7698670 -16153869 -17999353 -11814113 -5905532
1349e905532k73958n308822p440957p224862k601318N985690J1545912R217374
$$ -5905532 -6179490 -11488312 -18929269 -26154131 -28755449 -22769759 -11223847 -2006473
1341b006473M509760N096729Q173827N044124l844004q630678n365577j505055
$$ -2006473 2503287 7600016 15773843 20817967 16973963 8343285 2977708 1472653
1333A472653k882550m437910J19135O653444O636985O91191k405985R43046M680997
$$ 1472653 -1409897 -5847807 -5728672 924772 7561757 8252948 5846963 6790009 11471006
1324A1471006L141317j042935k201894k04090M06530k296113n114062m424517
$$ 11471006 14612323 13569388 11367494 11163404 11569934 9273821 4159759 -264758
1316b64758p23735K451028K822485J342885P6455m52943p00358m8801K137298
$$ -264758 -988493 1462535 4285020 5627905 5704360 5251417 4551059 4502258 6639556
1307F639556L522360M98222n548551p626723k231654M477448M599810k18720k039782
$$ 6639556 10161916 10660138 5111587 -2515136 -4746790 -269342 4330468 4111748 2071966
1298B071966M59475P15452l365357n000652j92445M706547L073621j465116k007453
$$ 2071966 2531441 3246893 -118464 -5119116 -5311561 -605014 2468607 1003491 -1003962
1289a003962O0470p73689k939212p77107L772799L176292k302404l800683J816344
$$ -1003962 -943492 -1717181 -4656393 -5433500 -1660701 1515591 -786813 -4587496 -2771152
1280b771152O695039M388786j222909l654706k704289q32438K220970N661028
$$ -2771152 3923887 8312673 7089764 3435058 730769 -101669 2119301 7780329
1272G780329M803616j653787o589722l285466M441824P215006K459674l903776
$$ 7780329 12583945 10930158 4340436 1054970 5496794 12711800 15171474 11267698
1264A1267698o064029l696086l54629j43027l941749o643822k090829O823184
$$ 11267698 5203669 1507583 1152954 1009927 -2931822 -9575644 -11666473 -4843289
1256d843289R161141J354633n729818k183453N572661M726732l942725q062832
$$ -4843289 4317852 5672485 -57333 -2240786 3331875 8058607 4115882 -3946950
1248c946950l145743K640332L467492L156437M616279L426677k734510p474062
$$ -3946950 -7092693 -4452361 -984869 2171568 6787847 10214524 7480014 5952
1240E952m902711J291260M016517K567225N95444q94377k637301k867107J32600
$$ 5952 -4896759 -3605499 411018 2978243 3573687 2679310 42009 -2825098 -2692498
1231b692498L453398K658670j746700m968849m250392j399836M93432N57891M40773
$$ -2692498 760900 3419570 1672870 -3295979 -7546371 -8946207 -8452775 -7894884 -7454111
1222g454111K014486M505689M674439J382626j781505j610993p81766l066868
$$ -7454111 -5439625 -933936 3740503 5123129 3341624 1730631 948865 -2118003
1214b118003n073794m55417P849399Q945342J12296p811463o089680k71582L00075
$$ -2118003 -7191797 -7647214 202185 9147527 9259823 1448360 -4641320 -4912902 -4612827
1205d612827k707139j538912L575401N670444L352025J680764J867397k32450
$$ -4612827 -7319966 -8858878 -5283477 386967 3738992 5419756 7287153 7054703
1197G054703m874599o632987l595210m50537l0526Q56556L938714M800828M05873
$$ 7054703 2180104 -4452883 -8048093 -8498630 -8529156 -7672600 -3733886 1066942 1472815
1188A472815m231463k675398K992750M678376n35917o656173o682880r13641L961100
$$ 1472815 -2758648 -5434046 -2441296 2237080 1701163 -4955010 -11637890 -12551531 -8590431
1179h590431K666446k834307n562052j594372N113512P447574L844523l32702
$$ -8590431 -5923985 -8758292 -14320344 -15914716 -10801204 -3353630 490893 158191
1171A58191k53727K559831L245220R1315l907109m758763j380081L336967M799718
$$ 158191 -95536 2464295 5709515 5800830 1893721 -2865042 -4245123 -908156 3891562
1162C891562J374213l041640l200659M81044K275882l36001k606405o3484L826057
$$ 3891562 5265775 2224135 -976524 -495480 1780402 1444401 -1162004 -1225488 2600569
1153B600569K846114j541776j867554L247713O073157J541171m712014n009580
$$ 2600569 5446683 3904907 2037353 5285066 11358223 12899394 8187380 3177800
1145C177800q55523J189411Q34056K785181N868525L164291n438663j0211433
$$ 3177800 2322277 3511688 4345744 7130925 12999450 16163741 10725078 513645
1137E13645n453140J630443K035600j867581k112088J230846J785732o64023L5083
$$ 513645 -4939495 -3309052 -1273452 -3141033 -5253121 -4022275 -2236543 -2900566 -2865483
1128b865483M239656M506149j657523o357142l386690J938332J408466l198698
$$ -2865483 1374173 5880322 4222799 -2134343 -5521033 -3582701 -2174235 -5372933
1120e372933l382899K667095P301077M294867k995687o375419k790921K775772
$$ -5372933 -8755832 -6088737 1212340 5507207 2511520 -3863899 -6654820 -3879048
1112c879048L980792J044545J08707M274681Q406375O117321o10460m219130k889152
$$ -3879048 101744 1146289 1254996 5529677 13936052 20053373 19442913 15223783 12334631
1103A2334631k201336m635549n048506q9538M831744L565673j006239j756540
$$ 12334631 10133295 5497746 449240 359702 5191446 8757119 7750880 5994340
1095E994340J575569K938321K0176k847886k065396L76440Q91855n27936j141234
$$ 5994340 7569909 10508230 10528406 7680520 5615124 5991564 6883419 6355483 5214249
1086E214249K32580J378889n14569m448372n651584j918054K056674P25756l369989
$$ 5214249 5446829 6825718 6311149 1862777 -3788807 -5706861 -3650187 -2924431 -6294420
1077f294420k832409K453201M082454j714317p607870o140772Q3584M524594O168680
$$ -6294420 -9126829 -6673628 -2591174 -4305491 -11913361 -18054133 -17970549 -13445955 -7277275
1068g277275O614701M349037n78777k162636K833946P041224K591996n596117
$$ -7277275 -662574 3686463 3107686 945050 3778996 10820220 13412216 7816099
1060G816099o827600j189426J950154m57228k641984k090061k389446l647583
$$ 7816099 988499 -200927 1749227 1291999 -1349985 -3440046 -5829492 -9477075
1052i477075j454520L237580M120904J129977R95942M061495K417839n090452
$$ -9477075 -10931595 -7694015 -3573111 -2443134 -1447192 2614303 5032142 -58310
1044e8310q188542j416407O156604M984642r81901k874088r68994p46128j661879
$$ -58310 -8246852 -9663259 -3506655 1477987 496086 -2378002 -3346996 -4093124 -5755003
1035e755003J84627K842878J458953k503659l284474l0098L002030L504924K339790
$$ -5755003 -5570376 -2727498 -1268545 -3772204 -7056678 -7086776 -4084746 -579822 1759968
1026A759968n7712k869357l059575K13596K303890k70862l325339j431408K596810
$$ 1759968 1702256 -1167101 -4226676 -4013080 -1709190 -1980052 -5305391 -6736799 -4139989
1017d139989K005455k621752m331440r43203K436270K106209J36351o99507n09689
$$ -4139989 -2134534 -4756286 -9087726 -10030929 -7594659 -5488450 -5352099 -6051606 -6561295
1008f561295J50344J495202K638223K423222J854829J980003Q16068k937908n013857
$$ -6561295 -6410951 -4915749 -2277526 145696 2000525 3980528 4796596 1858688 -3155169
999c155169n47678P006074Q721060K324480m990392o896188m746386k308179M8356
$$ -3155169 -3702847 3303227 12024287 14348767 9358375 2462187 -2284199 -4592378 -4544022
990d544022K744400L671706J451118j247655j145106J033084K181757J485517
$$ -4544022 -1799622 1872084 3323202 2075547 930441 1963525 4145282 5630799
982E630799R85886K110819L405145K201200j597540m234813k431615J196622O09769
$$ 5630799 6616685 8727504 12132649 14333849 12736309 8501496 6069881 7266503 7876272
973G876272m590843p367158l626402R72031n284l071235r23922M431676M387775
$$ 7876272 3285429 -4081729 -7708131 -6736100 -6741384 -9812619 -10736541 -6304865 -1917090
964a917090j748246n316865k422122O88535n94750j614938K372588P325668O865677
$$ -1917090 -3665336 -8982201 -11404323 -10715788 -11310538 -12925476 -10552888 -3227220 3638457
955C638457J706035l234949o294667q053738p110331k524178K625236M858295
$$ 3638457 5344492 2109543 -4185124 -12238862 -19349193 -21873371 -19248135 -14389840
947a4389840M606517L289061J29843m006756m316528J082355O247247N282003
$$ -14389840 -9783323 -6494262 -6364419 -10371175 -14687703 -13605348 -7358101 -2076098
939b076098J156170J09511J037724j557718o449251o403898J24886O203828O620932
$$ -2076098 -919928 -810417 227307 -1330411 -7779662 -14183560 -14058674 -7854846 -1233914
930a233914L879365K133236J373053J73069q89201j220800j700839k260875j546174
$$ -1233914 2645451 4778687 6151740 6324809 5435608 4214808 2513969 253094 -1293080
921a293080j55751k44897r50189J095299N192266N624604j28144o769118p922845
$$ -1293080 -1448831 -1693728 -2643917 -1548618 3643648 9268252 9140108 2370990 -5551855
912e551855l740099J203489L892132L529848o5881m742558n663312r54236M425609
$$ -5551855 -9291954 -8088465 -4196333 -666485 -732366 -5474924 -11138236 -12092472 -7666863
903g666863M493656J57112k673227j433165Q21651Q18511j198802l246428l966328
$$ -7666863 -3173207 -3016095 -5689322 -7122487 -6300836 -5482325 -6681127 -9927555 -13893883
894a3893883k840842k76404K353884M055168M845684M141277P17310l995343n583916
$$ -13893883 -16734725 -17011129 -14657245 -10602077 -5756393 -1615116 -897806 -4893149 -10477065
885a0477065k538772O29243j2716j357588J459019O263561O980684L693989J915182
$$ -10477065 -13015837 -12386594 -12399310 -13756898 -12297879 -6034318 946366 4640355 6555537
876F555537K461715O35203l584053l826514J103891L211315j784849n997315j375291
$$ 6555537 9017252 9652455 6068402 2241888 3345779 6557094 4772245 -1225070 -2600361
867b600361O740283P387496P34019l129185j45954L053559R41331l467441n237403
$$ -2600361 4139922 11527418 12261437 9132252 8986298 12039857 12981188 9513747 4276344
858D276344m296496k570779n0552L079165M609031L275584M48874k379179m344939
$$ 4276344 -20152 -2590931 -2641483 437682 5046713 8322297 8771171 6391992 2047053
849B047053l251563K182442P381034N298215l031393p501560k198703N923933
$$ 2047053 -1204510 977932 8358966 13657181 10625788 3124228 925525 6849458
841F849458O578382j70449n615917m817179j068580R20958P01167L80039J109762
$$ 6849458 13427840 13257391 7641474 2824295 1755715 2676673 3377840 3757879 4867641
832D867641K198231J738568j689845o486332q443423n487543m03848L050281M546875
$$ 4867641 7065872 8804440 7114595 628263 -7815160 -13302703 -13706551 -10656270 -6109395
823f109395N287526M389677Q49594k844185l251739j097619P2337n10489o49866
$$ -6109395 -821869 3567808 4417402 1573217 -1678522 -2776141 -2703804 -3214293 -3864159
814c864159p022o35115k473559k753019r29860p0828j569214k218357Q65412N284644
$$ -3864159 -3871181 -4506296 -6979855 -9732874 -10662734 -10733562 -12302776 -14521133 -13655721 -8371077
804h371077O453518L868168J016451j71134j265194l121402l171837L59081L607631
$$ -8371077 -1917559 1950609 2967060 2795926 1530732 -1590670 -4762507 -4403426 -795795
795g95795Q30475o575842r598709l164315N898333P553952K292748r12666P92544
$$ -795795 34680 -6541162 -16139871 -19304186 -13405853 -5851901 -3559153 -4471819 -3679275
786c679275O22941m717137p879720k682349M680869M489051j702849m374614j098602
$$ -3679275 -3056334 -7773471 -15653191 -18335540 -13654671 -9165620 -10868469 -15243083 -16341685
777a6341685J470918j29679j489602O72721L246328L219786K360429K155478L90238
$$ -16341685 -14870767 -15000446 -16490048 -15817327 -12570999 -9351213 -6990784 -4835306 -4445068
768d445068l305378m048504J250566P402208O701518q78397p604128p174543q00202
$$ -4445068 -7750446 -11798950 -10548384 -3146176 3555342 2676945 -4927183 -12101726 -12901928
759a2901928N377177O521980K838088j492375k823190j321312P58427K684151
$$ -12901928 -7524751 -1002771 1835317 342942 -2480248 -3801560 -3043133 -358982
751c58982M863115N894300L477188j507451m999418m566872j768626M57042L14386
$$ -358982 4504133 10398433 13875621 12368170 7368752 2801880 1033254 1490296 1804682
742A804682k476191n821163n552289l20582M708933L758700o57621o65091M861016
$$ 1804682 -671509 -6492672 -12044961 -12365543 -7656610 -3897910 -4555531 -5220622 -359606
733c59606Q014511L738435k835095m672907k599155j875496l457250m015317k027792
$$ -359606 7654905 11393340 8558245 3885338 1286183 -589313 -4046563 -8061880 -10089672
724a0089672P63781K395359J925909o56426l387526l391220r41019L90980n20404
$$ -10089672 -9325891 -6930532 -5004623 -5661049 -9048575 -12439795 -13380814 -12989834 -13510238
715a3510238j76779L482019O810138N552793Q02055l379601n046644m141299q44237
$$ -13510238 -13687017 -10204998 -3394860 2157933 2959988 -419613 -5466257 -9607556 -10451793
706a0451793K688403K811870r2378q37402K350672L950763J12806l907919j562094
$$ -10451793 -7763390 -4951520 -5043898 -5881300 -3530628 420135 532941 -3374978 -4937072
697d937072M317996N949904K334964j065359j957822k645326l190094j005835
$$ -4937072 -619076 5330828 7665792 6600433 4642611 1997285 -1192809 -2198644
689b198644K830431L922955J677667p7030P5401m65762k680669m183412l597743
$$ -2198644 631787 4554742 6232409 6155379 6230780 5765018 3084349 -1099063 -4696806
680d696806j879688N09429L037907K901768j055639l785477j15011N899858N526263
$$ -4696806 -6576494 -6067065 -3029158 -127390 -1183029 -4968506 -5083517 816341 6342604
671F342604j224333n339264k566511J631615K637464K794312L712006J719107
$$ 6342604 5118271 -220993 -2787504 -1155889 1481575 4275887 7987893 9707000
663I707000l990894o829684k507488L443178M011465O69854j284450j796815l419260
$$ 9707000 5716106 -1113578 -3621066 -177888 3833577 4503431 3218981 1422166 -1997094
654a997094m126256m10633N142226O367086K178901k839340n027239m027887m55504
$$ -1997094 -6123350 -6533983 -1391757 4975329 7154230 4314890 -712349 -4740236 -5195740
645e195740M038984O057926M142895J365041N44590k37093l158393n340004l493541
$$ -5195740 -1156756 4901170 9044065 10409106 10953696 10716603 7558210 2218206 -1275335
636a275335n21670j035013l057208j384137K837124L770813J138609N42673L304027
$$ -1275335 -1797005 -2832018 -5889226 -7273363 -4436239 -665426 473183 1015856 4319883
627D319883M244686J106282j685092j113566j04537q73122p30905J629728K282429
$$ 4319883 8564569 9670851 7985759 6872193 6767656 5894534 5163629 6793357 9075786
618I075786q44897l134347r46070J552420l08092k603292R67920P150177O542229
$$ 9075786 8230889 5096542 4150472 5702892 5394800 2791508 3759428 10909605 17451834
609A7451834j883752q607296p301391k676482j431646k394165p15449L087046
$$ 17451834 15568082 6960786 -340605 -3017087 -4448733 -6842898 -7558347 -4471301
601d471301M290521J694242j295555k414375k710924k995362k188278j152J942707
$$ -4471301 -180780 1513462 217907 -2196468 -4907392 -7902754 -10091032 -10092184 -8149477
592h149477K688622L052626L235807J983894n61885j745491r9390J889491J095126
$$ -8149477 -5460855 -2408229 827578 2811472 2249587 504096 404706 2294197 3389323
583C389323j631699k773011j223502O35830P82117k4441o6267J042245K373700
$$ 3389323 1757624 -1015387 -2238889 -1603059 -820942 -845383 -911650 130595 2504295
574B504295K466142L3066m252784o707555l918167K204437N364467K483306k031035
$$ 2504295 4970437 5003503 750719 -5956836 -9875003 -7670566 -2306099 177207 -1853828
565a853828j968233K556420N706204L877890k58839k276209j757402j729561l691271
$$ -1853828 -3822061 -1265641 4440563 8318453 8059614 5783405 4026003 2296442 -1394829
556a394829n298155l335682J953566O348915N823790J080125k852453k099723
$$ -1394829 -6692984 -10028666 -8075100 -1726185 4097605 5177730 2325277 225554
548B25554J616449L097581j7371m536189n830305l208084K24470K074699K743978
$$ 225554 1842003 4939584 4922213 386024 -5444281 -8652365 -8427895 -6353196 -3609218
539c609218K890782J571654j317504k929773q45888K481389K346000j115900k629688
$$ -3609218 -718436 853218 -464286 -3394059 -4239947 -1758558 587442 -528458 -3158146
530c158146J21033K616568P43344k260034r86671K875486K696302k511718o150015
$$ -3158146 -3037113 -420545 322799 -1937235 -2923906 -48420 2647882 136164 -6013851
521f013851l797855R28635K692720J567770M98264k02353j616223k324274j81133
$$ -6013851 -9811706 -8883071 -6190351 -4622581 -4124317 -4326670 -5942893 -8267167 -8448300
512h448300L401250M712281K631965o09238k791047l229803j836901O25603J904251
$$ -8448300 -5047050 -334769 2297196 1687958 -1103089 -4332892 -6169793 -5544190 -3639939
503c639939L79720k484741l837262k927418r30111J617253M571621O169117M377966
$$ -3639939 -3260219 -5744960 -9582222 -12509640 -13439751 -11822498 -7250877 -1081760 3296206
494C296206M21671j755573k11676K790346L899819K429889M19078n8100O77724
$$ 3296206 3717877 1962304 1750628 4540974 8440793 10870682 11289760 11231660 11909384
485A1909384j7317l774243p808981p164056j649314K440025L83601m001542l721445
$$ 11909384 11892067 8117824 308843 -6855213 -8504527 -6064502 -5680901 -9682443 -13403888
476a3403888J136780L996320J970882o57163j85834J235644P43410L5373J640449
$$ -13403888 -12267108 -8270788 -6299906 -6957069 -7142903 -5907259 -5163849 -5128476 -3488027
467c488027L706942K864057j53749j836633j189432M3307J069865K183453K127523
$$ -3488027 218915 3082972 2929223 1092590 -96842 -53535 1016330 3199783 5327306
458E327306p15672m553246n183356j417041L248979M967288L241003J7016k473611
$$ 5327306 4611634 58388 -5124968 -6542009 -3293030 1674258 4915261 4932277 2458666
449B458666k572913l59517J481539L19749k433922k718117J51597K141414O40738
$$ 2458666 -114247 -473764 1007775 1327524 -1106398 -3824515 -3672918 -1531504 -890766
440h90766j599555j255973J80098l27797j256673J217183N822808O633233J778301
$$ -890766 -2490321 -3746294 -3566196 -3893993 -5150666 -3933483 1889325 8522558 10300859
431A0300859l396588m058450k260477k318571l660884k842967k27704O32774n17839
$$ 10300859 6904271 2845821 585344 -1733227 -5394111 -8237078 -8464782 -7832008 -8349847
422h349847p7654K815000M066952J066509k797852l141496j039383o95641k495745
$$ -8349847 -8427501 -5612501 -1545549 -479040 -3276892 -6418388 -7457771 -8153412 -10649157
413a0649157k586839Q47253M695215N354991L261415J352447R09953Q58449K31182
$$ -10649157 -13235996 -12388743 -7693528 -2338537 922878 2275325 3185278 4043727 4274909
404D274909n83606r55853r01173n49152J62906P45924R1538j912240l352128k201229
$$ 4274909 3691303 2735450 1834277 1285125 1448031 2193955 2285493 373253 -2978875 -5180104
394e180104Q27398K719185J782256n40797k089078k617156k811949k295051o28546
$$ -5180104 -4352706 -1633521 148735 -392062 -2481140 -5098296 -7910245 -10205296 -10833842
385a0833842Q17165N37439j26765J398544M225529M222282J47728l552777k483129
$$ -10833842 -10016677 -9479238 -9606003 -8207459 -3981930 240352 388080 -3164697 -5647826
376e647826J458191K747499O1387k095970o2770L730811M101738P4667l945814
$$ -5647826 -4189635 -1442136 -1380749 -3476719 -3539489 191322 4293060 4367727 421913
367D21913l893077p62452J499835J266839K91316P4747j50836j138499j854750
$$ 421913 -3471164 -4233616 -2733781 -1466942 -1175626 -1100879 -1251715 -2390214 -4244964
358d244964j513196j184691j421564m34102K781459N514853M821771K269059J360478
$$ -4244964 -5758160 -6942851 -8364415 -8798517 -6017058 -502205 4319566 6588625 7949103
349G949103J579687l65626l997071n025479k333974K07008J34414m65564Q3583
$$ 7949103 9528790 9163164 5166093 140614 -2193360 -1986352 -1851938 -2317502 -2233919
340b233919J16006r35199k57087L001296M822922K436461r85069j622855p37719
$$ -2233919 -2117913 -3053112 -3310199 -308903 4514019 6950480 5965411 4342556 3604837
331C604837q43451n52549J684212K848742K67944k426102q64403J760496l97832
$$ 3604837 2761386 2208837 3893049 6741791 7009735 4583633 3719230 5479726 5081894
322E081894m950150m053941K416583N617249J343009l554632j914674L539854
$$ 5081894 131744 -3922197 -1505614 4111635 5454644 1900012 -14662 3525192
314C525192N460263K193389k141831m414735m548712k907636J15840K636877K584741
$$ 3525192 8985455 11178844 9037013 4622278 73566 -2834070 -2718230 -81353 2503388
305B503388N41169n94439R84161L720855M100610O06265l743102m201822k99114
$$ 2503388 3044557 2450118 3434279 7155134 11255744 11862009 8118907 3917085 3617971
296C617971L185842K699399M05651k98634j69116r76644o77426K481195M098140
$$ 3617971 6803813 9503212 9908863 9610229 9441113 8464469 7787043 10268238 14366378
287A4366378p29208p680276p653018p69148L101376o53304m979586l040826K078589
$$ 14366378 13637170 5956894 -1696124 -2465272 636104 -17200 -4996786 -8037612 -5959023
278e959023M294994L543249K242367n14085m826554n807665n48059N252894M628342
$$ -5959023 -1664029 1879220 4121587 3607502 -1219052 -7026717 -7574776 -2321882 2306460
269B306460l93842k807677j580616j122002k168384j062583K581947M608230L003602
$$ 2306460 1912618 -895059 -2475675 -3597677 -5766061 -6828644 -4246697 361533 3365135
260C365135M0477k369679m089088l722595J48256M495646M342412M57575j074100
$$ 3365135 3405612 1035933 -3053155 -6775750 -6627494 -2131848 2210564 2668139 1594039
251A594039J853155M254627K312073q43882r46899M93319n31201l530721m603315
$$ 1594039 3447194 7701821 10013894 9170012 8223113 8716432 8185231 4654510 51195
242E1195k985543j900703k862987l167059m86217K967680L342279P09054j128471
$$ 51195 -2934348 -4835051 -7698038 -10865097 -11351314 -8383634 -5041355 -4332301 -5460772
233e460772j88753J327369J229170Q45605J975404K981379J543456n82237o4606
$$ -5460772 -5649525 -4322156 -3092986 -2247381 -271977 2709402 4252858 3670621 3606015
224C606015J838153Q77098k622029l688855j067913O34482r19746k077943n94651
$$ 3606015 5444168 6321266 3699237 10382 -1057531 -423049 -1342795 -3420738 -4015389
215d015389R2149j663361r20149M972207R009051M084423m783425o837990j324863
$$ -4015389 -3923240 -5586601 -6506750 -1534543 7474508 11558931 6775506 -62484 -1387347
206a387347K531649R2902l524140l422306j380378k58215O88022K107577K141941
$$ -1387347 1144302 1237204 -2286936 -5709242 -7089620 -7347835 -6659813 -4552236 -2410295
197b410295M74849j64236J085673J325398r10722k789789j673828J186967L269710
$$ -2410295 -1935446 -2099682 -1014009 311389 -599333 -3389122 -5062950 -3875983 -606273
188f06273L781947K760466M67368j373738j017103J86368l85789j814006r33978
$$ -606273 3175674 5936140 6403508 5029770 4012667 4199035 3813246 1999240 1065262
179A065262J705137K246241J52678j092782o00738j407394l880197m091716r89516
$$ 1065262 2770399 5016640 5169318 4076536 3475798 2068404 -1811793 -5903509 -6893025
170f893025R95563n42368j760501N62235L391688K855496N77000J79893J357272
$$ -6893025 -5897462 -6439830 -8200331 -7638096 -4246408 -1390912 -813912 -634019 723253
161G23253J639571P96448k05642j509189k511751j200698J683345J794662k172889
$$ 723253 2362824 3159272 2953630 1444441 -1067310 -2268008 -584663 1209999 -962890
152i62890n082298k352618L426354O564692N226775R73483m232480o885433k912916
$$ -962890 -6045188 -8397806 -4971452 1593240 6820015 7793498 3561018 -3324415 -6237331
143f237331N481047R010939K927037n334529o292401j475340R02338r28436k011121
$$ -6237331 -756284 8254655 11181692 5847163 -445238 -1920578 -1018240 -1946676 -3957797
134c957797p40676k90409j115133l49619J666454J887216J217719L063438N549515
$$ -3957797 -4698473 -4988882 -6104015 -6453634 -4787180 -2899964 -1682245 1381193 6930708
125F930708L325821k517364m787269j649176P34387r74379k412659n28013R58336
$$ 6930708 10256529 7739165 2951896 1302720 2037107 1062728 -1349931 -1877944 -919608
116i19608o73651j806744q9853P1424m052765o362359j029293O440324O129326
$$ -919608 -1593259 -3400003 -3489856 -3418432 -7471197 -13833556 -14862849 -8422525 -2293199
107b293199j276729n415546j442394M112580L995469l10690k692988j032516J786549
$$ -2293199 -3569928 -8985474 -10427868 -6315288 -2319819 -2630509 -5323497 -6356013 -4569464
98d569464K810083J961765R28751P50578N88588j028953l580060m472441k605914
$$ -4569464 -1759381 202384 1131135 1881713 2470301 1441348 -2138712 -6611153 -9217067
89i217067k64392L17548L59075J946260L832744L200276M27380j628121k355169
$$ -9217067 -9481459 -9163911 -8804836 -6858576 -3025832 174444 601824 -1026297 -3381466
80c381466l267098l493492l32344M782682O050394J525881k988093j863713K357158
$$ -3381466 -6648564 -10142056 -10474400 -5691718 358676 1884557 -1103536 -2967249 -610091
71f10091L437091R36628m08204P30701O96982j714302k552939K17553K464250
$$ -610091 2827000 3763628 3355424 4086125 4783107 3068805 515866 733419 3197669
62C197669M62162k762620k501361l24733j078410l982833l535775Q14240K900068
$$ 3197669 3659831 897211 -1604150 -1928883 -3007293 -6990126 -10525901 -9711661 -6811593
53f811593l14791l536594j505045K736609K992457m37626k086151k09325J610927
$$ -6811593 -7126384 -10662978 -12168023 -9431414 -6438957 -6876583 -8962734 -9172059 -7561132
44g561132J242930Q00858J862613K640767J549265j18769q33393j092508j368224
$$ -7561132 -6318202 -5517344 -3654731 -1013964 535301 416532 -416861 -1509369 -2877593
35b877593o08810J343975K346622J029665p93657q66479J78600L63421l55388
$$ -2877593 -3486403 -2142428 204194 1233859 440202 -426277 -247677 115744 -239644
26b39644o73917n87205j029299j651593j312068l13044J35715L70303J644674
$$ -239644 -913561 -1500766 -2530065 -4181658 -5493726 -5806770 -5671055 -5300752 -3656078
17c656078K926889J272347l330258o163243l361216K275461M200796N64698l550579
$$ -3656078 -729189 543158 -2787100 -8950343 -12311559 -10036098 -5835302 -5270604 -8821183
8h821183l210946L08118K733573L196558L752187M250242K445925q29174
$$ -8821183 -12032129 -11724011 -8990438 -5793880 -2041693 2208549 4654474 3825300
0C825300
$$ 3825300
##END NTUPLES=NMR SPECTRUM
##END=
