##TITLE=31Pdec_LR-675-C1-C2
 CDCl3, 24 sc
 31.5.2019
##JCAMPDX= 6.0         $$ Bruker NMR JCAMP-DX V2.0
##DATA TYPE= NMR SPECTRUM
##DATA CLASS= NTUPLES
##ORIGIN= UXNMR, Bruker Analytische Messtechnik GmbH
##OWNER= root
$$ XWIN-NMR		Version 3.5
$$ Fri May 31 16:35:07 2019 Russian Standard Time (UT+4h)  she@DPX200
##.OBSERVE FREQUENCY= 81.013821
##.OBSERVE NUCLEUS= ^31P
##.ACQUISITION MODE= SIMULTANEOUS
##.ACQUISITION SCHEME= undefined
##.AVERAGES= 24
##.DIGITISER RES= 17
##SPECTROMETER/DATA SYSTEM= spect
##.PULSE SEQUENCE= zgpg30
##.SOLVENT NAME= CDCl3
##.SHIFT REFERENCE= (INTERNAL, CDCl3, 0, 182.463)
##AUDIT TRAIL= $$ (NUMBER, WHEN, WHO, WHERE, WHAT)
$$ ##TITLE= Audit trail, XWIN-NMR		Version 3.5
$$ ##JCAMPDX= 5.01
$$ ##ORIGIN= Bruker BioSpin GmbH
$$ ##OWNER= she
$$ F:/spectra/data/she/nmr/P31/1/pdata/1/auditp.txt
$$ ##AUDIT TRAIL=  $$ (NUMBER, WHEN, WHO, WHERE, WHAT)
(   1,<2019-05-31 16:34:04.09 +0400>,<she>,<DPX200>,
      <created by zg, POWCHK disabled, PULCHK disabled
       configuration hash MD5:
       00 E9 B6 7A A2 85 ED C7 34 08 36 98 17 FE 4E 26
       data hash MD5: 32K
       AB 36 6D 7F 78 DD 75 1B 10 52 59 86 4E D6 1A 13>)
(   2,<2019-05-31 16:34:06.73 +0400>,<she>,<DPX200>,
      <Start of raw data processing
       efp BC_mod = 2 LB = 1 FT_mod = 6 PKNL = 1 PHC0 = -2214.215 PHC1 = 170.5991 SI = 64K 
       data hash MD5: 64K
       40 F1 97 7C CA 9C C5 12 63 F2 72 0F 5D 63 52 A2>)
(   3,<2019-05-31 16:34:21.01 +0400>,<she>,<DPX200>,
      <pk PHC0 = -8.150195 PHC1 = 24 
       data hash MD5: 64K
       D0 95 EA 4D AD 53 8A CB 1F 88 D2 6A 59 C7 79 2D>)
(   4,<2019-05-31 16:34:24.07 +0400>,<she>,<DPX200>,
      <abs ABSG = 5 
       data hash MD5: 64K
       94 6D 7B 31 69 38 B7 8E 59 39 D5 72 15 F4 49 6E>)
(   5,<2019-05-31 16:34:42.48 +0400>,<she>,<DPX200>,
      <abs ABSG = 5 
       data hash MD5: 64K
       71 70 74 24 65 3B 76 90 C4 73 29 B4 1F A0 9F 86>)
$$ ##END=
$$ 
$$ hash MD5
$$ 33 17 BD 30 21 5C 9D B8 C7 56 F3 32 6B AE FD B2
##$RELAX= 
##$RELAX= 
##$RELAX= 
##$RELAX= 
##$RELAX= 
##$RELAX= 
##$RELAX= 
##$RELAX= 
$$ Bruker specific parameters
$$ --------------------------
##$DU= <F:/spectra>
##$EXPNO= 1
##$NAME= <P31>
##$PROCNO= 1
##$TYPE= <nmr>
##$USER= <she>
##$AMP= (0..31)
100 100 100 100 100 100 100 100 100 100 100 100 100 100 100 100 100 100 
100 100 100 100 100 100 100 100 100 100 100 100 100 100 
##$AQSEQ= 0
##$AQ_mod= 1
##$AUNM= <au_zg>
##$AUTOPOS= <>
##$BF1= 81.014009
##$BF2= 200.13
##$BF3= 200.13
##$BF4= 200.13
##$BF5= 200.13
##$BF6= 200.13
##$BF7= 200.13
##$BF8= 200.13
##$BYTORDA= 1
##$CFDGTYP= 0
##$CFRGTYP= 5
##$CHEMSTR= <none>
##$CNST= (0..31)
1 1 145 1 1 1 1 1 1 1 1 1 1 1 1 1 1 1 1 1 1 1 1 1 1 1 1 1 1 1 1 1 
##$CPDPRG= <waltz16>
##$CPDPRG1= <>
##$CPDPRG2= <waltz16>
##$CPDPRG3= <>
##$CPDPRG4= <mlev>
##$CPDPRG5= <mlev>
##$CPDPRG6= <mlev>
##$CPDPRG7= <mlev>
##$CPDPRG8= <mlev>
##$CPDPRGB= <>
##$CPDPRGT= <>
##$D= (0..31)
0 1 0 0 0 0 0 0 0 0 0 0.03 2e-05 3e-06 0 0 0 0 0 0 0 0 0 0 0 0 0 0 0 0 
0 0 
$$ [...]
##$SUBNAM3= <"">
##$SUBNAM4= <"">
##$SUBNAM5= <"">
##$SUBNAM6= <"">
##$SUBNAM7= <"">
##$SUBNAM8= <"">
##$SUBNAM9= <"">
##$SW= 369.568048894756
##$SWIBOX= (0..15)
0 1 3 0 0 0 0 0 0 0 0 0 0 0 0 0 
##$SW_h= 29940.119760479
##$TD= 32768
##$TD0= 1
##$TE= 0
##$TE2= 300
##$TE3= 300
##$TEG= 300
##$TL= (0..7)
0 120 53 12 22 120 120 120 
##$TP= (0..7)
150 150 150 150 150 150 150 150 
##$TP07= 0
##$TPNAME0= <>
##$TPNAME1= <>
##$TPNAME2= <>
##$TPNAME3= <>
##$TPNAME4= <>
##$TPNAME5= <>
##$TPNAME6= <>
##$TPNAME7= <>
##$TPOAL= (0..7)
0.5 0.5 0.5 0.5 0.5 0.5 0.5 0.5 
##$TPOFFS= (0..7)
0 0 0 0 0 0 0 0 
##$TUNHIN= 0
##$TUNHOUT= 0
##$TUNXOUT= 0
##$USERA1= <user>
##$USERA2= <user>
##$USERA3= <user>
##$USERA4= <user>
##$USERA5= <user>
##$V9= 5
##$VALIST= <valist>
##$VCLIST= <CCCCCCCCCCCCCCC>
##$VD= 0
##$VDLIST= <DDDDDDDDDDDDDDD>
##$VPLIST= <PPPPPPPPPPPPPPP>
##$VTLIST= <TTTTTTTTTTTTTTT>
##$WBST= 1024
##$WBSW= 4
##$XGAIN= (0..3)
0 0 0 0 
##$XL= 0
##$YL= 0
##$YMAX_a= 94307
##$YMIN_a= -109227
##$ZGOPTNS= <>
##$ZL1= 120
##$ZL2= 120
##$ZL3= 120
##$ZL4= 120
##$ABSF1= 182.463
##$ABSF2= -187.1042
##$ABSG= 5
##$ABSL= 3
##$ALPHA= 0
##$AQORDER= 0
##$ASSFAC= 0
##$ASSFACI= 0
##$ASSFACX= 0
##$ASSWID= 0
##$AUNMP= <proc_1d>
##$AZFE= 0.1
##$AZFW= 0.5
##$BCFW= 0
##$BC_mod= 2
##$BYTORDP= 0
##$COROFFS= 0
##$CY= -3
##$DATMOD= 1
##$DC= 0
##$DFILT= <>
##$DTYPP= 0
##$F1P= 0
##$F2P= 0
##$FCOR= 1
##$FTSIZE= 65536
##$FT_mod= 6
##$GAMMA= 0
##$GB= 0
##$INTBC= 1
##$INTSCL= 5.30512e-09
##$ISEN= 30
##$LB= 1
##$LEV0= 0
##$LPBIN= 0
##$MAXI= 10000
##$MC2= 0
##$MEAN= 0
##$ME_mod= 0
##$MI= 50
##$NCOEF= 0
##$NC_proc= -3
##$NLEV= 6
##$NOISF1= 182.463
##$NOISF2= 159.3651
##$NSP= 0
##$NTH_PI= 0
##$NZP= 0
##$OFFSET= 182.463
##$PC= 4
##$PHC0= -2222.365
##$PHC1= 194.5991
##$PH_mod= 1
##$PKNL= yes
##$PPARMOD= 0
##$PSCAL= 0
##$PSIGN= 0
##$REVERSE= no
##$SF= 81.0140089999434
##$SI= 65536
##$SIGF1= 159.3651
##$SIGF2= -187.1042
##$SINO= 113.3802
##$SIOLD= 16384
##$SREGLST= <1H.CDCl3>
##$SSB= 0
##$STSI= 65536
##$STSR= 0
##$SW_p= 29940.119760479
##$SYMM= 0
##$S_DEV= 0
##$TDeff= 32768
##$TDoff= 0
##$TI= <>
##$TILT= no
##$TM1= 0
##$TM2= 0
##$TOPLEV= 0
##$USERP1= <user>
##$USERP2= <user>
##$USERP3= <user>
##$USERP4= <user>
##$USERP5= <user>
##$WDW= 1
##$XDIM= 65536
##$YMAX_p= 385293700
##$YMIN_p= -2461601
$$ End of Bruker specific parameters
$$ ---------------------------------
##NTUPLES= NMR SPECTRUM
##VAR_NAME=  FREQUENCY,     SPECTRUM/REAL,   SPECTRUM/IMAG
##SYMBOL=    X,             R,               I
##VAR_TYPE=  INDEPENDENT,   DEPENDENT,       DEPENDENT
##VAR_FORM=  AFFN,          ASDF,            ASDF
##VAR_DIM=   65536,         65536,           65536
##UNITS=     HZ,            ARBITRARY UNITS, ARBITRARY UNITS
##FACTOR=    0.456856943014862, 1,           1
##FIRST=     14782.0589164792, 0,            0
##LAST=      -15158.0608439998, 0,           0
##MIN=       -15158.0608439998, -2461601,    0
##MAX=       14782.0589164792, 385293700,    0
$$ Real data points
##PAGE= N=1
##DATA TABLE= (X++(R..R)), XYDATA
$$ [...]
$$ plain form
42632 -27340 233646 449254 492322 419952 346128 281136 181172 98692 158208 367659 554508
42621 554508 551060 394305 273647 289403 329538 223825 -18943 -202793 -187047 -57112
42611 -57112 10015 -16915 -32614 -8565 -44714 -174501 -266479 -210392 -87470 -42619 -74839
42600 -74839 -82091 -46971 -32105 -29023 31764 121485 115806 -10066 -119951 -102703 -12147 35432
42588 35432 6761 -71038 -191104 -339700 -443894 -428783 -304683 -149472 -36356 -14841
42578 -14841 -108322 -270517 -388092 -395781 -359328 -375293 -416389 -365777 -207240 -87800 -145051
42567 -145051 -333711 -487174 -521232 -505951 -533330 -586681 -589094 -537369 -511835 -550706 -585449
42556 -585449 -536583 -422983 -325251 -271849 -218049 -124302 -50 132181 267392 395692
$$ packed form
42632b7340K60986K15608M3068p2370p3824o4992r9964q2480N9516K09451J86849
42621E54508l448j56755j20658J5756M0135j05713k42768j83850J5746J29935
42611e7112O7127k6930j5699K4049l6149j29787r1978N6087J22922M4851l2220
42600g4839p252L5120J4866L082O0787Q9721n679j25872j09885J7248R0556M7579
42588C5432k8671p7799j20066j48596j04194J5111J24100J55211J13116K1515
42578a4841r3481j62195j17575p689L6453j5965m1096N0612J58537J19440n7251
42567a45051j88660j53463l4058J5281k7379n3351k413N1725K5534l8871l4743
42556e85449M8866J13600R7732N3402N3800R3747J24252J32231J35211J28300
$$ plain form
42546 395692 478812 469783 355156 182505 43842 3132 27903 26489 -31524 -79964 -67720
42535 -67720 -43069 -73592 -139997 -179642 -184262 -172346 -114068 12719 126122 117980 16800
42524 16800 -44935 -28373 -32077 -119511 -224250 -270124 -280472 -311453 -356095 -364031 -297649 -147091
42512 -147091 44312 169272 161816 109300 142637 215452 145244 -94847 -294080 -281208 -122883
42501 -122883 36506 161578 239269 180510 -29899 -224442 -263670 -231327 -247807 -235491 -99031
42490 -99031 -9981 -205438 -542494 -575070 -135508 428989 701702 653442 532083 491000
42480 491000 491134 451716 346809 210013 132866 196546 349777 439330 407214 348567 324558
42469 324558 258704 104338 -32842 -68889 -108369 -268783 -428492 -345348 -3116 334330
$$ packed form
42546C95692Q3120r029j14627j72651j38663m0710K4771j414n8013m8440J2244
42535f7720K4651l0523o6405l9645m620J1916N8278J26787J13403q142j01180
42524A6800o1735J6562l704q7434j04739m5874j0348l0981m4642p936O6382J50558
42512a47091J91403J24960p456n2516L3337P2815p0208k40091j99233J2872J58325
42501a22883J59389J25072P7691n8759k10409j94543l9228L2343j6480J2316J36460
42490i9031Q9050j95457l37056l2576M39562N64497K72713m8260j21359m1083
42480D91000J34l9418j04907j36796p7147O3680J53231Q9553l2116n8647k4009
42469C24558o5854j54366j37180l6047l9480j60414j59709Q3144L42232L37446
$$ plain form
42459 334330 431729 309192 136391 23004 -35906 -88958 -153972 -179990 -85111 118386 265039
42448 265039 194763 -33955 -193706 -168385 -73473 -54192 -81846 -43646 54426 105764 89695
42437 89695 104777 197694 272697 221718 61001 -115654 -239406 -255941 -107825 151774 296672
42426 296672 149825 -141530 -238985 -63210 86233 -35924 -267793 -306649 -166492 -108327
42416 -108327 -198075 -237344 -145304 -103233 -213973 -287789 -145755 71342 114658 3854 -41005
42405 -41005 40830 93908 20532 -106747 -221387 -355839 -506488 -566895 -471537 -291406 -124459
42394 -124459 5359 81832 41627 -121288 -276389 -289678 -200135 -168062 -257970 -359296 -341018
42383 -341018 -213777 -87234 -3223 112235 307349 477880 458351 230335 -38926 -185292
$$ packed form
42459C34330R7399j22537j72801j13387n8910n3052o5014k6018R4879K03497J46653
42448B65039p0276k28718j59751K5321R4912J9281k7654L8200R8072N1338j6069
42437H9695J5082R2917P5003n0979j60717j76655j23752j6535J48116K59599J44898
42426B96672j46847k91355r7455J75775J49443j22157k31869l8856J40157N8165
42416a08327q9748l9269R2040M2071j10740p3816J42034K17097M3316j10804m4859
42405d1005Q1835N3078p3376j27279j14640j34452j50649o0407R5358J80131J66947
42394a24459J29818P6473m0205j62915j55101j3289Q9543L2073q9908j01326J8278
42383c41018J27241J26543Q4011J15458J95114J70531j9529k28016k69261j46366
$$ plain form
42373 -185292 -199579 -157487 -88696 6300 78648 74666 23582 -12457 -45508 -116745 -171704 -107623
42361 -107623 52468 166661 187156 233600 386726 528230 492046 297324 114792 41782
42351 41782 23696 -13053 -63484 -108640 -184374 -315555 -426667 -403088 -253640 -145337 -222979
42340 -222979 -424620 -542544 -460094 -250494 -34057 151123 280907 275954 131800 24761
42330 24761 106097 234435 130161 -188276 -364998 -201442 43256 32119 -157363 -183941
42320 -183941 16890 152195 44268 -114231 -99147 -9193 -78540 -277204 -331657 -110211
42310 -110211 208729 372979 300530 44042 -330437 -719600 -940916 -864840 -578972 -314225
42300 -314225 -195775 -150001 -70795 19046 28104 -52863 -140193 -169076 -146656 -102064 -41913
$$ packed form
42373a85292j4287M2092O8791R4996P2348l982n1084l6039l3051p1237n4959O4081
42361a07623J60091J14193K0495M6444J53126J41504l6184j94722j82532p3010
42351D1782j8086l6749n0431m5156p5734j31181j11112K3579J49448J08303p7642
42340b22979k01641j17924Q2450K09600K16437J85180J29784m953j44154j07039
42330B4761Q1336J28338j04274l18437j76722J63556K44698j1137j89482k6578
42320a83941K00831J35305j07927j58499J5084Q9954o9347j98664n4453K21446
42310a10211L18940J64250p2449k56488l74479l89163k21316P6076K85868K64747
42300c14225J18450M5774P9206Q9841R058q0967q7330k8883K2420M4592O0151
$$ plain form
42289 -41913 37620 128392 197205 177877 15738 -234073 -399505 -360514 -191935 -46459 64461
42278 64461 231670 402576 373667 109325 -118576 -67630 134330 180836 25518 -103453
42268 -103453 -87401 -48902 -60789 3731 199253 322750 204495 11013 8382 131061 69659
42257 69659 -238164 -494751 -480019 -342071 -323634 -409700 -421357 -311920 -181908 -92189 -36810
42246 -36810 -36829 -100027 -143180 -111503 -113032 -254435 -401609 -327119 -76264 65810 3959 -38613
42234 -38613 82357 176402 41569 -177892 -201633 -40599 44156 -59439 -202600 -247407
42224 -247407 -229084 -218235 -202151 -156813 -108155 -75865 -42742 9070 101840 265119 442830
42213 442830 468259 274608 66478 100990 339931 517893 519877 453267 358364 141754 -138854
$$ packed form
42289d1913P9533R0772O8813j9328j62139k49811j65432L8991J68579J45476J10920
42278F4461J67209J70906k8909k64342k27901N0946K01960M6506j55318j28971
42268a03453J6052L8499j1887O4520J95522J23497j18255j93482k631J22679o1402
42257F9659l07823k56587J4732J37948J8437q6066j1657J09437J30012Q9719N5379
42246c6810j9o3198m3153L1677j529j41403j47174P4490K50855J42074o1851m2572
42234c8613J20970R4045j34833k19461k3741J61034Q4755j03595j43161m4807
42224b47407J8323J0849J6084M5338M8658L2290L3123N1812R2770J63279J77711
42213D42830K5429j93651k08130L4512K38941J77962J984o6610r4903k16610k80608
$$ plain form
42202 -138854 -225831 -41641 142708 97366 -43501 -55956 2429 -35970 -82996 81501 409333
42191 409333 617105 590805 474011 357688 174059 -52156 -132403 -14327 77750 -42993
42181 -42993 -248036 -299043 -196384 -132089 -173778 -198224 -136406 -99884 -188644 -300502 -260523
42170 -260523 -97470 -50275 -256829 -551569 -676270 -612867 -551569 -559144 -481192 -226076 54989
42159 54989 192453 230599 274065 256561 77060 -143359 -191853 -101494 -103244 -244010 -310221
42148 -310221 -179290 -1341 65310 82622 162521 243965 201879 63695 -35456 -45819 -30658
42137 -30658 -49727 -106583 -169685 -182981 -108522 -5854 1647 -113134 -234913 -267656 -248770
42126 -248770 -242127 -218201 -125314 409 81533 91990 36891 -83964 -219038 -249912 -121927
$$ packed form
42202a38854q6977J84190J84349m5342j40867j2455N8385l8399m7026J64497L27832
42191D09333K07772k6300j16794j16323j83629k26215q0247J18076R2077j20743
42181d2993k05043n1007J02659O4295m1689k4446O1818L6522q8760j11858L9979
42170b60523J63053M7195k06554k94740j24701O3403O1298p575P7952K55116K81065
42159E4989J37464L8146M3466j7504j79501k20419m8494R0359j750j40766o6211
42148c10221J30931J77949O6651J7312P9899Q1444m2086j38184r9151j0363J5161
42137c0658j9069n6856o3102j3296P4459J02668P501j14781j21779l2743J8886
42126b48770O643K3926R2887J25723Q1124J0457n5099j20855j35074l0874J27985
$$ plain form
42115 -121927 65237 171140 168346 127133 108400 123327 133497 55180 -144549 -319974 -244720
42104 -244720 88022 392469 415322 214839 16019 -72562 -62698 47562 218773 276595
42094 276595 84150 -230291 -397381 -330009 -162021 -8279 125617 211821 179420 58044
42084 58044 -19334 3613 54862 79101 90639 55759 -120430 -419505 -642915 -610623 -370971
42073 -370971 -159461 -174969 -398248 -597725 -545487 -273630 -57280 -82853 -230748 -286216
42063 -286216 -236748 -192477 -136833 19 96429 -40309 -313117 -389702 -171457 69644
42053 69644 108572 48727 58491 83632 123 -150215 -259193 -320323 -332971 -206240 65733
42042 65733 287547 304223 220782 206309 227018 165784 59571 899 -64937 -212472 -328523
$$ packed form
42115a21927J87164J05903k794m1213j8733J4927J0170p8317j99729j75425P5254
42104b44720L32742L04447K2853k00483j98820q8581R864J10260J71211N7822
42094B76595j92445l14441j67090O7372J67988J53742J33896Q6204l2401j21376
42084E8044p7378K2947N1249K4239J1538l4880j76189k99075k23410L2292K39652
42073c70971K11510j5508k23279j99477N2238K71857K16350k5573j47895n5468
42063b86216M9468M4271N5644J36852R6410j36738k72808p6585K18245K41101
42053F9644L8928n9845R764K5141q3509j50338j08978o1130j2648J26731K71973
42042F5733K21814J6676q3441j4473K0709o1234j06213n8672o5836j47535j16051
$$ plain form
42031 -328523 -284972 -210811 -310776 -492866 -482976 -269746 -111656 -95591 -23255 194080 346990
42020 346990 262835 58943 -89758 -198662 -320163 -356246 -228547 -78971 -93667 -229976
42010 -229976 -299808 -244544 -162242 -123184 -108221 -90162 -59026 -8018 21588 -41392 -148525
41999 -148525 -113966 125660 344892 287757 5482 -242773 -348810 -404021 -440594 -376357
41989 -376357 -239425 -203581 -313454 -375477 -235873 -3128 129074 137043 111020 73884 14521
41978 14521 -1118 67640 91646 -75475 -328318 -395874 -217758 -42264 -85127 -263821 -373475
41967 -373475 -375709 -362366 -328610 -158548 172933 510199 649580 503622 156212 -183018
41957 -183018 -319623 -246491 -137348 -107064 -67858 65812 149029 -5964 -276793 -334220
$$ packed form
42031c28523M3551P4161r9965j82090R890K13230J58090J6065P2336K17335J52910
42020C46990q4155k03892j48701j08904j21501l6083J27699J49576j4696j36309
42010b29976o9832N5264Q2302L9058J4963J8059L1136N1008K9606o2980j07133
41999a48525L4559K39626K19232n7135k82275k48255j06037n5211l6573O4237
41989c76357J36932L5844j09873o2023J39604K32745J32202P969k6023l7136n9363
41978A4521j5639O8758K4006j67121k52843o7556J78116J75494m2863j78694j09654
41967c73475k234J3343L3756J70062L31481L37266J39381j45958l47410l39230
41957a83018j36605P3132J09143L0284L9206J33670Q3217j54993k70829n7427
$$ plain form
41947 -334220 -120079 52998 -34782 -222915 -296652 -329863 -469480 -604086 -547274 -398078
41937 -398078 -391980 -484955 -428616 -222983 -135683 -240032 -292494 -171253 -98599 -256435 -469819
41926 -469819 -486652 -340298 -208706 -110417 14668 80917 -21591 -179267 -176743 -10723
41916 -10723 131830 161113 147395 132127 69430 -56262 -209044 -370757 -504092 -521150 -433238
41905 -433238 -416506 -533739 -529557 -185013 229524 221709 -214325 -546990 -447448 -199027 -194018
41894 -194018 -371171 -426456 -327711 -298128 -421488 -552440 -563700 -462223 -303439 -169240
41884 -169240 -177933 -348161 -505279 -477954 -327119 -229085 -213799 -200602 -217269 -361794 -574162
41873 -574162 -665293 -583840 -460638 -374442 -272315 -157737 -153504 -295590 -431917 -424532 -325561
$$ packed form
41947c34220K14141J73077q7780j88133p3737l3211j39617j34606N6812J49196
41937c98078O098r2975N6339K05633Q7300j04349n2462J21241P2654j57836k13384
41926d69819j6833J46354J31592R8289J25085O6249j02508j57676K524J66020
41916a0723J42553K9283j3718j5268o2697j25692j52782j61713j33335j7058Q7912
41905d33238J6732j17233M182L44544M14537p815m36034l32665R9542K48421N009
41894a94018j77153n5285R8745K9583j23360j30952j1260J01477J58784J34199
41884a69240q693j70228j57118K7325J50835R8034J5286J3197j6667j44525k12368
41873e74162r1131Q1453J23202Q6196J02127J14578M233j42086j36327P385R8971
$$ plain form
41862 -325561 -268501 -301511 -405827 -558630 -684782 -657254 -458382 -259576 -229760 -324528
41852 -324528 -369844 -304842 -228911 -231224 -285099 -325750 -344530 -361375 -350999 -255959 -82528
41841 -82528 55202 39298 -96282 -172521 -69329 129206 251897 248133 197883 170348 186018
41830 186018 278287 452118 597415 598813 536489 605512 803907 891921 738935 524076 473291
41819 473291 567640 665299 760907 929227 1116399 1194968 1169459 1138497 1101778 1001106 915087
41808 915087 985869 1141486 1124200 866694 635368 686097 941686 1144636 1194899 1173931
41798 1173931 1125731 1006297 841500 767671 855409 992413 1015469 912686 825996 860285
41788 860285 947092 926655 738136 486536 322413 297847 355916 419702 459631 500934 588534
$$ packed form
41862c25561N7060l3010j04316j52803j26152K7528J98872J98806K9816r4768
41852c24528m5316O5002P5931k313n3875m0651j8780j6845J0376R5040J73431
41841h2528J37730j5904j35580p6239J03192J98535J22691l764n0250k7535J5670
41830A86018R2269J73831J45297J398o2324O9023J98395Q8014j52986k14859n0785
41819D73291R4349R7659R5608J68320J87172P8569k5509l0962l6719j00672q6019
41808I15087P0782J55617j7286k57506k31326N0729K55589K02950N0263k0968
41798A173931m8200j19434j64797p3829Q7738J37004K3056j02783q6690L4289
41788H60285Q6807k0437j88519k51600j64123k4566N8069O3786L9929M1303Q7600
$$ plain form
41777 588534 711565 751544 580444 261747 70214 207080 542923 763494 750813 687115
41767 687115 766983 943364 1021960 903305 647485 369725 163663 89412 141808 221749
41757 221749 203743 64322 -78514 -75057 112685 389253 637497 815891 926939 941412
41747 941412 826835 628879 431503 240898 22626 -141560 -96291 132475 307054 309603
41737 309603 309088 433972 493386 290565 36013 85397 355184 416702 184313 66367 301758
41726 301758 573522 525906 300185 228985 280334 189756 -32757 -123259 -13452 98269
41716 98269 108954 130660 230549 323690 358506 376503 366617 283750 221191 323394 505305
41705 505305 515436 328096 209537 312598 472324 524032 553186 646018 639702 382203 77666
$$ packed form
41777E88534J23031L9979j71100l18697j91533J36866L35843K20571j2681o3698
41767F87115P9868J76381P8596j18655k55820k77760k06062p4251N2396P9941
41757B21749j8006j39421j42836L457J87742K76568K48244J78394J11048J4473
41747I41412j14577j97956j97376j90605k18272j64186M5269K28766J74579K549
41737C09603n15J24884N9414k02821k54552M9384K69787O1518k32389j17946K35391
41726C01758K71764m7616k25721p1200N1349r0578k22513r0502J09807J11721
41716I8269J0685K1706R9889R3141L4816J7997r886q2867o2559J02203J81911
41705E05305J0131j87340j18559J03061J59726N1708K9154R2832o316k57499l04537
$$ plain form
41694 77666 81528 408676 695805 652190 347079 32325 -141273 -182955 -180404 -227760 -344660
41683 -344660 -417430 -294980 16042 321032 447046 422217 394673 430118 469508 461386 438334
41672 438334 437079 426567 376037 330770 333845 321415 216002 101442 147678 334364 423582
41661 423582 288967 98155 38303 32898 -76861 -218118 -208161 -97107 -100267 -219032 -229831
41650 -229831 -76787 27344 -26837 -65246 43505 148843 85149 -46832 -67232 2285
41640 2285 54627 128265 294393 442228 406787 220388 37817 -87831 -156691 -77034 183202
41629 183202 401852 340817 120343 68490 232399 347738 294322 244082 290791 278327 143531
41618 143531 111226 325415 545983 487467 272690 244418 436654 554931 459543 353448
$$ packed form
41694G7666L862L27148K87129m3615l05111l14754j73598m1682K551m7356j16900
41683c44660p2770J22450L11022L04990J26014k4829k7544L5445L9390q122k3052
41672D38334j255j0512n0530m5267L075j2430j05413j14560M6236J86686Q9218
41661D23582j34615j90812n9852n405j09759j41257R957J11054l160j18765j0799
41650b29831J53044J04131n4181l8409J08751J05338o3694j31981k0400O9517
41640B285N2342P3638J66128J47835l5441j86399j82571j25648o8860P9657K60236
41629A83202K18650o1035k20474n1853J63909J15339n3416n0240M6709j2464j34796
41618A43531l2305K14189K20568n8516k14777k8272J92236J18277r5388j06095
$$ plain form
41608 353448 413196 496975 378132 96569 -111962 -153249 -154749 -219177 -269866 -208405 -104110
41597 -104110 -107394 -223316 -294933 -215637 -45056 121063 282112 453385 551984 490221 341943
41586 341943 283241 365342 460667 451412 360375 257562 146935 19036 -66970 -53527 -1834
41575 -1834 -41406 -189840 -290468 -171160 157049 493354 634810 541262 316738 91882
41565 91882 -25413 47587 287497 491884 436405 160627 -38242 18520 159651 133679
41555 133679 -25245 -86057 19241 146297 211087 281987 386005 440085 423362 419392 423967
41544 423967 308735 67151 -93671 -30581 131924 212443 227614 265488 245192 29938
41534 29938 -283134 -415256 -264980 -37549 30933 -57184 -129768 -82634 29803 93991 60305
$$ packed form
41608C53448N9748Q3779j18843k81563k08531m1287j500o4428n0689O1461J04295
41597a04110l284j15922p1617P9296J70581J66119J61049J71273R8599o1763j48278
41586C41943n8702Q2101R5325r255r1037j02813j10627j27899q6006J3443N1693
41575a834l9572j48434j00628J19308L28209L36305J41456r3548k24524k24856
41565I1882j17295P3000K39910K04387n5479k75778j98869N6762J41131k5972
41555A33679j58924o0812J05298J27056O4790P0900J04018N4080j6723l970M575
41544D23967j15232k41584j60822O3090J62505Q0519J5171L7874k0296k15254
41534B9938l13072j32122J50276K27431O8482q8117p2584M7134J12437O4188l3686
$$ plain form
41523 60305 -28862 -97253 -101723 -44715 50700 146403 189917 162042 117424 121854 160877 183767
41511 183767 221641 349493 517101 550059 381847 176371 139916 293729 501741 634237
41501 634237 622655 442013 153517 -77341 -102796 70428 300295 434400 411778 313133
41491 313133 313667 485243 648363 567971 304819 165850 249678 296333 128188 -27721 98120
41480 98120 350804 365785 123514 -46602 34319 212632 317679 355004 346005 253445 130737
41469 130737 97876 111848 13952 -135469 -61115 271506 497778 342685 20646 -86740
41459 -86740 45738 153490 133285 130325 219028 273531 200734 99415 106435 208668 281408
41448 281408 244758 129670 19131 -48666 -112458 -205129 -259891 -177459 5161 123126 107780
$$ packed form
41523F0305q9167o8391m470N7008R5415R5703M3514k7875m4618M430L9023K2890
41511A83767L7874J27852J67608L2958j68212k05476l6455J53813K08012J32496
41501F34237j1582j80642k88496k30858k5455J73224K29867J34105k2622r8645
41491C13133N34J71576J63120q0392k63152j38969Q3828M6655j68145j55909J25841
41480I8120K52684J4981k42271j70116Q0921J78313J05047L7325q999r2560j22708
41469A30737l2861J3972r7896j49421P4354L32621K26272j55093l22039j07386
41459h6740J32478J07752k0205k960Q8703N4503p2797j01319P020J02233P2740
41448B81408l6650j15088j10539o7797o3792r2671n4762Q2432J82620J17965j5346
$$ plain form
41437 107780 82778 152303 213319 114372 -80913 -153667 -32253 111559 88792 -93717 -278236
41426 -278236 -333804 -251192 -110154 8649 83676 132466 155143 144106 138501 183760 220020
41415 220020 120419 -102974 -246089 -164838 15457 69350 -22749 -89598 -53744 -31766 -123883
41404 -123883 -245175 -240810 -93052 56572 65897 -65153 -208736 -260617 -261291 -319970 -422529
41393 -422529 -415579 -235226 -42410 -19282 -115534 -146384 -91651 -114006 -268751 -379781 -287968
41382 -287968 -91843 -28222 -183119 -425460 -599121 -692979 -811847 -1029290 -1290761 -1453892
41372 -1453892 -1424864 -1258491 -1118135 -1134301 -1299800 -1490141 -1583382 -1576147 -1578886 -1672420 -1790020
41361 -1790020 -1802183 -1702529 -1608750 -1567861 -1496179 -1373450 -1343656 -1489430 -1627478 -1512481
$$ packed form
41437A07780k5002O9525O1016r8947j95285p2754J21414J43812k2767j82509j84519
41426b78236n5568Q2612J41038J18803P5027M8790K2677j1037n605M5259L6260
41415B20020r9601k23393j43115Q1251J80295N3893r2099o6849L5854K1978r2117
41404a23883j21292M365J47758J49624R325j31050j43583n1881o74n8679j02559
41393d22529O950J80353J92816K3128r6252l0850N4733k2355j54745j11030R1813
41382b87968J96125O3621j54897k42341j73661r3858j18868k17443k61471j63131
41372a453892K9028J66373J40356j6166j65499j90341r3241P235k739r3534j17600
41361a790020j2163R9654R3779M0889P1682J22729K9794j45774j38048J14997
$$ plain form
41351 -1512481 -1183007 -914589 -848387 -852061 -763025 -592676 -442393 -368016 -387366 -494742
41341 -494742 -609511 -624041 -553731 -526436 -578061 -588588 -485028 -373281 -373897 -442177 -463295
41330 -463295 -438596 -463647 -579229 -735166 -846863 -817106 -582455 -227225 30983 76195
41320 76195 40617 100917 207010 170055 -23083 -163243 -103990 62415 163401 149927 69675
41309 69675 -55782 -220125 -349248 -337434 -182842 -31028 -48334 -252557 -478938 -530987
41299 -530987 -377605 -183673 -123039 -185083 -212510 -118119 6479 25749 -58591 -128075 -124748
41288 -124748 -123287 -198606 -294122 -296711 -210365 -159845 -210696 -281462 -281809 -250955 -279963 -361576
41276 -361576 -412653 -402386 -359876 -288375 -176027 -64859 -1235 52162 133093 146504 -25605
$$ packed form
41351a512481L29474K68418O6202l674Q9036J70349J50283P4377j9350j07376
41341d94742j14769j4530P0310K7295n1625j0527J03560J11747o16o8280k1118
41330d63295K4699k5051j15582j55937j11697K9757K34651L55230K58208M5212
41320G6195l5578O0300J06093l6955j93138j40160N9253J66405J00986j3474q0252
41309F9675j25457j64343j29123J1814J54592J51814j7306k04223k26381n2049
41299e30987J53382J93932O0634o2044k7427R4391J24598J9270q4340o9484L327
41288a24748J461p5319r5516k589Q6346N0520n0851p0766l47L0854k9008q1613
41276c61576n1077J0267M2510P1501J12348J11168O3624N3397Q0931J3411j72109
$$ plain form
41265 -25605 -298972 -459940 -470927 -487006 -529181 -402036 -57478 216893 176440 -19948
41255 -19948 -72350 2091 -40623 -231334 -352590 -311920 -245357 -222799 -137579 32531 113155
41244 113155 7981 -119578 -83054 60950 117728 7880 -198412 -392750 -466947 -341967
41234 -341967 -72095 154085 209137 155994 118225 117732 119643 133958 171903 188836 167530 170038
41222 170038 210157 177675 11340 -154060 -165809 -97431 -138119 -285910 -343029 -216834 -43062
41211 -43062 30846 27999 39991 68925 62743 34264 62005 197689 409757 597690 660862
41200 660862 592452 495272 455837 430459 330050 181793 90419 50225 -60051 -261276 -395353
41189 -395353 -335091 -152097 12719 133354 242263 294854 243378 183083 250693 387872
$$ packed form
41265b5605k73367j60968j0987j6079m2175J27145L44558K74371m0453j96388
41255a9948n2402P4441m2714j90711j21256M0670O6563K2558Q5220J70110Q0624
41244A13155j05174j27559L6524J44004N6778j09848k06292j94338p4197J24980
41234c41967K69872K26180N5052n3143l7769m93J911J4315L7945J6933k1306K508
41222A70038M0119l2482j66335j65400j1749O8378m0688j47791n7119J26195J73772
41211d3062P3908k847J1992K8934o182k8479K7741J35684K12068J87933O3172
41200F60862o8410r7180l9435k5378j00409j48257r1374m0194j10276k01225j34077
41189c95353O0262J82994J64816J20635J08909N2591n1476o0295O7610J37179
$$ plain form
41179 387872 377153 149906 -96631 -165838 -114143 -123315 -215044 -245225 -157777 -89364 -166001
41168 -166001 -296941 -267716 -14551 272773 348304 176729 -32119 -56098 102331 241935
41158 241935 211871 77096 4581 40431 78629 34155 -53271 -121707 -198929 -327578 -434768
41147 -434768 -390385 -196924 -18253 20796 -18410 -7355 44583 6946 -152795 -270922 -173480
41136 -173480 90347 287907 275460 144250 53873 7779 -96700 -235003 -229462 -8729
41126 -8729 242328 307932 231435 236606 396572 537599 489912 296277 121984 71453 155353
41115 155353 335134 515209 567927 457533 292116 182664 107177 -5666 -114672 -96119
41105 -96119 78280 283894 375466 327506 247495 279526 459772 631417 566752 242004 -76211
$$ packed form
41179C87872j0719k27247k46537o9207N1695r172r1729l0181Q7448O8413p6637
41168a66001j30940K9225K53165K87324P5531j71575k08848k3979J58429J39604
41158B41935l0064j34775p2515L5850L8198m4474q7426o8436p7222j28649j07190
41147d34768M4383J93461J78671L9049l9206J1055N1938l7637j59741j18127R7442
41136a73480K63827J97560j2447j31210r0377m6094j04479j38303N541K20733
41126h729K51057O5604p6497N171J59966J41027m7687j93635j74293n0531Q3900
41115A55353J79781J80075N2718j10394j65417j09452p5487j12843j09006J8553
41105i6119J74399K05614R1572m7960q0011L2031J80246J71645o4665l24748l18215
$$ plain form
41094 -76211 -119192 60623 176381 84337 -69061 -80669 77530 303295 507530 638766
41084 638766 668845 644126 680961 826849 978536 1013288 952026 906313 895811 816913 604151
41073 604151 347891 210543 254390 386773 474367 484141 482254 501760 473450 334025 155217
41062 155217 84010 165935 305242 398515 425549 401901 337506 277314 301586 439522 637530
41051 637530 830742 972671 988288 816386 545314 385265 426264 528534 536951 485482
41041 485482 469786 433758 256622 -11510 -183291 -183347 -101065 -9477 91664 144321 44419
41030 44419 -143921 -164248 121105 517430 720466 664305 521387 426328 351394 246093
41020 246093 161588 181999 300145 415698 442714 398678 384836 471711 609785 684274 658223
$$ packed form
41094g6211m2981J79815J15758r2044j53398j1608J58199K25765K04235J31236
41084F38766L0079k4719L6835J45888J51687L4752o1262m5713j0502p8898k12762
41073F04151k56260j37348M3847J32383Q7594R774j887J9506k8310j39425j78808
41062A55217p1207Q1925J39307R3273K7034k3648o4395o0192K4272J37936J98008
41051F37530J93212J41929J5617j71902k71072j60049M0999J02270Q417n1469
41041D85482j5696l6028j77136k68132j71781n6Q2282R1588J01141N2657r9902
41030D4419j88340k0327K85353L96325K03036n6161j42918r5059p4934j05301
41020B46093q4505K0411J18146J15553K7016m4036j3842Q6875J38074P4489k6051
$$ plain form
41009 658223 605199 576360 506136 319278 85707 -28164 35279 153894 191330 162328 169911
40998 169911 218142 178625 -29040 -285610 -369374 -202235 53474 164484 59786 -125662
40988 -125662 -207096 -119626 40950 110638 8362 -172912 -244940 -124561 70449 160975
40978 160975 107021 19896 13203 111474 276333 434507 488794 392686 223337 100888 31955
40967 31955 -77192 -244607 -356852 -322798 -186641 -46364 50348 90570 76884 71346 151843
40956 151843 269107 271566 153360 137686 381021 713565 844203 740581 616580 594343
40946 594343 591083 539403 502897 516363 503104 449370 503751 770787 1108516 1267544 1180505
40935 1180505 1006312 926674 997791 1173579 1365835 1470408 1423537 1277672 1178110 1219646
$$ packed form
41009F58223n3024k8839p0224j86858k33571j13871O3443J18615L7436k9002P583
40998A69911M8231l9517k07665k56570q3764J67139K55709J11010j04698j85448
40988a25662q1434Q7470J60576O9688j02276j81274p2028J20379J95010R0526
40978A60975n3954q7125o693R8271J64859J58174N4287r6108j69349j22449o8933
40967C1955j09147j67415j12245L4054J36157J40277R6712M0222j3686n538Q0497
40956A51843J17264K459j18206j5674K43335L32544J30638j03622j24001k2237
40946E94343l260n1680l6506J3466j3259n3734N4381K67036L37729J59028q7039
40935A180505j74193p9638P1117J75788J92256J04573m6871j45865r9562M1536
$$ plain form
40925 1219646 1338103 1380832 1294326 1205235 1271418 1473422 1632151 1644561 1595442 1577801 1531653
40914 1531653 1397829 1323264 1493200 1789113 1867794 1638527 1409832 1422875 1472248 1229902
40904 1229902 795689 621694 905215 1332483 1504652 1407278 1323922 1422795 1594707 1658891
40894 1658891 1588423 1493936 1453203 1423483 1334903 1224739 1202138 1263911 1242326 1020746 730147
40883 730147 603314 662620 697977 565064 351529 194615 88735 -17689 -62543 32674
40873 32674 172600 170495 19691 -75207 17510 173425 192398 65312 -41874 -12248 126958
40862 126958 311048 514378 684218 701632 498827 181556 -42305 -56852 82799 248214
40852 248214 353108 377898 358106 374329 483354 616411 612793 419319 198403 146629 239713
$$ packed form
40925A219646J18457M2729q6506q9091O6183K02004J58729J2410m9119j7641m6148
40914A531653j33824p4565J69936K95913P8681k29267k28695J3043M9373k42346
40904A229902m34213j73995K83521M27268J72169r7374q3356R8873J71912O4184
40894A658891p0468r4487m0733k9720q8580j10164k2601O1773k1585k21580k90599
40883G30147j26833N9306L5357j32913k13535j56914j05880j06424m4854R5217
40873C2674J39926k105j50804r4898R2717J55915J8973j27086j07186K9626J39206
40862A26958J84090K03330J69840J7414k02805l17271k23861j4547J39651J65415
40852B48214J04894K4790j9792J6223J09025J33057l618j93474k20916n1774R3084
$$ plain form
40841 239713 266886 118248 -76365 -131017 -23429 131934 243333 283879 234225 94065
40831 94065 -63687 -145457 -147063 -131803 -103263 -3139 141844 189016 71135 -73552 -71659
40820 -71659 38466 52906 -119219 -342986 -438132 -362240 -184581 6136 107221 29239
40810 29239 -176276 -292492 -161924 102396 240142 149125 -42450 -180061 -224661 -193148
40800 -193148 -103429 -14207 9941 16850 119214 274681 263955 -10306 -335469 -432796 -287426
40789 -287426 -95001 27457 111073 184460 241289 328561 480514 571653 433968 151835
40779 151835 41121 251334 551376 615540 394766 98673 -80353 -111041 -76320 -90661
40769 -90661 -203397 -307369 -223105 50979 277069 269915 143288 130241 255768 359956
$$ packed form
40841B39713K7173j48638j94613n4652J07588J55363J11399M0546m9654j40160
40831I4065j57752q1770j606J5260K8540J00124J44983M7172j17881j44687J893
40820g1659J10125J4440j72125k23767r5146P5892J77659J90717J01085p7982
40810B9239k05515j16216J30568K64320J37746r1017j91575j37611m4600L1513
40800a93148Q9719Q9222K4148O909J02364J55467j0726k74261l25163r7327J45370
40789b87426J92425J22458Q3616P3387N6829Q7272J51953R1139j37685k82133
40779A51835j10714K10213L00042O4164k20774k96093j79026l0688L4721j4341
40769i0661j12736j03972Q4264K74084K26090p154j26627j3047J25527J04188
$$ plain form
40759 359956 376682 384635 396921 306898 83560 -151460 -297878 -377267 -404980 -323738 -154253
40748 -154253 -58912 -124938 -200954 -98608 124310 239918 162203 24614 -39120 -35509 -13445
40737 -13445 28314 80532 88474 51677 64331 165319 218372 56622 -272220 -512733 -484061
40726 -484061 -286471 -175166 -257220 -371068 -286475 8796 275418 291500 104475 -41854
40716 -41854 -1257 139169 218201 192257 120715 53607 18792 55086 158253 236871 224612
40705 224612 200103 276897 401101 404471 262665 138163 124633 118462 30068 -43946 2207
40694 2207 72899 16278 -112859 -134174 -38488 1270 -86165 -171387 -145144 -63481 -11369 28360
40682 28360 97050 178164 262544 377053 483632 476695 356791 273775 301952 307525 161752
$$ packed form
40759C59956J6726P953J2286r0023k23338k35020j46418p9389k7713Q1242J69485
40748a54253R5341o6026p6016J02346K22918J15608p7715j37589o3734L611K2064
40737a3445M1759N2218P942l6797J2654J00988N3053j61750l28842k40513K8672
40726d84061J97590J11305q2054j13848Q4593K95271K66622J6082j87025j46329
40716d1854M0597J40426P9032k5944p1542o7108l4815L6294J03167P8618j2259
40705B24612k4509P6794J24204L370j41806j24502j3530o171q8394p4014M6153
40694B207P0692n6621j29137k1315R5686L9758q7435q5222K6243Q1663N2112L9729
40682B8360O8690Q1114Q4380J14509J06579o937j19904q3016K8177N573j45773
$$ plain form
40671 161752 -44489 -153772 -194482 -285818 -367751 -255650 40313 270532 277884 194352 217950
40660 217950 340103 413625 391456 360367 375787 388192 350654 312498 352540 451054 488983
40649 488983 400522 292469 348461 598984 843450 845675 576440 228725 31579 87966
40639 87966 345415 654968 872884 953893 941863 873378 761845 689971 783539 1002726 1094370
40628 1094370 910576 668787 681957 893216 947137 741864 615241 845239 1210163 1269890
40618 1269890 940037 545422 367976 379464 431500 491162 594055 704849 747080 714251
40608 714251 660427 610487 556350 526451 573162 665073 663567 474377 192171 17658 33434
40597 33434 141443 231402 303012 368943 358820 242457 165083 294409 554527 677761 549452
$$ packed form
40671A61752k06241j09283m0710r1336q1933J12101K95963K30219P352q3532K3598
40660B17950J22153P3522k2169l1089J5420J2405l7538l8156M0042R8514L7929
40649D88983q8461j08053N5992K50523K44466K225k69235l47715j97146N6387
40639H7966K57449L09553K17916Q1009j2030o8485j11533p1874R3568K19187R1644
40628A094370j83794k41789J3170K11259N3921k05273j26623K29998L64924N9727
40618A269890l29853l94615j77446J1488N2036N9662J02893J10794M2231l2829
40608G14251n3824m9940n4137k9899M6711R1911j506j89190k82206j74513J5776
40597C3434J08009Q9959P1610O5931j0123j16363p7374J29326K60118J23234j28309
$$ plain form
40586 549452 359105 353184 548014 747311 757618 538049 216686 -557 -12043 64315
40576 64315 41344 -70524 -78278 84917 231475 189167 55987 59732 263293 531997 714922
40565 714922 744133 627204 458126 375699 404315 399279 256098 98479 125680 327677 492154
40554 492154 466178 287459 84619 -28051 20272 201482 361010 356159 227357 144799
40544 144799 198271 327254 433349 463001 403116 298208 251203 308286 374137 348285 302565
40533 302565 387787 591130 736219 723563 630624 567780 572058 649268 774386 830289 695152
40522 695152 429115 239906 226696 291510 336964 396275 502349 576293 545140 466268 447245
40511 447245 522708 670551 857812 1010681 1034993 933176 815067 735326 612104 369609
$$ packed form
40586E49452j90347n921J94830J99297J0307k19569l21363k17243j1486P6358
40576F4315k2971j11868p754J63195J46558m2308j33180L745K03561K68704J82925
40565G14922K9211j16929j69078q2427K8616n036j43181j57619K7201K01997J64477
40554D92154k5976j78719k02840j12670M8323J81210J59528m851j28802q2558
40544A44799N3472J28983J06095K9652n9885j04908m7005N7083O5851k5852m5720
40533C02565Q5222K03343J45089j2656r2939o2844M278P7210J25118N5903j35137
40522F95152k66037j89209j3210O4814M5454N9311J06074P3944l1153p8872j9023
40511D47245P5463J47843J87261J52869K4312j01817j18109p9741j23222k42495
$$ plain form
40501 369609 72791 -148239 -239074 -240121 -234691 -297999 -405474 -386160 -96958 342152 646313
40490 646313 727174 760493 836568 791004 530520 288844 318569 492558 487168 271307 128983
40479 128983 210497 326177 246932 12421 -148648 -82181 176003 465458 632501 642198
40469 642198 577383 518684 480427 490173 614679 818422 921125 833431 720835 762521 856477
40458 856477 785317 598838 567194 762950 949174 921273 725535 489068 274059 179387
40448 179387 336845 669147 866141 767208 588110 592753 709206 687801 511044 393730
40438 393730 431176 494661 488118 491995 585660 689451 676975 546269 398749 311561 296871
40427 296871 342704 427899 506966 525752 467397 374665 317909 332899 392358 448155 487168
$$ packed form
40501C69609k96818k21030r0835j047N430o3308j07475J9314K89202M39110L04161
40490F46313Q0861L3319P6075m5564k60484k41676K9725J73989n390k15861j42324
40479A28983Q1514J15680p9245k34511j61069O6467K58184K89455J67043R697
40469F42198o4815n8699l8257R746J24506K03743J02703q7694j12596M1686R3956
40458H56477p1160j86479l1644J95756J86224k7901j95738k36467k15009r4672
40448A79387J57458L32302J96994r8933j79098M643J16453k1405j76757j17314
40438C93730L7446O3485o543L877R3665J03791j2476j30706j47520q7188j4690
40427B96871M5833Q5195P9067J8786n8355r2732n6756J4990N9459N5797L9013
$$ plain form
40416 487168 517115 517127 462002 392531 381399 405231 339885 140875 -51431 -71386 66901
40405 66901 222710 340522 481583 650421 731735 660313 550393 561481 685224 756477
40395 756477 660331 450153 259597 172183 197280 302760 424789 497396 526653 592036 713819
40384 713819 770695 645047 418014 296233 344389 428735 454348 496953 618045 710948 671233
40373 671233 590555 606423 657891 591361 440912 376818 407860 387054 327928 436760 734468
40362 734468 907451 711849 336950 165651 301607 528895 643511 620859 508428 354959
40352 354959 248056 261782 344882 375059 326841 281300 280962 292619 313774 393561 523191
40341 523191 609076 589517 498383 388339 268838 149541 74446 73906 129467 212329 318029
$$ packed form
40416D87168K9947J2n5125o9471j1132K3832o5346j99010j92306j9955J38287
40405F6901J55809J17812J41061J68838Q1314p1422j09920J1088J23743P1253
40395G56477r6146k10178j90556q7414K5097J05480J22029P2607K9257O5383J21783
40384G13819N6876j25648k27033j21781M8156Q4346K5613M2605J21092R2903l9715
40373F71233q0678J5868N1468o6530j50449o4094L1042k0806n9126J08832K97708
40362G34468J72983j95602l74899j71299J35956K27288J14616k2652j12431j53469
40352C54959j06903J3726Q3100L0177m8218m5541l38J1657K1155P9787J29630
40341E23191Q5885j9559r1134j10044j19501j19297p5095n40N5561Q2862J05700
$$ plain form
40330 318029 446974 584399 704977 766767 716585 559208 419189 462395 719399 1022996
40320 1022996 1156946 1060065 870115 771195 809073 869221 835044 724909 632601 581376 529839
40309 529839 500405 574065 736841 866539 922621 1007804 1162116 1246786 1153010 982001 863057
40298 863057 735471 519658 383567 557834 923608 1085850 912382 728006 848145 1141868
40288 1141868 1236743 1016388 727763 656042 844734 1124316 1308704 1339434 1277903 1185549
40278 1185549 1058021 917219 894470 1099430 1437400 1699414 1823067 1907715 1980934 1955919
40268 1955919 1857043 1856360 1986295 2036233 1878641 1690696 1663758 1684112 1549577 1357256 1373101
40257 1373101 1574474 1637840 1422502 1192169 1240133 1496516 1661224 1607615 1496195 1516577
$$ packed form
40330C18029J28945J37425J20578O1790n0182j57377j40019M3206K57004L03597
40320A022996J33950r6881j89950r8920L7878O0148l4177j10135r2308n1225n1537
40309E29839k9434P3660J62776J29698N6082Q5183J54312Q4670r3776j71009j18944
40298H63057j27586k15813j36091J74267L65774J62242j73468j84376J20139K93723
40288A141868R4875k20355k88625p1721J88692K79582J84388L0730o1531r2354
40278A185549j27528j40802k2749K04960L37970K62014J23653Q4648P3219k5015
40268A955919r8876o83J29935M9938j57592j87945k6938K0354j34535j92321J5845
40257A373101K01373O3366k15338k30333M7964K56383J64708n3609j11420K0382
$$ plain form
40247 1516577 1630748 1615354 1341844 972294 806714 921519 1068425 1009650 833328 788487
40237 788487 905582 996182 994743 1051267 1231046 1350013 1230554 955671 734499 640466
40227 640466 616296 633943 704085 794879 872325 967396 1084023 1101500 910435 609955 420424
40216 420424 406902 433986 407859 409518 527454 686772 742495 668307 564816 530956 604463
40205 604463 783966 1020938 1210134 1271702 1242620 1221509 1230542 1206521 1126277 1048730 1009394
40194 1009394 967293 902733 872870 896242 872440 725423 558234 532625 639310 736861 788760
40183 788760 876998 972586 912330 682821 512592 539270 576568 410104 170425 164836 431784
40172 431784 722820 874619 920945 850208 569227 183039 11766 179350 426717 500100
$$ packed form
40247A516577J14171j5394k73510l69550j65580J14805J46906n8775j76322m4841
40237G88487J17095R0600j439N6524J79779J18967j19459k74883k21172r4033
40227F40466k4170J7647P0142R0794P7446R5071J16627J7477j91065l00480j89531
40216D20424j3522K7084k6127J659J17936J59318N5723p4188j03491l3860P3507
40205F04463J79503K36972J89196O1568k9082k1111R033k4021q0244p7547l9336
40194A009394m2101o4560k9863K3372k3802j47017j67189k5609J06685R7551N1899
40183G88760Q8238R5588o0256k29509j70229K6678L7298j66464k39679n589K66948
40172D31784K91036J51799M6326p0737k80981l86188j71273J67584K47367P3383
$$ plain form
40162 500100 499498 636221 847761 916377 835024 777650 778984 713985 571154 494910 542299
40151 542299 613223 639470 642144 592668 434981 271208 291412 460462 508877 322963 112942
40140 112942 78282 140051 162089 209380 372592 522874 488672 342285 266927 259006 225376
40129 225376 265553 534836 868119 885222 520081 137855 35133 106334 129481 109095
40119 109095 149408 206197 181346 116073 97440 96765 75229 121375 295443 455288 440644
40108 440644 331364 313438 381162 400868 387605 454002 531776 436858 218947 150237 308614
40097 308614 460117 455549 456982 608194 741002 636862 386867 241874 240030 238074 221861
40086 221861 317041 512954 622201 551700 424910 387010 435222 477984 434345 257869 -47
$$ packed form
40162E00100o02J36723K11540O8616q1353n7374J334o4999j42831p6244M7389
40151E42299P0924K6247K674m9476j57687j63773K0204J69050M8415j85914k10021
40140A12942l4660O1769K2038M7291J63212J50282l4202j46387p5358p921l3630
40129B25376M0177K69283L33283J7103l65141l82226j02722P1201K3147k0386
40119A09095M0313N6789k4851o5273j8633o75k1536M6146J74068J59845j4644
40108D40644j09280j7926O7724J9706j3263O6397P7774r4918k17911o8710J58377
40097C08614J51503m568J433J51212J32808j04140k49995j44993j844j956j6213
40086B21861R5180J95913J09247p0501j26790l7900M8212M2762m3639j76476k57916
$$ plain form
40075 -47 -135161 39711 421849 673841 628618 494336 555386 804890 1012115 1051355 993727
40064 993727 919188 811382 655562 504441 402867 342141 324612 385244 509104 614500
40054 614500 668204 726171 788975 718885 428391 84278 -42127 85134 251568 338608
40044 338608 478515 765362 1018521 1028931 893511 854349 889189 759152 467814 353440
40034 353440 600590 923703 932910 633612 355175 315258 469865 702822 934512 1074699
40024 1074699 1074609 1038342 1127557 1351130 1578221 1732455 1821574 1805573 1627039 1386335 1297975
40013 1297975 1422332 1601200 1706101 1776614 1838836 1772863 1507273 1221494 1181960 1416356
40003 1416356 1683849 1767319 1702575 1699457 1888364 2176708 2361127 2371559 2355171 2483831
$$ packed form
40075d7j35114J74872L82138K51992m5223j34282O1050K49504K07225L9240n7628
40064I93727p4539j07806j55820j51121j01574o0726j7529O0632J23860J05396
40054F14500N3704N7967O2804p0090k90494l44113j26405J27261J66434Q7040
40044C38608J39907K86847K53159J0410j35420l9162L4840j30037k91338j14374
40034C53440K47150L23113R207k99298k78437l9917J54607K32957K31690J40187
40024A074699r0l6267Q9215K23573K27091J54234Q9119j6001j78534k40704q8360
40013A297975J24357J78868J04901P0513O2222o5973k65590k85779l9534K34396
40003A416356K67493Q3470o4744l118J88907K88344J84419J0432j6388J28660
$$ plain form
39993 2483831 2743685 2995951 3182912 3349553 3505711 3629381 3805113 4190906 4816994
39984 4816994 5573624 6429712 7481483 8709701 9859218 10664757 11059048 11067855 10661316
39975 10661316 9848327 8796834 7719703 6722620 5850598 5149412 4562592 3915460 3161930
39966 3161930 2524148 2218902 2163481 2134658 2092846 2118289 2125335 1921043 1527579 1183097
39956 1183097 998848 855920 688667 632193 788163 1033275 1177161 1174072 1085630 964431
39946 964431 869695 878301 971374 994544 826180 526971 263450 152411 222645 429751 638692
39935 638692 685804 549539 394506 366823 411913 384896 284144 260153 400409 604598
39925 604598 708355 677351 629737 670360 742206 683733 432096 117640 -65335 -27769 195298
$$ packed form
39993B483831K59854K52266J86961J66641J56158J23670J75732L85793O26088
39984D816994P56630Q56088J051771J228218J149517Q05539L94291Q807m06539
39975A0661316q12989j051493j077131r97083q72022p01186n86820o47132p53530
39966C161930o37782l05246n5421k8823m1812K5443P046k04292l93464l44482
39956A183097j84249j42928j67253n6474J55970K45112J43886l089q8442j21199
39946I64431r4736Q606R3073K3170j68364k99209k63521j11039P0234K07106K08941
39935F38692M7112j36265j55033k7683M5090k7017j00752k3991J40256K04189
39925F04598J03757l1004m7614M0623P1846n8473k51637l14456j82975L7566K23067
$$ plain form
39914 195298 500738 728782 733390 569969 519011 749777 1030181 992873 666307 476243
39904 476243 661504 954497 982956 758935 562418 509649 488702 437401 428871 482673 505667
39893 505667 463673 442502 479383 479566 385889 316318 416930 635984 760956 676405 491866
39882 491866 387054 407841 477061 551475 660907 788653 830896 742710 637411 642741 714512
39871 714512 704066 579299 462394 455545 535120 616607 625284 511766 305346 141830 124470
39860 124470 177781 175230 180265 368703 703584 908415 832457 640080 546887 568691 645250
39849 645250 800173 1008591 1090312 944552 759389 776975 950525 1044500 999165 977867
39839 977867 1083351 1220105 1239093 1079893 788023 507471 410560 522839 681898 768659
$$ packed form
39914A95298L05440K28044M608j63421n0958K30766K80404l7308l26566j90064
39904D76243J85261K92993K8459k24021j96517n2769k0947n1301q530N3802K2994
39893E05667m1994k1171L6881J83r3677o9571J00612K19054J24972q4551j84539
39882D91866j04812K0787O9220P4414J09432J27746M2243q8186j05299N330P1771
39871G14512j0446j24767j16905o849P9575Q1487Q677j13518k06420j63516j7360
39860A24470N3311k551N035J88438L34881K04831p5958j92377r3193K1804P6559
39849F45250J54923K08418Q1721j45760j85163J7586J73550R3975m5335k1298
39839I77867J05484J36754J8988j59200k91870k80552r6911J12279J59059Q6761
$$ plain form
39829 768659 860015 1019228 1101491 986060 853851 950132 1170106 1200516 1023073 928259
39819 928259 1018228 1058944 911968 770393 817578 949671 1016760 1077000 1205341 1276455 1168539
39808 1168539 1007053 976337 1026353 984328 842080 723219 669856 673733 824115 1190758
39798 1190758 1611646 1821457 1772996 1637390 1514469 1359481 1195690 1159255 1258637 1291572
39788 1291572 1126267 924628 938664 1157785 1305052 1184742 923894 814517 970301 1223588
39778 1223588 1369178 1407656 1454661 1485984 1352447 1064603 867768 928968 1105442 1167270
39768 1167270 1118265 1114445 1167483 1160278 1121738 1239660 1551261 1825683 1848224 1671859 1491161
39757 1491161 1394651 1352559 1348397 1393670 1463400 1525437 1602121 1710114 1768878 1675992 1477992
$$ packed form
39829G68659R1356J59213Q2263j15431j32209R6281K19974L0410j77443r4814
39819I28259Q9969M0716j46976j41575M7185J32093O7089O0240J28341P1114j07916
39808A168539j61486l0716N0016m2025j42248j18861n3363L877J50382L66643
39798A190758M20888K09811m8461j35606j22921j54988j63791l6435R9382L2935
39788A291572j65305k01639J4036K19121J47267j20310k60848j09377J55784K53287
39778A223588J45590L8478M7005L1323j33537k87844j96835O1200J76474O1828
39768A167270m9005l820N3038p205l8540J17922L11601K74422K2541j76365j80698
39757A491161r6510m2092m162M5273O9730O2037P6684J07993N8764r2886j98000
$$ plain form
39746 1477992 1365523 1453669 1635071 1716060 1663814 1638535 1770328 1983445 2106334 2109972
39736 2109972 2132536 2253548 2354321 2287864 2124265 2107715 2361442 2730156 2960032 2972783
39726 2972783 2898716 2870263 2867887 2803005 2691138 2650628 2719478 2771104 2690632 2567905 2586959
39715 2586959 2737440 2788870 2607544 2363637 2315337 2480726 2654842 2697826 2660830 2632004
39705 2632004 2598650 2516479 2427796 2435232 2574357 2747872 2799539 2673083 2500682 2482312 2642699
39694 2642699 2769738 2665699 2412396 2287737 2430456 2685845 2801876 2696730 2497952
39685 2497952 2380248 2414635 2548693 2688628 2787913 2861498 2932647 2999876 3059648 3115706 3146318
39674 3146318 3112752 3033160 2997763 3066128 3187875 3261595 3234368 3125588 3016391 3031646 3234762
$$ packed form
39746A477992j12469Q8146J81402Q0989n2246k5279J31793K13117J22889L638
39736B109972K2564J21012J00773o6457j63599j6550K53727L68714K29876J2751
39726B972783p4067k8453k376o4882j11867m0510O8850N1626q0472j22727J9054
39715B586959J50481N1430j81326k43907m8300J65389J74116M2984l6996k8826
39705B632004l3354q2171q8683P436J39125J73515N1667j26456j72401j8370J60387
39694B642699J27039j04039k53303j24659J42719K55389J16031j05146j98778
39685B497952j17704L4387J34058J39935R9285P3585P1149O7229N9772N6058L0612
39674C146318l3566p9592l5397O8365J21747P3720k7227j08780j09197J5255K03116
$$ plain form
39663 3234762 3503951 3631799 3605022 3642143 3866501 4117014 4232689 4342002 4638111 5010006
39653 5010006 5191458 5201067 5313306 5604447 5860228 5984178 6159057 6475066 6705195 6639980
39643 6639980 6399432 6211029 6094939 5985634 5961193 6090197 6204240 6104108 5897787 5863117
39633 5863117 6033765 6184830 6199180 6186091 6230123 6274976 6300411 6383308 6509815 6531959 6406546
39622 6406546 6302053 6358344 6484615 6513749 6446857 6432646 6585494 6912766 7341768 7735627
39612 7735627 7964910 8052336 8172867 8428024 8709468 8892985 9072330 9434876 9945674 10346489
39602 10346489 10509738 10632179 10978166 11535101 12046418 12339387 12498488 12711293 13046941
39593 13046941 13432258 13786246 14126613 14563005 15199862 16012236 16816640 17435287 17917248
$$ packed form
39663C234762K69189J27848k6777L7121K24358K50513J15675J09313K96109L71895
39653E010006J81452R609J12239K91141K55781J23950J74879L16009K30129o5215
39643F639980k40548j88403j16090j09305k4441J29004J14043j00132k06321l4670
39633E863117J70648J51065J4350j3089M4032M4853K5435Q2897J26507K2144j25413
39622F406546j04493N6291J26271K9134o6892j4211J52848L27272M29002L93859
39612G735627K29283Q7426J20531K55157K81444J83517J79345L62546N10798M00815
39602A0346489J63249J22441L45987N56935N11317K92969J59101K12805L35648
39593A3046941L85317L53988L40367M36392O36857Q12374Q04404O18647M81961
$$ plain form
39584 17917248 18512548 19370247 20358275 21281284 22176214 23223280 24421788 25577560 26637551
39575 26637551 27813515 29277612 30931417 32622154 34429010 36554401 39042058 41790710
39567 41790710 44768162 48017609 51503577 55158395 59078639 63498774 68567241 74314076
39559 74314076 80830472 88279757 96702065 106016354 116292180 127838757 140938798 155675603
39551 155675603 172131559 190552705 211106198 233573033 257453099 282253986 307396233
39544 307396233 331782336 353643802 370932735 381875370 385293700 380736784 368587240
39537 368587240 350073749 327043164 301545075 275420627 250026503 226139694 204058009
39530 204058009 183839819 165520770 149156096 134710048 121978273 110681196 100633545
$$ packed form
39584A7917248N95300Q57699R88028R23009Q94930J047066J198508J155772J059991
39575B6637551J175964J464097J653805J690737J806856K125391K487657K748652
39567D1790710K977452L249447L485968L654818L920244M420135N068467N746835
39559G4314076O516396P449285Q422308R314289J0275826J1546577J3100041J4736805
39551A55675603J6455956J8421146K0553493K2466835K3880066K4800887K5142247
39544C07396233K4386103K1861466J7288933J0942635L418330m556916j2149544
39537C68587240j8513491k3030585k5498089k6124448k5394124k3886809k2081685
39530B04058009k0218190j8319049j6364674j4446048j2731775j1297077j0047651
$$ plain form
39523 100633545 91768362 83982057 77036760 70687180 64854439 59587844 54892552 50704100
39515 50704100 47008189 43831998 41076398 38498991 35952022 33534464 31413562 29586174
39507 29586174 27928969 26405705 25071145 23885428 22672013 21312327 19905268 18682142
39499 18682142 17784736 17134170 16497941 15697567 14771401 13913430 13247742 12722517 12240809
39490 12240809 11788675 11363301 10890904 10352243 9905887 9707184 9636124 9400252 8928425
39481 8928425 8470462 8240193 8140892 7957622 7666856 7397061 7185322 6952417 6678785 6440373
39471 6440373 6266286 6095522 5897619 5726542 5624191 5561069 5504176 5462827 5433568 5374115
39461 5374115 5268915 5150896 5019920 4815774 4531272 4286070 4207754 4274743 4350162 4347747
$$ packed form
39523A00633545q865183p786305o945297o349580n832741n266595m695292m188452
39515E0704100l695911l176191k755600k577407k546969k417558k120902j827388
39507B9586174j657205j523264j334560j185717j213415j359686j407059j223126
39499A8682142q97406o50566o36229q00374r26166q57971o65688n25225m81708
39490A2240809m52134m25374m72397n38661m46356j98703p1060k35872m71827
39481H928425m57963k30269r9301j83270k90766k69795k11739k32905k73632k38412
39471F440373j74087j70764j97903j71077j02351o3122n6893m1349k9259n9453
39461E374115j05200j18019j30976k04146k84502k45202p8316O6989P5419k415
$$ plain form
39451 4347747 4291726 4224153 4128301 3962336 3730135 3514518 3456723 3656461 4029857 4312291
39441 4312291 4309719 4139736 4108510 4334759 4624415 4757216 4743534 4697829 4609181 4415394
39431 4415394 4210521 4155984 4199152 4098760 3773294 3419255 3198692 3015571 2755702 2564623
39421 2564623 2640639 2839087 2769243 2325871 1880649 1818167 2053057 2178667 1997877 1714419
39411 1714419 1611082 1715499 1849266 1886253 1855834 1840938 1875381 1942359 2001788 2002575 1922431
39400 1922431 1816305 1774515 1803609 1801168 1696150 1566204 1544515 1640913 1743350 1785680 1805448
39389 1805448 1810081 1705700 1445535 1165996 1054718 1113064 1170271 1142291 1154680 1341441
39379 1341441 1607033 1702629 1535491 1308370 1301851 1568677 1908319 2115843 2160475 2101809
$$ packed form
39451D347747n6021o7573r5852j65965k32201k15617n7795J99738L73396K82434
39441D312291k572j69983l1226K26249K89656J32801j3682m5705q8648j93787
39431D415394k04873n4537M3168j00392l25466l54039k20563j83121k59869j91079
39421B564623P6016J98448o9844m43372m45222o2482K34890J25610j80790k83458
39411A714419j03337J04417J33767L6987l0419j4896L4443O6978N9429P87q0144
39400A922431j06126m1790K9094k441j05018j29946k1689R6398J02437M2330J9768
39389A805448M633j04381k60165k79539j11278N8346N7207k7980J2389J86761
39379A341441K65592R5596j67138k27121o519K66826L39642K07524M4632n8666
$$ plain form
39369 2101809 1952160 1729389 1571313 1634888 1869649 2032920 1980169 1820074 1719496 1681870
39359 1681870 1621699 1550878 1554545 1646174 1775565 1928223 2086005 2139771 1994747 1739147
39349 1739147 1553457 1461266 1328338 1108046 910376 802235 726905 677031 751586 940953
39339 940953 1037762 901696 667357 542358 533095 533032 552308 655565 764216 746790 663337
39328 663337 701730 884602 1047806 1105552 1115266 1063634 842192 516240 371467 544493
39318 544493 804019 872005 796125 805034 935128 1042830 1101712 1216864 1352913 1312919 1053335
39307 1053335 792845 699330 668180 567350 530821 772456 1179374 1351748 1102513 717239
39297 717239 596489 772724 937152 875848 698622 620116 674404 732424 702501 610786 536056
$$ packed form
39369B101809j49649k22771j58076O3575K34761J63271n2751j60095j00578l7626
39359A681870o0171p0821L667R1629J29391J52658J57782N3766j45024k55600
39349A739147j85690r2191j32928k20292j97670j08141p5330m9874P4555J89367
39339I40953R6809j36066k34339j24999r263o3J9276J03257J08651j7426q3453
39328F63337L8393J82872J63204N7746R714n1632k21442l25952j44773J73026
39318E44493K59526O7986p5880Q909J30094J07702N8882J15152J36049l9994k59584
39307A053335k60490r3515l1150j00830l6529K41635M06918J72374k49235l85274
39297G17239j20750J76235J64428o1304j77226p8506N4288N8020k9923r1715p4730
$$ plain form
39286 536056 554608 704957 913467 1000008 876783 712569 750597 957098 1022057 770891
39276 770891 410832 256853 353775 519977 650882 780614 891582 873441 705090 527320
39266 527320 486843 605197 808347 975147 964389 741234 497300 490450 719584 908547
39256 908547 867663 706302 604501 554485 469576 393636 413917 467023 429290 344560 372828
39245 372828 535630 685849 727045 707379 693244 694227 715602 744470 688710 484642 264868
39234 264868 244342 420632 573028 593179 604463 678917 669313 474383 273192 292495 479455
39223 479455 616743 653916 689571 694291 521079 209113 33254 163742 451565 646704
39213 646704 689214 680368 679482 655172 580880 471340 342575 205527 88496 21336 6688
$$ packed form
39286E36056J8552J50349K08510Q6541j23225j64214L8028K06501O4959k51166
39276G70891l60059j53979R6922J66202J30905J29732J10968j8141j68351j77770
39266E27320m0477J18354K03150J66800j0758k23155k43934o850K29134J88963
39256I08547m0884j61361j01801n0016q4909p5940K0281N3106l7733q4730K8268
39245C72828J62802J50219M1196j9666j4135R83K1375K8868n5760k04068k19774
39234B64868k0526J76290J52396K0151J1284P4454r604j94930k01191J9303J86960
39223D79455J37288L7173L5655M720j73212l11966j75859J30488K87823J95139
39213F46704M2510q846q86k4310p4292j09540j28765j37048j17031o7160j4648
$$ plain form
39202 6688 23714 33052 -25711 -181413 -348460 -361465 -150212 156093 350850 352875 250264
39191 250264 176722 194971 277219 340391 304047 163150 8174 -63627 -52847 -29364 -5220
39180 -5220 90447 276284 433702 441345 354848 335531 391098 326776 39040 -263065 -286801
39169 -286801 -47906 152896 146459 82977 133611 209593 133856 -59590 -197881 -246969 -299077
39158 -299077 -327678 -192249 85373 264868 191140 -3867 -85945 27023 266113 522514
39148 522514 661222 558238 251758 -37289 -150009 -166520 -226443 -276535 -157488 116885
39138 116885 339003 364473 259999 188868 250157 423986 579754 558069 351461 184080
39128 184080 290274 620655 892034 925835 798192 647566 503944 371113 322283 404072
$$ packed form
39202F688J7026R338n8763j55702j67047j3005K11253L06305J94757K025j02611
39191B50264p3542J8249Q2248O3172l6344j40897j54976p1801J0780K3483K4144
39180e220R5667J85837J57418P643q6497j9317N5567o4322k87736l02105k3736
39169b86801K38895K00802o437o3482N0634P5982p5737j93446j38291m9088n2108
39158b99077k8601J35429K77622J79495p3728j95007q2078J12968K39090K56401
39148E22514J38708j02984l06480k89047j12720j6511n9923n0092J19047K74373
39138A16885K22118K5470j04474p1131O1289J73829J55768k1685k06608j67381
39128A84080J06194L30381K71379L3801j27643j50626j43622j32831m8830Q1789
$$ plain form
39118 404072 545694 660113 751694 841416 884691 870960 913739 1105772 1345745 1454971
39108 1454971 1432962 1445722 1565035 1675350 1673695 1616704 1594003 1570768 1462569 1301583 1218927
39097 1218927 1277915 1407924 1507365 1547059 1551162 1524893 1450024 1350450 1315563 1406551 1543388
39086 1543388 1557343 1400726 1237200 1239197 1348036 1358478 1220140 1101752 1131676 1238247
39076 1238247 1316365 1387119 1475701 1486952 1368129 1266211 1319873 1396570 1279350 1048626
39066 1048626 989697 1128941 1186982 1064801 1029794 1233056 1356497 1043310 475293 178046
39056 178046 343492 667141 828242 823149 788362 770139 763100 772288 745453 601799 388411
39045 388411 254377 230184 206751 170870 251085 455402 588636 555166 529105 652961 760775
$$ packed form
39118D04072J41622J14419R1581Q9722M3275j3731M2779J92033K39973J09226
39108A454971k2009J2760J19313J10315j655n6991k2701k3235j08199j60986q2656
39097A218927N8988J30009R9441L9694M103k6269p4869r9574l4887R0988J36837
39086A543388J3955j56617j63526J997J08839J0442j38338j18388K9924J06571
39076A238247P8118P0754Q8582J1251j18823j01918N3662P6697j17220k30724
39066A048626n8929J39244N8041j22181l5007K03262J23441l13187n68017k97247
39056A78046J65446L23649J61101n093l4787j8223p039R188k6835j43654k13388
39045C88411j34034k4193k3433l5881Q0215K04317J33234l3470k6061J23856J07814
$$ plain form
39034 760775 625671 347199 240963 401459 604228 634828 520557 411677 385265 406719
39024 406719 386920 258329 59251 -78523 -86821 -46132 -34510 14680 172986 322374 280936
39013 280936 81511 -59896 -39582 52983 145496 267390 384148 355204 156648 -17745
39003 -17745 524 129417 172418 88285 6156 33426 160310 323793 471342 564993 585516
38992 585516 545880 488652 478108 571915 744978 859583 803943 671259 694204 952474 1236296
38981 1236296 1270369 1011206 658295 426489 382006 468226 604270 729121 782838 698377
38971 698377 466917 213865 124469 229847 343524 307950 227995 317825 575458 795945
38961 795945 885922 948483 1030566 1021980 894107 816674 894972 973158 861028 606600 381397
$$ packed form
39034G60775j35104k78472j06236J60496K02769L0600j14271j08880k6412K1454
39024D06719j9799j28591j99078j37774q298M0689J1622M9190J58306J49388m1438
39013B80936j99425j41407K0314R2565R2513J21894J16758k8944j98556j74393
39003a7745J8269J28893M3001q4133q2129K7270J26884J63483J47549R3651K0523
38992E85516l9636n7228j0544R3807J73063J14605n5640j32684K2945K58270K83822
38981A236296L4073k59163l52911k31806m4483Q6220J36044J24851N3717q4461
38971F98377k31460k53052q9396J05378J13677l5574p9955Q9830K57633K20487
38961G95945Q9977O2561Q2083q586j27873p7433P8298P8186j12130k54428k25203
$$ plain form
38950 381397 239531 167635 228280 435465 603131 562093 447813 511112 690888 667302
38940 667302 358508 74467 88829 310919 510292 640437 760491 809803 684207 458216
38930 458216 331838 370255 443112 423227 327189 248970 255356 368498 563257 738478 753734
38919 753734 557763 266542 68679 43660 99272 101759 35254 -11341 6726 38355 56025
38908 56025 128665 294972 440131 421556 287224 236956 357406 518650 566885 504820 425288
38897 425288 367053 311576 245802 149550 -18758 -243891 -406888 -393916 -224233 -13604
38887 -13604 146010 209341 144429 -17548 -131172 -60089 132777 223604 93168 -132294
38877 -132294 -247803 -189990 -27513 181332 408831 575092 574422 408183 200486 51936
$$ packed form
38950C81397j41866p1896O0645K07185J67666m1038j14280O3299J79776k3586
38940F67302l08794k84041J4362K22090J99373J30145J20054M9312j25596k25991
38930D58216j26378L8417P2857j9885r6038p8219O386J13142J94759J75221J5256
38919G53734j95971k91221j97863k5019N5612K487o6505m6595J8067L1629J7670
38908E6025P2640J66307J45159j8575j34332n0268J20450J61244M8235o2065p9532
38897D25288n8235n5477o5774r6252j68308k25133j62997J2972J69683K10629
38887a3604J59614O3331o4912j61977j13624P1083J92866R0827j30436k25462
38877a32294j15509N7813J62477K08845K27499J66261o70j66239k07697j48550
$$ plain form
38867 51936 -41154 -94747 -72246 15586 46997 -53991 -162136 -97073 104415 222574 168651
38856 168651 92841 124980 177450 112345 -36384 -146151 -203178 -259615 -266360 -117042 167728
38845 167728 441243 596970 615208 491934 274682 132392 203383 372277 387754 227168
38835 227168 141626 276261 454487 457990 340278 304448 407054 554387 689003 801587
38825 801587 833545 755698 701247 828562 1056644 1124276 948504 756141 786070 996175
38815 996175 1161559 1164709 1078292 1017235 1019379 1061883 1108423 1121911 1083419 1019324 974235 934762
38803 934762 810502 535825 195436 3205 104922 399409 599514 502757 189369 -68169
38793 -68169 -82508 79374 195561 131285 -37485 -141187 -123497 -78731 -80991 -60933 75342
$$ packed form
38867E1936r3090n3593K2501Q7832L1411j00988j08145O5063K01488J18159n3923
38856A68651p5810L2139N2470o5105j48729j09767n7027n6437o745J49318K84770
38845A67728K73515J55727J8238j23274k17252j42290P0991J68894J5477j60586
38835B27168q5542J34635J78226L503j17712l5830J02606J47333J34616J12584
38825H01587L1958p7847n4451J27315K28082O7632j75772j92363K9929K10105
38815I96175J65384L150q6417o1057K144M2504M6540J3488l8492o4095m5089l9473
38803I34762j24260k74677l40389j92231J01717K94487K00105r6757l13388k57538
38793f8169j4339J61882J16187o4276j68770j03702J7690M4766k260K0058J36275
$$ plain form
38782 75342 264258 339455 263378 184982 232165 350285 401299 332677 181343 -4899 -161516
38771 -161516 -189414 -50296 144467 226782 146932 2744 -77085 -23658 152882 353860
38761 353860 428413 303359 73350 -95813 -135625 -93558 -22346 71380 189744 325605
38751 325605 457802 507354 363556 56006 -166560 -88040 164834 238784 1806 -304275
38741 -304275 -418605 -382150 -380410 -425115 -384734 -255915 -200016 -298527 -433865 -467855 -422464
38730 -422464 -404951 -424088 -372842 -184139 64284 230849 269086 263513 300664 355199 355002
38719 355002 321778 350153 437556 447860 310219 157002 150556 230323 175556 -78668 -327457
38708 -327457 -354845 -203066 -95777 -152806 -280703 -334841 -299460 -269621 -301764 -338434 -291335
$$ packed form
38782G5342J88916P5197p6077p8396M7183J18120N1014o8622j51334j86242j56617
38771a61516k7898J39118J94763Q2315p9850j44188p9829N3427J76540K00978
38761C53860P4553j25054k30009j69163l9812M2067P1212R3726J18364J35861
38751C25605J32197M9552j43798l07550k22566P8520K52874P3950k36978l06081
38741c04275j14330L6455J740m4705M0381J28819N5899r8511j35338l3990M5391
38730d22464J7513j9137N1246J88703K48423J66565L8237n573L7151N4535j97
38719C55002l3224K8375Q7403J0304j37641j53217o446P9767n4767k54224k48789
38708c27457k7388J51779J07289n7029j27897n4138L5381K9839l2143l6670M7099
$$ plain form
38697 -291335 -169414 -85545 -123243 -228220 -269115 -190941 -63321 19489 35222 24689 41487
38686 41487 122906 247643 302330 171847 -89060 -261313 -219144 -102477 -119946 -247577
38676 -247577 -276536 -130173 45593 125656 152613 173978 114883 -63696 -224779 -224976 -120010
38665 -120010 -50281 -15412 68249 163013 156358 69178 20604 6854 -76104 -186517 -142388
38654 -142388 72531 226283 160923 10907 -18766 67367 125285 82699 -50620 -255062
38644 -255062 -442774 -444063 -209767 59295 133489 31688 -57057 -44619 13388 67977 102428
38633 102428 61342 -79670 -207697 -189470 -64574 21809 40545 82273 177799 272381 343988
38622 343988 386343 319238 102661 -95566 -59023 160969 309433 310313 335438 449955 460378
$$ packed form
38697b91335J21921Q3869l7698j04977m0895P8174J27620Q2810J5733j0533J6798
38686D1487Q1419J24737N4687j30483k60907j72253M2169J16667j7469j27631
38676b47577k8959J46363J75766Q0063K6957K1365n9095j78579j61083j97J04966
38665a20010O9729L4869Q3661R4764o655q7180m8574j3750q2958j10413M4129
38654a42388K14919J53752o5360j50016k9673Q6133N7918m2586j33319k04442
38644b55062j87712j289K34296K69062P4194j01801q8745J2438N8007N4589L4451
38633A02428m1086j41012j28027J8227J24896Q6383J8736M1728R5526R4582P1607
38622C43988M2355o7105k16577j98227L6543K19992J48464Q80K5125J14517J0423
$$ plain form
38611 460378 235393 -50058 -147202 -41063 115154 222214 253771 193957 99255 102827 225556
38600 225556 302960 232185 162920 283686 525980 655143 584256 435819 340729 319346 327894
38589 327894 308673 230586 157502 200444 329632 361350 240383 177130 331259 508675 409229
38578 409229 75323 -171458 -191714 -149519 -169665 -151624 651 190514 270656 204843 15521
38567 15521 -260538 -490463 -494396 -275907 -53651 27859 59849 137905 152500 -14670 -225847
38556 -225847 -242535 -85494 -17804 -159220 -315710 -265936 -66674 49281 -28 -63970
38546 -63970 -8485 79503 23228 -170562 -295245 -216008 -38482 62438 80616 132910 244347
38535 244347 321594 319633 295393 285967 261068 221162 223222 271762 291827 248510 189630 134338
$$ packed form
38611D60378k24985k85451r7144J06139J56217J07060L1557n9814r4702L572J22729
38600B25556P7404p0775o9265J20766K42294J29163p0887j48437r5090k1383Q548
38589C27894j9221p8087p3084M2942J29188L1718j20967o3253J54129J77416r9446
38578D09229l33906k46781k0256M2195k0146J8041J52275J89863Q0142o5813j89322
38567A5521k76059k29925l933K18489K22256Q1510L1990P8056J4595j67170k11177
38556b25847j6688J57041O7690j41416j56490M9774J99262J15955m9309o3942
38546f3970N5485Q7988n6275j93790j24683P9237J77526J00920J8178N2294J11437
38535B44347P7247j961k4240r426k4899l9906K060M8540K0065m3317n8880n5292
$$ plain form
38523 134338 35379 -96160 -147620 -65414 35385 5727 -158914 -330469 -366886 -185888
38513 -185888 168730 479510 503218 257615 43119 74723 214446 203388 42656 -37004
38503 -37004 83466 288081 419784 431308 349257 240562 216224 322455 420226 318073
38493 318073 42040 -170326 -169896 -42650 76706 171088 245207 222904 69041 -90870 -109712
38482 -109712 -19849 24129 -30256 -74359 4153 189229 369770 452234 431277 368561 297667
38471 297667 171589 -32847 -179765 -81993 204262 350552 161295 -112730 -68091 297900
38461 297900 563846 448649 172504 136404 419248 769787 988826 1107855 1204578 1236558
38451 1236558 1127803 904681 669107 498655 420107 418602 423074 343329 184673 79471
$$ packed form
38523A34338r8959j31539n1460Q2206J00799k9658j64641j71555l6417J80998
38513a85888L54618L10780K3708k45603k14496L1604J39723j1058j60732p9660
38503c7004J20470K04615J31703J1524q2051j08695k4338J06231R7771j02153
38493C18073k76033k12366M30J27246J19356R4382P4119k2303j53863j59911j8842
38482a09712Q9863M3978n4385m4103P8512J85076J80541Q2464k0957o2716p0894
38471B97667j26078k04436j46918R7772K86255J46290j89257k74025M4639L65991
38461B97900K65946j15197k76145l6100K82844L50539K19039J19029R6723L1980
38451A236558j08755k23122k35574j70452p8548j505M472p9745j58656j05202
$$ plain form
38441 79471 136383 293005 391367 371156 299674 226238 125858 20815 34358 219831 408760
38430 408760 367378 103232 -110356 -65656 120318 162688 -32775 -274725 -345201 -251708
38420 -251708 -172638 -216015 -311243 -335225 -279144 -245814 -298306 -363955 -324018 -174251 -33266
38409 -33266 22550 57132 147442 226684 171706 25190 -15523 128291 292850 303056 198737
38398 198737 107175 11627 -162400 -298444 -168925 204331 490560 453931 247290 171160
38388 171160 274398 360324 312264 234197 267006 395790 478017 403076 206788 47001 42662
38377 42662 131381 152845 82644 61620 139232 143335 -64351 -336545 -426160 -333329 -261510
38366 -261510 -280953 -261893 -139486 -22947 -1602 -39911 -116309 -271932 -450341 -481893 -330737
$$ packed form
38441G9471N6912J56622R8362k0211p1482p3436j00380j05043J3543J85473J88929
38430D08760m1382k64146k13588M4700J85974M2370j95463k41950p0476R3493
38420b51708P9070m3377r5228k3982N6081L3330n2492o5649L9937J49767J40985
38409c3266N5816L4582R0310P9242n4978j46516m0713J43814J64559J0206j04319
38398A98737r1562r5548j74027j36044J29519L73256K86229l6629k06641p6130
38388A71160J03238Q5926m8060p8067L2809J28784Q2227p4941j96288j59787m339
38377D2662Q8719K1464p0201k1024P7612M103k07686k72194q9615R2831P1819
38366b61510j9443J9060J22407J16539K1345l8309p6398j55623j78409l1552J51156
$$ plain form
38355 -330737 -186030 -189872 -233468 -160538 -28585 -2871 -98107 -198308 -262160 -340100 -424907
38344 -424907 -440584 -376906 -315439 -311044 -324460 -272529 -104678 135983 300049 255947 68024
38333 68024 -52565 -35117 -57925 -273018 -562678 -714007 -712380 -686973 -668281 -599511 -510794
38322 -510794 -465027 -384213 -163339 68576 53537 -208168 -419577 -389535 -239277 -129736
38312 -129736 -24457 142077 273888 271543 221671 236739 224302 22547 -297285 -461775
38302 -461775 -321608 4255 312287 510244 615332 675694 735148 798525 795884 635905
38292 635905 326512 8708 -152143 -96700 98639 291547 371221 317371 190170 75312
38282 75312 35668 85013 176708 233801 226687 209366 246795 332787 421667 496497 536194 467994
$$ packed form
38355c30737J44707l842m3596P2930J31953K5714r5236j00201o3852p7940q4807
38344d24907j5677O3678O1467M395j3416N1931J67851K40661J64066m4102j87923
38333F8024j20589J7448k2808k15093k89660j51329J627K5407J8692O8770Q8717
38322e10794M5767Q0814K20874K31915j5039k61705k11409L0042J50258J09541
38312a29736J05279J66534J31811k345m9872J5068j2437k01755l19832j64490
38302d61775J40167L25863L08032J97957J05088O0362N9454O3377k641j59979
38292F35905l09393l17804j60851N5443J95339J92908P9674n3850j27201j14858
38282G5312l9644M9345R1695N7093p114j7321L7429Q5992Q8880P4830L9697o8200
$$ plain form
38270 467994 266356 69159 53981 193360 278868 212751 114420 84283 45174 -61993 -86118
38259 -86118 146643 535672 777376 712191 458410 211579 45407 -70477 -167878 -246066
38249 -246066 -290190 -295566 -285045 -281957 -250827 -119187 103195 289008 330216 247596 110719
38238 110719 -63723 -247200 -320618 -188253 72801 291409 397498 436798 436136 372270 244799
38227 244799 72692 -139604 -325065 -323509 -93332 117177 35848 -217472 -242609 69645
38217 69645 356115 296284 45877 -53494 16184 15322 -102501 -132951 -6463 79600 9151
38206 9151 -27835 171822 481688 602016 469345 305628 287722 369419 461481 590244 769388
38195 769388 868302 776128 616310 614453 774131 869142 786288 691369 768447 955553 1072855
$$ packed form
38270D67994k01638j97197j5178J39379Q5508o6117r8331l0137l9109j07167k4125
38259h6118K32761L89029K41704o5185k53781k46831j66172j15884r7401p8188
38249b46066m4124n376J0521L088L1130J31640K22382J85813M1208q2620j36877
38238A10719j74442j83477p3418J32365K61054K18608J06089L9300o62o3866j27471
38227B44799j72107k12296j85461J556K30177K10509q1329k53320k5137L12254
38217F9645K86470n9831k50407r9371O9678q62j17823l0450J26488Q6063p0449
38206I151l6986J99657L09866J20328j32671j63717j7906Q1697R2062J28763J79144
38195G69388R8914r2174j59818j857J59678R5011q2854r4919P7078J87106J17302
$$ plain form
38184 1072855 1090597 1109283 1160618 1209171 1301661 1513860 1749480 1798116 1653805 1593681 1827085
38173 1827085 2197362 2367224 2225625 1981846 1886330 1968010 2056500 1994782 1804126 1652240
38163 1652240 1657329 1739479 1712311 1516497 1290005 1188938 1216087 1263036 1248656 1167363 1062738
38152 1062738 1001084 1013805 1028842 930839 729320 575925 556642 575058 534157 518830 647101
38141 647101 816354 785263 499898 167707 -18087 -70243 -74068 -19543 124671 271298
38131 271298 277913 124126 -56261 -109994 5950 191879 267641 125945 -123071 -223652
38121 -223652 -66065 152621 161655 -33165 -165379 -67016 140627 260220 268578 247341 192409
38110 192409 61069 -55113 -48 194520 307154 232411 121678 129001 183615 165689 162172
$$ packed form
38184A072855J7742J8686N1335M8553R2490K12199K35620M8636j44311o0124K33404
38173A827085L70277J69862j41599k43779r5516Q1680Q8490o1718j90656j51886
38163A652240N089Q2150k7168j95814k26492j01067K7149M6949j4380q1293j04625
38152A062738o1654J2721J5037r8003k01519j53395j9283J8416m0901j5327J28271
38141F47101J69253l1091k85365l32191j85794n2156l825N4525J44214J46627
38131B71298O615j53787j80387n3733J15944J85929P5762j41696k49016j00581
38121b23652J57587K18686R034j94820j32214R8363K07643J19593Q358k1237n4932
38110A92409j31340j16182N5065J94568J12634p4743j10733P323N4614j7926l517
$$ plain form
38099 162172 320863 521856 464883 118438 -167213 -107411 159558 318100 306934 288049
38089 288049 292105 168228 -99541 -279061 -210733 -65089 -111343 -324127 -413600 -241033
38079 -241033 -20199 -19251 -190881 -247620 -61117 178915 243556 159789 125952 232185 402202
38068 402202 556547 671705 685761 521724 256769 111695 178474 281804 220057 38274
38058 38274 -65622 -21890 66718 103068 67302 -55001 -257280 -425659 -419177 -262112 -126940
38047 -126940 -99380 -92930 -34093 14129 -9986 -39301 -613 34714 -44566 -192708 -247595
38036 -247595 -145175 25663 174817 296246 382324 377238 287588 250426 381019 579385
38026 579385 600662 355392 61551 18934 256301 488542 447719 182135 -35766 -45356
$$ packed form
38099A62172J58691K00993n6973l46445k85651N9802K66969J58542j1166j8885
38089B88049M056j23877k67769j79520O8328J45644m6254k12784q9473J72567
38079b41033K20834R48j71630n6739J86503K40032O4641q3767l3837J06233J70017
38068D02202J54345J15158J4056j64037k64955j45074O6779J03330o1747j81783
38058C8274j03896M3732Q8608L6350l5766j22303k02279j68379O482J57065J35172
38047a26940K7560O450N8837M8222k4115k9315L8688L5327p9280j48142n4887
38036b47595J02420J70838J49154J21429Q6078n086q9650l7162J30593J98366
38026E79385K1277k45270k93841m2617K37367K32241m0823k65584k17901r590
$$ plain form
38016 -45356 62455 141328 205386 366161 616917 794640 766780 569457 329215 128963
38006 128963 11614 35704 205991 375680 364193 207621 151935 318923 518440 524368
37996 524368 407861 395735 484604 460384 292509 211025 307756 356262 201736 61579 179353
37985 179353 391995 371295 169040 151705 418255 650420 606950 430440 329251 252616
37975 252616 83160 -78260 -64319 60260 82821 -43589 -161055 -146176 -37882 53865
37965 53865 54065 -39528 -142249 -146972 -65518 -34071 -114496 -198225 -200441 -219971 -361107 -512536
37953 -512536 -495060 -356544 -310640 -411256 -498539 -477013 -439638 -464387 -477168 -406372 -317158
37942 -317158 -278841 -220867 -54097 141866 193660 74681 -48379 -25524 110263 225066
$$ packed form
38016d5356J07811P8873O4058J60775K50756J77723k7860j97323k40242k00252
38006A28963j17349K4090J70287J69689j1487j56572n5686J66988J99517N928
37996E24368j16507j2126Q8869k4220j67875q1484R6731M8506j54526j40157J17774
37985A79353K12642k0700k02255j7335K66550K32165m3470j76510j01189p6635
37975B52616j69456j61420J3941J24579K2561j26410j17466J4879J08294R1747
37965E3865K00r3593j02721m723Q1454L1447q0425q3729k216j9530j41136j51429
37953e12536J7476J38516M5904j00616q7283K1526L7375k4749j2781P0796Q9214
37942c17158L8317N7974J66770J95963N1794j18979j23060K2855J35787J14803
$$ plain form
37932 225066 260617 252671 202600 39993 -237232 -474188 -517019 -413901 -327241 -267388 -90819
37921 -90819 200512 364661 253712 73617 120741 362593 484407 303149 -55425 -367651
37911 -367651 -514927 -479176 -317583 -176301 -185742 -306804 -389290 -379774 -346797 -318111 -251143
37900 -251143 -168004 -153364 -195064 -186725 -116874 -95284 -158695 -211711 -195211 -149069 -82171 26706
37888 26706 61623 -164478 -584189 -842038 -722159 -414805 -214583 -149799 -86100 -15119
37878 -15119 -20585 -80224 -109174 -114281 -133097 -116158 -38764 -24967 -179739 -395240 -503703
37867 -503703 -520616 -550510 -568611 -511087 -466424 -529241 -567109 -414090 -212579 -238871 -428797
37856 -428797 -435876 -190440 -33272 -182471 -403393 -383680 -158992 38145 129314 174182
$$ packed form
37932B25066L5551p946n0071j62607k77225k36956m2831J03118Q6660N9853J76569
37921i0819K91331J64149j10949j80095M7124K41852J21814j81258l58574l12226
37911c67651j47276L5751J61593J41282r441j21062q2486R516L2977K8686O6968
37900b51143Q3139J4640m1700Q339O9851K1590o3411n3016J6500M6142O6898J08877
37888B6706L4917k26101m19711k57849J19879L07354K00222O4784O3699P0981
37878a5119n466n9639k8950n107j8816J6939P7394J3797j54772k15501j08463
37867e03703j6913k9894j8101N7524M4663o2817l7868J53019K01511k6292j89926
37856d28797p079K45436J57168j49199k20922J9713K24688J97137R1169M4868
$$ plain form
37846 174182 177507 126753 99941 148870 172400 62822 -117340 -239843 -278817 -238644 -52061
37835 -52061 269187 497751 418471 135742 -37567 36513 215262 313552 276683 139582
37825 139582 -16495 -69069 33180 162165 147538 6545 -104334 -139380 -187939 -252888
37815 -252888 -210567 -44089 75555 34233 -62766 -82981 -72013 -126514 -188092 -140767 -37913
37804 -37913 -41663 -159996 -229998 -179527 -120399 -116332 -41882 184766 363618 215936 -210475
37793 -210475 -545230 -543279 -350757 -241990 -259135 -261101 -209342 -205425 -282263 -347498 -349063 -333841
37781 -333841 -307153 -190750 13853 156383 117480 -48446 -225175 -378826 -502694 -533891
37771 -533891 -450543 -371290 -425842 -575138 -674425 -666063 -593653 -477379 -318026 -199817 -232685
$$ packed form
37846A74182L325n0754k6812M8929K3530j09578j80162j22503l8974M0173J86583
37835e2061L21248K28564p9280k82729j73309P4080J78749R8290l6869j37101
37825A39582j56077n2574J02249J28985j4627j40993j10879l5046m8559o4949
37815b52888M2321J66478J19644m1322r6999k0215J0968n4501o1578M7325J02854
37804c7913l750j18333p0002N0471N9128M067P4450K26648J78852j47682m26411
37793b10475l34755J951J92522J08767j7145j966N1759L917p6838o5235j565J5222
37781c33841K6688J16403K04603J42530l8903j65926j76729j53651j23868l1197
37771e33891Q3348P9253n4552j49296r9287Q362P2410J16274J59353J18209l2868
$$ plain form
37760 -232685 -369235 -410957 -245432 18139 192652 206036 103612 -58748 -244323 -395846
37750 -395846 -445308 -382177 -285421 -267123 -374220 -542741 -657305 -659896 -593539 -546833 -571440
37739 -571440 -635914 -635326 -486010 -264746 -197859 -408938 -724863 -880693 -885797 -982106 -1228940
37728 -1228940 -1393203 -1352096 -1329845 -1537629 -1815768 -1894717 -1821257 -1821233 -1888940 -1865730 -1832850
37717 -1832850 -2026639 -2365588 -2461601 -2180141 -1821034 -1622839 -1451572 -1163229 -924894 -907658
37707 -907658 -942370 -795478 -581371 -568513 -714630 -735666 -569302 -437181 -442316 -409256 -200551
37696 -200551 46648 113429 -27093 -225942 -341784 -332696 -237099 -117748 5208 155022
37686 155022 288565 251876 -35998 -390601 -505723 -310183 -50858 21852 -64061 -98805
$$ packed form
37760b32685j36550m1722J65525K63571J74513J3384j02424j62360j85575j51523
37750c95846m9462O3131R6756J8298j07097j68521j14564k591O6357M6706k4607
37739e71440o4474N88J49316K21264O6887k11079l15925j55830n104r6309k46834
37728a228940j64263M1107K2251k07784k78139p8949P3460K4o7707K3210L2880
37717a832850j93789l38949r6013K81460L59107J98195J71267K88343K38335J7236
37707i07658l4712J46892K14107J2858j46117k1036J66364J32121n135L3060K08705
37696b00551K47199O6781j40522j98849j15842R088R5597J19351J22956J49814
37686A55022J33543l6689k87874l54603j15122J95540K59325P2710q5913l4744
$$ plain form
37676 -98805 22070 196022 261984 174114 17905 -108040 -190700 -271603 -350079 -373458 -318528
37665 -318528 -212381 -64531 132957 314647 361147 261706 144982 81507 -14346 -190704
37655 -190704 -314568 -269338 -161959 -143483 -135677 30154 275760 348970 225522 162231 295388
37644 295388 442448 405288 244056 114959 35241 -24553 15759 203290 361599 264428
37634 264428 -33210 -231270 -166598 1536 36463 -75332 -159684 -116509 -27399 3964 9269
37623 9269 66652 116644 19314 -182848 -236159 -27692 187070 102319 -195722 -348499 -239970
37612 -239970 -109262 -125446 -154811 -68901 -2660 -105936 -253568 -239256 -108485 -57876 -106860
37601 -106860 -109237 -28885 26022 15735 8897 24991 28093 63798 208214 384923 433339 370221
$$ packed form
37676i8805J20875J73952O5962q7870j56209j25945q2660q0903p8476k3379N4930
37665c18528J06147J47850J97488J81690M6500r9441j16724o3475r5853j76358
37655a90704j23864M5230J07379J8476P806J65831K45606P3210j23448o3291J33157
37644B95388J47060l7160j61232j29097p9718n9794M0312J87531J58309r7171
37634B64428k97638j98060O4672J68134L4927j11795q4352M3175Q9110L1363N305
37623I269N7383M9992r7330k02162n3311K08467K14762q4751k98041j52777J08529
37612b39970J30708j6184k9365Q5910O6241j03276j47632J4312J30771N0609m8984
37601a06860k377Q0352N4907j0287o838J6094L102L5705J44416J76709M8416o3118
$$ plain form
37589 370221 373969 475861 489014 321646 149123 151325 252929 267616 161657 26386 -94115
37578 -94115 -188397 -183580 -42056 93611 19660 -265425 -542004 -616434 -484574 -257522 -37869
37567 -37869 113818 184561 212621 229784 200499 81677 -71610 -146175 -116455 -63049 -40795
37556 -40795 -24182 656 -38 -6579 83763 304012 511483 529646 358506 167797 109733
37545 109733 201361 355742 456236 426650 302032 213266 239588 308041 310159 266764 262195
37534 262195 252841 106835 -142655 -261407 -127378 61195 32566 -190687 -325779 -194176
37524 -194176 96209 330512 408730 356244 236163 123204 90075 142515 196113 168398 81495
37513 81495 44113 136946 321825 455376 411942 229677 115007 237361 514927 675683
$$ packed form
37589C70221L748J01892J3153j67368j72523K202J01604J4687j05959j35271j20501
37578i4115r4282M817J41524J35667p3951k85085k76579p4430J31860K27052K19653
37567c7869J51687P0743K8060J7163k9285j18822j53287p4565K9720N3406K2254
37556d0795J6613K4838o94o541R0342K20249K07471J8163j71140j90709n8064
37545A09733R1628J54381J00494k9586j24618q8766K6322O8453K118m3395m569
37534B62195r354j46006k49490j18752J34029J88573k8629k23253j35092J31603
37524a94176K90385K34303P8218n2486j20081j12959l3129N2440N3598k7715q6903
37513H1495l7382R2833J84879J33551m3434j82265j14670J22354K77566J60756
$$ plain form
37503 675683 561932 311241 182927 252273 353368 316433 177265 100601 144184 192732
37493 192732 147148 83492 127926 226884 189181 -24401 -206484 -176270 -11395 112802 191374
37482 191374 322442 456753 437852 287372 232817 389289 588200 610923 458791 299722
37472 299722 251439 300220 350888 298045 133005 14507 116713 370940 511817 442138
37462 442138 365345 442092 522250 420300 285782 413680 755722 921396 699018 322165
37452 322165 132266 184521 307024 380289 399274 360046 249821 121508 56280 53323 40837
37441 40837 -8620 -53613 -77770 -121669 -185285 -175719 -28579 160145 222586 136980 46424
37430 46424 28322 -18557 -157273 -218362 -13481 324527 450575 267922 43099 -7010
$$ packed form
37503F75683j13751k50691j28314O9346J01095l6935j39168p6664M3583M8548
37493A92732m5584o3656M4434R8958l7703k13582j82083L0214J64875J24197P8572
37482A91374J31068J34311j8901j50480n4555J56472J98911K2723j52132j59069
37472B99722m8283M8781N0668n2843j65040j18498J02206K54227J40877o9679
37462D42138p6793P6747Q0158j01950j34518J27898L42042J65674k22378l76853
37452C22165j89899N2255J22503P3265J8985l9228j10225j28313o5228k957j2486
37441D0837m9457m4993k4157m3899o3616R566J47140J88724O2441q5606r0556
37430D6424j8102m6879j38716o1089K04881L38008J26048j82653k24823n0109
$$ plain form
37420 -7010 -1096 -125069 -291023 -276297 -70767 130022 205193 197970 183893 214371 330692
37409 330692 473960 449509 152671 -235577 -456194 -502410 -543982 -600261 -538729 -363057
37399 -363057 -233003 -185671 -96871 45854 93268 16086 -27445 5625 -61166 -292777 -458292
37388 -458292 -355326 -112724 19559 6530 -39144 -97898 -198622 -256892 -182829 -72107
37378 -72107 -85436 -197841 -256347 -229684 -205569 -180994 -62265 128018 238823 220560 205351
37367 205351 303979 452755 529788 530899 555196 654917 750843 704133 477870 215022 102882
37356 102882 160108 249292 316587 473327 757981 974155 926779 712579 585525 594931 558016
37345 558016 372375 155430 50106 69240 175251 348024 505615 504516 314683 92013
$$ packed form
37420g010N914j23973j65954J4726K05530K00789P5171p223j4077L0478J16321
37409C30692J43268k4451k96838l88248k20617m6216m1572n6279O1532J75672
37399c63057J30054M7332Q8800J42725M7414p7182m3531L3070o6791k31611j65515
37388d58292J02966K42602J32283j3029m5674n8754j00724n8270P4063J10722
37378g2107j3329j12405n8506K6663K4115K4575J18729J90283J10805j8263j5209
37367B05351R8628J48776P7033J111K4297R9721R5926m6710k26263k62848j12140
37356A02882N7226Q9184O7295J56740K84654K16174m7376k14200j27054R406l6915
37345E58016j85641k16945j05324J9134J06011J72773J57591j099j89833k22670
$$ plain form
37335 92013 -7877 -1506 13784 32354 115507 250087 347225 374612 397394 468492 548503 574519
37323 574519 562349 579482 629299 639616 602331 648394 886566 1199339 1324456 1159136 865077
37312 865077 633405 483247 375757 378922 554874 769772 809890 675313 586566 672096
37302 672096 799979 781617 624487 497480 519344 668694 866926 1062939 1220267 1278243
37292 1278243 1188192 1000374 861556 866567 940192 948198 908308 970114 1165783 1326355 1321416
37281 1321416 1247999 1266086 1354899 1371409 1275544 1156906 1088073 1077018 1118031 1171909 1147912
37270 1147912 1023551 921634 943070 994445 927728 780947 710919 743636 774807 776958 813932
37259 813932 875760 891354 881436 898018 841069 574185 223823 100923 272804 463723 461224
$$ packed form
37335I2013r9890O371J5290J8570Q3153J34580R7138K7387K2782P1098Q0011K6016
37323E74519j2170J7133M9817J0317l7285M6063K38172L12773J25117j65320k94059
37312H65077k31672j50158j07490L165J75952K14898M0118j34577q8747Q5530
37302F72096J27883j8362j57130j27007K1864J49350J98232J96013J57328N7976
37292A278243r0051j87818j38818N011P3625Q006l9890O1806J95669J60572m939
37281A321416p3417J8087Q8813J6510r5865j18638o8833j1055M1013N3878k3997
37270A147912j24361j01917K1436N1375o6717j46781p0028L2717L1171K151L6974
37259H13932O1828J5594r918J6582n6949k66884l50362j22900J71881J90919k499
$$ plain form
37248 461224 377328 394397 482829 519535 492432 427983 280870 58857 -83389 -41768 54601
37237 54601 11667 -163758 -300376 -294660 -196486 -122628 -161436 -297575 -392620 -337319 -233401
37226 -233401 -269604 -404391 -394873 -201720 -99325 -250566 -443404 -450722 -394316 -480282 -586177
37215 -586177 -441161 -86309 174508 209893 136726 12961 -220064 -483602 -562858 -428877
37205 -428877 -302050 -315901 -341381 -234329 -62404 16185 -48599 -203004 -368045 -455800
37195 -455800 -423231 -350185 -353772 -409829 -384441 -248233 -114153 -50876 -16707 -2621 -76898
37184 -76898 -246874 -430625 -604273 -816048 -1010695 -1018503 -796751 -523282 -364019 -292681
37174 -292681 -225003 -177244 -179142 -165833 -90918 -51796 -176099 -442989 -707681 -845758 -813431
$$ packed form
37248D61224q3896J7069Q8432L6706k7103o4449j47113k22013j42246M1621R6369
37237E4601m2934j75425j36618N716R8174P3858l8808j36139r5045N5301J03918
37226b33401l6203j34787R518J93153J02395j51241j92838p318N6406q5966j05895
37215e86177J45016L54852K60817L5385p3167j23765k33025k63538p9256J33981
37205d28877J26827j3851k5480J07052J71925P8589o4784j54405j65041q7755
37195d55800L2569P3046l587n6057K5388J36208J34080O3277L4169J4086p4277
37184g6898j69976j83751j73648k11775j94647p808K21752K73469J59263P1338
37174b92681O7678M7759j898J3309P4915L9122j24303k66890k64692j38077L2327
$$ plain form
37163 -813431 -648663 -478650 -437584 -507015 -520621 -380607 -166847 17132 164367 248955
37153 248955 154859 -133385 -399925 -437678 -334026 -333516 -474984 -564273 -491517 -371727 -327200
37142 -327200 -305101 -200337 -36559 83119 136973 192476 276381 322881 265706 128210 -7457
37131 -7457 -91670 -131323 -136111 -90175 11257 143678 288976 428259 472587 302857 -32474
37120 -32474 -258059 -162185 105970 202827 29224 -195482 -302265 -374723 -503602 -580235
37110 -580235 -497787 -373915 -377848 -468712 -502047 -482493 -493969 -469356 -283148 -42400 -23799
37099 -23799 -281642 -547247 -596143 -514689 -491222 -516943 -453119 -287573 -155057 -138333 -183541
37088 -183541 -209132 -191084 -123680 13412 198282 322678 264120 11561 -301257 -500293
$$ packed form
37163h13431J64768J70013M1066o9431j3606J40014K13760J83979J47235Q4588
37153B48955r4096k88244k66540l7753J03652N10j41468q9289P2756J19790M4527
37142c27200K2099J04764J63778J19678N3854N5503Q3905M6500n7175j37496j35667
37131g457q4213l9653m788M5936J01432J32421J45298J39283M4328j69730l35331
37120c2474k25585R5874K68155R6857j73603k24706j06783p2458j28879p6633
37110e80235Q2448J23872l933r0864l3335J9554j1476K4613J86208K40748J8601
37099b3799k57843k65605m8896Q1454K3467k5721O3824J65546J32516J6724m5208
37088a83541k5591J8048O7404J37092J84870J24396n8558k52559l12818j99036
$$ plain form
37078 -500293 -507526 -376845 -220341 -128262 -146633 -272187 -433017 -510795 -437907 -276321 -166990
37067 -166990 -185976 -261511 -248659 -96215 72575 86015 -59631 -178726 -144659 -75833 -153677
37056 -153677 -316408 -321130 -119597 39184 -32427 -197117 -237117 -196387 -271452 -465759 -587371
37045 -587371 -556572 -492446 -479789 -454352 -369986 -300398 -298752 -306510 -287861 -319019 -437258 -513057
37033 -513057 -400481 -146121 73531 181202 247751 327859 362690 275961 88769 -107130
37023 -107130 -250516 -345592 -415871 -460088 -455085 -378294 -223306 -22582 128204 110332 -93610
37012 -93610 -328538 -395888 -271694 -126620 -106156 -178173 -245958 -307270 -398281 -458311 -391453
37001 -391453 -237457 -144929 -165333 -194652 -147602 -78971 -82282 -157816 -242813 -304800 -337178
$$ packed form
37078e00293p233J30681J56504R2079j8371j25554j60830p7778P2888J61586J09331
37067a66990j8986p5535J2852J52444J68790J3440j45646j19095L4067O8826p7844
37056a53677j62731m722K01533J58781p1611j64690m0000M0730p5065j94307j21612
37045e87371L0799O4126J2657K5437Q4366O9588J646p758J8649l1158j18239p5799
37033e13057J12576K54360K19652J07671O6549Q0108L4831q6729j87192j95899
37023a07130j43386r5076p0279m4217N003P6791J54988K00724J50786j7872k03942
37012i3610k34928o7350J24194J45074K0464p2017o7785o1312r1011o0030O6858
37001c91453J53996R2528k0404k9319M7050O8631l311p5534q4997o1987l2378
$$ plain form
36990 -337178 -307943 -188183 -25463 68338 29693 -71241 -90485 22302 141860 110761
36980 110761 -40431 -104967 35927 259984 383622 393343 388194 381026 312904 220211 214156
36969 214156 288109 302706 195903 68758 12766 -25007 -140296 -333410 -535025 -688599
36959 -688599 -750205 -680854 -503354 -318936 -216593 -190515 -164115 -70252 79803 171479 74411
36948 74411 -180856 -374774 -345811 -199125 -137762 -161260 -120307 -19808 -26821 -168912 -274553
36937 -274553 -263974 -249788 -274527 -220929 -104291 -160789 -444134 -609522 -381017 -16252
36927 -16252 32628 -222035 -353800 -172766 52757 60336 -74384 -190495 -327906 -567037
36917 -567037 -788997 -814312 -670868 -532753 -453148 -336265 -164024 -80833 -184526 -339715
$$ packed form
36990c37178K9235J19760J62720R3801l8645j00934j9244J12787J19558l1099
36980A10761j51192o4536J40894K24057J23638R721n149p168o8122r2693o055
36969B14156P3953J4597j06803j27145n5992l7773j15289j93114k01615j53574
36959f88599o1606O9351J77500J84418J02343K6078K6400R3863J50055R1676r7068
36948G4411k55267j93918K8963J46686O1363k3498M0953J00499p013j42091j05641
36937b74553J0579J4186k4739N3598J16638n6498k83345j65388K28505L64765
36927a6252M8880k54663j31765J81034K25523P579j34720j16111j37411k39131
36917e67037k21960k5315J43444J38115P9605J16883J72241Q3191j03693j55189
$$ plain form
36907 -339715 -313327 -74479 150325 160548 25538 -44261 5301 46930 11195 -29431 -38719
36896 -38719 -87799 -177483 -180595 -76265 -59222 -259692 -514048 -592300 -507454 -399224 -255744
36885 -255744 -1563 242656 270063 113823 864 2727 -8790 -68796 -60999 12822 -26598
36874 -26598 -244593 -462647 -504785 -392127 -234377 -105634 -66513 -124230 -149587 -35928
36864 -35928 63931 -81937 -360247 -391753 -103847 127420 48530 -109601 -53314 115517
36854 115517 138503 26647 -57320 -119671 -224010 -249751 -89983 69106 4689 -141475
36844 -141475 -72267 160904 239445 95658 -44804 -118499 -306729 -606005 -718681 -510286
36834 -510286 -232957 -122493 -73982 81103 237969 201575 22205 -90787 -74235 -28141
$$ packed form
36907c39715K6388K38848K24804J0223j35010o9799M9562M1629l5735m0626r288
36896c8719m9080q9684l112J04330J7043k00470k54356p8252Q4846J08230J43480
36885b55744K54181K44219K7407j56240j12959J863j1517o0006P797P3821l9420
36874b6598k17995k18054m2138J12658J57750J28743L9121n7717k5357J13659
36864c5928R9859j45868k78310l1506K87906K31267p8890j58131N6287J68831
36854A15517K2986j11856q3967o2351j04339k5741J59768J59089o4417j46164
36844a41475O9208K33171P8541j43787j40462p3695j88230k99276j12676K08395
36834e10286K77329J10464M8511J55085J56866l6394j79370j12992J6552M6094
$$ plain form
36824 -28141 -15003 -19589 -44522 -92245 -100426 -26555 43645 -11634 -176795 -309456 -304547 -186091
36812 -186091 -65552 -50342 -148550 -237549 -193916 -73697 -62269 -205601 -315263 -222249 -13525
36801 -13525 96804 51520 -18450 -3571 59701 68324 -25800 -182433 -315581 -363901 -331870
36790 -331870 -255868 -155348 -62104 -53005 -153216 -231737 -128416 108955 264253 259093 253057
36779 253057 373767 518088 530458 430065 328312 242358 131398 20746 -46547 -100912
36769 -100912 -170711 -203859 -176184 -168616 -210238 -171040 30448 239892 279892 232392 279884
36758 279884 362736 267837 12321 -150511 -115723 -38505 -26812 -7496 25565 -78581 -330554
36747 -330554 -474798 -348484 -150806 -144009 -266772 -280933 -160336 -69137 -38382 60346 237902
$$ packed form
36824b8141J3138m586k4933m7723q181P3871P0200n5279j65161j32661M909J18456
36812a86091J20539J5210r8208q8999M3633J20219J1428j43332j09662R3014K08724
36801a3525J10329m5284o9970J4879O3272Q623r4124j56633j33148m8320L2031
36790c31870P6002J00520R3244R099j00211p8521J03321K37371J55298n160o036
36779B53057J20710J44321J2370j00393j01753q5954j10960j10652o7293n4365
36769a00912o9799l3148K7675P568m1622L9198K01488K09444M0000m7500M7492
36758B79884Q2852r4899k55516j62832L4788P7218J1693J9316L3061j04146k51973
36747c30554j44244J26314J97678O797j22763j4161J20597R1199L0755R8728J77556
$$ plain form
36736 237902 343595 334195 358871 498889 614774 561532 406210 304599 270241 201824 71416
36725 71416 -52334 -139256 -225700 -302077 -290103 -173496 -57767 -32071 -36181 48117 204265
36714 204265 279020 186972 29915 -34119 23214 107877 149879 161546 163794 134734 50760
36703 50760 -72760 -198307 -284711 -286223 -186506 -48771 22927 3128 -20984 25317 87188
36692 87188 52420 -70018 -119743 19356 230427 252339 -12304 -343302 -434324 -244551
36682 -244551 -11029 88559 137033 269856 414017 393777 217821 73867 49040 31912
36672 31912 -78214 -226672 -328545 -396321 -459792 -479466 -439315 -425319 -495436 -543774 -421212
36661 -421212 -157225 56646 102975 62360 82981 195538 290579 249423 76350 -95627
$$ packed form
36736B37902J05693r400K4676J40018J15885n3242j55322j01611l4358o8417j30408
36725G1416j23750q6922q6444p6377J1974J16607J15729K5696m110Q4298J56148
36714B04265P4755r2048j57057o4034N7333Q4663M2002J1667K248k9060q3974
36703E0760j23520j25547q6404j512R9717J37735P1698j9799k4112M6301O1871
36692H7188l4768j22438m9725J39099K11071K1912k64643l30998r1022J89773
36682b44551K33522R9588M8474J32823J44161k0240j75956j43954k4827j7128
36672C1912j10126j48458j01873o7776o3471j9674M0151J3996p0117m8338J22562
36661d21212K63987K13871M6329m0615K0621J12557R5041m1156j73073j71977
$$ plain form
36651 -95627 -134512 -45214 40429 7154 -136301 -287174 -347139 -291062 -178440 -100754 -91113
36640 -91113 -104581 -113106 -157740 -242032 -259502 -152021 -64398 -163489 -351836 -381402 -238262
36629 -238262 -153131 -197605 -173795 -10622 57816 -90295 -183486 9779 233771 118155
36619 118155 -181225 -162747 255593 599166 522292 232394 99038 176597 291890 337589
36609 337589 287359 125893 -58910 -80842 99687 290988 348835 357379 402137 372153 173561
36598 173561 -44798 -99386 -60653 -101765 -173197 -80996 169838 356502 360939 308840 360998
36587 360998 513994 629303 564404 300839 26669 8492 259502 443732 282199 -59806
36577 -59806 -221050 -178544 -218391 -391669 -365496 59011 586997 796216 654480 453757
$$ packed form
36651i5627l8885Q9298Q5643l3275j43455j50873n9965N6077J12622P7686R641
36640i1113j3468q525m4634q4292j7470J07481Q7623r9091j88347k9566J43140
36629b38262Q5131m4474K3810J63173O8438j48111r3191J93265K23992j15616
36619A18155k99380J8478M18340L43573p6874k89898j33356P7559J15293M5699
36609C37589n0230j61466j84803k1932J80529J91301N7847Q544M4758k9984j98592
36598A73561k18359n4588L8733m1112p1432R2201K50834J86664M437n2099N2158
36587C60998J52996J15309o4899k63565k74170j8177K51010J84230j61533l42005
36577e9806j61244M2506l9847j73278K6173M24507N27986K09219j41736k00723
$$ plain form
36567 453757 377191 358342 285960 134621 -80816 -308528 -424996 -339188 -134801 5287
36557 5287 16792 -658 56199 190979 357365 506637 579937 552764 499598 517722 570014
36546 570014 507973 289492 72057 21026 101507 142978 62411 -64266 -136702 -156625 -201661
36535 -201661 -314243 -438135 -461637 -334482 -146492 -59422 -142615 -311673 -450570 -535433
36525 -535433 -585382 -559230 -412032 -232746 -193643 -324403 -444584 -385707 -192841 -25388
36515 -25388 63907 141776 238215 309706 351545 414400 472645 395318 130077 -160965 -253126
36504 -253126 -122782 36382 73411 64774 169444 353632 389756 175116 -70331 -67409 117537
36493 117537 137107 -127300 -346117 -188778 190017 352048 163190 -98541 -196697 -198001
$$ packed form
36567D53757p6566j8849p2382j51339k15437k27712j16468Q5808K04387J40088
36557E287J1505j7450N6857J34780J66386J49272P3300k7173n3166J8124N2292
36546E70014o2041k18481k17435n1031Q0481M1471q0567j26677p2436j9923m5036
36535b01661j12582j23892k3502J27155J87990Q7070q3193j69058j38897q4863
36525e35433m9949K6152J47198J79286L9103j30760j20181N8877J92866J67453
36515b5388Q9295P7869R6439P1491M1839O2855N8245p7327k65241k91042r2161
36504b53126J30344J59164L7029q637J04670J84188L6124k14640k45447K922J84946
36493A17537J9570k64407k18817J57339L78795J62031j88858k61731r8156j304
$$ plain form
36483 -198001 -219257 -202427 -92443 -13840 -86672 -232264 -332872 -424197 -544018 -555364 -361144
36472 -361144 -168941 -260896 -557788 -691835 -505939 -214474 -44536 14144 29999 -43456
36462 -43456 -228114 -399968 -447292 -410827 -359950 -275486 -163890 -132093 -215430 -276124 -222537
36451 -222537 -188181 -313346 -477489 -471366 -345482 -330159 -441465 -445891 -263046 -131476 -240000
36440 -240000 -415330 -375981 -152637 -23503 -92900 -172620 -103587 24876 76209 109939 254672
36429 254672 436666 441369 243173 79793 123331 235705 186318 5163 -64816 62499
$$ packed form
36483a98001k1256J6830J09984P8603p2832j45592j00608r1325j19821j1346J94220
36472c61144J92203r1955k96892j34047J85896K91465J69938N8680J5855p3455
36462d3456j84658j71854m7324L6465N0877Q4464J11596L1797q3337o0694N3587
36451b22537L4356j25165j64143O123J25884J5323j11306m426J82845J31570j08524
36440b40000j75330L9349K23344J29134o9397p9720O9033J28463N1333L3730J44733
36429B54672J81994M703j98196j63380M3538J12374m9387j81155o9979J27315
$$ [...]
##END NTUPLES=NMR SPECTRUM
##END=
