##TITLE=31Pdec_LR-675-C1-C
 CDCl3, 24 sc
 30.5.2019
##JCAMPDX= 6.0         $$ Bruker NMR JCAMP-DX V2.0
##DATA TYPE= NMR SPECTRUM
##DATA CLASS= NTUPLES
##ORIGIN= UXNMR, Bruker Analytische Messtechnik GmbH
##OWNER= root
$$ XWIN-NMR		Version 3.5
$$ Thu May 30 13:43:33 2019 Russian Standard Time (UT+4h)  she@DPX200
##.OBSERVE FREQUENCY= 81.013821
##.OBSERVE NUCLEUS= ^31P
##.ACQUISITION MODE= SIMULTANEOUS
##.ACQUISITION SCHEME= undefined
##.AVERAGES= 24
##.DIGITISER RES= 17
##SPECTROMETER/DATA SYSTEM= spect
##.PULSE SEQUENCE= zgpg30
##.SOLVENT NAME= CDCl3
##.SHIFT REFERENCE= (INTERNAL, CDCl3, 0, 182.463)
##AUDIT TRAIL= $$ (NUMBER, WHEN, WHO, WHERE, WHAT)
$$ ##TITLE= Audit trail, XWIN-NMR		Version 3.5
$$ ##JCAMPDX= 5.01
$$ ##ORIGIN= Bruker BioSpin GmbH
$$ ##OWNER= she
$$ F:/spectra/data/she/nmr/P31/1/pdata/1/auditp.txt
$$ ##AUDIT TRAIL=  $$ (NUMBER, WHEN, WHO, WHERE, WHAT)
(   1,<2019-05-30 13:42:31.39 +0400>,<she>,<DPX200>,
      <created by zg, POWCHK disabled, PULCHK disabled
       configuration hash MD5:
       00 E9 B6 7A A2 85 ED C7 34 08 36 98 17 FE 4E 26
       data hash MD5: 32K
       8B 77 68 C0 82 45 5E D1 F8 74 B8 DD 9F 7E E8 63>)
(   2,<2019-05-30 13:42:36.98 +0400>,<she>,<DPX200>,
      <Start of raw data processing
       efp BC_mod = 2 LB = 1 FT_mod = 6 PKNL = 1 PHC0 = -2175.098 PHC1 = 71.7991 SI = 64K 
       data hash MD5: 64K
       46 C4 5E DA 69 73 00 C3 42 FB F9 B9 AC 19 51 2D>)
(   3,<2019-05-30 13:42:50.20 +0400>,<she>,<DPX200>,
      <pk PHC0 = 2.918464 PHC1 = 0 
       data hash MD5: 64K
       25 11 E4 36 51 F4 F9 69 4D 16 FA B0 84 81 1C 47>)
(   4,<2019-05-30 13:42:54.10 +0400>,<she>,<DPX200>,
      <abs ABSG = 5 
       data hash MD5: 64K
       05 4F 91 9D 11 FF F8 4F FF 02 6A 48 76 86 4D 7F>)
$$ ##END=
$$ 
$$ hash MD5
$$ D6 0A 53 C3 AE FA 99 EA 7D AF 9D 78 D2 42 E5 04
##$RELAX= 
##$RELAX= 
##$RELAX= 
##$RELAX= 
##$RELAX= 
##$RELAX= 
##$RELAX= 
##$RELAX= 
$$ Bruker specific parameters
$$ --------------------------
##$DU= <F:/spectra>
##$EXPNO= 1
##$NAME= <P31>
##$PROCNO= 1
##$TYPE= <nmr>
##$USER= <she>
##$AMP= (0..31)
100 100 100 100 100 100 100 100 100 100 100 100 100 100 100 100 100 100 
100 100 100 100 100 100 100 100 100 100 100 100 100 100 
##$AQSEQ= 0
##$AQ_mod= 1
##$AUNM= <au_zg>
##$AUTOPOS= <>
##$BF1= 81.014009
##$BF2= 200.13
##$BF3= 200.13
##$BF4= 200.13
##$BF5= 200.13
##$BF6= 200.13
##$BF7= 200.13
##$BF8= 200.13
##$BYTORDA= 1
##$CFDGTYP= 0
##$CFRGTYP= 5
##$CHEMSTR= <none>
##$CNST= (0..31)
1 1 145 1 1 1 1 1 1 1 1 1 1 1 1 1 1 1 1 1 1 1 1 1 1 1 1 1 1 1 1 1 
##$CPDPRG= <waltz16>
##$CPDPRG1= <>
##$CPDPRG2= <waltz16>
##$CPDPRG3= <>
##$CPDPRG4= <mlev>
##$CPDPRG5= <mlev>
##$CPDPRG6= <mlev>
##$CPDPRG7= <mlev>
##$CPDPRG8= <mlev>
##$CPDPRGB= <>
##$CPDPRGT= <>
##$D= (0..31)
0 1 0 0 0 0 0 0 0 0 0 0.03 2e-05 3e-06 0 0 0 0 0 0 0 0 0 0 0 0 0 0 0 0 
0 0 
##$DATE= 1559209350
##$DBL= (0..7)
120 120 120 11 120 120 24 19 
##$DBP= (0..7)
150 150 150 150 150 150 150 150 
##$DBP07= 0
##$DBPNAM0= <>
##$DBPNAM1= <>
##$DBPNAM2= <>
$$ [...]
##$SUBNAM3= <"">
##$SUBNAM4= <"">
##$SUBNAM5= <"">
##$SUBNAM6= <"">
##$SUBNAM7= <"">
##$SUBNAM8= <"">
##$SUBNAM9= <"">
##$SW= 369.568048894756
##$SWIBOX= (0..15)
0 1 3 0 0 0 0 0 0 0 0 0 0 0 0 0 
##$SW_h= 29940.119760479
##$TD= 32768
##$TD0= 1
##$TE= 0
##$TE2= 300
##$TE3= 300
##$TEG= 300
##$TL= (0..7)
0 120 53 12 22 120 120 120 
##$TP= (0..7)
150 150 150 150 150 150 150 150 
##$TP07= 0
##$TPNAME0= <>
##$TPNAME1= <>
##$TPNAME2= <>
##$TPNAME3= <>
##$TPNAME4= <>
##$TPNAME5= <>
##$TPNAME6= <>
##$TPNAME7= <>
##$TPOAL= (0..7)
0.5 0.5 0.5 0.5 0.5 0.5 0.5 0.5 
##$TPOFFS= (0..7)
0 0 0 0 0 0 0 0 
##$TUNHIN= 0
##$TUNHOUT= 0
##$TUNXOUT= 0
##$USERA1= <user>
##$USERA2= <user>
##$USERA3= <user>
##$USERA4= <user>
##$USERA5= <user>
##$V9= 5
##$VALIST= <valist>
##$VCLIST= <CCCCCCCCCCCCCCC>
##$VD= 0
##$VDLIST= <DDDDDDDDDDDDDDD>
##$VPLIST= <PPPPPPPPPPPPPPP>
##$VTLIST= <TTTTTTTTTTTTTTT>
##$WBST= 1024
##$WBSW= 4
##$XGAIN= (0..3)
0 0 0 0 
##$XL= 0
##$YL= 0
##$YMAX_a= 92271
##$YMIN_a= -107075
##$ZGOPTNS= <>
##$ZL1= 120
##$ZL2= 120
##$ZL3= 120
##$ZL4= 120
##$ABSF1= 182.463
##$ABSF2= -187.1042
##$ABSG= 5
##$ABSL= 3
##$ALPHA= 0
##$AQORDER= 0
##$ASSFAC= 0
##$ASSFACI= 0
##$ASSFACX= 0
##$ASSWID= 0
##$AUNMP= <proc_1d>
##$AZFE= 0.1
##$AZFW= 0.5
##$BCFW= 0
##$BC_mod= 2
##$BYTORDP= 0
##$COROFFS= 0
##$CY= -3
##$DATMOD= 1
##$DC= 0
##$DFILT= <>
##$DTYPP= 0
##$F1P= 0
##$F2P= 0
##$FCOR= 1
##$FTSIZE= 65536
##$FT_mod= 6
##$GAMMA= 0
##$GB= 0
##$INTBC= 1
##$INTSCL= 5.30512e-09
##$ISEN= 30
##$LB= 1
##$LEV0= 0
##$LPBIN= 0
##$MAXI= 10000
##$MC2= 0
##$MEAN= 0
##$ME_mod= 0
##$MI= 50
##$NCOEF= 0
##$NC_proc= -4
##$NLEV= 6
##$NOISF1= 182.463
##$NOISF2= 159.3651
##$NSP= 0
##$NTH_PI= 0
##$NZP= 0
##$OFFSET= 182.463
##$PC= 4
##$PHC0= -2172.179
##$PHC1= 71.7991
##$PH_mod= 1
##$PKNL= yes
##$PPARMOD= 0
##$PSCAL= 0
##$PSIGN= 0
##$REVERSE= no
##$SF= 81.0140089999434
##$SI= 65536
##$SIGF1= 159.3651
##$SIGF2= -187.1042
##$SINO= 113.3802
##$SIOLD= 16384
##$SREGLST= <1H.CDCl3>
##$SSB= 0
##$STSI= 65536
##$STSR= 0
##$SW_p= 29940.119760479
##$SYMM= 0
##$S_DEV= 0
##$TDeff= 32768
##$TDoff= 0
##$TI= <>
##$TILT= no
##$TM1= 0
##$TM2= 0
##$TOPLEV= 0
##$USERP1= <user>
##$USERP2= <user>
##$USERP3= <user>
##$USERP4= <user>
##$USERP5= <user>
##$WDW= 1
##$XDIM= 65536
##$YMAX_p= 327074933
##$YMIN_p= -10238589
$$ End of Bruker specific parameters
$$ ---------------------------------
##NTUPLES= NMR SPECTRUM
##VAR_NAME=  FREQUENCY,     SPECTRUM/REAL,   SPECTRUM/IMAG
##SYMBOL=    X,             R,               I
##VAR_TYPE=  INDEPENDENT,   DEPENDENT,       DEPENDENT
##VAR_FORM=  AFFN,          ASDF,            ASDF
##VAR_DIM=   65536,         65536,           65536
##UNITS=     HZ,            ARBITRARY UNITS, ARBITRARY UNITS
##FACTOR=    0.456856943014862, 1,           1
##FIRST=     14782.0589164792, 0,            0
##LAST=      -15158.0608439998, 0,           0
##MIN=       -15158.0608439998, -10238589,   0
##MAX=       14782.0589164792, 327074933,    0
$$ Real data points
##PAGE= N=1
##DATA TABLE= (X++(R..R)), XYDATA
$$ [...]
44789 -69 -515160 -884260 -756489 -271713 120058 209292 212917 383848 632231 668394 419472
44778 419472 148227 157652 475319 859655 1051858 965539 671561 308517 54234 85785
44768 85785 439794 925974 1281161 1405182 1354030 1141390 721795 205371 -93743 50157
44758 50157 517344 962334 1120663 947920 565069 166353 -75839 -98372 55843 294294
44748 294294 461790 363189 -10374 -331385 -282137 -52400 -146118 -599036 -795419 -311526
44738 -311526 435402 757431 613710 482148 517831 419617 120221 26378 381146 827148
44728 827148 867742 459737 -97957 -614529 -1076644 -1432376 -1568255 -1456995 -1195473 -961719
44718 -961719 -975281 -1313146 -1667668 -1528176 -807244 -86906 21858 -380218 -679626 -586358
44708 -586358 -393135 -376508 -353269 -64209 293118 275556 -151791 -518848 -462631 -153264
44698 -153264 25986 -17688 -121972 -222180 -360822 -429563 -253798 46173 140802 37420
44688 37420 154802 642649 1011128 782371 187388 -226731 -419785 -734084 -1107784 -1082461
44678 -1082461 -640969 -374787 -594927 -860718 -720790 -405552 -352995 -467551 -360841 -40990
44668 -40990 161339 178718 224446 325887 293785 98145 -136499 -441570 -878872 -1163219
44658 -1163219 -904982 -267788 102236 -75761 -384012 -378242 -158188 -36099 -34076 -28684
44648 -28684 -94444 -348355 -634693 -684630 -490547 -278094 -192152 -205518 -243752 -224564 -69488
44637 -69488 167272 283759 180336 6926 -61690 -52074 -73793 -153947 -318712 -616241 -896321
44626 -896321 -841249 -456249 -241886 -548233 -1021440 -1100828 -832997 -686825 -721967 -550055
44616 -550055 -114424 119251 -93951 -388210 -364636 -85854 247333 638930 1005291 994189
44606 994189 507819 36937 17355 156748 -98770 -665829 -945892 -714076 -317162 -10580
44596 -10580 332986 751366 942587 704098 250357 -113151 -329147 -433733 -380594 -230610
44586 -230610 -228672 -440226 -544663 -257060 226373 472288 364543 158540 87381 170957
44576 170957 349380 547299 616411 445003 163924 73049 310999 701637 941066 853486
44566 853486 494554 117257 11913 252080 594075 725117 597914 423639 366154 374402
44556 374402 322241 196318 112127 203881 484289 756069 729571 338978 -121422 -313521
44546 -313521 -239556 -137226 -80463 33198 117488 -98874 -551621 -686089 -141296 649254
44536 649254 933396 602230 252616 293438 452365 341150 91666 78311 257901 200824
44526 200824 -281058 -881540 -1192148 -1077569 -645715 -120519 201934 143573 -108329 -178504
44516 -178504 -11563 70188 -77862 -161006 32348 204266 20667 -269802 -180264 212923
44506 212923 373645 189359 156880 541777 920437 870323 645396 730957 1053492 1123249
44496 1123249 787598 361625 66953 -203692 -507423 -635325 -437528 -93715 114537
44487 114537 123141 31264 -123359 -366506 -637853 -790070 -736949 -516179 -199134 188541
44477 188541 614881 956600 1057407 897927 622160 337671 6917 -335794 -403652 38856
44467 38856 738928 1138336 1032607 728438 479813 173251 -233447 -390875 -47140 457245
44457 457245 607848 401550 184184 23381 -236076 -429020 -180568 420925 819315 760967
44447 760967 557946 454283 273068 -72826 -248907 -40676 204907 103477 -143878 -116274
44437 -116274 101018 75244 -225654 -372396 -168517 69623 47188 -79634 -5924 259380
44427 259380 452714 412492 180203 -137490 -398369 -373355 83556 723009 952050 424386
44417 424386 -460556 -892880 -565374 -23838 62293 -245955 -337213 52202 530083 668938
44407 668938 531677 401756 314980 138548 -75179 -115863 40606 128572 -112670 -602204
44397 -602204 -907922 -638223 88891 680253 730719 509801 517227 716250 664483 351237
44387 351237 301930 689129 945178 605680 13681 -268786 -291684 -406897 -511490 -278080
44377 -278080 80392 4032 -485937 -725697 -378488 113320 212853 -77796 -474321 -848630
44367 -848630 -1142433 -1195645 -947395 -574514 -223657 168629 613331 873944 753885 396751
44357 396751 102724 -10653 -12763 14127 -8227 -168029 -428222 -581988 -481564 -226066
44347 -226066 -21840 45035 8390 -94044 -231183 -348121 -399050 -358874 -202742 19806
44337 19806 118246 -43758 -268097 -162845 342793 824391 844435 461880 111707 80868
44327 80868 256222 345275 211313 -40084 -250346 -405034 -560660 -610454 -339066 172688
44317 172688 434003 101321 -506125 -767648 -534660 -186945 6806 144546 283971 254386
44307 254386 34866 -86029 52115 216702 174978 49099 50893 143078 201765 255068 318915
44296 318915 248047 3753 -170063 -96247 50024 74588 123268 372688 592503 426466
44286 426466 -10692 -217744 35780 462867 678503 608659 463629 484055 697061 817723
44276 817723 517814 -80714 -400236 -117879 356305 431424 156167 69799 349296 578977
44266 578977 410522 39937 -122050 21835 209031 141728 -223074 -607073 -637285 -233121
44256 -233121 301483 659537 833226 889069 706027 237604 -194894 -268066 -156318 -235426
44246 -235426 -415118 -268663 219060 568315 517200 302136 131990 -88013 -337584 -320948
44236 -320948 -7757 128521 -241130 -790267 -1026681 -960369 -909282 -938305 -918563 -927146 -1133130
44225 -1133130 -1387877 -1337094 -915099 -401830 -12113 278324 517119 667977 730099 728102
44215 728102 581624 209887 -232583 -450643 -363933 -170634 -43304 29008 63935 -19016
44205 -19016 -224263 -378250 -332593 -155520 -6242 84596 175445 215948 55123 -315890
44195 -315890 -650700 -675974 -392041 -58285 101188 80545 -1645 -29459 103096 404345
44185 404345 585995 189841 -817365 -1733104 -1765235 -962599 -151797 70944 -107999 -266771
44175 -266771 -378807 -588389 -723019 -500664 -85330 21103 -316241 -619101 -390649 265917
44165 265917 779302 744459 287090 -166273 -359857 -388518 -447693 -527870 -452867 -154533
44155 -154533 231125 521494 603772 428316 71413 -207682 -199021 -59934 -160332 -556710
44145 -556710 -881093 -835399 -515101 -139444 205830 389003 174185 -363857 -698532 -500114
44135 -500114 -160153 -249345 -673994 -860027 -633934 -372242 -295644 -183019 83311 209268
44125 209268 -5903 -257247 -172308 100505 119694 -140872 -174088 390206 1218229 1553037
44115 1553037 1037614 117362 -471241 -511894 -396104 -428382 -405733 -93337 215507 29328
44105 29328 -593331 -1058358 -992644 -608545 -277859 -118504 -117656 -322643 -698797 -1002763
44095 -1002763 -986046 -640548 -185714 93029 33725 -205577 -215543 159193 475061 185904
44085 185904 -563601 -1044152 -865538 -372258 -52042 -15287 -197543 -574590 -923773 -843764
44075 -843764 -347661 -25825 -259307 -672000 -770008 -709124 -900743 -1211923 -1200995 -924800
44065 -924800 -819025 -863631 -572162 134717 712773 817348 737707 761013 663622 203667
44055 203667 -321619 -443172 -161491 158461 310095 316964 190391 -16732 -73190 134568
44045 134568 282565 -11454 -533966 -633515 -109190 462599 496271 185931 222997 869539
44035 869539 1624920 1838592 1431531 887028 625284 549223 265599 -342295 -929921 -1125722
44025 -1125722 -988082 -861261 -870781 -810953 -544270 -232184 -37362 147981 437622 606490
44015 606490 341534 -229637 -601419 -511868 -198634 18055 77532 -1108 -264020 -560075
44005 -560075 -485146 74971 628952 700993 522536 627231 950648 939834 517255 268329
43995 268329 517748 843198 799696 569839 487904 395256 -10159 -518991 -671437 -490734
43985 -490734 -426488 -649158 -878087 -890257 -774523 -657581 -534831 -401118 -266773 -85449
43975 -85449 60398 -149022 -798975 -1313024 -1041214 -236427 169205 -144691 -461167 -132779
43965 -132779 516032 813628 735172 697313 713083 408722 -229605 -719801 -748630 -509679
43955 -509679 -266584 24146 455834 830351 851373 547003 259781 197947 169361 -116297
43945 -116297 -558358 -691884 -295826 223021 288940 -109738 -444049 -356968 484 373794
43935 373794 728757 1005702 945577 452494 -145046 -469710 -497326 -361771 -78761 232546
43925 232546 208337 -234895 -520979 -94804 707299 1047182 735929 369164 332803 373913
43915 373913 315291 484154 1037835 1431175 1104241 366279 39455 370717 798818 793919
43905 793919 498191 395365 616726 785984 503042 -141705 -614788 -518534 -19763 415604
43895 415604 592512 645962 615354 345669 -113892 -409601 -380175 -312360 -452550 -595622
43885 -595622 -489907 -349958 -525825 -853494 -831212 -393155 -28272 -58444 -222516 -150405
43875 -150405 81337 116818 -139560 -391695 -326408 17339 290536 236928 17935 19937
43865 19937 303992 450673 119367 -429162 -636588 -347911 92882 358748 403717 246470
43855 246470 -115723 -499889 -590439 -328512 21223 271776 478175 620074 493133 94994
43845 94994 -232868 -285506 -292604 -462414 -551269 -253114 236710 467036 374367 251255 173035
43834 173035 -84326 -538087 -829033 -675186 -201257 273535 521463 424226 -10875 -542304
43824 -542304 -833713 -808777 -677001 -560061 -351261 -38312 125155 -36875 -325247 -424131
43814 -424131 -295303 -105130 103310 416145 774580 921367 676589 169559 -239298 -262737
43804 -262737 31525 235620 9821 -486974 -713189 -361664 282833 697712 681917 429318
43794 429318 191360 61877 28452 51443 84457 110442 141347 147004 76209 1551 108917
43783 108917 447967 821205 1017741 1017112 877964 627100 384687 352555 486222 448117
43773 448117 148807 36404 461236 1013454 997828 406420 -141365 -340346 -449561 -584202
43763 -584202 -460786 -52268 164511 -48221 -284656 -233202 -249594 -672125 -1074057 -862939
43753 -862939 -272471 -45828 -341581 -658559 -725228 -737185 -722856 -409938 137528 404400
43743 404400 167790 -194768 -346682 -398657 -446562 -276417 142843 408337 325184 308555
43733 308555 678804 1010420 757422 179099 -131 349434 676742 626909 398831 241676
43723 241676 174220 270434 677459 1198340 1330670 916966 366715 55070 -115271 -351459
43713 -351459 -554679 -549555 -431432 -386552 -383319 -309897 -232939 -270965 -377951 -478829 -632450
43702 -632450 -810037 -715950 -163526 504203 741991 509335 287152 360868 453730 214057
43692 214057 -242999 -521132 -479446 -313013 -178646 -19618 193156 289187 138061 -74202
43682 -74202 -41953 200590 262469 -62328 -461917 -518137 -275574 -103652 -84274 84206
43672 84206 516452 844089 687145 162092 -296815 -423508 -223774 196966 645951 841292
43662 841292 689462 472560 493510 631337 552337 292104 254430 587377 920348 876655
43652 876655 567126 362400 366802 359861 176597 -73485 -183174 -105211 25372 74215 51194
43641 51194 47406 65507 1686 -180676 -369126 -463219 -499980 -511700 -392050 -77702 242592
43630 242592 320291 192056 107899 148138 148236 -6144 -258844 -568381 -947105 -1273416 -1346253
43619 -1346253 -1214854 -1175858 -1311782 -1305235 -900599 -318074 17321 -14941 -214459 -404368
43609 -404368 -550075 -623558 -583622 -475173 -390534 -351163 -333806 -358781 -446927 -546016 -589826
43598 -589826 -572556 -511543 -430966 -424918 -602773 -919476 -1206808 -1398337 -1517539 -1432526 -952935
43587 -952935 -278568 35292 -207482 -532681 -507372 -392348 -665042 -1217028 -1546513 -1507988
43577 -1507988 -1294791 -863216 -52011 776670 940752 405770 -102626 -139629 -59620 -241265
43567 -241265 -455817 -420065 -388238 -647120 -881043 -655467 -212661 -150602 -503304 -754678
43557 -754678 -658707 -442780 -227336 143704 599728 729205 371888 -113959 -390258 -557855
43547 -557855 -796330 -938934 -728798 -274672 55481 70536 -146683 -456175 -739806 -840392
43537 -840392 -648923 -257295 106488 281218 235990 14608 -262016 -404154 -305910 -74561
43527 -74561 87958 102056 23470 -104240 -282211 -458748 -531879 -479420 -389342 -324005 -244923
43516 -244923 -134984 -110839 -284146 -519989 -498703 -139504 149255 -119982 -821033 -1192694
43506 -1192694 -708674 212666 670426 386911 -8410 123645 620634 859888 639481
43497 639481 324495 195131 71042 -283239 -694148 -780274 -472288 -69768 185690 344595
43487 344595 496670 512573 227845 -223019 -487064 -427315 -284502 -314057 -415669 -283207
43477 -283207 149356 581587 669622 357596 -114646 -420265 -356112 21968 418689 542690
43467 542690 379275 160451 62574 42520 -7884 -88268 -142736 -163695 -153579 -92070 -31957
43456 -31957 -101897 -290363 -359050 -150121 126481 140372 -82419 -193523 -39554 142190
43446 142190 139114 94695 229981 450216 492466 341368 216348 193365 124982 -41354 -146272
43435 -146272 -115847 -122082 -279170 -383834 -186787 199867 411610 302450 85973 15825
43425 15825 137369 376373 653979 837328 776723 526520 389905 595790 1007521 1266220
43415 1266220 1164704 801925 448670 338541 492823 657229 512792 51643 -368652
43406 -368652 -457168 -331709 -264647 -240387 -22979 409434 775778 843701 638926 294651
43396 294651 -75786 -329919 -354383 -228244 -129835 -62050 98269 277458 249530 65633
43386 65633 69091 323648 411237 74549 -283777 -124842 449650 862888 840488 586478
43376 586478 291008 -47172 -292406 -154710 335014 703861 600588 218108 -28043 -15122
43366 -15122 79184 103207 78240 121451 330722 651123 832793 691072 413120 348774 459380
43355 459380 325917 -143885 -404564 10995 755216 1059837 717115 250582 148718 327987
43345 327987 429631 324829 171731 159141 320758 511672 527628 322448 75901 -48431
43335 -48431 -117519 -246499 -331856 -220871 -54633 -111325 -318194 -278972 131080 536144
43325 536144 571448 327096 102449 -13708 -104139 -191350 -271272 -392861 -497743 -373894
43315 -373894 14162 352977 379325 235886 151401 20363 -302183 -503924 -151995 525904
43305 525904 756768 225352 -520406 -826998 -646356 -284740 93330 384023 364290 10862
43295 10862 -272615 -152853 135149 193893 127787 288772 520751 288263 -404805 -845353
43285 -845353 -582540 -58072 60973 -220648 -396510 -254508 -60178 -51161 -146888 -189049
43275 -189049 -182886 -212601 -277304 -275588 -87397 308948 741479 941283 825972 609028 535656
43264 535656 605736 657371 605814 476319 324213 252684 357597 498903 326576 -222773
43254 -222773 -647858 -440746 199949 601897 508982 309574 349871 485898 481141 426659
43244 426659 493281 589269 575786 584800 799669 1082501 1135019 934338 726403 644369 589796
43233 589796 468509 319705 201605 111496 16291 -149130 -454223 -820502 -989311 -805854
43223 -805854 -464998 -304695 -401475 -515977 -390085 19056 518645 786517 630023 265806
43213 265806 164512 450051 672443 412785 -129444 -475904 -550954 -583315 -515007 -72037
43203 -72037 604974 969504 805801 457663 206596 -59914 -377866 -442567 -123335 214797
43193 214797 265208 269974 574996 1037769 1296116 1348562 1437824 1576206 1608377 1569277 1574827
43182 1574827 1515209 1261656 1042697 1209552 1730961 2295095 2789797 3299218 3776835 4169427
43172 4169427 4740704 5774448 7029084 8007696 8738367 9730647 11121750 12441207 13345053
43163 13345053 14027766 14713048 15253999 15481140 15472070 15206604 14407852 13043361 11586536
43154 11586536 10450533 9512280 8504976 7516437 6749584 6127122 5509089 5010665 4747623
43145 4747623 4557989 4323299 4232390 4330461 4172330 3432353 2549410 2186011 2279524 2245920
43135 2245920 1946290 1768187 1816076 1730800 1382586 1087966 995853 867881 653986 680293
43125 680293 991468 1074532 608136 12657 -157809 24615 145686 151712 267321 432349
43115 432349 348310 35286 -102501 171825 616647 827488 662816 299725 -4747 -164653
43105 -164653 -308156 -535791 -679655 -491342 -72147 181514 169549 283362 784645 1324504
43095 1324504 1429672 1200710 1095118 1192884 1168356 934355 803790 922961 993964 755451
43085 755451 400922 294448 517085 903523 1315262 1646829 1724548 1465855 1086567 930987
43075 930987 1081597 1280249 1252602 994664 705439 533029 459653 390446 258668 26077
43065 26077 -313486 -630311 -643919 -211224 359394 518460 121941 -337822 -332238 52481
43055 52481 309187 207856 -18212 -117800 -97651 -15450 167484 404728 508125 420262
43045 420262 319633 316055 271923 93832 -36194 41395 129295 -66124 -449951 -624933
43035 -624933 -433242 -115153 107040 310148 601285 800888 623308 87348 -460764 -737790
43025 -737790 -772193 -713692 -559960 -240433 97896 133092 -204703 -538569 -473088 -108311
43015 -108311 110987 4598 -173333 -195577 -156365 -154958 -7556 431708 873364 872023 426676
43004 426676 -17656 -143692 -35206 122857 282379 381375 270369 -31317 -236524 -142325
42994 -142325 95659 229361 288777 451516 656293 615453 209716 -325720 -632561 -528451
42984 -528451 -110801 301693 382336 115507 -139888 -81885 101574 -25262 -503068 -903235
42974 -903235 -966184 -945488 -1095492 -1159541 -775762 -212516 -189585 -892791 -1597117 -1512311
42964 -1512311 -721234 25424 273334 246534 273799 234269 -178312 -860639 -1330948 -1366074
42954 -1366074 -1286873 -1441608 -1652703 -1480471 -926845 -503980 -541687 -769303 -766373 -540866
42944 -540866 -388260 -393812 -420791 -474643 -697513 -1009213 -1117869 -959903 -804036 -804121 -761954
42933 -761954 -511301 -259464 -305323 -613377 -908507 -1046447 -1061482 -977614 -818432 -713713
42923 -713713 -752557 -788210 -623165 -351808 -280009 -496935 -744402 -753759 -535655 -286604
42913 -286604 -156013 -159970 -212461 -197927 -94501 -36961 -174113 -458958 -652776 -540931
42903 -540931 -121125 358015 520901 174355 -412167 -703262 -521075 -287392 -439063 -811533
42893 -811533 -918638 -680359 -464062 -471127 -529656 -524146 -575522 -672768 -563239 -218237 -19367
42882 -19367 -213152 -509946 -521685 -303233 -123461 36978 353403 701379 774294 593119
42872 593119 483984 529687 427626 -5169 -507932 -721207 -630342 -496349 -504519 -646824
42862 -646824 -844100 -1012177 -1044517 -883856 -646038 -567634 -743648 -958328 -898635 -574614
42852 -574614 -397207 -705702 -1301351 -1633050 -1412101 -841569 -257766 184864 418510 362150
42842 362150 99779 -67422 45205 276082 377609 313869 126825 -253683 -796483 -1160571
42832 -1160571 -1033003 -581923 -279836 -346778 -634786 -966131 -1263840 -1392169 -1207358 -810560
42822 -810560 -495885 -419469 -520809 -717716 -920957 -922275 -594826 -187106 -76159 -221098
42812 -221098 -226815 17221 179435 77223 -10239 157606 354834 266175 -5271 -144583
42802 -144583 -126191 -168132 -322816 -436328 -445423 -436398 -444673 -432358 -438355 -537150 -666728 -700110
42790 -700110 -684755 -809423 -1093659 -1287066 -1173210 -874443 -744606 -964643 -1316057 -1418128
42780 -1418128 -1177264 -882798 -782664 -721498 -421853 -26062 -6355 -469031 -902944 -831854
42770 -831854 -437244 -240209 -364331 -479234 -404202 -379103 -632976 -976622 -1043066 -807078
42760 -807078 -641213 -838641 -1248610 -1496661 -1459497 -1321010 -1178218 -887467 -449314 -241035
42750 -241035 -534157 -986665 -1046032 -746253 -600087 -722606 -662430 -237213 106346 85480
42740 85480 119516 574441 993555 753680 139459 -3638 449118 730429 341300 -309737
42730 -309737 -621144 -570073 -486236 -509900 -599067 -751913 -915074 -891442 -586105 -179627
42720 -179627 108765 251236 282258 171933 -9413 -22755 246088 591062 749188 694782
42710 694782 524100 247241 -99868 -302446 -177297 130697 264197 47985 -352566 -626076
42700 -626076 -580689 -285711 -33516 -81843 -352998 -471538 -177174 379401 806877 838896
42690 838896 483068 -54608 -491554 -612296 -402181 -27394 308460 432442 229755 -201921
42680 -201921 -495607 -395692 -186363 -396422 -1007489 -1341000 -913532 -45368 624630 875137
42670 875137 831070 508257 -88622 -605994 -597907 -127497 290076 338217 126475 -197353
42660 -197353 -621729 -995586 -1024618 -729170 -545246 -732664 -965564 -770301 -155364 458608
42650 458608 772036 794399 613163 288228 -7772 -7963 353197 771154 825111 409799
42640 409799 -136406 -376924 -241148 -57500 -75299 -101346 183343 631120 693530 182395
42630 182395 -363791 -340791 118724 357942 105822 -234380 -252179 -81404 -69733 -198460
42620 -198460 -157832 139330 443669 540856 458937 285536 40180 -205430 -326329 -369973
42610 -369973 -550033 -875994 -1035572 -859754 -668279 -831829 -1150634 -1071078 -491548 57632
42600 57632 128370 -119686 -281191 -270739 -258964 -257534 -81583 324363 739327 854654 528758
42589 528758 -79497 -569725 -611302 -274493 78425 279113 510735 878344 1112525 943572
42579 943572 536531 245391 107733 -74310 -281389 -301158 -161858 -136108 -261696 -232237
42569 -232237 115348 529906 726820 764255 836119 906080 793161 515850 330258 419751
42559 419751 651782 670769 251903 -392378 -730320 -470424 55137 253862 -28014 -414474
42549 -414474 -582569 -605076 -632868 -593263 -421402 -310460 -443874 -656912 -648530 -411504
42539 -411504 -179659 -31877 168110 462615 697555 756602 676355 497225 227308 22118
42529 22118 156549 647996 1078967 1027043 606664 348721 527431 850930 935874 850274
42519 850274 916067 1107651 1031489 551945 47790 -157527 -272227 -607413 -952950 -855537
42509 -855537 -386785 -94165 -152736 -102905 378110 924264 1019493 723583 477630 435964
42499 435964 402345 298705 295197 476985 691678 781756 768119 768612 865385 1038422 1130924
42488 1130924 961433 594783 381427 542773 819052 755133 286316 -185983 -297723 -97086
42478 -97086 118695 177308 163847 243855 407052 434284 196500 -73058 -18052 316554 493596
42467 493596 326160 165288 310426 478892 242872 -266929 -558386 -520415 -468194 -506149
42457 -506149 -370548 15648 298662 180054 -199018 -525930 -686227 -720170 -657515 -530923
42447 -530923 -365962 -101011 277594 530554 388274 -7565 -221688 -129447 -35063 -107403
42437 -107403 -109775 141436 434284 495612 339545 83917 -242264 -504530 -449824 -143001
42427 -143001 -39683 -317645 -512775 -195694 343246 532337 342457 170233 124058 -25530
42417 -25530 -297502 -431545 -345969 -214473 -101199 67238 199875 140822 45911 210016
42407 210016 519811 553564 256547 2466 -105771 -426253 -1045992 -1407312 -1043531 -273617
42397 -273617 258197 418025 509690 612593 515535 240884 136572 342221 530954 357683
42387 357683 -84138 -453381 -648690 -864823 -1191143 -1393155 -1226528 -828967 -574381 -558054
42377 -558054 -500197 -264596 -171878 -519414 -1011968 -1073416 -648334 -266253 -274887 -437858
42367 -437858 -433669 -349491 -423819 -606667 -678922 -609461 -517782 -431960 -334594 -319405 -452836
42356 -452836 -574351 -466023 -153303 162919 399870 614041 782263 763703 482784 32575
42346 32575 -373191 -495527 -256881 60299 -7444 -536291 -1008714 -933482 -518149 -395715
42336 -395715 -767613 -1196338 -1270122 -1093734 -978509 -966903 -910691 -817769 -821868 -856292 -633996
42325 -633996 -54496 539837 701691 432215 180643 217701 255787 -61019 -486252 -421631
42315 -421631 177822 643685 508007 104495 -49445 -24469 -165783 -357188 -205715 196118
42305 196118 314277 -13275 -355075 -358531 -156308 11213 123135 183571 121866 39931
42295 39931 151718 328859 151928 -391909 -737285 -543891 -209031 -218701 -421981 -410522
42285 -410522 -258126 -328458 -562811 -525286 -94109 372470 568083 552533 517839 552769
42275 552769 648118 697576 546348 237971 50097 43048 -157419 -742374 -1174066 -824730
42265 -824730 15350 432081 149146 -205869 -173422 -55882 -192428 -354698 -282172 -214332
42255 -214332 -374263 -419687 6115 557240 638293 299501 46765 -48273 -369435 -943638
42245 -943638 -1281752 -1134519 -832060 -695895 -613572 -425246 -295760 -412331 -643644 -789322
42235 -789322 -909205 -1126622 -1317453 -1280323 -1073943 -929723 -923192 -943080 -904772 -806819 -646545
42224 -646545 -451011 -334452 -374187 -476858 -487242 -368104 -172818 59317 255345 271991
42214 271991 74649 -138088 -174274 -139452 -273687 -535585 -599765 -325208 -6463 -16149
42204 -16149 -321841 -525263 -360787 -11971 143828 34195 -16649 247691 612249 644264
42194 644264 278670 -117387 -290156 -400185 -636642 -832693 -726802 -386753 -70483 170816
42184 170816 426966 606722 558152 433766 533223 793292 837711 565196 271499 114756
42174 114756 -92659 -411659 -550098 -346096 -66293 57328 189069 457179 565005 274698
42164 274698 -57726 52579 459864 629370 456413 272453 151247 -162657 -624407 -799213
42154 -799213 -515423 -76058 286927 616083 759632 347818 -466787 -864469 -404703 282858
42144 282858 359422 -102965 -436717 -442092 -434206 -434506 -91089 550907 894183 636924 257161
42133 257161 351118 846645 1176053 1002595 511387 104689 4437 108195 150267 30869
42123 30869 -60258 50042 208143 156132 -35624 -80928 13032 -68840 -399514 -638672 -552921
42112 -552921 -341969 -255723 -237771 -192773 -264141 -517462 -641684 -373991 -25100 -131941
42102 -131941 -664912 -1018999 -827251 -399389 -232390 -388382 -543992 -481535 -347133 -456570
42092 -456570 -921779 -1482150 -1742981 -1585201 -1217648 -797254 -249847 364142 608526 175366
42082 175366 -540766 -827727 -571842 -330565 -464944 -700536 -697864 -560949 -498882 -412990
42072 -412990 -189610 -55275 -215012 -403241 -258621 38984 -1750 -410407 -704690 -609542
42062 -609542 -362944 -251148 -279116 -399262 -636500 -839579 -728939 -389664 -305636 -648499
42052 -648499 -940802 -770107 -463153 -599800 -1134923 -1510508 -1464703 -1200629 -850437 -352535
42042 -352535 99103 60002 -510065 -1053268 -1116581 -869488 -674510 -520371 -220050 124670
42032 124670 245842 115294 -116998 -429813 -821911 -1044108 -866791 -569707 -715497 -1343180
42022 -1343180 -1778901 -1445592 -576381 113410 276638 203154 319230 658745 890777 751820
42012 751820 341767 -27839 -207446 -311718 -441849 -492547 -373366 -260059 -384660 -648948
42002 -648948 -710796 -450316 -101195 96238 106171 -79207 -510236 -1025066 -1212143 -882956
41992 -882956 -419695 -400388 -944805 -1614533 -1904560 -1679947 -1177149 -722808 -455992 -273906
41982 -273906 -76580 -12464 -288222 -727261 -827810 -425151 -3825 -83598 -546077 -917603
41972 -917603 -1105319 -1384246 -1742024 -1777866 -1367410 -961270 -985876 -1299084 -1511661 -1559609
41962 -1559609 -1629233 -1710871 -1594327 -1252885 -929972 -829926 -938595 -1147416 -1343664 -1363336
41952 -1363336 -1070198 -551624 -75090 211707 387063 509547 462126 179162 -134966 -226965
41942 -226965 -154670 -193210 -391954 -479497 -295817 -76150 -113024 -320516 -414755 -431569 -704947
41931 -704947 -1272180 -1657374 -1467241 -949361 -665804 -765645 -901650 -791123 -511171 -226706
41921 -226706 20086 147719 2451 -318074 -400369 -47860 339681 235484 -321782 -857985
41911 -857985 -1171572 -1464020 -1749929 -1657237 -1067797 -534831 -639856 -1171728 -1415457 -1165896
41901 -1165896 -956291 -1206220 -1615616 -1649589 -1265579 -819261 -483091 -150295 177067 285505
41891 285505 72057 -309885 -673858 -938804 -1026757 -891811 -714205 -788338 -1101119 -1283221
41881 -1283221 -1129416 -900409 -890794 -940296 -671906 -62694 522831 768450 595788 38734
41871 38734 -711190 -1187015 -1006051 -449721 -298203 -882915 -1620124 -1756849 -1318648 -950721
41861 -950721 -963516 -981844 -608373 -48784 171380 -99177 -517552 -749624 -802992 -807622
41851 -807622 -733098 -512441 -286007 -275839 -461196 -601575 -584478 -533527 -537779 -507639 -395028
41840 -395028 -342419 -473189 -704814 -902440 -1046061 -1111442 -981863 -648121 -303130 -58232
41830 -58232 212371 534167 614899 276844 -149753 -250695 -107819 2169 242092 916859
41820 916859 1660724 1675573 887972 149673 41422 165834 -2298 -240407 -119661 122060
41810 122060 -30420 -418730 -390138 169788 649588 608866 311795 227231 428418 673759
41800 673759 778326 719680 553322 352479 158872 -13497 -81675 64480 311316 324742
41790 324742 15500 -228876 -71768 240322 252113 3288 -110064 -34716 -73549 -242386
41780 -242386 -204631 71243 174295 -36589 -135292 154575 431186 212409 -289910 -441320
41770 -441320 -31486 543524 838081 779644 597564 565729 764229 954010 805650 364429
41760 364429 80507 214075 462245 424456 199569 191214 491886 827960 1022597 1141602
41750 1141602 1201312 1091327 850198 724478 847112 1055900 1103912 893299 481564 34493
41740 34493 -218110 -185452 -102570 -294286 -694616 -833224 -418735 260859 669536 597945
41730 597945 245546 -127763 -404765 -515621 -378826 -23334 349553 519711 432860 201450
41720 201450 -34781 -210574 -324067 -363967 -260942 61647 541950 909250 885860 530181
41710 530181 254581 344739 552115 408964 -76427 -383684 -262373 -161557 -537083 -1034048
41700 -1034048 -897226 -107858 487988 323066 -168687 -280740 -18385 116345 15890
41691 15890 60101 386699 622731 481029 202459 164722 338842 422392 347052 332848 452476
41680 452476 440967 88240 -364154 -465240 -154362 157471 197391 226375 559066 927868
41670 927868 781411 164020 -231732 -42465 242613 59693 -366940 -430895 -122771 -9717
41660 -9717 -321537 -640359 -585397 -295961 -41794 202225 490863 557703 133283 -526128
41650 -526128 -803829 -441332 165669 468272 381909 278468 460068 813126 1020372 974897
41640 974897 843265 780774 777622 808446 926483 1109671 1191664 1078012 880814 718244
41630 718244 557628 392349 349073 425219 372776 117541 37681 449640 1021881 1145720
41620 1145720 755447 310139 69775 -66721 -47520 374025 1049865 1404606 1219241 931296
41610 931296 912840 962530 807894 608195 597974 692421 825990 1206108 1782189 1952491
41600 1952491 1381575 697314 699087 1182024 1285225 804605 362948 333212 403471 319559
41590 319559 304997 494185 584779 368966 101143 39190 70456 68965 177060 429349 520966
41579 520966 280021 -19103 -139801 -267202 -527461 -552647 -39285 591222 678917 270732
41569 270732 -10648 68236 125195 -93331 -337160 -369434 -352609 -481529 -626394 -615578
41559 -615578 -578151 -715451 -926611 -930080 -646232 -242003 130733 451792 716969 857522
41549 857522 802920 567908 272163 75373 56047 157973 286789 402567 451870 320207
41539 320207 12698 -210504 -112508 145511 177381 -68903 -227693 -71425 164683 175497
41529 175497 15189 -89864 -105776 -95594 30470 345613 633331 632188 470680 497321
41519 497321 699415 662913 173909 -470484 -852638 -842144 -518001 -16953 370049 287584
41509 287584 -214664 -559325 -320127 167296 245420 -144321 -421052 -242229 36957 -55800
41499 -55800 -445875 -698066 -620546 -393256 -243534 -265645 -460684 -686603 -640167 -181820
41489 -181820 341017 407483 5998 -319273 -227426 -55391 -291910 -851687 -1216355 -1125934
41479 -1125934 -742159 -221725 405218 883021 759170 30712 -610177 -543574 -8200 251003
41469 251003 -37761 -463343 -639327 -660261 -744336 -819275 -706637 -467239 -297043 -207709
41459 -207709 -42893 232596 432168 346061 -28361 -434595 -530936 -213742 218925 365509
41449 365509 208358 116818 307231 545331 533571 345917 234740 211281 141427 131072
41439 131072 429889 942257 1194098 916729 414755 204989 454552 893164 1138912 996308
41429 996308 547558 69347 -194618 -243658 -265607 -376928 -504828 -516037 -342327 15370
41419 15370 462914 786521 809564 595901 338104 45880 -430367 -1021216 -1348981 -1163532
41409 -1163532 -667923 -254178 -89043 -115974 -275738 -505273 -650874 -614005 -513714 -520263
41399 -520263 -603224 -615727 -535539 -434511 -304209 -124419 -17328 -92078 -204402 -144996
41389 -144996 -32398 -208353 -709818 -1159242 -1282006 -1238745 -1281892 -1354167 -1271642 -1103297
41379 -1103297 -1063874 -1124769 -1052220 -851049 -866304 -1289159 -1769263 -1768666 -1257139 -815587 -958932
41368 -958932 -1528905 -1929687 -1866516 -1614913 -1559913 -1738952 -1959200 -2118829 -2192547 -2093736
41358 -2093736 -1847816 -1775809 -2139822 -2628171 -2589746 -1884210 -1136611 -955591 -1216218 -1378997
41348 -1378997 -1241475 -1018398 -859404 -706018 -589017 -674132 -943556 -1156487 -1231186 -1368993
41338 -1368993 -1649554 -1787370 -1523281 -1041009 -713354 -582520 -415205 -202079 -223633 -541522
41328 -541522 -774331 -604379 -277063 -308525 -803261 -1351581 -1587989 -1565277 -1497706 -1395938
41318 -1395938 -1149207 -817167 -614720 -641817 -793742 -925810 -961558 -842499 -533617 -136649
41308 -136649 119834 85623 -166220 -430925 -546767 -465736 -251062 -65321 -89539 -380228
41298 -380228 -823073 -1230883 -1430514 -1290433 -833440 -375577 -349938 -815811 -1273394 -1187056
41288 -1187056 -627689 -161021 -125141 -298616 -347705 -309442 -435401 -756449 -1053482 -1169808
41278 -1169808 -1127588 -980530 -769406 -622340 -693471 -950501 -1170548 -1186992 -1018597 -753520
41268 -753520 -472774 -314805 -423966 -750971 -1052476 -1157435 -1089401 -894109 -568596 -240096
41258 -240096 -139591 -226689 -115114 374156 836227 794817 397092 202165 406189 712884
41248 712884 898717 1009149 976945 594728 31777 -141789 257922 638344 372748 -402106
41238 -402106 -1071261 -1305571 -1168255 -774395 -305387 -117747 -324823 -441433 7137 636336
41228 636336 583790 -249842 -993284 -997265 -595934 -363140 -216161 196351 632091 479232
41218 479232 -255112 -808277 -643775 -108533 113539 -130765 -439892 -504544 -428851 -411661
41208 -411661 -408608 -264958 -19209 132404 130301 114817 162400 130491 -143311 -610303 -1074360
41197 -1074360 -1381728 -1460828 -1301513 -1021271 -844164 -879222 -1009058 -1098158 -1163536 -1209190
41187 -1209190 -1094003 -777303 -496386 -422913 -336788 5383 353282 272329 -119657 -249394
41177 -249394 52104 323221 227815 -7756 -149963 -414012 -967608 -1404432 -1228530 -642146
41167 -642146 -363127 -725289 -1333592 -1585247 -1240153 -505438 179492 437178 234026 -110016
41157 -110016 -281047 -263268 -199561 -137236 -65616 -38691 -75469 -78593 -14964 -11957 -104412 -80447
41145 -80447 216096 619229 886969 1005786 1022525 821666 375800 -2464 -12431 197189
41135 197189 282814 227386 246997 350635 396740 437209 570467 585340 227255 -279766 -482543
41124 -482543 -397215 -411879 -535802 -379103 48358 178237 -266420 -856623 -1159254 -1292221
41114 -1292221 -1456597 -1462381 -1144441 -784262 -643301 -470641 18113 512677 523363 179846
41104 179846 25083 152264 141159 -172490 -431606 -355118 -129307 -50192 -142315 -287834
41094 -287834 -441192 -581637 -694926 -882311 -1229345 -1514294 -1377134 -892228 -606457 -787260
41084 -787260 -979084 -642027 47399 475738 508974 591831 906454 1003655 549948 -20250
41074 -20250 -62246 349110 601748 548068 688175 1229484 1593633 1244007 528238 171525
41064 171525 238669 195315 -150924 -408737 -326035 -152960 -116455 -54708 165903 302503
41054 302503 117749 -220926 -426238 -488110 -487384 -291496 209512 764437 1016281 972790
41044 972790 915645 950516 938302 788281 558860 341833 252332 394007 607459 454434
41034 454434 -218137 -866035 -808404 -124268 434127 417826 133887 35561 93345 10188
41024 10188 -241914 -404532 -321366 -94193 129557 355476 667253 1004147 1105455 777939
41014 777939 203397 -193455 -249425 -228192 -348814 -403002 -107944 367241 588961 465590
41004 465590 297850 277369 311421 333082 388017 367658 56570 -446188 -727541 -624364
40994 -624364 -430696 -378531 -289861 6839 261394 141897 -249931 -543195 -604874 -555577
40984 -555577 -422462 -139459 161542 214635 18318 -116882 -12215 113376 -37971 -395841
40974 -395841 -558966 -269624 256382 549457 430070 233781 398540 905890 1319110 1368840
40964 1368840 1258478 1284364 1376276 1224121 749060 241195 45062 228720 545838 663201
40954 663201 482190 268159 352370 686621 896018 851419 903340 1317001 1736437 1597292
40944 1597292 956673 474655 531598 781545 761201 589108 736417 1285634 1780639 1825001
40934 1825001 1554312 1400845 1556961 1825302 1929197 1812387 1619609 1518798 1615440 1928323
40924 1928323 2313926 2481782 2272599 1932201 1913151 2322032 2740803 2730586 2355476 2017021
40914 2017021 1895400 1823458 1690369 1671046 1926096 2276204 2373916 2133945 1833854 1783774
40904 1783774 1998411 2221001 2210401 1975660 1761029 1823612 2198575 2641030 2799015 2499482
40894 2499482 1920417 1467588 1415420 1647511 1797190 1656745 1378289 1232973 1262680 1278816
40884 1278816 1166410 1046282 1090454 1284722 1465359 1525261 1461730 1245860 821250 316871
40874 316871 95889 380976 887042 1078315 829287 561999 597996 666625 343064 -242847
40864 -242847 -551103 -426627 -304814 -520568 -808812 -716769 -220425 330085 661393 703944
40854 703944 445903 -34254 -478093 -665604 -679145 -720911 -736582 -489528 18682 489665
40844 489665 726288 826806 908173 886414 669981 381850 222204 217986 241558 199783 98086
40833 98086 -13978 -64648 12507 181286 279654 181696 -43510 -207002 -217555 -164883 -193576
40822 -193576 -344974 -534809 -661204 -711043 -739406 -743798 -615258 -281276 125079 335232
40812 335232 225448 -31075 -149948 -50861 72617 14864 -163184 -195903 38445 341860
40802 341860 468390 475537 604058 828262 808245 420409 69241 189461 584143 604477
40792 604477 -9814 -782635 -1090642 -850671 -468085 -288262 -301630 -309389 -189157 23198
40782 23198 206598 258691 154497 -58614 -285350 -405524 -362406 -282404 -387368 -658703
40772 -658703 -716405 -268131 385099 601848 205297 -282806 -355578 -160870 -174993 -483362
40762 -483362 -741564 -737514 -612442 -510220 -359420 -126452 -2336 -137037 -367511 -427333
40752 -427333 -330874 -338357 -564696 -808877 -800309 -468889 76162 690421 1206377 1403219
40742 1403219 1143779 572355 61643 -112865 -11950 80845 -36655 -324399 -583433 -644194
40732 -644194 -507786 -344498 -315360 -368069 -285995 7934 301785 352601 186613 -14138
40722 -14138 -219298 -500757 -720702 -590467 -136913 180198 10591 -437037 -697639 -613643
40712 -613643 -345598 4170 423034 707492 556331 54914 -252942 18833 601227 883490
40702 883490 606290 76284 -229661 -124908 181412 331607 190431 -2537 71375 370114
40692 370114 539030 455568 444887 740142 995824 722807 80278 -226360 116682 628751
40682 628751 736299 491096 310657 311394 279862 139770 45621 41998 -19771 -179990 -279330
40671 -279330 -248892 -229816 -282703 -208449 159949 637790 859249 711242 446305 375876
40661 375876 550289 739772 668142 267933 -254740 -604012 -648680 -490672 -314538 -214683
40651 -214683 -145140 13017 304243 574987 579154 297912 48492 111747 337472 340879 47317
40640 47317 -221792 -220931 -56837 89733 250269 528478 881755 1195805 1415976 1492671
40630 1492671 1382520 1218621 1267295 1570054 1838483 1858632 1766220 1731736 1628583 1280269
40620 1280269 824912 533769 429314 376719 399202 584539 806014 866483 822955 848357
40610 848357 874397 721807 504212 527498 825351 1154024 1405535 1638669 1731055 1447540
40600 1447540 909170 565577 592817 702739 652700 548210 514618 483012 476563 695154
40590 695154 1081475 1194455 808865 306367 149527 252919 220225 -21883 -182309 -54240
40580 -54240 293262 661333 831059 676264 385897 393011 835906 1275319 1226278 796929
40570 796929 482463 470298 516941 450662 414690 547558 712485 674270 395353 66426
40560 66426 -92508 -38536 61711 41804 -30755 52770 318056 562130 660381 688122 685651
40549 685651 592406 512334 697971 1088541 1224029 880423 443032 328604 384465 264081
40539 264081 70071 109460 248153 95880 -270130 -348426 10541 399100 496484 439850
40529 439850 431210 409485 292886 190709 170668 83090 -196407 -538346 -709642 -616049 -332043
40518 -332043 -16377 195598 338520 593615 973029 1166887 935842 508443 293130 330160
40508 330160 368545 357759 458242 635297 660572 496668 303805 114845 -109899 -199035
40498 -199035 4005 224092 83263 -229176 -208756 83790 83478 -285599 -429490 -76069
40488 -76069 311273 402083 528219 928139 1164746 836235 285981 38801 34146 -15302
40478 -15302 8682 278163 464812 211964 -173249 -164189 132553 228618 96605 64612 84521
40467 84521 -136799 -383840 -90226 707441 1274557 1164607 704209 363395 206356 143486
40457 143486 210990 353980 321871 6789 -383598 -603533 -561601 -221133 362231 883902
40447 883902 1025485 884271 831956 941684 928560 669860 385987 273398 348424 654151
40437 654151 1167104 1477526 1096525 215134 -347701 -149662 374266 609295 494577 308101
40427 308101 161312 43940 45902 216136 429942 612133 847313 1109592 1174699 954512
40417 954512 615141 256552 -141881 -359026 -33373 655341 964000 596220 206397 450062
40407 450062 1028360 1234502 1027920 901495 964953 871494 546254 329973 381095 479264
40397 479264 471572 445568 404826 199190 -140776 -347637 -253700 91539 606573 1174861
40387 1174861 1526811 1474565 1202876 976740 676406 65040 -583528 -680848 -170316 373123
40377 373123 580021 669749 847051 904420 722133 643300 944970 1326988 1353066 1108025
40367 1108025 998726 1121692 1234613 1200268 1069459 815905 352879 -200410 -548006 -520751
40357 -520751 -176541 333211 817550 1064816 1012217 826256 663399 489968 312490 367924
40347 367924 781077 1203585 1181742 808425 599902 723164 780138 476408 95981 68949
40337 68949 362933 590352 536910 318100 138004 146720 446148 964298 1340766 1199171
40327 1199171 605024 69576 18246 396736 865997 1204987 1372951 1327238 1040320 696784
40317 696784 633514 968291 1430614 1681846 1685861 1618938 1526196 1297446 971176 818727
40307 818727 1016849 1386182 1585214 1494130 1313988 1325002 1594197 1884987 1862686 1469786
40297 1469786 1057430 987765 1142685 1085718 739787 546551 771206 1025541 851131 493359
40287 493359 587654 1197504 1725606 1823653 1827774 2084480 2360429 2296193 2065777 2110372 2416996
40276 2416996 2537676 2278043 1954284 1917979 2155013 2444603 2649827 2733486 2686952 2566482
40266 2566482 2464640 2357381 2099718 1651916 1204491 995535 1067615 1256334 1372461 1377207
40256 1377207 1412967 1628839 1929277 1998096 1699567 1342647 1331992 1631185 1848969 1831465
40246 1831465 1819875 1943089 1937164 1601520 1223317 1211648 1494715 1636121 1462479 1224957
40236 1224957 1142803 1125710 1043875 994509 1124081 1352190 1460287 1396485 1344957 1471455
40226 1471455 1676168 1676347 1376922 1101657 1294217 1929275 2404554 2194935 1482341 901558
40216 901558 753000 777758 707724 663720 839761 1101578 1194687 1183197 1351270 1699374
40206 1699374 1847784 1540615 1031611 804380 1007464 1319428 1345903 1023012 617189 440548
40196 440548 616566 1027567 1399782 1502728 1371539 1284021 1398635 1489157 1249120 831007
40186 831007 772468 1273230 1855133 1978536 1736464 1607363 1720319 1793252 1711943 1688233
40176 1688233 1786881 1756745 1502804 1320683 1414797 1524796 1327541 928960 628730 436180
40166 436180 197777 28288 183232 563064 755998 598526 333232 160226 -5587 -217407
40156 -217407 -284136 -75288 226483 400245 508422 715538 959485 1059377 1026581 995531
40146 995531 923869 661708 308720 185016 362145 515929 413583 293118 499581 918255
40136 918255 1102286 918039 722593 823004 1058792 1095480 908648 742687 717930 724418
40126 724418 667202 606003 627691 721076 805675 803274 690713 534723 412876 257546 -72751
40115 -72751 -466902 -527108 -94934 382030 353902 -65792 -230693 159602 722087 1000425
40105 1000425 1011564 1030890 1180705 1427678 1704639 1848761 1673439 1263405 946744 852901
40095 852901 805789 766584 962605 1361266 1478027 1060518 558008 499814 785514 1054000
40085 1054000 1360326 1880245 2262486 2018611 1421064 1254991 1659917 1942686 1674236
40076 1674236 1283110 1292837 1559598 1631102 1429796 1218951 1197758 1426629 1903404 2471317
40066 2471317 2864025 3017891 3139442 3379821 3716848 4220580 5068022 6164802 7126160
40057 7126160 7803746 8478516 9371663 10342911 11238817 12105177 12824434 12993803 12471398
40048 12471398 11635187 10790858 9766556 8467925 7357619 6856004 6629940 6053376 5119516
40039 5119516 4334390 3910188 3638007 3420161 3347887 3300414 2998305 2469879 2037982 1871056
40029 1871056 1931272 2250342 2793412 3162236 2971414 2473384 2262511 2378541 2296764 1852028
40019 1852028 1536221 1709318 2105820 2370388 2548627 2746107 2781042 2535124 2266684 2218938
40009 2218938 2228937 2054806 1809277 1739381 1814014 1850721 1866016 2013212 2317753 2697595
39999 2697595 3092945 3397514 3450668 3273495 3112099 3087632 3032068 2821970 2598167 2477874
39989 2477874 2362788 2248792 2374018 2763182 2971103 2661030 2153604 1987426 2171374
39980 2171374 2303410 2218568 2045405 1782393 1336425 915262 882568 1216387 1547193 1729204
39970 1729204 1926999 2125459 2050776 1687525 1411900 1435970 1524126 1458054 1397998 1527332
39960 1527332 1667202 1550670 1256815 1091178 1188930 1463116 1799830 2088705 2185728 2055103
39950 2055103 1860085 1747130 1638899 1400917 1104450 932756 892336 813343 639821 569896
39940 569896 845146 1438647 1987938 2093066 1739462 1356784 1331221 1527192 1493380 1103556
39930 1103556 720044 687966 963383 1335154 1697863 1938195 1872882 1562728 1419748 1685909
39920 1685909 2020651 1956876 1589369 1404192 1531696 1619316 1440264 1173251 980132 738040
39910 738040 398085 248573 526259 1001060 1239362 1122623 834995 478333 30797 -348820
39900 -348820 -324361 180059 762213 938855 676328 394237 479991 911722 1361578 1570633
39890 1570633 1566219 1557466 1685203 1878104 1921420 1673817 1244786 926544 896327 1036482
39880 1036482 1150238 1282043 1603559 1982463 1990823 1522002 1097073 1224681 1662234 1742763
39870 1742763 1345029 1041846 1224385 1581735 1663416 1516749 1440889 1462872 1455801 1516023
39860 1516023 1776619 2004535 1848788 1439765 1297878 1604688 1954624 1926614 1571308 1211818
39850 1211818 1044038 1066770 1181378 1251001 1242231 1335104 1663471 1972779 1891317 1571137
39840 1571137 1600282 2110668 2457999 2115469 1460310 1221174 1463023 1646800 1498994 1259825
39830 1259825 1136438 1063504 1061145 1330774 1844495 2236696 2270808 2095305 1915032 1743988
39820 1743988 1617634 1692392 1943373 2096074 2073447 2177381 2563761 2871525 2726571 2346095
39810 2346095 2234666 2461849 2657333 2600432 2392997 2127808 1834194 1734247 2076023 2638605
39800 2638605 2872204 2679961 2590443 2909350 3177927 2886838 2339705 2237153 2603542 2766798
39790 2766798 2420376 2081230 2264988 2729210 2929067 2858831 2941731 3250605 3355733 2984482
39780 2984482 2410961 2051895 1998195 2118078 2343550 2620012 2774879 2701785 2562398 2572808
39770 2572808 2683443 2705456 2666616 2757467 2953147 3001103 2840699 2734950 2850926 2973409
39760 2973409 2844380 2595757 2591125 2927665 3328892 3510771 3468356 3397398 3483987 3777471
39750 3777471 4135131 4291298 4127429 3885684 3942982 4316658 4579024 4392518 3966993 3774202
39740 3774202 3910631 4035349 3951293 3905899 4126990 4351284 4160523 3640567 3305314 3388405
39730 3388405 3629957 3835107 4175271 4709448 5056186 4928726 4652033 4683585 4883737 4794652
39720 4794652 4456995 4333939 4488916 4498122 4247863 4151945 4377043 4494999 4231199 3977897
39710 3977897 4140986 4478742 4577648 4555739 4748463 5045245 5125706 5092016 5254175 5462783
39700 5462783 5281398 4752312 4402721 4484777 4731361 4886163 4985687 5084832 5169805 5371183
39690 5371183 5808075 6218578 6235787 6027352 6098640 6420469 6396748 5866597 5493914 5859358
39680 5859358 6713050 7453470 7842976 7915561 7692223 7391445 7443177 7850297 7992156 7546415
39670 7546415 7139925 7485544 8282978 8699959 8661846 8844360 9468588 9933154 9795009 9416998
39660 9416998 9351896 9610014 9867471 10013589 10150485 10292992 10364146 10367193 10383170 10491800
39650 10491800 10774518 11257460 11785931 12099733 12091149 11874220 11614401 11458274 11593235 12120721
39640 12120721 12827132 13318884 13471383 13557938 13866029 14363943 14806945 14994447 14861765
39631 14861765 14501541 14177043 14156341 14450204 14835487 15172962 15548958 16059647 16624024
39622 16624024 17093992 17432911 17726144 18101535 18643861 19286989 19828487 20185549 20561406
39613 20561406 21155821 21790078 22113484 22168237 22402369 23034648 23747016 24191586 24521198
39604 24521198 25165762 26263148 27557517 28751466 29740271 30563448 31324140 32152214 33114659
39595 33114659 34153104 35179493 36217305 37393807 38799974 40374746 41925058 43307801
39587 43307801 44634188 46206474 48161420 50292282 52371089 54503275 56918067 59522310
39579 59522310 61995224 64292873 66695540 69320725 71979727 74645415 77684425 81389317
39571 81389317 85558954 89798422 94043068 98564528 103609692 109216165 115250335 121487606
39563 121487606 127795167 134335942 141425315 149126333 157225589 165674683 174724086 184463973
39555 184463973 194578914 204795130 215246883 226099077 237088578 247791800 258147424
39548 258147424 268379417 278551881 288479075 297897888 306442866 313636086 319208281 323278211
39540 323278211 325968492 327074933 326391360 324058793 320225081 314685597 307351632 298796680
39532 298796680 289759627 280307452 270105261 259335140 248611392 238047158 227226468
39525 227226468 216226764 205853592 196546187 187761521 178864290 170021106 161730607 153999969
39517 153999969 146557051 139469688 132936070 126728624 120466956 114318374 108863736 104292282
39509 104292282 100208894 96244851 92404068 88740327 85130166 81546162 78229232 75357209
39501 75357209 72733716 70017423 67165844 64484024 62255963 60430792 58677519 56693200
39493 56693200 54445431 52153346 50080148 48347554 46889226 45535170 44181242 42904542
39485 42904542 41825550 40823781 39581542 38061777 36724562 35968926 35510016 34705393
39477 34705393 33441589 32244628 31467983 30859108 30100737 29307558 28685474 28087559 27287589
39468 27287589 26426534 25811833 25451454 25113606 24702295 24286374 23893504 23522638 23198627
39459 23198627 22791132 22011928 20873097 19895462 19509937 19480373 19310988 18991078 18844381
39450 18844381 18808534 18445252 17654024 16838905 16304517 15978442 15818970 15980936 16380167
39441 16380167 16554003 16240216 15755192 15521784 15500396 15360054 14982998 14520836 14110499
39432 14110499 13786496 13571969 13451562 13314881 13058546 12682628 12232688 11775719 11473527
39423 11473527 11476732 11647758 11598028 11146166 10562619 10211175 10122233 10088884 10012196 9931155
39413 9931155 9825659 9624319 9370505 9194400 9129986 9102008 9083237 9131009 9246143 9289835
39403 9289835 9091243 8629605 8108759 7826772 7914162 8199980 8387763 8345256 8157856 7946777
39393 7946777 7751988 7572735 7400973 7219505 7058770 7005588 7051771 7039827 6920225 6919809
39383 6919809 7197770 7464917 7304245 6811851 6503692 6564913 6642170 6485812 6321180 6359872
39373 6359872 6387371 6165000 5888514 5879668 6086558 6243229 6304348 6381663 6442895 6397133 6299789
39362 6299789 6185951 5929866 5578022 5527424 5956919 6358857 6151687 5545398 5221423 5314231
39352 5314231 5376675 5287641 5425138 5816956 5898537 5441991 5033989 5154533 5365105 5024590
39342 5024590 4382543 4242155 4744046 5206185 5165936 4919048 4864775 4890334 4723115 4476485
39332 4476485 4436265 4534302 4445033 4127442 3900762 3949255 4074323 4063268 4038043 4225896
39322 4225896 4562091 4778651 4793520 4735692 4622469 4333486 3964766 3872126 4176269 4493044
39312 4493044 4401230 3974934 3586552 3359053 3128905 2837155 2624659 2587404 2733999 3129658
39302 3129658 3763960 4322830 4452054 4246168 4110372 4130506 3999441 3622542 3314618 3238425
39292 3238425 3142407 2917937 2923769 3357017 3728649 3489814 2888924 2630206 2841299 2973266
39282 2973266 2694373 2302390 2146821 2159753 2170695 2266714 2556433 2862116 2922339 2722007
39272 2722007 2418067 2112009 1889278 1910715 2229405 2617482 2790493 2753837 2753765 2925090
39262 2925090 3148883 3246067 3174817 3024403 2908990 2881739 2901283 2892244 2861185 2888845 2961499
39251 2961499 2908485 2619251 2260461 2136079 2330671 2603837 2665391 2478065 2259571 2237314
39241 2237314 2422572 2597665 2527705 2212112 1906280 1860969 2077963 2369965 2595666 2728732
39231 2728732 2735502 2547286 2205121 1906332 1812871 1881164 1963941 2022123 2131877 2296617
39221 2296617 2354080 2121202 1611976 1086911 861319 1024022 1338692 1466614 1299963 1035122
39211 1035122 932492 1093317 1465648 1911657 2200506 2104503 1651829 1163143 878541 674194
39201 674194 349299 55521 135383 586120 1027559 1237966 1379762 1595462 1729906 1644576
39191 1644576 1505721 1513785 1582147 1534812 1418640 1369374 1364100 1367382 1520971 1888958 2198283
39180 2198283 2163434 1915789 1776976 1766230 1695996 1582186 1529899 1376007 960720 636618
39170 636618 903667 1561825 1880043 1678096 1543790 1795904 1972518 1694741 1326636 1281065
39160 1281065 1311100 1112161 1070351 1652923 2450833 2647369 2211961 1830859 1794188 1776658
39150 1776658 1684923 1848724 2226026 2248978 1762982 1389883 1566083 1878121 1843730 1762776
39140 1762776 2150047 2735524 2759179 2099125 1444299 1339028 1606779 1812826 1819983 1696092
39130 1696092 1441319 1075826 793484 785395 995255 1212443 1351324 1505043 1749007 2008978
39120 2008978 2145702 2100502 1928060 1733958 1620098 1653699 1823230 2032303 2204142 2383108
39110 2383108 2636422 2860125 2844914 2597246 2408928 2468771 2582578 2484876 2276293 2280275
39100 2280275 2559747 2867953 3018798 2995316 2746239 2266223 1899817 2119443 2844537 3383583
39090 3383583 3280932 2861956 2669761 2723598 2711318 2619161 2690815 2906489 2976048 2823433
39080 2823433 2668467 2613648 2534757 2435074 2529226 2853848 3133763 3203100 3257726 3473454
39070 3473454 3635631 3433839 2959397 2604758 2532473 2522064 2348646 2062655 1821154 1647088
39060 1647088 1491974 1410992 1511508 1754613 1932163 1871522 1613134 1374457 1359614 1578647
39050 1578647 1817994 1830481 1611859 1436071 1526688 1758216 1836439 1732258 1709121 1890279
39040 1890279 2071150 2087140 2082141 2174260 2118175 1667805 1113185 1011404 1407159 1762721
39030 1762721 1734239 1579482 1619251 1708852 1552661 1245371 1132379 1283051 1429968 1367620
39020 1367620 1154193 957083 910086 1091981 1459217 1808765 1945158 1870499 1725542 1606885
39010 1606885 1523605 1443285 1303569 1100741 1040316 1411045 2164361 2798830 2854881 2393038
39000 2393038 1820182 1408748 1179441 1075557 1002998 843076 676765 839913 1462838 2101587
38990 2101587 2184084 1747798 1374774 1428027 1720156 1947970 2064553 2114135 2036406 1809856
38980 1809856 1563488 1406331 1320925 1308865 1446038 1702269 1893531 1915872 1869641 1860974
38970 1860974 1822508 1627707 1294943 1026241 1086366 1579278 2231402 2506245 2141019 1496955
38960 1496955 1151164 1219791 1356075 1335959 1280521 1289751 1242916 1081228 975131 1059713 1234004
38949 1234004 1336290 1330699 1273043 1283232 1519578 1921705 2058053 1601471 903812 634101
38939 634101 850295 987138 842869 913847 1483265 2030228 1990356 1570667 1298078 1211640
38929 1211640 1068629 971932 1158084 1410707 1305262 891005 583821 522585 555637 699978
38919 699978 1033103 1255387 989626 472724 329425 655314 944926 960892 1001748 1182266
38909 1182266 1144513 752798 449364 559330 774041 721771 586434 724366 1058209 1306306
38899 1306306 1483849 1697548 1712330 1250357 579787 301795 572488 947916 1022409 869105
38889 869105 783242 867403 968671 861429 445510 -124212 -512462 -504414 -198517 155666
38879 155666 399331 474657 381264 270536 395636 768300 1035537 926168 656275 618120
38869 618120 804820 869263 687755 530912 653560 983418 1257971 1268406 970705 555972
38859 555972 380994 603699 917533 892844 553903 337279 476846 736852 811533 694233
38849 694233 549321 475121 503942 613354 652199 486209 282394 374716 763169 1061546
38839 1061546 1068733 1036964 1174547 1265655 1103880 961462 1194390 1612731 1718130 1439187
38829 1439187 1159509 1083949 1073728 1122146 1464366 2058772 2431887 2305523 2016191 2012626
38819 2012626 2221639 2236285 1925403 1524824 1256094 1168805 1279251 1558607 1801062 1775585
38809 1775585 1539969 1388241 1445708 1502986 1314068 919116 604532 622055 970410 1388888
38799 1388888 1569670 1426943 1121248 796158 428567 39915 -124409 147769 696612
38790 696612 1143564 1318888 1311233 1194317 1020440 1020353 1393485 1837983 1725290 943149 191877
38779 191877 159261 696803 1134039 1156889 986195 851212 731142 612705 620737 792131
38769 792131 970174 1005738 885456 643167 346197 184327 343153 726923 1002750 983636
38759 983636 790010 587991 381891 152579 -12596 -65149 -95202 -137053 -39935 276869
38749 276869 570680 520994 188648 -11377 158953 464529 547832 413169 362159 513981
38739 513981 645376 582561 505388 637898 805691 648960 244959 103363 400581 626340
38729 626340 304228 -261394 -394203 -538 381996 408291 264632 145991 -44492 -268511
38719 -268511 -134286 529504 1233417 1368530 980654 638704 673783 890619 946462 703816
38709 703816 250203 -169228 -275331 -40665 194336 99866 -219114 -392950 -286531 -70929
38699 -70929 119906 301859 444309 469803 460960 579080 750232 714455 425206 121638
38689 121638 -32560 -84569 -29419 234236 583632 677508 455238 274680 333869 328215 1645
38678 1645 -307334 -113136 449300 793253 712633 553318 545287 445813 8499 -550047 -775329
38667 -775329 -476698 130625 636097 722819 411064 55329 -49612 -17642 -107148 -208142
38657 -208142 17929 489942 685180 414125 128607 194219 346523 271172 256446 680667
38647 680667 1180368 1045561 326978 -168967 -36683 256402 220726 23334 15717 146337
38637 146337 247142 448773 846574 1108580 920417 572241 591271 949800 1149022 1006019
38627 1006019 832271 802883 656608 194056 -320080 -498825 -335651 -143148 -128844 -209497
38617 -209497 -186908 2225 211605 259050 180646 207648 418024 579205 509514 418285 607619
38606 607619 959269 1064941 829202 582318 558133 609673 546237 440978 444360 518548 503797
38595 503797 300305 -67973 -397491 -329799 297731 1108827 1506057 1378460 1152408 1078478
38585 1078478 901565 424507 -40692 -113516 93692 216657 186415 159432 101304 -144107
38575 -144107 -456956 -495994 -161098 285284 582544 726546 821865 863992 755206 484785
38565 484785 250881 328573 714013 995450 810423 362809 150256 217475 151642 -125219
38555 -125219 -160731 192962 388319 66955 -260314 -34970 353354 175876 -375302 -435251
38545 -435251 147699 586898 414026 123696 295132 768550 1061743 1068580 962768 816885
38535 816885 672747 679578 855535 947312 758472 423010 215948 297242 688740 1224841
38525 1224841 1511612 1290357 858187 714156 788957 564695 23001 -190778 216941 687148
38515 687148 719840 656847 1008077 1518020 1565557 1145838 780885 660148 507908 196852
38505 196852 -101424 -348506 -680128 -979197 -886328 -338524 269147 556180 519633 393224
38495 393224 393137 597645 841549 778125 303300 -154245 -71888 477568 893253 806228 467062
38484 467062 323458 471093 618768 449423 -30684 -439877 -395650 -7925 197785 -16192
38474 -16192 -257660 -120593 170516 139015 -166579 -276960 -46218 235138 407931 579899
38464 579899 688038 496019 137649 111213 527281 862471 736690 486636 613026 1018604
38454 1018604 1213494 1056984 883856 976438 1248518 1466218 1556302 1640575 1861796 2197964
38444 2197964 2441781 2409968 2144395 1805754 1423676 926890 388247 20044 -90214 -40690
38434 -40690 83958 250720 331736 194115 -37449 -91205 31935 52565 -91443 -66358
38424 -66358 373884 977870 1256860 1002813 449225 64256 203399 765927 1205353 1120054
38414 1120054 768855 665355 755308 506906 -163115 -658794 -577481 -223352 17087 210488
38404 210488 414755 299568 -219930 -492735 39417 880204 1059351 450538 -185746 -322409
38394 -322409 -115506 202654 642487 1078029 1206152 1066036 1057754 1276490 1350712 1126933
38384 1126933 977705 1154595 1325476 1113188 700854 504523 530324 455607 168617 -132612
38374 -132612 -286474 -330002 -361456 -427505 -494822 -439071 -188476 59856 -3605 -313326 -390436
38363 -390436 -6830 407604 345202 -32422 -140515 177775 514536 591425 597840 697545
38353 697545 652781 248924 -221762 -298643 -20926 156750 92103 163387 600763 1001388
38343 1001388 855893 333488 101992 387922 643406 295684 -511885 -1163176 -1300511
38334 -1300511 -1030278 -581579 -97965 290075 488646 556561 592186 541896 350735 238644
38324 238644 498133 984734 1151635 731327 99777 -224356 -203501 -165114 -236241 -195182
38314 -195182 132713 575853 810271 754651 675215 873123 1290555 1507192 1197082 525329
38304 525329 -20821 -143484 62950 358615 589607 659489 500026 171739 -149730 -354780
38294 -354780 -448270 -419461 -259725 -129108 -251504 -555995 -679431 -468169 -231564 -302753
38284 -302753 -565191 -656210 -475661 -232833 -101053 -84499 -158022 -284722 -315143 -99007
38274 -99007 277335 537386 527702 363131 256991 313722 481292 617810 623037 562536 598053
38263 598053 740836 799698 672740 528140 520088 477291 131542 -419643 -761648 -687983
38253 -687983 -431878 -307996 -319196 -221782 134390 614167 897604 769260 366210 93193
38243 93193 194092 460989 492882 192657 -143326 -204869 10120 245898 241191 -48122
38233 -48122 -377618 -419030 -131211 184192 319068 457162 793409 1054876 806315 165970
38223 165970 -238868 -96264 244783 398070 471492 702163 936176 867118 570222 392265
38213 392265 415455 412364 309146 326991 582291 846542 869051 750045 804922 1140054 1534220
38202 1534220 1743877 1787791 1845969 1958338 1984683 1891271 1892575 2149868 2453624 2438989 2074643
38191 2074643 1687774 1501791 1434799 1424900 1635864 2142711 2657104 2820967 2633481 2367963
38181 2367963 2183777 2036235 1874518 1706570 1515532 1293081 1115261 1043473 1017411 978125
38171 978125 998831 1144919 1315469 1388445 1404169 1431914 1403141 1291371 1294396 1559158 1864238
38160 1864238 1903411 1783321 1868816 2180662 2347439 2186389 1945796 1883805 1960523 2059179
38150 2059179 2174375 2244437 2120887 1867057 1787268 1989236 2206723 2227247 2185462 2222427
38140 2222427 2169772 1847765 1413296 1121645 965328 820654 716801 668084 490956 137410
38130 137410 -20598 351691 981218 1297620 1183881 979866 848663 637777 346246 218440
38120 218440 300848 364782 364558 519449 813543 882502 595925 305023 256348 191234 -140439
38109 -140439 -461102 -378371 -17713 213171 280383 462749 751063 806903 544421 320353
38099 320353 422031 687473 783676 638237 458273 466924 708431 1005003 1076576 818902
38089 818902 456062 274690 232679 28846 -422511 -801034 -748619 -276932 265320 505717
38079 505717 290832 -213602 -579367 -431913 155040 675997 719650 400540 161851 239787
38069 239787 480149 644818 703409 749584 780096 718859 609223 591573 645334 548933 240694
38058 240694 42016 261471 681380 785634 491020 237479 240522 133732 -340662 -741580
38048 -741580 -544144 -35321 46751 -354216 -528904 -114017 390794 461103 298841 353294
38038 353294 566446 578077 367733 214844 230514 371335 736162 1368991 1872094 1728439
38028 1728439 1039578 490198 474680 656823 560162 239061 96455 253892 399183 220589
38018 220589 -196203 -445147 -225035 328520 770394 833381 697022 676519 772690 740698
38008 740698 540333 444171 640078 940910 994817 654898 76615 -431354 -602443 -375636
37998 -375636 70087 491415 771739 885798 800485 579732 463834 583635 678872 425500
37988 425500 8929 -19968 482515 1032497 1203532 1110666 994836 770548 357371 87129
37978 87129 284094 669698 715638 470944 478199 857045 1041662 620960 -28253 -251502
37968 -251502 58201 466012 610661 482815 203129 -143055 -424648 -468896 -260855 -30424
37958 -30424 -48750 -360960 -749797 -946443 -859447 -598449 -300172 5572 320431 542234
37948 542234 524226 281993 51275 85172 399860 710452 627272 18949 -747254 -1044810
37938 -1044810 -619606 93458 457061 353007 177134 169960 111552 -204914 -536699 -498572
37928 -498572 -113285 225723 247136 15061 -281462 -504612 -554057 -416018 -259797 -292126
37918 -292126 -475017 -560920 -437949 -241367 -63453 213045 640370 966480 911321 581645
37908 581645 352729 357477 352117 142249 -116966 -194028 -135716 -112319 -53804 244934 675054
37897 675054 800312 409641 -176826 -523049 -577061 -542686 -461029 -237968 17889 48537
37887 48537 -138331 -226442 -55862 133805 44864 -316861 -739565 -1044307 -1093566 -794040
37877 -794040 -282999 75521 82916 -64584 -123442 -178963 -416476 -698669 -719046 -503111
37867 -503111 -408638 -612100 -892413 -972991 -820626 -548325 -261339 -72581 -60590 -142886
37857 -142886 -174730 -198211 -362771 -565749 -466358 21521 527557 701203 660202 740403
37847 740403 978734 1110235 994684 797381 731080 771987 677601 252822 -384688 -834461
37837 -834461 -824435 -570159 -532353 -807372 -1018020 -879607 -560135 -310375 -65953 289858
37827 289858 541199 413331 84772 17674 308341 562426 439890 19224 -428386 -759008
37817 -759008 -971551 -1101945 -1168573 -1108100 -802470 -306900 60785 72053 -92127 -137872
37807 -137872 -134913 -340897 -659622 -723017 -497353 -334382 -362950 -319388 -108553 -29352 -226269
37796 -226269 -393656 -302533 -173396 -212383 -233226 -124376 -229977 -763912 -1255092 -1191164
37786 -1191164 -898175 -1065071 -1569903 -1566488 -768745 101020 346665 135769 -2796 24954
37776 24954 -2521 -78891 13690 311063 602832 669164 411164 -109501 -620305 -797459
37766 -797459 -612557 -363687 -280017 -305912 -349373 -457770 -607469 -614505 -454660 -414535 -714905
37755 -714905 -1218211 -1689506 -2060617 -2224832 -1922986 -1172478 -508838 -396959 -636271 -760544
37745 -760544 -780619 -1018586 -1389411 -1465854 -1232939 -1161193 -1421838 -1601803 -1409494 -1155271
37735 -1155271 -1239790 -1586895 -1907485 -2160893 -2393210 -2428754 -2136468 -1785579 -1713173 -1780825
37725 -1780825 -1595127 -1205387 -1129546 -1608943 -2218442 -2397603 -2114004 -1796729 -1767575 -1946265
37715 -1946265 -2071473 -2038771 -1952855 -1903551 -1792828 -1470804 -1027177 -810484 -1063205 -1609830
37705 -1609830 -2009202 -1986744 -1656531 -1370647 -1405915 -1722350 -1964217 -1791187 -1280009 -880010
37695 -880010 -885268 -1113469 -1239451 -1235566 -1237791 -1168374 -862153 -487119 -418334 -651263 -754227
37684 -754227 -541293 -388515 -631992 -1007512 -1052119 -812937 -722776 -889281 -967757 -769269
37674 -769269 -565832 -622540 -760971 -648376 -316687 -109175 -192486 -374777 -409935 -278641
37664 -278641 -118257 -28736 -20402 -39300 25996 247496 472577 364775 -189334 -781752
37654 -781752 -831403 -270760 338871 478015 230322 -2198 -117984 -332042 -685765 -931149
37644 -931149 -955257 -968144 -1112915 -1176037 -904589 -402351 24044 255313 360442 346625
37634 346625 180557 -20431 -96728 -120954 -304011 -626556 -829772 -812863 -763146 -782275
37624 -782275 -649584 -173447 387254 522468 88305 -460975 -523032 57604 890478 1457199
37614 1457199 1530189 1195596 631480 25753 -361024 -318864 23148 238090 95281 -145499
37604 -145499 -112737 167923 377704 372020 252199 80043 -129037 -175036 167668 706626
37594 706626 925030 644070 259215 174128 332965 501465 673310 913499 1053171 863818
37584 863818 403886 -51521 -314947 -348465 -188289 5466 684 -210338 -345075 -238878
37574 -238878 -90321 -92456 -95744 79943 278739 309099 346234 606563 845515 678378 245206
37563 245206 16556 30723 -94509 -412227 -540168 -399481 -419609 -767952 -960640 -604491
37553 -604491 -52818 112765 -88034 -170951 64039 340712 367281 165433 -26983 8988
37543 8988 269444 466446 336450 75705 174682 673065 940228 476574 -388783 -954937
37533 -954937 -1027729 -924856 -824393 -611536 -297929 -98645 -32698 147567 511853 760508
37523 760508 628361 251595 -8226 43521 311286 559602 615564 492043 335001 226265
37513 226265 113717 -14503 -44118 46542 54982 -154316 -372049 -292785 83517 543158
37503 543158 997047 1400700 1466609 901743 -33587 -613901 -445057 117820 480453 469110
37493 469110 322481 256389 248737 157850 -80760 -334916 -340806 13155 495542 778005 833797
37482 833797 890805 1026631 1077198 964795 832024 777179 720074 619195 563257 547188 428043
37471 428043 232973 231029 517722 787712 747481 536083 479669 596214 620304 425847
37461 425847 175437 89932 257498 629854 1050154 1327159 1411903 1452488 1582424 1748407
37451 1748407 1838822 1842638 1757573 1510388 1143495 902511 895759 823243 364265 -248287 -411098
37440 -411098 55771 638236 770395 457832 90925 -102628 -161232 -114644 82117 363160
37430 363160 555077 608071 626501 620632 439592 65925 -218061 -154085 123673 265687
37420 265687 183947 109320 192867 314443 330225 249520 81752 -228000 -586205 -740596
37410 -740596 -646177 -572853 -655949 -641644 -340310 -9953 67163 73209 263951 386953 85269
37399 85269 -325308 -198343 378321 627672 294646 28144 287851 630471 528420 235774
37389 235774 261070 498170 525219 387190 412942 504075 268499 -252394 -578695 -475322
37379 -475322 -152387 167324 423078 511264 360525 186288 255181 445243 461022 404410
37369 404410 634629 1087847 1270917 988982 569811 278660 33783 -158981 -44089 352288
37359 352288 530975 217938 -142025 17388 596942 1045383 1129309 1065430 1017535 890463
37349 890463 628663 371771 226719 123009 -5668 -64344 60682 291481 407057 294903
37339 294903 73333 -76241 -133546 -187526 -184633 73993 572372 890548 599637 -200672
37329 -200672 -923671 -1069850 -644976 -64945 218642 61510 -260511 -336306 -109740 59156
37319 59156 -49537 -132785 202826 833300 1287261 1380728 1311111 1225587 1097211 968986
37309 968986 914244 791241 445721 112815 162268 469775 555411 370639 378335 744208
37299 744208 1052455 1048302 1083054 1491284 2027896 2303009 2348079 2361297 2282033 2037312 1870998
37288 1870998 1983270 2108936 1887642 1450009 1239856 1419707 1796939 2166369 2394005
37279 2394005 2326814 1946284 1491687 1188002 1009454 891943 911553 1030132 985128 711466
37269 711466 543134 699932 946494 1088521 1352179 1823817 1998086 1500490 858781 833692
37259 833692 1270704 1385024 986194 599813 470448 310946 94204 234860 762986 1067707
37249 1067707 775090 270850 53391 118279 270823 510701 774991 778034 459325 194498
37239 194498 249831 397440 350886 200355 122382 27249 -194580 -405692 -491096 -578357 -727665
37228 -727665 -737978 -523418 -326849 -287515 -187215 60113 92236 -315354 -732023 -632769
37218 -632769 -187382 7159 -246681 -674776 -1074384 -1400816 -1453550 -1028905 -362185 54082
37208 54082 84308 -41675 -275431 -786465 -1408947 -1600604 -1171241 -624501 -491212 -638777
37198 -638777 -554884 -97014 390775 631685 751017 964869 1163703 1033549 555216 134722
37188 134722 88146 174454 -85847 -705781 -1197977 -1278005 -1202876 -1245326 -1232454 -913548 -461600
37177 -461600 -220021 -179673 -116309 -72123 -253144 -544573 -591077 -358178 -191978 -273432
37167 -273432 -402148 -404041 -384831 -444111 -455060 -298665 -78863 48365 78385 80297 73937
37156 73937 51873 -21881 -237369 -570949 -723262 -402226 213108 594142 509836 246732
37146 246732 103585 11497 -192838 -460554 -722587 -1080485 -1524316 -1718378 -1403193 -842585
37136 -842585 -539920 -610390 -731176 -628370 -311193 118836 567739 851101 803341 550866
37126 550866 416852 477467 469541 248093 59606 148678 315023 174499 -227046 -398521
37116 -398521 -60314 469701 710252 625804 554855 633797 594254 191274 -412957 -852828
37106 -852828 -1005558 -1057756 -1194173 -1392104 -1522745 -1518328 -1400310 -1228292 -1064489 -944554
37096 -944554 -847892 -698123 -404179 48857 485036 570015 122778 -580622 -998854 -905757
37086 -905757 -606422 -479530 -533362 -597095 -703368 -960189 -1196853 -1118622 -777887 -534839
37076 -534839 -528366 -521215 -325657 -55573 130899 212733 108758 -362111 -1119407 -1700424
37066 -1700424 -1741939 -1380420 -974395 -651090 -356398 -134460 -66621 -74982 -54046 -74302
37056 -74302 -198784 -235347 21107 391698 491649 281345 122380 258284 530864 675701
37046 675701 640346 522861 416069 398595 481407 494155 239317 -164371 -342212 -199334
37036 -199334 -134874 -491191 -992856 -1048433 -538348 4371 38848 -396613 -832628 -923086
37026 -923086 -714878 -460168 -308161 -200354 -11344 249904 417179 364774 163458 -48187
37016 -48187 -290994 -673263 -1071404 -1101021 -576208 129616 405080 60996 -520757 -890408
37006 -890408 -956015 -854355 -665746 -460297 -446389 -778031 -1237906 -1373073 -1025390 -548664
36996 -548664 -389854 -575222 -740525 -610461 -307578 -157239 -283361 -498674 -590218 -588530
36986 -588530 -648191 -748251 -710143 -516355 -372303 -351923 -226928 149233 493244 413780
36976 413780 -37234 -432593 -516315 -376332 -128044 207461 478880 431756 85887 -215013
36966 -215013 -253364 -150337 -20298 242259 640558 875499 734352 404371 120947 -224060
36956 -224060 -783150 -1302122 -1390342 -1119185 -932727 -993483 -1003583 -722714 -339067 -219639
36946 -219639 -496472 -959578 -1217264 -989206 -407332 34558 14931 -230634 -278292 -115769
36936 -115769 -33970 -36966 172903 582489 717946 311225 -250264 -410575 -138877 121853
36926 121853 38290 -310530 -619058 -665591 -482367 -309682 -334918 -472944 -515699 -458574
36916 -458574 -470004 -554132 -532510 -422197 -516879 -935859 -1359718 -1411179 -1094595 -685422
36906 -685422 -384460 -250138 -265047 -285180 -121811 147594 167613 -201156 -611783 -684973
36896 -684973 -496306 -350256 -322096 -350584 -541796 -960214 -1276078 -1076220 -471223 12100
36886 12100 104190 -28419 -215703 -445328 -598425 -507046 -343353 -476490 -835446 -914623
36876 -914623 -578658 -315577 -405502 -403366 80465 567489 335153 -411131 -704191 -127633
36866 -127633 679859 961331 729676 465455 364276 251074 6731 -272626 -475116 -595547
36856 -595547 -668476 -707233 -687187 -531176 -187932 221571 447802 380526 163787 -32465
36846 -32465 -219864 -461865 -682818 -774771 -791053 -845868 -891667 -796877 -601883 -474995 -414126
36835 -414126 -233843 83876 259968 86822 -244307 -373503 -240294 -140069 -337915 -769184
36825 -769184 -1131185 -1174056 -890769 -485017 -164561 36985 187173 234409 34312 -335063
36815 -335063 -501623 -243654 153717 248525 36122 -126510 -134545 -275332 -672743 -979200
36805 -979200 -840757 -388900 -19748 117186 176374 324184 598361 909015 1009547 673117
36795 673117 90528 -182674 42698 219761 -161005 -722500 -710561 -177170 71308 -262317
36785 -262317 -534900 -268126 47430 -229650 -822366 -943327 -451135 74237 269663 348672
36775 348672 500394 526079 272845 -6193 5048 235795 345778 145940 -251314 -601764
36765 -601764 -745989 -716543 -668770 -669634 -606869 -381419 -81590 165600 379752 569542 536597
36754 536597 113720 -492317 -884678 -929478 -741236 -351587 204348 573126 384841 -99252
36744 -99252 -202052 169100 323145 -150445 -706291 -660090 -176408 110950 81551 98900
36734 98900 239174 219533 24857 -15550 178367 303191 216143 125016 121773 859 -282996
36723 -282996 -413375 -208448 41473 -4625 -266462 -443496 -439986 -336714 -149283 121295
36713 121295 339660 366577 243780 97850 -15447 -54335 36567 150656 33076 -321729
36703 -321729 -491962 -123072 543736 941887 905785 815954 1004326 1299543 1286920 852038
36693 852038 310882 31683 34237 36755 -117729 -236651 -114309 64018 -34016 -286554
36683 -286554 -187548 349642 696859 325503 -439548 -885637 -858748 -753992 -726354 -484655
36673 -484655 86222 601617 661027 323585 -59392 -228770 -119150 172232 395969 339797
36663 339797 96899 -49938 -43364 -98373 -302137 -479662 -539858 -614572 -716518 -618590 -286268
36652 -286268 -83343 -258736 -530691 -522469 -355968 -420873 -749144 -1052201 -1255778 -1524093
36642 -1524093 -1769965 -1621058 -993421 -307790 39076 106108 132587 131403 13466 -98587
36632 -98587 11917 303684 501579 475843 409216 540411 854392 1084043 984795 590500
36622 590500 194851 52957 116984 135032 -8711 -183364 -265951 -338875 -519724 -720922
36612 -720922 -736094 -501465 -130358 257059 586622 760285 726520 635117 732355 1026093
36602 1026093 1203643 990401 499372 131882 189146 631808 1140648 1366218 1221543 986598
36592 986598 1006677 1237173 1271805 930011 570831 580097 763841 631410 175976 -84340
36582 -84340 110427 389780 338684 63233 -85065 -26735 95427 203576 204271 -114573 -727369
36571 -727369 -1131768 -898137 -300913 51961 83660 211148 513528 572259 250468 8532
36561 8532 174574 439734 434616 332012 431619 543069 324854 -21246 25565 492027 866123
36550 866123 867989 766667 830958 904571 718967 301899 -138838 -501215 -752522 -790705
36540 -790705 -567083 -255561 -96650 -81030 60914 497372 1003786 1147372 799683 357308
36530 357308 305096 618308 835993 744681 658443 844806 1007723 698737 38144 -395618
36520 -395618 -321985 2386 288525 536446 763410 808352 604157 358917 266752 261905
36510 261905 237405 287066 512997 755785 742297 415525 -51815 -487818 -802757 -902617
36500 -902617 -693844 -209434 329413 616694 500928 198784 166420 564653 921546 615002
36490 615002 -291222 -1018662 -991214 -464838 -63974 -6605 -79502 -143285 -286866 -553173
36480 -553173 -819095 -959889 -946739 -807104 -628725 -531842 -511089 -424159 -265639 -257811 -471949
36469 -471949 -592128 -357733 -27394 -3808 -162607 -58209 265222 256721 -244947 -690788
36459 -690788 -666604 -511533 -662887 -841438 -496111 196197 469862 107015 -216293 69731
36449 69731 619032 731804 357732 69573 197566 462264 502261 376934 369449 535541
36439 535541 670147 623601 476933 422131 555780 762230 762522 364809 -271051 -726163
36429 -726163 -775274 -631126 -609204 -690423 -633261 -412229 -241015 -174579 -29011 211966
36419 211966 249997 -65089 -401725 -345636 66070 488772 768339 960422 986515 684263
36409 684263 194431 -97846 -81976 -23334 -49205 70095 426528 652318 432837 48275
36399 48275 -16743 179068 147942 -222628 -475742 -294523 41409 136986 63144 136760 357549
36388 357549 442738 338239 335190 621527 979935 1053539 768326 389380 231921 378391
36378 378391 643412 797218 826710 908384 1087372 1136578 891308 583757 580683 848923
36368 848923 993844 849229 692517 765458 912484 889951 741291 613472 459680 229275
36358 229275 129729 323871 508540 207842 -546770 -1205922 -1393025 -1269803 -1170876 -1195842
36348 -1195842 -1242798 -1169077 -849809 -335174 19257 -118645 -557243 -754667 -565558 -419821
36338 -419821 -609672 -822530 -657320 -252564 -62373 -258836 -670426 -1093640 -1364866 -1340880
36328 -1340880 -1124433 -1102437 -1427744 -1669951 -1360591 -711840 -376725 -615534 -1123407 -1586651
36318 -1586651 -1937743 -2081673 -1863785 -1404042 -1052746 -910455 -769628 -616421 -743608
36309 -743608 -1168324 -1363599 -905685 -116350 286454 37735 -454580 -649226 -391506 67776
36299 67776 381740 414950 322661 318594 375809 276445 -19029 -227854 -85548 285698 488973
36288 488973 305142 -47838 -124176 269435 800559 910099 447686 -125788 -294205 -71476
36278 -71476 177973 301492 381587 324359 -92269 -705130 -964230 -639909 -178594 -130667
36268 -130667 -503704 -897512 -1027682 -883112 -566639 -212837 55290 232107 376631 417506
36258 417506 234849 -22899 -16973 282299 507493 444063 308404 304131 302758 205253 196895
36247 196895 324374 250666 -156695 -401671 -36050 573828 720411 330090 -120747 -421974
36237 -421974 -696164 -822926 -549449 -139285 -140463 -424102 -233771 590898 1209270 979442
36227 979442 379998 212370 431902 399809 -63586 -527534 -676020 -600159 -421194 -130451
36217 -130451 154581 188407 -45284 -265204 -271099 -173044 -171752 -280786 -338266 -205466 60231
36206 60231 194937 -17215 -414678 -553769 -273533 36651 -35801 -331914 -394320 -199189
36196 -199189 -174312 -483568 -756981 -682001 -439374 -286047 -72969 428701 965227 1036853
36186 1036853 622078 214598 110611 104343 18962 79494 455838 800033 664641 171325
36176 171325 -179267 -237178 -262881 -296996 -14716 646966 1200049 1212278 849669 555353
36166 555353 514110 702143 1113336 1572861 1633341 1092158 395974 104641 154525 107349
36156 107349 -82983 -117778 -32996 -179523 -513737 -564396 -240281 -35349 -187985 -241863
36146 -241863 186453 719865 766670 376235 64463 43160 87370 4069 -192482 -478633
36136 -478633 -827971 -1069024 -1028192 -775153 -515387 -338292 -273237 -438992 -871883 -1317507
36126 -1317507 -1452434 -1243299 -903291 -624553 -531550 -696595 -964047 -982126 -700646 -594715
36116 -594715 -1012871 -1523239 -1401388 -661039 -65119 -90897 -400887 -480523 -343493 -350037
36106 -350037 -637244 -1001471 -1184163 -1089573 -820724 -592237 -510853 -432345 -182840 102650
36096 102650 83497 -321690 -792279 -978467 -829572 -518107 -229891 -73003 -30885 15521
36086 15521 88070 2113 -347773 -693101 -663448 -289105 71338 233370 258338 107086
36076 107086 -292789 -620553 -367512 359108 771677 417065 -231846 -539607 -578061 -757191
36066 -757191 -994408 -879082 -470500 -296152 -544709 -782448 -582704 -43191 448091 646765
36056 646765 526412 182634 -196841 -447608 -606013 -810499 -982481 -828043 -276997 274676
36046 274676 361540 10332 -285844 -173575 134670 155368 -216890 -547876 -423742 9187
36036 9187 259115 122879 -166947 -375244 -503764 -553598 -419251 -174039 -115730 -303356
36026 -303356 -368854 -71353 263160 204163 -149756 -411842 -551523 -792928 -1004312 -774389
36016 -774389 -144719 277686 123934 -257787 -364685 -216218 -166813 -304323 -390405 -307868
36006 -307868 -260147 -464461 -805735 -913719 -595588 -117418 79535 -44058 -45024 380946
35996 380946 938485 1126891 856458 341575 -372099 -1274146 -1929956 -1788000 -1010699 -403476
35986 -403476 -348413 -381063 -68119 298990 293810 106789 161948 358994 286053 -50118 -277393
35975 -277393 -290048 -282808 -261024 -81963 44363 -316910 -1086682 -1573647 -1315755 -630025
35965 -630025 -134659 -67519 -269633 -516359 -622683 -472756 -188652 -89541 -291661 -528487
35955 -528487 -541628 -438626 -433898 -430513 -179133 225145 339411 -61655 -656345 -960407
35945 -960407 -910542 -875327 -1088589 -1270243 -985619 -306296 156899 -20241 -560075 -903271
35935 -903271 -934295 -963072 -1113893 -1161478 -1005731 -885023 -951391 -988401 -792731 -559665
35925 -559665 -604521 -885577 -1081418 -1028017 -842246 -699047 -688808 -813930 -950332 -903764
35915 -903764 -662044 -470493 -497001 -588465 -566244 -569234 -809828 -1152932 -1306314 -1333231 -1557315
35904 -1557315 -1964568 -2140145 -1902345 -1590054 -1532447 -1593013 -1495040 -1295382 -1208404 -1168159
35894 -1168159 -931523 -533498 -302727 -406868 -645533 -754006 -708272 -642108 -609761 -541487
35884 -541487 -373446 -152267 -27791 -146118 -503230 -896888 -1067646 -901282 -479619 26844
35874 26844 445786 602402 361505 -215426 -777385 -894874 -485584 24498 131982 -134140
35864 -134140 -238756 120577 551945 514463 131884 35161 423517 777242 670910 402564
35854 402564 469670 790863 925885 837672 866609 993744 728848 -79638 -803443 -740026
35844 -740026 19676 750854 942375 680560 312487 67249 20175 149095 316705 352486
35834 352486 243133 148756 178223 238299 159923 -98526 -421346 -636663 -596307 -244194
35824 -244194 281657 650364 581157 139126 -292759 -398355 -226308 -49719 -18026 -67148
35814 -67148 -110825 -140311 -123485 11587 229191 389091 475600 633975 856821 857752 485408
35803 485408 80659 107838 524236 854204 856675 747262 711348 599254 287266 2322
35793 2322 14722 232886 374417 377859 384035 432238 438850 412886 464897 629991 839577 1007400
35781 1007400 1024530 810600 528873 553630 976886 1342927 1206830 797830 714506 1051096
35771 1051096 1298571 1115861 705936 348619 86413 47795 513762 1315083 1675675 1154777
35761 1154777 356887 130645 363035 261121 -312375 -580916 -64388 672033 837323
35752 837323 450533 108821 86723 158977 131457 89652 159514 356407 649741 918532
35742 918532 910989 536726 150917 232377 767897 1248771 1304962 1037743 668076 209518
35732 209518 -326618 -691746 -637958 -252891 154885 405954 534509 647661 851569 1188896
35722 1188896 1507561 1549672 1320748 1151620 1175957 1019922 385469 -279543 -221957 557212
35712 557212 1241182 1285440 1014461 914449 880678 579871 145083 -14746 123903 218735
35702 218735 117942 -51071 -258991 -576582 -817625 -641048 -81248 421059 602714 613972
35692 613972 584957 385722 6813 -218462 -47365 320840 592138 783546 982163 987408
35682 987408 596025 66187 -130002 42897 162915 -19827 -280187 -301194 -68098 208775
35672 208775 338425 240301 -16310 -205995 -156077 9420 31131 -63156 46056 471577
35662 471577 890169 985028 891617 959529 1212869 1328427 1122340 802370 663954 713540
35652 713540 716081 525045 231816 -1254 -141765 -268401 -422489 -562100 -628668 -561207
35642 -561207 -270549 254259 796356 1050397 995751 945873 1096051 1232349 1107538 899472
35632 899472 957776 1218607 1282256 1054208 863395 854542 730128 325741 11429 151785
35622 151785 490703 523450 272017 184601 343980 328173 -24158 -209234 261623 1076092
35612 1076092 1397166 842859 -112563 -733562 -778337 -562655 -453162 -503298 -564634 -542957
35602 -542957 -418989 -153072 222154 460202 303764 -112320 -301905 -4483 488671 754361
35592 754361 765538 748154 700696 421666 -35321 -300511 -153246 226835 551782 722100
35582 722100 745274 601953 329756 60187 -145353 -342504 -510770 -504865 -294564 -49325
35572 -49325 131801 353035 632088 719245 446978 75571 2605 235223 435370 425118
35562 425118 347448 323593 251453 46126 -144469 -114795 127948 388392 507861 480236
35552 480236 400238 380212 495056 724974 910679 810821 316837 -327475 -633704 -362811
35542 -362811 141484 327968 125532 -32904 91129 216028 109163 56301 359777 700454
35532 700454 561159 122099 100420 676547 1209208 1201892 967537 995943 1151460 970665
35522 970665 442360 -5888 -141684 -106460 -34860 110369 329699 539528 752798 1040432
35512 1040432 1300682 1304640 981785 464303 -104850 -578431 -703638 -349766 156584 275271
35502 275271 -72860 -385004 -258215 110934 300100 258337 245735 345162 354433 149009
35492 149009 -86941 -53408 353518 943302 1370083 1377453 982336 442575 36179 -118108
35482 -118108 -65447 59068 102314 -1979 -164863 -252064 -251942 -227594 -142407 81149 336072
35471 336072 406463 323257 378312 666362 889568 804501 594073 537386 556293 425622 243230
35460 243230 290581 529827 664564 677560 869025 1286408 1533831 1323035 885245 635948
35450 635948 682367 834446 876116 686547 339991 207241 640972 1383446 1656169 1125513
35440 1125513 415684 263128 497248 413415 -59898 -255620 152062 638712 647701 377538
35430 377538 372568 694300 930077 845993 651635 659204 932032 1252830 1296487 913715 368464
35419 368464 168594 512762 1035354 1249021 1081099 797211 595627 547128 764992 1266880
35409 1266880 1721054 1703509 1266980 951155 1130548 1596127 1879656 1773187 1426565 1133067
35399 1133067 1129413 1429822 1751320 1764934 1507376 1364968 1560931 1867281 1950990 1788657
35389 1788657 1563845 1362799 1211597 1258661 1632414 2165517 2497167 2447714 2135807 1779795
35379 1779795 1561317 1622326 1969586 2370312 2523075 2361381 2072062 1846762 1748703 1753710
35369 1753710 1738421 1499721 1023944 688765 900703 1509614 1900949 1773484 1520847 1655451
35359 1655451 2111093 2379639 2191232 1795184 1612554 1806547 2185754 2399451 2237532
35350 2237532 1815419 1436201 1260095 1226963 1314181 1632299 2131038 2459941 2385255 2182938
35340 2182938 2304278 2729044 2981865 2800917 2474668 2421128 2689930 3017610 3179197 3128803
35330 3128803 2930636 2716427 2648416 2794175 3039698 3172540 3043435 2676527 2302376 2255987
35320 2255987 2704536 3437882 4021317 4172987 3919313 3443549 2959855 2714987 2874232
35311 2874232 3320978 3738680 3954019 4033854 4022235 3834879 3502011 3241421 3141174 3040610
35301 3040610 2910109 3039910 3565949 4097798 4205246 4047800 4061284 4190167 4003762 3549753
35291 3549753 3459807 4016652 4661489 4747648 4361562 4037295 4012231 4182434 4517455 5033652
35281 5033652 5494144 5606108 5487941 5531322 5790226 5902959 5686699 5425042 5412664 5536496
35271 5536496 5521114 5355781 5248829 5304909 5447009 5559342 5544828 5335639 5016856 4876389
35261 4876389 5157684 5769232 6372324 6763361 7048968 7407402 7791469 7986861 7949776 7943966
35251 7943966 8218257 8611200 8688531 8345256 8056870 8332303 9052979 9608409 9629640 9330701
35241 9330701 9146197 9314397 9847593 10607484 11289529 11587526 11529744 11469811 11647277 11974669
35231 11974669 12344778 12844744 13475472 13946413 14023188 13875291 13824745 13951967 14209983 14684613
35221 14684613 15380071 15936809 15993146 15743568 15727310 16104294 16553134 16880707 17283057 17897402
35211 17897402 18491744 18779800 18767543 18654126 18630058 18851032 19339624 19837361 20046146 20093186
35201 20093186 20430717 21172073 21883872 22190165 22219053 22243609 22239880 22081169 21874805 21810990
35191 21810990 21909876 22153647 22589611 23051931 23117569 22681226 22259188 22316077 22576474 22475439
35181 22475439 22043331 21786826 21842877 21850364 21631841 21422763 21360700 21274429 21083046 20906874
35171 20906874 20661004 20055866 19191258 18632587 18611204 18618642 18154050 17457829 17067531 16990014
35161 16990014 16836024 16557658 16475412 16610483 16531510 16000758 15365028 15087077 15151997 15163689
35151 15163689 14877534 14432668 14119305 14070881 14172015 14163163 13831267 13179604 12437224 11849846
35141 11849846 11438587 11024766 10531268 10155526 10099681 10192855 10030778 9550267 9185193 9259568
35131 9259568 9479841 9345232 8884418 8575995 8599086 8615731 8368933 8058143 7927141 7847668
35121 7847668 7584420 7206855 6959137 6915853 7013941 7240433 7532325 7661803 7504728 7293487
35111 7293487 7313042 7439760 7282646 6744151 6158152 5861307 5864412 5966363 5974871 5775670
35101 5775670 5376055 4946881 4694002 4649375 4680265 4690017 4696895 4734939 4796091 4858109 4878434
35090 4878434 4807567 4698690 4709818 4871069 4974685 4881557 4802285 4998597 5290890 5217004
35080 5217004 4709278 4249012 4201503 4321421 4169944 3780250 3563591 3649250 3684818 3366750
35070 3366750 2871891 2564678 2465607 2293833 1991747 1889585 2217762 2702625 2892333 2747807
35060 2747807 2627870 2745380 2943262 3028067 3021312 3001611 2979125 3018602 3191523 3304760
35050 3304760 3038128 2525372 2383640 2862280 3366789 3258539 2770236 2572082 2703977
35041 2703977 2631992 2262401 2129557 2436860 2618460 2193502 1515746 1258143 1538257 1970377
35031 1970377 2285771 2457755 2399497 1994033 1403499 1009399 1005124 1257826 1560147 1805167
35021 1805167 1905811 1766835 1451026 1255857 1464738 1975092 2263119 1876582 1002986
35012 1002986 370585 448650 922345 1172253 1075759 983772 1051199 1084364 1060820 1260379
35002 1260379 1700492 1932083 1690384 1338759 1315451 1493509 1501511 1389697 1490144 1777343
34992 1777343 1866650 1626933 1368223 1364905 1532724 1661035 1690402 1661999 1601675 1550231 1562752
34981 1562752 1612242 1605007 1532412 1518355 1676607 1947589 2074838 1790051 1147282 646258
34971 646258 788679 1447044 1934771 1825941 1420425 1218314 1264125 1309143 1317873 1398187
34961 1398187 1430055 1216030 900242 808111 919924 913149 702459 530811 524379 568413 651768
34950 651768 904916 1213722 1220992 860384 514581 481558 633815 768860 922997 1111184
34940 1111184 1113621 829782 574437 696034 1089875 1386552 1462003 1465096 1471653 1425756 1358439
34929 1358439 1364897 1367028 1160483 748215 422163 425199 658829 813338 725259 532784 478403
34918 478403 604488 716760 680799 646882 838707 1187519 1394687 1364037 1317410 1384475
34908 1384475 1329804 890204 214300 -276370 -386994 -281324 -135933 102231 527157 1006028
34898 1006028 1261979 1194748 981234 810184 636914 330400 -22919 -190214 -172512 -230672
34888 -230672 -420179 -412962 -17446 431570 567327 612034 1003707 1561266 1634274 1106642
34878 1106642 633255 706218 1055552 1241388 1294861 1384954 1322708 897142 381876 202635
34868 202635 316489 390281 411859 624234 951777 1002787 677944 361067 411627 766423
34858 766423 1111896 1209061 1006600 640635 356978 299881 420356 686028 1184317 1809135
34848 1809135 2091902 1708992 1005634 617692 664960 728272 565097 393220 432423 589646
34838 589646 694608 700068 580192 366150 320818 700466 1279273 1507969 1241978 911989
34828 911989 862372 961246 1032644 1199833 1516633 1678577 1460907 1121930 1014056 1065811
34818 1065811 1003365 840421 772942 780126 704020 589948 610720 764872 939652 1129358
34808 1129358 1297870 1203627 716906 165647 -17959 112289 170713 90520 182081 561781
34798 561781 965298 1187821 1309102 1386027 1294788 1020266 794654 806223 1009992 1296164
34788 1296164 1577079 1669369 1426180 1061704 981119 1182467 1224854 937273 700813 769948
34778 769948 788922 399038 -64036 -14609 479457 798936 681882 494023 571988 772115
34768 772115 788664 563419 259936 92905 231944 620835 903324 827299 675494 896224
34758 896224 1324319 1295376 666437 159999 374826 943523 1124781 857063 673333 787119
34748 787119 854780 623082 301215 189563 318708 568831 841438 1003230 916648 631217
34738 631217 341629 108473 -145475 -318785 -106784 558519 1268798 1521373 1218359 678688
34728 678688 288170 230933 422677 592273 525312 301169 194649 311794 457322 399161
34718 399161 118334 -231234 -440013 -296240 254742 922771 1252212 1097738 754448 551744
34708 551744 530614 592952 698739 773914 687096 507538 548411 939822 1369681 1467083 1246345
34697 1246345 965050 770428 723869 918800 1257629 1335355 911861 328447 78766 127361
34687 127361 78983 -107766 -80195 261847 594889 730472 865567 1108877 1188600 888521
34677 888521 453558 281965 423435 619679 692120 690394 752513 947913 1184436 1234337
34667 1234337 983181 650566 559565 676853 645009 325811 9624 -41508 41564 27606
34657 27606 -19944 88624 275212 261672 -13385 -271495 -218051 126622 451784 488038
34647 488038 313656 272641 524472 796995 761179 527659 486134 719656 936207 989108
34637 989108 1060985 1226616 1241221 970333 682957 664996 819935 895383 848569 747516
34627 747516 563927 323979 236101 410464 657904 790776 876943 960819 833939 398212
34617 398212 -29451 -147987 -151585 -363624 -619371 -492513 10458 474256 712146 892403
34607 892403 1054338 989743 675824 405988 381700 500949 611125 659567 568907 298688
34597 298688 60505 133214 441015 665556 775678 1020953 1357285 1372836 945879 509010
34587 509010 419726 490594 434596 381856 578823 883048 983066 933837 1068170 1469553
34577 1469553 1879933 2077872 2048835 1825476 1452006 1095726 918440 821028 585146 321352
34567 321352 484567 1262418 2148824 2398010 1872447 1199216 1007907 1223915 1309530 1052554
34557 1052554 781631 789761 933363 1004303 1148627 1546048 1908444 1773597 1228608 865622
34547 865622 970923 1201257 1188773 1049234 1083620 1325965 1626156 1887222 1980195 1703547
34537 1703547 1104149 603751 517183 639320 595296 413002 420600 703097 995726 1062328
34527 1062328 890942 553256 147378 -122647 -57966 304348 722964 991046 1016658 782568
34517 782568 442868 354577 728497 1287448 1554707 1461931 1356271 1390621 1294485 906039
34507 906039 570867 705046 1181295 1502171 1495904 1483488 1711147 1937933 1769420 1208022
34497 1208022 650739 422571 511226 724688 896129 908806 737932 571054 706564 1185309
34487 1185309 1655915 1760589 1544116 1330236 1320364 1497368 1787329 2065809 2100021 1768180
34477 1768180 1294558 1004138 897600 755044 588176 623254 856001 1026661 1060425 1102777
34467 1102777 1080691 754972 341260 475483 1257014 1909044 1841795 1524215 1706891 2224988
34457 2224988 2330028 1953526 1790174 2118755 2336920 1895637 1063310 436036 173137
34448 173137 89484 146795 431260 811830 983870 844463 622782 618531 887553 1174633
34438 1174633 1152089 768589 314423 72390 27701 68303 284942 763829 1192998 1086301
34428 1086301 446308 -156839 -272194 -20374 243926 383332 418113 333618 206798 300962
34418 300962 754656 1295776 1493578 1229551 769718 459879 478290 782928 1161616 1405240
34408 1405240 1515917 1640426 1754175 1621396 1201864 869735 985707 1399554 1649295
34399 1649295 1566031 1384986 1279792 1123339 831415 661265 906200 1400807 1600615 1203314
34389 1203314 508940 61680 66511 307288 540582 730900 877463 867681 665550 479457
34379 479457 534590 754658 857462 728997 534877 478091 593675 774150 875555 820231
34369 820231 699904 718573 914360 1034197 858785 561720 517091 790519 1059437 1043255
34359 1043255 794963 544528 451765 540171 693705 700484 471509 218954 244035 560051
34349 560051 905868 1098048 1157834 1123307 978415 765141 547508 296098 29466 -29014
34339 -29014 253668 569423 521300 271454 342360 742935 869382 462118 85255 298471
34329 298471 832325 1053904 904960 846900 1050682 1157892 852685 294415 -97273 -71983
34319 -71983 277118 633890 742102 618573 442162 269155 36726 -178363 -195990 -76250
34309 -76250 -98264 -291855 -341158 -102775 155902 232837 305569 502895 562787 266653 -130684
34298 -130684 -273043 -184189 -10715 355093 942420 1329948 1148984 708547 560395 645297
34288 645297 466218 -33947 -401318 -429774 -372600 -365063 -224124 73119 246820 203566
34278 203566 209249 419857 651674 762982 873825 1051969 1131329 987352 687851 288451
$$ [...]
##END NTUPLES=NMR SPECTRUM
##END=
