##TITLE=31Pdec_LR-675-C-2-3-C2
 CDCl3, 24 sc
 31.5.2019
##JCAMPDX= 6.0         $$ Bruker NMR JCAMP-DX V2.0
##DATA TYPE= NMR SPECTRUM
##DATA CLASS= NTUPLES
##ORIGIN= UXNMR, Bruker Analytische Messtechnik GmbH
##OWNER= root
$$ XWIN-NMR		Version 3.5
$$ Fri May 31 16:27:21 2019 Russian Standard Time (UT+4h)  she@DPX200
##.OBSERVE FREQUENCY= 81.013821
##.OBSERVE NUCLEUS= ^31P
##.ACQUISITION MODE= SIMULTANEOUS
##.ACQUISITION SCHEME= undefined
##.AVERAGES= 24
##.DIGITISER RES= 17
##SPECTROMETER/DATA SYSTEM= spect
##.PULSE SEQUENCE= zgpg30
##.SOLVENT NAME= CDCl3
##.SHIFT REFERENCE= (INTERNAL, CDCl3, 0, 182.463)
##AUDIT TRAIL= $$ (NUMBER, WHEN, WHO, WHERE, WHAT)
$$ ##TITLE= Audit trail, XWIN-NMR		Version 3.5
$$ ##JCAMPDX= 5.01
$$ ##ORIGIN= Bruker BioSpin GmbH
$$ ##OWNER= she
$$ F:/spectra/data/she/nmr/P31/1/pdata/1/auditp.txt
$$ ##AUDIT TRAIL=  $$ (NUMBER, WHEN, WHO, WHERE, WHAT)
(   1,<2019-05-31 16:26:29.15 +0400>,<she>,<DPX200>,
      <created by zg, POWCHK disabled, PULCHK disabled
       configuration hash MD5:
       00 E9 B6 7A A2 85 ED C7 34 08 36 98 17 FE 4E 26
       data hash MD5: 32K
       17 6F 80 79 8A B6 EE 06 36 AD 75 F0 FF 34 E2 B8>)
(   2,<2019-05-31 16:26:31.68 +0400>,<she>,<DPX200>,
      <Start of raw data processing
       efp BC_mod = 2 LB = 1 FT_mod = 6 PKNL = 1 PHC0 = -2231.145 PHC1 = 170.5991 SI = 64K 
       data hash MD5: 64K
       36 2F 25 87 10 2B 76 21 16 D0 15 49 37 2B DA 2A>)
(   3,<2019-05-31 16:26:42.15 +0400>,<she>,<DPX200>,
      <pk PHC0 = 16.92957 PHC1 = 0 
       data hash MD5: 64K
       65 89 7D EE 6B A1 28 44 8B 66 67 A2 73 95 80 27>)
(   4,<2019-05-31 16:26:50.82 +0400>,<she>,<DPX200>,
      <abs ABSG = 5 
       data hash MD5: 64K
       0D 01 91 DD 9E 13 60 34 71 D2 89 F2 4E 12 C8 E1>)
$$ ##END=
$$ 
$$ hash MD5
$$ 3D BB 18 17 A1 A3 63 AD 0C C6 12 E5 EE 03 4E 77
##$RELAX= 
##$RELAX= 
##$RELAX= 
##$RELAX= 
##$RELAX= 
##$RELAX= 
##$RELAX= 
##$RELAX= 
$$ Bruker specific parameters
$$ --------------------------
##$DU= <F:/spectra>
##$EXPNO= 1
##$NAME= <P31>
##$PROCNO= 1
##$TYPE= <nmr>
##$USER= <she>
##$AMP= (0..31)
100 100 100 100 100 100 100 100 100 100 100 100 100 100 100 100 100 100 
100 100 100 100 100 100 100 100 100 100 100 100 100 100 
##$AQSEQ= 0
##$AQ_mod= 1
##$AUNM= <au_zg>
##$AUTOPOS= <>
##$BF1= 81.014009
##$BF2= 200.13
##$BF3= 200.13
##$BF4= 200.13
##$BF5= 200.13
##$BF6= 200.13
##$BF7= 200.13
##$BF8= 200.13
##$BYTORDA= 1
##$CFDGTYP= 0
##$CFRGTYP= 5
##$CHEMSTR= <none>
##$CNST= (0..31)
1 1 145 1 1 1 1 1 1 1 1 1 1 1 1 1 1 1 1 1 1 1 1 1 1 1 1 1 1 1 1 1 
##$CPDPRG= <waltz16>
##$CPDPRG1= <>
##$CPDPRG2= <waltz16>
##$CPDPRG3= <>
##$CPDPRG4= <mlev>
##$CPDPRG5= <mlev>
##$CPDPRG6= <mlev>
##$CPDPRG7= <mlev>
##$CPDPRG8= <mlev>
##$CPDPRGB= <>
##$CPDPRGT= <>
##$D= (0..31)
0 1 0 0 0 0 0 0 0 0 0 0.03 2e-05 3e-06 0 0 0 0 0 0 0 0 0 0 0 0 0 0 0 0 
0 0 
##$DATE= 1559305588
##$DBL= (0..7)
120 120 120 11 120 120 24 19 
##$DBP= (0..7)
150 150 150 150 150 150 150 150 
##$DBP07= 0
##$DBPNAM0= <>
##$DBPNAM1= <>
##$DBPNAM2= <>
$$ [...]
##$SUBNAM3= <"">
##$SUBNAM4= <"">
##$SUBNAM5= <"">
##$SUBNAM6= <"">
##$SUBNAM7= <"">
##$SUBNAM8= <"">
##$SUBNAM9= <"">
##$SW= 369.568048894756
##$SWIBOX= (0..15)
0 1 3 0 0 0 0 0 0 0 0 0 0 0 0 0 
##$SW_h= 29940.119760479
##$TD= 32768
##$TD0= 1
##$TE= 0
##$TE2= 300
##$TE3= 300
##$TEG= 300
##$TL= (0..7)
0 120 53 12 22 120 120 120 
##$TP= (0..7)
150 150 150 150 150 150 150 150 
##$TP07= 0
##$TPNAME0= <>
##$TPNAME1= <>
##$TPNAME2= <>
##$TPNAME3= <>
##$TPNAME4= <>
##$TPNAME5= <>
##$TPNAME6= <>
##$TPNAME7= <>
##$TPOAL= (0..7)
0.5 0.5 0.5 0.5 0.5 0.5 0.5 0.5 
##$TPOFFS= (0..7)
0 0 0 0 0 0 0 0 
##$TUNHIN= 0
##$TUNHOUT= 0
##$TUNXOUT= 0
##$USERA1= <user>
##$USERA2= <user>
##$USERA3= <user>
##$USERA4= <user>
##$USERA5= <user>
##$V9= 5
##$VALIST= <valist>
##$VCLIST= <CCCCCCCCCCCCCCC>
##$VD= 0
##$VDLIST= <DDDDDDDDDDDDDDD>
##$VPLIST= <PPPPPPPPPPPPPPP>
##$VTLIST= <TTTTTTTTTTTTTTT>
##$WBST= 1024
##$WBSW= 4
##$XGAIN= (0..3)
0 0 0 0 
##$XL= 0
##$YL= 0
##$YMAX_a= 75520
##$YMIN_a= -86017
##$ZGOPTNS= <>
##$ZL1= 120
##$ZL2= 120
##$ZL3= 120
##$ZL4= 120
##$ABSF1= 182.463
##$ABSF2= -187.1042
##$ABSG= 5
##$ABSL= 3
##$ALPHA= 0
##$AQORDER= 0
##$ASSFAC= 0
##$ASSFACI= 0
##$ASSFACX= 0
##$ASSWID= 0
##$AUNMP= <proc_1d>
##$AZFE= 0.1
##$AZFW= 0.5
##$BCFW= 0
##$BC_mod= 2
##$BYTORDP= 0
##$COROFFS= 0
##$CY= -3
##$DATMOD= 1
##$DC= 0
##$DFILT= <>
##$DTYPP= 0
##$F1P= 0
##$F2P= 0
##$FCOR= 1
##$FTSIZE= 65536
##$FT_mod= 6
##$GAMMA= 0
##$GB= 0
##$INTBC= 1
##$INTSCL= 5.30512e-09
##$ISEN= 30
##$LB= 1
##$LEV0= 0
##$LPBIN= 0
##$MAXI= 10000
##$MC2= 0
##$MEAN= 0
##$ME_mod= 0
##$MI= 50
##$NCOEF= 0
##$NC_proc= -4
##$NLEV= 6
##$NOISF1= 182.463
##$NOISF2= 159.3651
##$NSP= 0
##$NTH_PI= 0
##$NZP= 0
##$OFFSET= 182.463
##$PC= 4
##$PHC0= -2214.215
##$PHC1= 170.5991
##$PH_mod= 1
##$PKNL= yes
##$PPARMOD= 0
##$PSCAL= 0
##$PSIGN= 0
##$REVERSE= no
##$SF= 81.0140089999434
##$SI= 65536
##$SIGF1= 159.3651
##$SIGF2= -187.1042
##$SINO= 113.3802
##$SIOLD= 16384
##$SREGLST= <1H.CDCl3>
##$SSB= 0
##$STSI= 65536
##$STSR= 0
##$SW_p= 29940.119760479
##$SYMM= 0
##$S_DEV= 0
##$TDeff= 32768
##$TDoff= 0
##$TI= <>
##$TILT= no
##$TM1= 0
##$TM2= 0
##$TOPLEV= 0
##$USERP1= <user>
##$USERP2= <user>
##$USERP3= <user>
##$USERP4= <user>
##$USERP5= <user>
##$WDW= 1
##$XDIM= 65536
##$YMAX_p= 322135477
##$YMIN_p= -2461549
$$ End of Bruker specific parameters
$$ ---------------------------------
##NTUPLES= NMR SPECTRUM
##VAR_NAME=  FREQUENCY,     SPECTRUM/REAL,   SPECTRUM/IMAG
##SYMBOL=    X,             R,               I
##VAR_TYPE=  INDEPENDENT,   DEPENDENT,       DEPENDENT
##VAR_FORM=  AFFN,          ASDF,            ASDF
##VAR_DIM=   65536,         65536,           65536
##UNITS=     HZ,            ARBITRARY UNITS, ARBITRARY UNITS
##FACTOR=    0.456856943014862, 1,           1
##FIRST=     14782.0589164792, 0,            0
##LAST=      -15158.0608439998, 0,           0
##MIN=       -15158.0608439998, -2461549,    0
##MAX=       14782.0589164792, 322135477,    0
$$ Real data points
##PAGE= N=1
##DATA TABLE= (X++(R..R)), XYDATA
$$ [...]
42494I36030Q7993m26975n29252k76520L2670K56360L66891K39221j51789m35454
42484I9175j88524L94698O15637J95157l36996m08746j52086l0560q2293k6839
42474G8623J06190L1397j83630j53093J19886J49931k20185m63738j62068L17603
42464c79084L90306J29915K3485R4420p3632m81657n62899p6074M23482L55711
42454a56027o8242k36998n5576L2896j72980l40580j66326J76847L37496K51293
42444c98197J06786L9571N3217J01299P7954j27761l87507l21390J98618O80622
42434B3212N29878j06737m62808k13364Q1825j18068m61015k57638L85819O65379
42424F6483K70571k02311k03819K0856p630k06275j93636k672L5681o2138K7119
$$ plain form
42494 936030 1024023 597048 67796 -208724 -176054 80306 447197 686418 534629 99175
42484 99175 -89349 305349 920986 1116143 779147 370401 218315 187755 105462 78623
42474 78623 184813 216210 32580 -120513 -627 149304 -70881 -534619 -696687 -379084
42464 -379084 11222 141137 164622 259042 185410 -296247 -859146 -935220 -511738 -156027
42454 -156027 -224269 -461267 -516843 -483947 -656927 -997507 -1163833 -986986 -649490 -398197
42444 -398197 -291411 -251840 -198623 -97324 -19370 -147131 -534638 -856028 -657410 23212
42434 23212 553090 446353 -16455 -229819 -147994 -266062 -727077 -984715 -598896 66483
42424 66483 337054 134743 -69076 -48220 -55850 -262125 -455761 -458433 -422752 -484890 -457771
42413d57771K93647L33513m788l82924n05094m62648l85685j64559K35542N30071
42403i70696M78839K31508L6450j35907l67234m37368j03477M01407N69793K94643
42393b042k8817r1068L482O5381J21703K28963K72091J61293K9249K4525N6907
42382H41667m9947k64196m04538m15360l85394l36837j94310L8620K52271L99770
42372e18254N20070N53061L25600j62221n92433o43757l71448j03501r563L0038
42362i72408J29843K05570J67741J09491J38478J64850N3250j11944j36240l6004
42352b87373o088p8930q5591J971j1631j64288j78816R0115L22514J70533j64261
42341c91845j93021J05281K40960j5760k63691q4125L26008M50920J70444j57738
$$ plain form
42413 -457771 -164124 169389 164601 -218323 -723417 -1186065 -1571750 -1736309 -1500767 -970696
42403 -970696 -491857 -260349 -223899 -359806 -727040 -1164408 -1267885 -866478 -296685 -2042
42393 -2042 -30859 -121927 -118445 -53064 68639 297602 569693 730986 760235 784760 841667
42382 841667 791720 527524 122986 -292374 -677768 -1014605 -1208915 -1170295 -918024 -518254
42372 -518254 1816 554877 880477 718256 125823 -517934 -889382 -992883 -1002446 -972408
42362 -972408 -842565 -636995 -469254 -359763 -221285 -56435 -3185 -115129 -251369 -287373
42352 -287373 -293461 -372391 -457982 -456011 -467642 -631930 -810746 -720631 -398117 -227584 -391845
42341 -391845 -584866 -479585 -238625 -254385 -518076 -602201 -276193 174727 345171 187433
42331A87433k23385n5731J71135L23431K75594j8421l27928k75462J71196N28529
42321G56391L30462k75210o78932n18393l4087K92910K61532K8884j76049k66200
42311b78692k69627k18859j11637M5192J80015J84581M3054r9084q5956L5630
42301e75383P5281q505l9459O5864J04223j01371l28485j86525K83111N40603
42291a70646K16958l68100n65968j76271L40760M26234M1836l37815k82630J29126
42281g46516M39016L59132P7925m8703K0051K5413j44539k74338j54536J16464
42271c30631K90965K78957J66402N1335q781J5694Q0976R5247N4715L4049N031
42260G33959j33347k79378j69821J51278K41253q6360l51333p0018M43419M85092
$$ plain form
42331 187433 -35952 -91683 79452 402883 678477 660056 332128 56666 227862 756391
42321 756391 1086853 811643 132711 -385682 -419769 -126859 134673 163557 -12492 -278692
42311 -278692 -548319 -767178 -878815 -833623 -653608 -469027 -425973 -525057 -611013 -575383
42301 -575383 -500102 -508607 -548066 -482202 -377979 -479350 -807835 -994360 -711249 -170646
42291 -170646 46312 -321788 -887756 -1064027 -723267 -297033 -255197 -593012 -875642 -746516
42281 -746516 -307500 51632 129557 80854 100905 126318 -18221 -292559 -447095 -330631
42271 -330631 -39666 239291 405693 457028 448247 463941 544917 640164 694879 728928 733959
42260 733959 600612 321234 151413 302691 543944 457584 106251 36233 479652 964744
42250I64744J7999l07771j84537k4773j44901k34307M045K46069P9958k57748
42240A58778k41521R5431K37701M00k59735k38336l1794J57003K68328K66980
42230D13235J17041m5928k8563P1942l6398l14896l36361P2021M69533L51205
42220G32831j84139n89452n31329j51377K04699K88977Q2043j71708j48511J54243
42210c13723L18767J5396n08777p00544l78231J25171M39118M87747L61626J66233
42200A2783N5379J46532L18404L16751J15308p0962j66540l11496m68310l31717
42190c83868J55284N45067M49981Q2729r9391l3391M2075P5204J42551R3859k19231
42179H50869m78423k48318K40705K95314j80395m97737k52063J08051J11810j5042
$$ plain form
42250 964744 982743 674972 490435 465662 320761 86454 90499 336568 416526 158778
42240 158778 -82743 12688 250389 250789 -8946 -247282 -279076 -122073 146255 413235
42230 413235 530276 484348 455785 527727 491329 176433 -159928 -87907 381626 732831
42220 732831 548692 -40760 -572089 -723466 -518767 -229790 -147747 -319455 -467966 -313723
42210 -313723 5044 20440 -488337 -1188881 -1567112 -1441941 -1002823 -515076 -153450 12783
42200 12783 68162 214694 533098 849849 965157 894195 727655 416159 -52151 -383868
42190 -383868 -228584 316483 766464 849193 749802 716411 758486 833690 976241 1070100 850869
42179 850869 372446 124128 364833 660147 479752 -17985 -270048 -161997 -50187 -65229
42169f5229M7948L2508l31866n64474q3638P10047Q67958K74688k52095k28431
42159D07416k8494l2252p9160k8753j02699l06115j99770L06832N63789J16255
42149F17049n02432n13182m450L20988J84294j14092l22566l87463j68396L49422
42139e40828O94536M24125q3299n5951M54551N60613r3453p27874n67822O5300
42129A29898L21825R209l62998m20255k35912M0145L41652N00809L37592j6822
42119F45143k12584j46002o0001j37349k49175j85189O9385L65817N44168N00861
42109A135074K51338k8557j55691j57632j94015k58421j66785R6258K48337P3883
42099H43789k60708m35774l79370k36984o7923J61908L41032K66092k1814k16126
$$ plain form
42169 -65229 -17281 15227 -316639 -881113 -964751 -254704 613254 887942 635847 407416
42159 407416 378922 346670 267510 238757 136058 -170057 -369827 -62995 500794 617049
42149 617049 114617 -398565 -403015 -82027 102267 -11825 -334391 -721854 -890250 -540828
42139 -540828 153708 577833 494534 438583 893134 1453747 1360294 632420 64598 129898
42129 129898 451723 460932 97934 -322321 -558233 -518088 -176436 324373 661965 645143
42119 645143 432559 286557 226556 89207 -159968 -345157 -275772 90045 634213 1135074
42109 1135074 1386412 1357855 1202164 1044532 850517 592096 425311 521569 769906 843789
42099 843789 583081 147307 -232063 -469047 -536970 -375062 -34030 232062 210248 -5878
42089e878j46995K5426J10647J26280J00800q0079l98568n29280k53041J37495
42079i13193J95838m8801j97140j11786j1760K0353J42248L16723K70466J9024
42069c18028n6810J48926K48430M3112r0418J28244L19615N1276m03270m93258
42059d22181k59554j45971j81812l7395K38733K53815K3441j6920J74882J32336
42049b40626k37280l49664J39288O99787O49968Q3979l63196l75191j70989o7232
42039b31156j65881l50377l71684q2432K87882L21443j1824k71751j83184N213
42029a053751l666j03162p4578L0853J09421K61924M98644N20971J71442k02300
42019A55798k22578l0814L6697J3552Q9189J30304n5437k25456m8004K48208J80425
$$ plain form
42089 -5878 -152873 -127447 -16800 109480 210280 130201 -268367 -797647 -1050688 -913193
42079 -913193 -717355 -766156 -963296 -1075082 -1086842 -1066489 -924241 -607518 -337052 -318028
42069 -318028 -374838 -225912 22518 65630 -24788 103456 423071 474347 71077 -422181
42059 -422181 -681735 -827706 -1009518 -1046913 -808180 -554365 -530924 -547844 -372962 -240626
42049 -240626 -477906 -827570 -688282 11505 661473 745452 382256 7065 -163924 -231156
42039 -231156 -397037 -747414 -1119098 -1201530 -913648 -592205 -604029 -875780 -1058964 -1053751
42029 -1053751 -1057417 -1160579 -1235157 -1204304 -1094883 -832959 -334315 186656 358098 155798
42019 155798 -66780 -97594 -60897 -47345 41844 172148 116711 -108745 -156749 91459 271884
42008B71884j64418k59627l4517L8455k01102l32859j04079J66484J73408Q1350
41998c65021J16907J58288L2767j43662j97132j58510q4227P2835K35604J88162
41988a43989l3442j04264M5742N8190k42470m86722l24783L2874J93247J44830
41978h60787P1195m8431k28244j96129J82458M72489K04294l50094m94549q3325
41968a331123L79763N40359N05597L68112M7134k78473j90372K69947M55973R06
41958G67823n98100o63848k40314J21633J91853J79981J88909P4258j43836j94844
41948c16485j3536R1993o7291j95076P1477N41287O15489P4654n76496p16528
41938d90512l64699o7779j02824j47996J11500L86258J75141l82657n38361O0852
$$ plain form
42008 271884 107466 -152161 -186678 -148223 -349325 -682184 -786263 -619779 -446371 -365021
41998 -365021 -248114 -89826 -57059 -200721 -397853 -556363 -640590 -567755 -332151 -143989
41988 -143989 -177431 -281695 -235953 -177763 -420233 -906955 -1231738 -1198864 -1005617 -860787
41978 -860787 -789592 -838023 -1066267 -1262396 -1079938 -607449 -403155 -753249 -1247798 -1331123
41968 -1331123 -951360 -411001 94596 462708 509842 231369 40997 310944 766917 767823
41958 767823 169723 -494125 -734439 -612806 -420953 -240972 -52063 22195 -121641 -316485
41948 -316485 -330021 -238028 -305319 -500395 -428918 112369 727858 802512 226016 -490512
41938 -490512 -855211 -922990 -1025814 -1173810 -1062310 -676052 -500911 -883568 -1421929 -1361077
41928a361077Q18002R29375L84982j50549k71247j93097k17887l00405k91188
41919f53091k34974j99497q6391J35567K37684N7893j56828n6004K76318M25968
41909b53355K45896Q743n6933n3012j48147l11694m27067m36935k77200R8517
41899a611187N26599P04451N60096L11197Q0499k24080n25043m80216l0779L40283
41889c48180K45367n6193j38967q9706k00672l08294p9604K53669J75416j86760
41879g33924j94793J97957L12084q1109k95820J37097O46474N27978M8436p3916
41869D90464J66210J98177j02244l08034k40420j51387j26330K5471K30269J33233
41859C15409k44714m08964j39648J76773J82966L6461n6L04p6231m5628K27353
$$ plain form
41928 -1361077 -543075 386300 771282 620733 349486 156389 -61498 -361903 -653091
41919 -653091 -888065 -1087562 -1173953 -1038386 -800702 -742809 -899637 -955641 -679323 -253355
41909 -253355 -7459 1284 -55649 -108661 -256808 -568502 -995569 -1432504 -1709704 -1611187
41899 -1611187 -1084588 -380137 179959 491156 571655 347575 -177468 -657684 -688463 -348180
41889 -348180 -102813 -159006 -297973 -387679 -588351 -896645 -976249 -722580 -547164 -733924
41879 -733924 -928717 -730760 -418676 -499785 -795605 -658508 -12034 515944 564380 490464
41869 490464 656674 854851 752607 444573 204153 52766 -73564 -48093 182176 315409
41859 315409 70695 -338269 -477917 -301144 -118178 -81717 -81773 -81469 -157700 -203328 24025
41848B4025M51240K94715o1423j72160J5152J60422J05926L6789O2273L6979r9845
41837H54093j55234k6243P1042n6172k25508j48936R1040J62612K9539O449K01807
41826H04489K92550P6386j04461J19759M52069K83439l23073o04320k04735K66613
41816A058716J39666l32527m03871N8324M77475M54739J96795M4658N3743J24660
41806A872378J58252M863l74699o43757l89762K19711N15380K20243j72919j54537
41796A255153J00532J26143j04000k65072k53718k25333k01203o4759J13920J35323
41786F16986K6011j9002l0556k19846n06648n07532j36331J74636J02846n0030
41776e49466J62897N68121N59665J8950m45315l52354k3687m7449l55850l42250
$$ plain form
41848 24025 475265 769980 708557 536397 551549 711971 817897 854686 916959 953938 854093
41837 854093 698859 672616 743658 687486 461978 313042 404082 566694 596233 602682 804489
41826 804489 1097039 1173425 1068964 1188723 1640792 1924231 1601158 996838 792103 1058716
41816 1058716 1198382 865855 461984 520308 997783 1452522 1649317 1693975 1747718 1872378
41806 1872378 2030630 2035493 1660794 1017037 627275 846986 1362366 1582609 1409690 1255153
41796 1255153 1355685 1481828 1377828 1112756 859038 633705 432502 367743 481663 616986
41786 616986 642997 623995 593439 373593 -133055 -640587 -776918 -602282 -499436 -549466
41776 -549466 -386569 181552 741217 760167 314852 -37502 -61189 -108638 -464488 -806738
41766h06738J66861O01037M70747L8003j50991m1351L4890j6963j9631J6444r2960
41755A99348k53021j55447J38867J85068j26788l31821j18207J68041J01953j28304
41745c20311o0733K73113M08488J57241j81869k94400j68493N5711K35541K10792
41735C15080o6153l42519k66481J55624N12722M75001J65487k9098Q3532K91045
41725A294240K05852k66086p08119o14057o5416K84965O7143k84755j82225K32352
41715c6106L33810J636k21388j7700K19779M6586l28490l82127o3438J76737P5343
41704a95358r5943K6870L55601M54717J29021l00530m02224j67312O2435J21711
41694a1012J67838K58755J64577j80591l86269j26152L00975L59748N7464j37703
$$ plain form
41766 -806738 -639877 -38840 431907 469910 318919 277568 312458 295495 275864 292308 199348
41755 199348 -53673 -209120 -70253 114815 -11973 -343794 -462001 -293960 -192007 -320311
41745 -320311 -381044 -107931 300557 457798 275929 -18471 -186964 -131253 104288 315080
41735 315080 248927 -93592 -360073 -204449 308273 783274 948761 919663 1003195 1294240
41725 1294240 1500092 1234006 525887 -88170 -153586 131379 198522 -86233 -268458 -36106
41715 -36106 297704 299340 77952 60252 280031 326617 -1873 -384000 -447438 -270701 -195358
41704 -195358 -291301 -264431 91170 545887 674908 374378 -27846 -195158 -132723 -11012
41694 -11012 156826 415581 580158 399567 13298 -112854 188121 547869 605333 467630
41684D67630n6671J7340m6882k4139J45599J57594j05206k79293q3776K00976
41674C93172J62728j29057l02017k59300k11245k48450k20420j9622K51013M05457
41664a77741L44289J29471m4988l6399P1657J13289J30469K67381L83471J50069
41654A330968l60712o07382l28234M7784N5706j32780j13361K2904q3834l22673
41644d91614k13327K90941O70472N89954K92327J05950J821j46440k34017j41059
41634G25008k9736j31711l63243m01345j12236K68996M03677K00329j30007l27480
41624A02252l33620k51389j26277P8877K88158L05404J04080p1646l7260Q5734
41614A44313J09408N9484K4168n3454j89552j90991L4903K16603R7090j31872
$$ plain form
41684 467630 410959 428299 381417 357278 502877 660471 555265 275972 192196 393172
41674 393172 555900 426843 124826 -134474 -345719 -594169 -814589 -834211 -583198 -177741
41664 -177741 166548 296019 251031 214632 286289 399578 530047 797428 1180899 1330968
41654 1330968 970256 362874 34640 82424 138130 5350 -108011 -85107 -168941 -491614
41644 -491614 -704941 -414000 256472 846426 1138753 1244703 1246524 1100084 866067 725008
41634 725008 695272 563561 200318 -201027 -313263 -44267 359410 559739 429732 102252
41624 102252 -231368 -482757 -609034 -530157 -241999 63405 167485 95839 58579 144313
41614 144313 253721 313205 337373 283919 94367 -96624 -61721 154882 251972 120100
41604A20100j44250p978L8578J05408L84151N40318P1188p46540j007109m23154
41594a069288K71617M13338K33187K36628L76511L25653R4136j22756l33825n30970
41584a05769m44368N493L48029J53396l12326n11716m02702k46900R647M93350
41574a013866Q01843M41461k23759k89038L43330P41031L13737l38235l64322
41565D12182J51736M77445K86842j21529m19087n40102m73593k04749J07055J99649
41555a24151K8399j61577j26409J11908L02979K30168m2794k10705r7413Q3117
41545f478K0545k05727k26073L8977K58437K29109J35509J08601l8978l44187
41535c0265l87171R6522O23042N35500j1783k44791R7443M35890K72229j34574
$$ plain form
41604 120100 -24150 -32128 6450 111858 496009 1036327 1107515 360975 -646134 -1069288
41594 -1069288 -797671 -384333 -151146 85482 461993 787646 881782 759026 425201 -105769
41584 -105769 -550137 -544644 -196615 -43219 -355545 -867261 -1269963 -1516863 -1507216 -1013866
41574 -1013866 -212023 229438 5679 -283359 59971 801002 1114739 776504 412182
41565 412182 563918 1041363 1328205 1206676 787589 247487 -226106 -430855 -323800 -124151
41555 -124151 -95752 -257329 -383738 -271830 31149 261317 218523 7818 -89595 -6478
41545 -6478 14067 -191660 -417733 -378756 -120319 108790 244299 352900 313922 -30265
41535 -30265 -417436 -320914 302128 837628 825845 581054 678497 1114387 1386616 1252042
41525A252042k76902j21631L3677R8497J85519K61259J78171k4709j58211j74887
41515A252825j71185j52363n7332J7886q9947k78758k34985Q6080L07592J30070
41505H09883k31335l34689j04740J09790L5857j92209k50675l3735K27969K08823
41495B44939j53266n12870m21748J22795N55436L73470j91779m30004q8596L03898
41485a97725K07848j81526k79960K7212K94033K18821J7798L022J36620K01172
41475D47315J75054J94515K56334J89753p1160l39385l70157j62403J2697n1430
41465B81133j79789j9829L78428M59569r6659p54488o86553R4055O77928M60099
41455F13894j08323k63828J2091J38956j23995m07384l45824k6932K29475K33278
$$ plain form
41525 1252042 975140 853509 887186 985683 1171202 1432461 1610632 1585923 1427712 1252825
41515 1252825 1081640 929277 871945 889831 799884 521126 286141 372221 679813 809883
41505 809883 578548 243859 139119 248909 284766 92557 -158118 -191853 36116 244939
41495 244939 91673 -421197 -842945 -720150 -164714 208756 16977 -413027 -501623 -197725
41485 -197725 10123 -171403 -451363 -424151 -130118 88703 106501 109523 246143 447315
41475 447315 622369 816884 1073218 1262971 1191811 852426 482269 319866 332563 281133
41465 281133 101344 81515 459943 919512 822853 68365 -618188 -524133 153795 613894
41455 613894 505571 241743 253834 392790 268795 -138589 -484413 -511345 -281870 -48592
41445d8592R629k43738k62367J3320K76936J74434k31993n25904m36728p1113
41435a346116L04800M79873L54071N0636p5299J69811M69599L74790l0678k56328
41425D95159j80497j84295m07880m39422l0184L83153K91389j19441k73270k4561
41415d89849K78559L77054L06280J23711j50960l56702l04440o7702J02161R7252
41405h4636l7609k72154m80333l50650J98376O57230M49221k41603o46601m17592
41395a226351L0411K27523J86437R7407j9610j38770j21212q669m9485k36847
41385a259166k27105P0437K77104J92426J63270M16303N13486K2843o49542p44567
41375a224511k38932K01617K29978J17990P6289n0435k83553l11506k6608K21294
$$ plain form
41445 -48592 -38963 -282701 -545068 -531748 -254812 -80378 -312371 -838275 -1275003 -1346116
41435 -1346116 -1041316 -561443 -207372 -156736 -232035 -62224 407375 782165 751487 495159
41425 495159 314662 130367 -277513 -716935 -747119 -363966 -72577 -192018 -465288 -489849
41415 -489849 -211290 165764 472044 595755 444795 88093 -216347 -284049 -181888 -84636
41405 -84636 -122245 -394399 -874732 -1225382 -1027006 -369776 79445 -162158 -808759 -1226351
41395 -1226351 -1195940 -968417 -781980 -684573 -704183 -842953 -964165 -972834 -1022319 -1259166
41385 -1259166 -1486271 -1415834 -1138730 -946304 -783034 -366731 146755 169598 -479944 -1224511
41375 -1224511 -1463443 -1261826 -1031848 -913858 -837569 -888004 -1171557 -1483063 -1509671 -1288377
41365a288377J62954j605j936Q4081P7505L0350K0117q9781l61533n02615k31653
41354b102493K39748M45246K93593J26775J73449K57602J24150j72191l35474
41345i49595j95214R3930K24498Q2801j25415j35560O3609K82375M01687M06889
41335A50005K37280j17838m05198l31836l2784O7142p2299l7968K67463L46739
41325G0706m5890l39176J066N05426L39946l60574o58128k54197J29260j7472
41315f29033k43141k4248L32921K62311j16403k58662n1825K04868M20848O81615
41305E79251P50636K69495n33606r35500o36276q7813K19100K96236K99241J40474
41295C61238k00801l87721j69467J53062J34220j27395j53297J55018L80952K41064
$$ plain form
41365 -1288377 -1125423 -1127028 -1128964 -1044883 -967378 -937028 -916911 -1006692 -1368225 -1870840 -2102493
41354 -2102493 -1862745 -1417499 -1123906 -997131 -823682 -566080 -441930 -614121 -949595
41345 -949595 -1144809 -1050879 -826381 -743580 -868995 -1004555 -940946 -658571 -256884 150005
41335 150005 387285 269447 -135751 -467587 -500371 -433229 -505528 -543496 -276033 70706
41325 70706 24816 -314360 -313294 192132 532078 171504 -486624 -740821 -611561 -629033
41315 -629033 -872174 -896422 -563501 -301190 -417593 -676255 -728080 -523212 -102364 579251
41305 579251 1329887 1599382 1065776 130276 -506000 -593813 -374713 -78477 220764 361238
41295 361238 160437 -227284 -396751 -243689 -109469 -236864 -390161 -235143 145809 386873
41285C86873n5004k05144k04415j57513k5059J96176K83228O1583k79032m03324
41275d01631k53644j3977K26705M81430O13714M23448R839k60506k21288p3377
41265E30713j5278J018L4597j9622j93442l03063k47939k00090k76562k87990
41255i77658p9718J43757J61285J43405L20626M78833K74344j18851k41201j36710
41245c1888k69934o21056n61612J36090P99534P44439J70621k37168j99630P6077
41235E473L50177M59392K68665q4901j81392Q0838K20081p6019l48823q2962L75094
41224I85623L36468q7809k08834L2179J4622l78322n03205j11336J83409k186
41214B60609j42452K02664M95900P7110o81199q98323m65539O826K22899L51533
$$ plain form
41285 386873 331869 126725 -77690 -235203 -260262 -64086 219142 280725 1693 -401631
41275 -401631 -655275 -669252 -442547 38883 652597 1076045 1085884 825378 604090 530713
41265 530713 515435 516453 551050 531428 337986 34923 -213016 -413106 -689668 -977658
41255 -977658 -1057376 -913619 -752334 -608929 -288303 190530 464874 346023 104822 -31888
41245 -31888 -301822 -922878 -1484490 -1348400 -548866 195573 366194 129026 -70604 5473
41235 5473 355650 815042 1083707 998806 817414 898252 1118333 1042314 693491 610529 985623
41224 985623 1322091 1234282 1025448 1057627 1072249 693927 190722 79386 262795 260609
41214 260609 118157 320821 816721 893831 212632 -685691 -1151230 -1144404 -921505 -569972
41204e69972L42458k1842m17594j96938N38211Q73135L63522l19993l96073o549
41194A88365K13411R3366q8694k25544l98995m62358j68329L03352M22191J3522
41184a09713m57700m60564k3656L76016M07058J84608K477o3841j52898k70939
41174e69152j88300J74762M69858L31099m6334j32733J33751K40019n9448k90277
41164F3245N042M86013M70229n8530m36218k54241J76634L50589J54860j71549
41154G86074l59540k88195p0064O631j62390k50948P2971N40688N40902K1128
41144H37257l68165j99731J53476J58179j10396k41607j73689j28581j04066O8082
41134a09241K83523K60608K7360j12825q1199p6486j22320J0747L47793N58762
$$ plain form
41204 -569972 -227514 -249356 -666950 -863888 -325677 547458 910980 590987 194914 188365
41194 188365 401776 495142 406448 180904 -218091 -680449 -848778 -545426 -123235 -109713
41184 -109713 -567413 -1027977 -1051633 -675617 -268559 -83951 -81474 -145315 -298213 -569152
41174 -569152 -757452 -582690 -112832 218267 171933 39200 172951 412970 353522 63245
41164 63245 68287 554300 1024529 965999 529781 275540 452174 802763 957623 786074
41154 786074 426534 138339 68275 74906 -87484 -338432 -265461 275227 816129 837257
41144 837257 469092 269361 422837 581016 470620 229013 55324 -73257 -177323 -109241
41134 -109241 174282 434890 462250 349425 268226 191740 69420 80167 427960 986722
41124I86722M03636L2040k68396l55175k03572J00458K77037R2036k45822k87637
41114E31327k6515N7823k07663l50577j4702M07891L56068m5266k31139o5764
41104D11483Q0648J8439k4718J25591L10938L04664N5562l43406o66313n98293
41094c25405p6389M81973O12060L74230J55691N6057p4609j33037R9945L58697
41084A529213J19906m64722n90705j6499M66207K04009l44560l92174j9207J32906
41074F24374l3522p4172R5269R9131j23437j78339N7747K28345J72275J92983
41064A060654M12597M30548j4186n05819n13150j60698J7618j13529j98779l9198
41054C76058J11606p686k45216k45133P8806M50376N63060L73952N3612k42841
$$ plain form
41124 986722 1390358 1422398 1154002 798827 595255 695713 972750 1064786 818964 531327
41114 531327 504812 562635 354972 4395 -10307 397584 753652 708386 477247 411483
41104 411483 492131 510570 485852 611443 922381 1227045 1282607 939201 272888 -325405
41094 -325405 -401794 80179 692239 1066469 1222160 1278217 1203608 1070571 1170516 1529213
41084 1529213 1649119 1184397 593692 577193 1043400 1247409 902849 510675 491468 624374
41074 624374 590852 516680 611949 711080 587643 409304 467051 695396 867671 1060654
41064 1060654 1473251 1903799 1889613 1383794 870644 709946 727564 614035 415256 376058
41054 376058 487664 479978 234762 -10371 68435 518811 1081871 1455823 1509435 1266594
41044A266594m58247n42902m41268k16297m6589k652N6285K44478M24901L77854
41034F62157J13814j32261j57708O2599L70683M58495J07090m33451n64781j23321
41024C63316K50721l6184n75364m74832K82453P46983L74512k64771m50423k82585
41014f6174k11918j99416K7036L04852L04737J85198K98694M36794R5568n65024
41004F10347p75462k83551K57566K65317j5269o9092R6267J59287J02525J26026
40994D73961J71381J7467k43045k54732O5018L81860L85116J16391j77796k98286
40984F37335j72753R9177K47640Q8568j93650k44591m7573N5731n9446n9576K72239
40973F23101N46884K65338l76623o65690l35993J27639K60530K12720L12305M52589
$$ plain form
41044 1266594 808347 265445 -175823 -392120 -438709 -441361 -385076 -140598 284303 662157
41034 662157 775971 643710 486002 548601 919284 1377779 1484869 1051418 486637 363316
41024 363316 614037 577853 2489 -472343 -189890 557093 931605 666834 216411 -66174
41014 -66174 -278092 -477508 -450472 -145620 159117 344315 643009 1079803 1175371 610347
41004 610347 -165115 -448666 -191100 74217 58948 -10144 86123 245410 347935 473961
40994 473961 645342 662809 419764 165032 230050 611910 997026 1113417 935621 637335
40984 637335 464582 563759 811399 899967 706317 461726 414153 469884 410438 350862 623101
40973 623101 1169985 1435323 1058700 393010 57017 184656 445186 657906 970211 1422800
40963A422800L26542J1826j34276m8481k834j03181j45984k0254R9334N6480p0732
40952A391240j49169j47117m8325J49676K94036J79166j42012l72958l37117j05763
40942G11657K05859M68562M19279o1859n37456l83796K99648O84382L33911k13348
40932A926839k94024q555J64842J45522J20450N6706j00698j05411J52744K52810
40922B311225r8851m00412q7046M15353K68942l60163m84849J23952N97436L86277
40912B671864j2023r3388j39171m47967o38216l60588O926M5519L6263L03155
40902A372374M25136n9583o57147n63865J9308J94618j79944l46828K9691L80196
40892F13956K79078R0187J97264L41266J97994J2090J19725K92859J14242l03864
$$ plain form
40963 1422800 1749342 1761168 1626892 1578411 1575577 1472396 1326412 1306158 1405492 1461972 1391240
40952 1391240 1242071 1094954 1046629 1196305 1490341 1669507 1527495 1154537 817420 711657
40942 711657 917516 1386078 1805357 1743498 1206042 822246 1121894 1806276 2140187 1926839
40932 1926839 1632815 1624260 1789102 1934624 2055074 2111780 2011082 1905671 2058415 2311225
40922 2311225 2212374 1811962 1724916 2140269 2409211 2049048 1564199 1688151 2285587 2671864
40912 2671864 2659841 2566453 2427282 1979315 1341099 980511 987437 1032956 1069219 1372374
40902 1372374 1797510 1737927 1080780 516915 536223 730841 550897 204069 233760 613956
40892 613956 893034 983221 1180485 1521751 1719745 1731835 1851560 2144419 2258661 1954797
40882A954797n02294l70609j81521p9609O513M2699o4021j43603N2995L36349
40872A051696K27783k69242n44743k64570J00535J6834k54889j09607L54865M50498
40862G59160L5248k17909Q0748L75145O0545n28420o49566k70175N2342J43124
40852a59758K88042M55052K66441j86649l11914N008J70048p7765j91477J72809
40842D29837M48912R7240m25237m03520l0699L5323j35574K3053L90877K70446
40832G00658l20271n10317L7640N47087L42395j65110k53318q864j1888l11790
40822D6222l93257j5304M53270N39728J74730l11912n07372k70920J08186K00188
40812B3559o0084l24485l21102j34391O9364K69914M07202L09925J9248j33069
$$ plain form
40882 1954797 1452503 1081894 900373 820764 827277 869976 805955 662352 715347 1051696
40872 1051696 1279479 1010237 465494 200924 301459 318293 63404 -46203 308662 759160
40862 759160 794408 576499 657247 1032392 1092937 564517 -85049 -355224 -302882 -159758
40852 -159758 128284 583336 849777 663128 351214 356222 526270 448505 257028 429837
40842 429837 878749 975989 550752 147232 116533 151856 16282 39335 430212 700658
40832 700658 380387 -129930 -92290 454797 797192 632082 378764 369900 358012 46222
40822 46222 -347035 -362339 90931 630659 805389 493477 -13895 -284815 -176629 23559
40812 23559 -36525 -361010 -682112 -816503 -747139 -477225 -70023 239902 259150 126081
40802A26081p701R3132p1801k55465j39119J19707J68564N5896Q1387K03771J00562
40791D75014k19130l49336j07972J90050K07908k673k02584k73973j71855J46454
40781c08097N28405N93268J66472l74721m66680n5364L11201J56208l41156n84023
40771c74487k97031J66576K99828N0092k08618k18649j16535j29021k16075j73653
40761a217573L4217K26576K51147J40225K9210K1686J26184K33642J64360j56717
40751a47043n38324o27353k63440K90963N65974L69430j3519j75290n3740J02804
40741d89538J61699K24759K92110J54297j95314l72497j33770J88786J77464K179
40731A0175J01392L74937L16218r8990l33209j87673q9735k59552k88466P1136
$$ plain form
40802 126081 118380 211512 139711 -115754 -254873 -135166 33398 89294 170681 374452 475014
40791 475014 255884 -93452 -201424 -11374 196534 193861 -8723 -282696 -454551 -308097
40781 -308097 220308 813576 980048 605327 138647 83283 394484 550692 209536 -374487
40771 -374487 -671518 -504942 -205114 -155022 -363640 -582289 -698824 -827845 -1043920 -1217573
40761 -1217573 -1183356 -956780 -705633 -565408 -536198 -514512 -388328 -154686 9674 -147043
40751 -147043 -685367 -1312720 -1576160 -1285197 -719223 -349793 -363312 -538602 -592342 -489538
40741 -489538 -327839 -103080 189030 343327 148013 -224484 -358254 -169468 7996 10175
40731 10175 111567 486504 802722 703732 370523 182850 93115 -166437 -454903 -383767
40721c83767L44223R1019l10001k58226J05950K11414L0108J6423K26467K25841
40711B99451j06904l30436j35029K13262K98905P2830j90997k10486O2698L20139
40701B93433J32381m37406o88457j59171N94534O64989P0276l22868j14568J64192
40691A97335N4506j35851l029K30203J49859j48176k81073j80065l0666J27081
40681a9876L25322L96845J68554j94025l49714k01637O4530K37271J99705l4888
40671E92087k42865j48738J77852L26786J11732j68140k32211k32876l72246m51692
40661f40311k00271K13203M18007L88587L43848K92327J21528j6289J09278L21741
40651A351648K24455j53505l69989k49769q9818j10996j52421n5371M7017J5604
$$ plain form
40721 -383767 -39544 51475 -258526 -516752 -410802 -199388 -169280 -152857 73610 299451
40711 299451 192547 -137889 -272918 -59656 239249 312079 121082 -89404 -26706 293433
40701 293433 425814 -11592 -700049 -859220 -264686 400303 470579 147711 33143 197335
40691 197335 251841 115990 112961 343164 493023 344847 63774 -116291 -146957 -19876
40681 -19876 305446 702291 870845 676820 327106 125469 189999 427270 626975 592087
40671 592087 349222 200484 378336 705122 816854 648714 416503 183627 -188619 -640311
40661 -640311 -840582 -627379 -209372 179215 523063 815390 936918 920629 1029907 1351648
40651 1351648 1576103 1422598 1052609 802840 713022 602026 449605 394234 441251 456855
40641D56855m6073k9316l5462j55865k57911j76986M5573K52368L39369K48944
40631F41496p485k28839j55493J51623K90881M1935l00856l13831M443K78556
40621D02430K40425k5511k48490k26937K6869K86858L20360J55058K5102J5048
40611I71212l1541j53620j06715K15549M53822K27337k56414m42037k11177P248
40601F73664n5186j43885N833K07228J61038o0901k11105l00750m49719m81424
40591f55207j29030M07166N87186K90301N037J04930L52478L67862K00923Q6771
40581A618417m2747l52031o16358m53501K1520K63120O2746j89423j18882J55880
40571C48741L19034K74342P6692k26639m64398l53358Q9725L98846K12639k17682
$$ plain form
40641 456855 410782 381466 346004 190139 -67772 -244758 -199185 53183 392552 641496
40631 641496 634011 405172 249679 401302 692183 734118 433262 119431 123874 402430
40621 402430 642855 617344 368854 141917 168786 455644 776004 931062 956164 971212
40611 971212 939671 786051 679336 894885 1348707 1576044 1319630 877593 666416 673664
40601 673664 618478 474593 480426 687654 848692 787791 576686 275936 -173783 -655207
40591 -655207 -784237 -377071 210115 500416 505453 610383 962861 1330723 1531646 1618417
40581 1618417 1575670 1223639 607281 153780 175300 438420 501166 311743 192861 348741
40571 348741 667775 942117 1018809 792170 327772 -25586 64139 462985 675624 457942
40561D57942l60999q2126L00958M89390M28304J69336j69910l51590k13922P5003
40551G42386J87415M9420j14029j11659L7589K18217L06921J92174r8021l39206
40541A071207l62856k75489k32964j51705P4039K30847N7080k36422j82086J94236
40531A85887L28884m3004m72401m57325j22154Q1804N5180O4521K41906M05470
40521B68768L38158L7552k77511l09654M8973M99609N67517J73737k27441k35696
40511H84012J7P8661r3690l14070m52260m86435l17830Q8432M52245M31283J12407
40500C82772q6566j2984P3872N3n7013N9492J95533J84392J39443J80711J23513
40489A183218k12879n51947m24314J37745N57097M50256P7616r8851j4619P5021
$$ plain form
40561 457942 96943 14817 315775 805165 1233469 1402805 1232895 881305 667383 742386
40551 742386 929801 979221 865192 753533 791122 1009339 1316260 1508434 1410413 1071207
40541 1071207 708351 432862 199898 48193 122232 353079 410159 173737 -8349 185887
40531 185887 514771 471767 -634 -457959 -580113 -498309 -443129 -378608 -136702 268768
40521 268768 606926 644478 366967 57313 106286 605895 1173412 1347149 1119708 884012
40511 884012 884029 962690 869000 554930 102670 -383765 -701595 -613163 -160918 270365 382772
40500 382772 296206 283222 357094 357147 300134 359626 555159 739551 878994 1059705 1183218
40489 1183218 970339 418392 -5922 131823 688920 1139176 1216792 1117941 1103322 1178343
40479A178343M5894k0759q7660j74755j77909J6427K41144J93901q4860k23656
40469I06110j12164r3099l42656m57851n3181N31325O28167J98176j59004j25740
40459I20083k1180j11698j42645J23563L66433J64421k82387l76699K4897M20114
40449A084902L48694p0485l86114l54113j08131O3024K359j85240k42359l3374
40439A19163K98089M81797L85416Q3180k49983m25214l19607j1442K21513J84120
40429G67032O865l8910O9029Q9742q2719k16315o7112K28983K91109O761k84388
40418G70077k21563R8248K56185P1582k11157l31129l29645l11625j76403J25101
40408b60329K99844Q1060k58987k37115O8408J28350j17842r9991L98994P55330
$$ plain form
40479 1178343 1224237 1203478 1115818 941063 763154 779581 1020725 1214626 1129766 906110
40469 906110 793946 700847 358191 -99660 -152841 378484 1006651 1204827 1045823 920083
40459 920083 898903 787205 644560 768123 1134556 1298977 1016590 639891 664788 1084902
40449 1084902 1433596 1363111 976997 622884 514753 577777 580136 394896 152537 119163
40439 119163 417252 899049 1284465 1367645 1117662 692448 372841 361399 582912 767032
40429 767032 773897 734987 804016 893758 811039 594724 527612 756595 1047704 1054465 770077
40418 770077 548514 646762 902947 974529 763372 432243 102598 -209027 -385430 -260329
40408 -260329 39515 120575 -138412 -375527 -307119 -178769 -296611 -396602 2392 757722
40398G57722M39452j26140k36653O935r832l17978l57293N366K30999L609l03702
40387I2485k78531j8465K20404M13444N23181L40706r4713l40574j80214j4088
40377F63635k10555m40228j79303L96844O23010L27491M715j1234L2388j32541
40367A074222l22177k65393n9259O0238J19298K38531K80340M7634k81869l19968
40357E71597n2779J26852M0487j2689K03247M15377K51568j56387l61302k49608
40347G76363r6698l9312O1315J91244Q8719k49279l95611j11876K16041J17232
40337E58138k57119l61808k1283M20993O10288M83691J51974j76371k20010R2804
40327A281297M23228M09574J54971k549m3057j47752j90535P1362L65485J47735
$$ plain form
40398 757722 1197174 1071034 834381 841316 831484 513506 156213 161579 392578 396187 92485
40387 92485 -186046 -204511 15893 429337 952518 1293224 1198511 857937 677723 663635
40377 663635 453080 12852 -166451 230393 853403 1180894 1185609 1174375 1206763 1074222
40367 1074222 752045 486652 427393 487631 606929 845460 1125800 1173434 891565 571597
40357 571597 518818 645670 686157 673468 876715 1292092 1543660 1387273 1025971 776363
40347 776363 679665 640353 701668 892912 981631 732352 336741 224865 440906 558138
40337 558138 301019 -60789 -82072 338921 949209 1432900 1584874 1408503 1188493 1281297
40327 1281297 1704525 2114099 2269070 2266521 2223464 2075712 1885177 1956539 2322024 2469759
40317B469759m44923o16841j24020K75341r851m72268l32208K62645N69355L88598
40307A965587J20635o3254l21013n12914k61521K88958M84575J22960k18616q0665
40297A524732K10875J39916j86700k77047l2750J66730O3800j57748j72192R3673
40287A373289M05737M59203J77102j86019l03521j57078k9976q6958j46795J3946
40277A518930K98537M09720K45169L425q3206M594J04085P3613o1034j54721j32617
40266B226495q2872j08828j61335j33697n6726k3792L6329K69658N52866N19246
40256C037344O7041l98027m38333j29165J09976R9085K4595K6578k2525k27923
40246B148646m07601l13817m678K09306J79983J03944K09826L91697L24930o3900
$$ plain form
40317 2469759 2024836 1407995 1283975 1559316 1549465 1077197 744989 1007634 1576989 1965587
40307 1965587 2086222 2022968 1701955 1189041 927520 1216478 1701053 1824013 1605397 1524732
40297 1524732 1735607 1875523 1688823 1411776 1379026 1545756 1609556 1451808 1279616 1373289
40287 1373289 1779026 2238229 2415331 2229312 1925791 1768713 1738737 1651779 1504984 1518930
40277 1518930 1817467 2227187 2472356 2475781 2392575 2397169 2501254 2574867 2513833 2359112 2226495
40266 2226495 2143623 2034795 1873460 1739763 1683037 1659245 1695574 1965232 2518098 3037344
40256 3037344 3104385 2706358 2268025 2138860 2248836 2347921 2372516 2399094 2376569 2148646
40246 2148646 1741045 1427228 1422550 1631856 1811839 1915783 2125609 2517306 2842236 2778336
40236B778336m29820m21691j33260L6687p5745k10146p5379K52016M35662K74455
40226B431115j17381m51245n02054k79936l9590l7334k13207k35940L6603L02372
40216H93403K14918q9633j52680J44070L94247K40555j50317l67289k83333p0833
40206G73108J33370K84689K57865m0953l87109l96099n6148J99994R3829j20884
40196G41662q6101J26336K06630J33068J43547K74204K95134J12647q6912j48745
40186A711470j34078j34032j40088j48375j66887j05452Q7156J95541j5304l20178
40176H29773k28901K48253N08560K23474j98237l06272k54275l18842k64045K03446
40166D42934O95651N71705n8737m53212l05011k7575M4451N7475J17625K6664
$$ plain form
40236 2778336 2348516 1926825 1793565 1830252 1754507 1544361 1468982 1720998 2156660 2431115
40226 2431115 2313734 1862489 1360435 1080499 1040909 1003575 790368 554428 591031 893403
40216 893403 1108321 1018688 866008 1010078 1404325 1644880 1494563 1127274 843941 773108
40206 773108 906478 1191167 1449032 1408079 1020970 624871 568723 768717 862546 741662
40196 741662 655561 781897 988527 1121595 1265142 1539346 1834480 1947127 1860215 1711470
40186 1711470 1577392 1443360 1303272 1154897 988010 882558 969714 1165255 1149951 829773
40176 829773 600872 849125 1357685 1581159 1382922 1076650 822375 503533 239488 442934
40166 442934 1138585 1710290 1651553 1198341 893330 865755 910206 967681 1085306 1111970
40156A111970k20095k56507K5976J86579p3451l79697k52002J61264L51167J89779
40146H44983j4067k8290J04546K74547M02280L93609K15909m0374k87776m93914
40136A371453n50148l35435J095J28753J9886j7363Q1166l658l09036l43433J03883
40125A47163M64238K51316r0660Q8240M87083K98486m09159p06079k18870L67927
40115F79685M23894J76293Q0235Q7611l3377j94261k29339k20719k18619l9396
40105E12007L11586M25605Q8325k80653k10416J14282J72133j17029l74922l48686
40095B92232j12033J80090L89669L77313J78753L9024K6290j16356m31874m38752
40085C84356J53205P51938N65451k06823n92532k32955J96527R2895k69837l55817
$$ plain form
40156 1111970 891875 635368 661344 847923 774472 394775 142773 304037 655204 844983
40146 844983 830916 802626 907172 1181719 1583999 1977608 2193517 2153143 1865367 1371453
40136 1371453 821305 485870 486965 615718 635604 618241 699407 695749 386713 43280 147163
40125 147163 611401 862717 772057 860297 1347380 1645866 1236707 530628 311758 679685
40115 679685 1103579 1279872 1360107 1447718 1414341 1220080 990741 770022 551403 512007
40105 512007 823593 1249198 1337523 1056870 846454 960736 1132869 1015840 640918 292232
40095 292232 180199 360289 749958 1127271 1306024 1345048 1371338 1254982 823108 384356
40085 384356 537561 1289499 1854950 1648127 1055595 822640 1019167 1112062 842225 486408
40075D86408j69314o145J23656L35574M62478K94572J8431k7270J06792R2642
40065A717824j17990k41350j26926Q2232K50914L85398M38885K88422k5329k85861
40055B366219l91859m32112m18639k04809K10605N19162M21584k285l76251m14684
40045A276931j52607J40992K30046J43240J23430K68022L21527L4419l58296l64491
40035A663213K6749K47467k0126l24930j13268M02738N32000J14626k75219j63856
40025B089394K44768M65934L41296N7855j68079k30626j47298p6639j59857k66814
40015B149934j15353K78818N39729M36852J64370l3595j85139l20927k50122N4018
40005B718585J78756j65523n61594l97304J96482N15149L43466J99030L95433
$$ plain form
40075 486408 317094 310949 434605 770179 1232657 1527229 1545660 1518390 1625182 1717824
40065 1717824 1599834 1358484 1231558 1313790 1564704 1950102 2388987 2677409 2652080 2366219
40055 2366219 1974360 1542248 1123609 918800 1129405 1648567 2070151 2067866 1691615 1276931
40045 1276931 1124324 1265316 1495362 1638602 1762032 2030054 2351581 2386000 2027704 1663213
40035 1663213 1689962 1937429 1917303 1592373 1479105 1881843 2413843 2528469 2253250 2089394
40025 2089394 2334162 2800096 3141392 3199247 3031168 2800542 2653244 2576605 2416748 2149934
40015 2149934 2034581 2313399 2853128 3289980 3454350 3420755 3235616 2914689 2664567 2718585
40005 2718585 2897341 2731818 2170224 1772920 1969402 2484551 2828017 3027047 3422480
39996C422480N21112J85063k59250k24607K08886M18012J17086l31988m60597
39987C596197j92909K14181M57598L77807O9659j60141r2253J50835K75641K00191
39977D896806J15530K06054M69198P80760R73834Q85770N21160J68177J44685
39968I161974L79763M48034J21169k95223l46866m1783J50398p8519m71014n68948
39958H458985l49607k47694n21109q60381q17238m39369j90696l04586n35160
39949D193145n91137m98016l89941k26818M8742K68973K20236l4923k41355k87681
39939B461225k54208j85568l9264J41909K06891J00567l8836n2331K9006n75k71810
39928B097006o00104n88579r8786M65548N72737K19347j26367k20281k61044l33648
$$ plain form
39996 3422480 3943592 4128655 3869405 3644798 3853684 4271696 4388782 4056794 3596197
39987 3596197 3403288 3617469 4075067 4452874 4522533 4362392 4270139 4420974 4696615 4896806
39977 4896806 5012336 5218390 5687588 6468348 7442182 8327952 8849112 9017289 9161974
39968 9161974 9541737 9989771 10110940 9815717 9468851 9427068 9577466 9498947 9027933 8458985
39958 8458985 8109378 7861684 7340575 6480194 5662956 5223587 5032891 4728305 4193145
39949 4193145 3602008 3103992 2714051 2487233 2535975 2804948 3025184 2990261 2748906 2461225
39939 2461225 2207017 2021449 1982185 2124094 2330985 2431552 2392716 2340385 2369391 2368816 2097006
39928 2097006 1496902 908323 809537 1275085 1847822 2067169 1940802 1720521 1459477 1125829
39918A125829j73273K37811L86342J1624l11291L240N40350M75990q1586k54487
39908A960549J58034L81001l0l71289j89350J12219n9444m18685l28908J16854
39898A360951L22114J78351O7531P1098o4323k48353q3381L56206M68537K7961
39888B456692m45933m65252k06470o7157l3275J29051L57396L78843J72023Q306
39878B284224O8740K42835K95690J01954k52023n13825m74797j99056L5262O4051
39868A653055q757l0823k2243q0155j93497k70799k56432j17770J74343N17892
39858A364814O22979K75772l19841o17841k67396M47770Q20539M56642k52459
39849B530979n43902j87604K37846J15040l86889n62961j47686L53380L88762
$$ plain form
39918 1125829 952556 1190367 1576709 1588333 1277042 1280282 1820632 2296622 2215036 1960549
39908 1960549 2118583 2499584 2499554 2128265 1938915 2051134 1991690 1573005 1244097 1360951
39898 1360951 1683065 1861416 1928947 2000045 1935722 1687369 1603988 1960194 2428731 2456692
39888 2456692 2010759 1545507 1339037 1271880 1238605 1367656 1725052 2103895 2275918 2284224
39878 2284224 2352964 2595799 2891489 2993443 2741420 2227595 1752798 1553742 1589004 1653055
39868 1653055 1644298 1613475 1591232 1511077 1317580 1046781 790349 672579 846922 1364814
39858 1364814 1987793 2263565 1943724 1325883 1058487 1506257 2326796 2783438 2530979
39849 2530979 1987077 1799473 2037319 2152359 1765470 1202509 1054823 1408203 1796965
39840A796965O2794j15816M4522K45554J82083n9456j55313K6627K57495K28669
39830B514124m1930k03296m2129J86914J08566j88865k34979J19299M26320K57822
39820B901846j81503l43062p5615K38395K47078L9125q1300k3325L4623m5426
39810B710836j30486K0111L73833N45424K35917l32142o35467m87936j94814l2066
39800B073210J01832L56963N74886N35818L27693J61986J2235k25907l77618j95447
39790C345651J58749K62558O0040q0705J1138O7100j00958k63596j98061q6213
39780C175703j71604k98591j57872J84321L64168K36655o513j74921k26186j10890
39770B814270K00632N05013M90175J64017j09551j14595n8201j77387l27345k26285
$$ plain form
39840 1796965 1859759 1743943 1788465 2034019 2216102 2156646 2001333 2027960 2285455 2514124
39830 2514124 2472194 2268898 2226769 2413683 2522249 2333384 2098405 2217704 2644024 2901846
39820 2901846 2720343 2377281 2301666 2540061 2787139 2826264 2744964 2721639 2756262 2710836
39810 2710836 2580350 2600461 2974294 3519718 3755635 3423493 2788026 2300090 2105276 2073210
39800 2073210 2175042 2532005 3106891 3642709 3970402 4132388 4144623 3918716 3541098 3345651
39790 3345651 3504400 3766958 3826998 3746293 3757431 3824531 3723573 3459977 3261916 3175703
39780 3175703 3004099 2705508 2547636 2731957 3096125 3332780 3326267 3151346 2925160 2814270
39770 2814270 3014902 3519915 4010090 4174107 4064556 3949961 3891760 3714373 3387028 3160743
39760C160743N7683J87683P9162J5414J71111L09070J44094j79320k40723O7459
39750C772376L62937K71940p8532k28150L9007M57371O21395M13276L6413k47280
39740E420753l03880j38589J23952K79646K12009N9465Q3982L00910L81519P0597
39730F490364m09445n96013l96218j85182k20772k61184L025L77439M01822P3496
39720E277332j02079J27401L63373J69819k44906l36865k9728K28103J77591P8733
39710E708774J97053L40054J80906j89222l63086j94550K8079K1449j24571j34966
39700E469920O1482K97857M39978M98960M67468K45373j48945m38065l60122l1432
39690F502474J86429J78062J70633K81555K99056J10214J2936K40210M36737J21514
$$ plain form
39760 3160743 3218426 3406109 3485271 3500685 3671796 3980866 4124960 3945640 3704917 3772376
39750 3772376 4135313 4407253 4328721 4100571 4139578 4596949 5218344 5631620 5668033 5420753
39740 5420753 5116873 4978284 5102236 5381882 5593891 5653356 5737338 6038248 6419767 6490364
39730 6490364 6080919 5484906 5088688 4903506 4682734 4421550 4424575 4802014 5203836 5277332
39720 5277332 5175253 5302654 5666027 5835846 5590940 5254075 5224347 5452450 5630041 5708774
39710 5708774 5905827 6245881 6426787 6237565 5874479 5679929 5708008 5729457 5604886 5469920
39700 5469920 5531402 5829259 6269237 6768197 7235665 7481038 7332093 6894028 6533906 6502474
39690 6502474 6688903 6866965 7037598 7319153 7618209 7728423 7741359 7981569 8418306 8539820
39680H539820m46714m76811K02344Q12878P15892K62299J28793K85374K21007
39671A0244882j06539k26722L3142L34709M58526N53439O45296M77264N8230j62197
39661A2310030L2851K53722J51556k2018N9249J50007j02295l82338j15144N00718
39651A2836338O47457J42925k12291J85182Q65029J012766N72601J06966r0129
39642A6066844j67684j92417k2017L00200M91754M54612L97535M51650M79694
39633A8260171L79079K95757L80461N35111N65493M64870M12808N41571P62174
39624B2597495Q10234N20608J11915M9831M65787Q87915Q26671M66887L80081
39615B7117424O48376P97485O43786O17396J001376J393439J328322J016586R85611
$$ plain form
39680 8539820 8093106 7616295 7818639 8631517 9347409 9609708 9738501 10023875 10244882
39671 10244882 10138343 9911621 9944763 10279472 10737998 11291437 11936733 12413997 12472227 12310030
39661 12310030 12342881 12596603 12748159 12726141 12785390 12935397 12833102 12450764 12335620 12836338
39651 12836338 13483795 13626720 13414429 13599611 14464640 15477406 16050007 16156973 16066844
39642 16066844 15899160 15706743 15684726 15984926 16476680 16931292 17328827 17780477 18260171
39633 18260171 18639250 18935007 19315468 19850579 20416072 20880942 21293750 21835321 22597495
39624 22597495 23407729 23928337 24040252 24090083 24555870 25443785 26270456 26737343 27117424
39615 27117424 27765800 28563285 29207071 29824467 30825843 32219282 33547604 34564190 35549801
39606C5549801J278387J501006J472738J357955J283321J262570J395492J723667
39598D6824937J991676J964912J863450K037677K356925K445414K404036K669670
39590F4558697L189808L430759L287705L267409L579449L789415L696749L821519
39582I2621510M536278N360269N702844N771573O113111O719680P262496P787807
39574A41875568Q432606Q812217Q548103Q177620Q623693R826916J0807910J1119749
39566B16224382J1294716J1663413J1707814J1039684J0193273R813255R639077
39559B91575614Q943099P572436N952935M354899K719744J016750p26631k605990
39551C18802856m628762o465877p799585q765221r674846j0480371j0922934j1054477
$$ plain form
39606 35549801 36828188 38329194 39801932 41159887 42443208 43705778 45101270 46824937
39598 46824937 48816613 50781525 52644975 54682652 57039577 59484991 61889027 64558697
39590 64558697 67748505 71179264 74466969 77734378 81313827 85103242 88799991 92621510
39582 92621510 97157788 102518057 108220901 113992474 120105585 126825265 134087761 141875568
39574 141875568 150308174 159120391 167668494 175846114 184469807 194296723 205104633 216224382
39566 216224382 227519098 239182511 250890325 261930009 272123282 281936537 291575614
39559 291575614 300518713 308091149 314044084 318398983 321118727 322135477 321408846 318802856
39551 318802856 314174094 307708217 299908632 291143411 281468565 270988194 260065260 249010783
39543B49010783j1154593j1230947j1065199j0703269j0435300j0286475r980334
39536A74154666r454435q968715q606851q109869p377759o738173o468325o360756
39528A12069783o042152n499264n007590m684483m387878m006164l623992l377111
39520G5441149l277019l222834l125569k971417k758250k433824k010493j719713
39512E3922030j827787k202049k329996j990449j627954j706591j950071j748252
39504C8538881j174543r36191j255699j501489j200569p72878q11366j160490
39496B9725656j275322j106389r99369r77077p90715n55546o46523r48484q84009
39487B1542222l44728K1381k65375q24170j010996p87223n59813m71313l51098
$$ plain form
39543 249010783 237856190 226625243 215560044 204856775 194421475 184135000 174154666
39536 174154666 164700231 155731516 147124665 139014796 131637037 124898864 118430539 112069783
39528 112069783 106027631 100528367 95520777 90836294 86448416 82442252 78818260 75441149
39520 75441149 72164130 68941296 65815727 62844310 60086060 57652236 55641743 53922030
39512 53922030 52094243 49892194 47562198 45571749 43943795 42237204 40287133 38538881
39504 38538881 37364338 36428147 35172448 33670959 32470390 31697512 30886146 29725656
39496 29725656 28450334 27343945 26344576 25367499 24576784 24021238 23374715 22426231 21542222
39487 21542222 21197494 21218875 20953500 20129330 19118334 18331111 17771298 17299985 16948887
39478A6948887k16241l10837o26413q02325o27407l31969k18155k37129j48477
39469A3429934M3646P3793j62254l89437k88548O4147K74905J37433j39001k82690
39459A2761928l30549m49256n49263l91924m4700J19024l9858k11617j32999P417
39449A0738203p4364k46300j70334J11030K04470k3333k55214k46146j81924l03584
39439I552504m52126l05928N4412J63110j98737o48461o41129j38619L41972L32797
39429H059795r1165m84430n67307m47256l57208l55991l43151k35186l3539J95613
39419E340175L28170K54868L4104j17939r2975n3943k00867m50810n12771k52958
39409D275054J52271M11214L59367N7380k35503k50853o833J64294L1768k06387
$$ plain form
39478 16948887 16732646 16421809 15795396 14993071 14365664 14033695 13815540 13578411 13429934
39469 13429934 13473580 13547373 13385119 12995682 12707134 12771281 13046186 13183619 13044618 12761928
39459 12761928 12431379 11982123 11432860 11040936 10996236 11115260 11075402 10863785 10730786 10738203
39449 10738203 10663839 10417539 10247205 10358235 10562705 10539372 10284158 10038012 9856088 9552504
39439 9552504 9100378 8794450 8848862 9011972 8813235 8164774 7523645 7385026 7726998 8059795
39429 8059795 7968630 7484200 6916893 6469637 6112429 5756438 5413287 5178101 5144562 5340175
39419 5340175 5668345 5923213 5957317 5839378 5746403 5692460 5491593 5040783 4528012 4275054
39409 4275054 4427325 4838539 5197906 5255286 5019783 4768930 4762097 4926391 4958159 4751772
39399D751772k21178n4138k0706j78933k54270j17246L0886M6270O2718J67597
39389D212772J90622L5310o7827R1287L18937K62885r7253m43673n03892k63406
39379C735762Q7080K68873J19901j90608l18546k06274j37244k24937k05262N4003
39369B982748K41999J36198N1335L07654N92763M04819j14528l84985k60539q9901
39359C867563k4726Q1219J37985j14915m65941l67216J49085L94970Q7685k17709
39349C528000p9920J31376n0184l70253l14176N0254K51472J27456j26429l51262
39339B796334m35008k13987K12361L60264j4898m71414m91253k02371q304J28241
39329A659965M21252O11948L17383j74174k33026P8875J08403k39194k99102K06088
$$ plain form
39399 4751772 4530594 4476456 4455750 4276817 4022547 3905301 3936187 3982457 4045175 4212772
39389 4212772 4403394 4438704 4370877 4462164 4781101 5043986 4946733 4503060 3999168 3735762
39379 3735762 3822842 4091715 4211616 4021008 3702462 3496188 3358944 3134007 2928745 2982748
39369 2982748 3224747 3360945 3412280 3719934 4312697 4717516 4602988 4218003 3957464 3867563
39359 3867563 3842837 3924056 4062041 3947126 3481185 3113969 3263054 3658024 3745709 3528000
39349 3528000 3448080 3579456 3529272 3159019 2844843 2895097 3146569 3274025 3147596 2796334
39339 2796334 2361326 2147339 2359700 2719964 2705066 2233652 1742399 1540028 1531724 1659965
39329 1659965 2081217 2693165 3010548 2836374 2603348 2682223 2790626 2551432 2252330 2458418
39319B458418O27210L87553j45692k99595j13116j40487n16333p71151n22469
39310I64338M9019M61151M46774J60597l7779J4746J26171M9439j54775k24971
39300A854710r1309O3788R3047M950j49103k68274j63794J92329M69397L47573
39290B353314r044j98399j73344j63803j46706N9524K48984J9035m60776n42948
39280I85837q7451L26618L51850L07752L96339K62902k24720n03728k02892J55447
39270A767954O816k91065j14777K97133K49982k01460l64357o6751J73069J08232
39260A564776O9047K25052K87046J05710p7577j49962l04343n15576m15500O6517
39250H55190M47884L53381R433j74725j38979m6563K0749P543j57667l41104k52097
$$ plain form
39319 2458418 3085628 3473181 3327489 3027894 2914778 2774291 2257958 1486807 964338
39310 964338 1013357 1474508 1921282 2081879 2044100 2058846 2185017 2234456 2079681 1854710
39300 1854710 1763401 1827189 1920236 1925186 1776083 1507809 1344015 1536344 2005741 2353314
39290 2353314 2344270 2145871 1972527 1808724 1662018 1721542 1970526 1989561 1528785 985837
39280 985837 898386 1225004 1576854 1884606 2280945 2543847 2319127 1815399 1612507 1767954
39270 1767954 1774770 1483705 1368928 1666061 1916043 1714583 1350226 1283475 1456544 1564776
39260 1564776 1633823 1858875 2145921 2251631 2174054 2024092 1719749 1204173 788673 855190
39250 855190 1303074 1656455 1665888 1491163 1352184 1305621 1326370 1333913 1176246 835142 583045
39239E83045R2039K78307R4300j19604J3861L31721L86760P5954k93989m41301
39229A001093l47825j44370K8719Q0098J6250r2107k10893l09522k61764O323
39219b33998K71125K04725j13818j99984J63800N61812M96688O7804k07223j14295
39209H96636L5147q9861l60987l51866Q5498N40132M67854j04262n22736l19323
39199B76232J58214K53679l8620j07640K96131O54646M38966j70860n93044n42344
39189F25360j62300K54123M18027J73539k69842m51462k23844L6719m195j55133
39179B40992o7977J81928K46271N0435j65408k31783j63878M907K13750K94096
39169F03333J68466L9301J34380L70273N03599M78393L66407J26873k52570n05624
$$ plain form
39239 583045 675084 953391 1047691 928087 941948 1273669 1660429 1736383 1442394 1001093
39229 1001093 653268 508898 537617 617715 633965 541858 330965 21443 -240321 -233998
39219 -233998 37127 241852 128034 -71950 91850 653662 1150350 1218154 1010931 896636
39209 896636 931783 841922 480935 129069 214567 754699 1222553 1118291 595555 276232
39199 276232 434446 688125 649505 541865 837996 1492642 1931608 1760748 1167704 625360
39189 625360 463060 717183 1135210 1308749 1038907 587445 363601 400320 396125 240992
39179 240992 173015 354943 601214 651649 486241 254458 90580 95487 309237 603333
39169 603333 771799 811100 945480 1315753 1819352 2297745 2664152 2791025 2538455 2032831
39159B032831l44200Q0310K99964J03581k79530n22469m61283q8796M01819O17142
39149A839369L33175j47956l15991j06815Q2495J6416j10077p8924L3767O9679
39139A615138K2830o4165j85137k43127q8603J99766L16649J46014m7692R430
39129A681103K33399L34835J75813j57015m80482n87857l44936J35728N13889
39120A504477N36099K68558l6993k04603k07601j06879k374L3788K9251N3660
39110A867383R0911O5512k2063j03588j49508j31314M1790L41660M65267J67063
39100B633113k76562l03242J62073N46381M01029k6204k35196j67522j23646k13804
39090B396420k67204j87528o6876K3938R2693R2852l3745j90391k04354o5827
$$ plain form
39159 2032831 1688631 1768941 2068905 2172486 1892956 1370487 909204 820408 1222227 1839369
39149 1839369 2172544 2024588 1708597 1601782 1684277 1700693 1590616 1511692 1545459 1615138
39139 1615138 1637968 1573803 1388666 1145539 1056936 1256702 1573351 1719365 1671673 1681103
39129 1681103 1914502 2249337 2425150 2268135 1787653 1199796 854860 990588 1504477
39120 1504477 2040576 2309134 2272141 2067538 1859937 1753058 1750684 1784472 1813723 1867383
39110 1867383 1958294 2023806 2001743 1898155 1748647 1617333 1659123 2000783 2466050 2633113
39100 2633113 2356551 2053309 2215382 2761763 3162792 3136588 2901392 2733870 2610224 2396420
39090 2396420 2129216 1941688 1874812 1898750 1991443 2084295 2050550 1860159 1655805 1589978
39080A589978Q1011J50624J47976M7536j50633k88767k08625k2179J8450q4333
39070A281038q8828M1917L8038j99933l40105q7761L19148M02700J09636j46587
39060A329263q2108J25984J57515n4981l36852m74267l23672Q0690M32114L76028
39050A229714l6008l22960j71216J58078K36619O7051l3091K4224N3061J4511
39040A219983P0326K05614J97375K4135p8665n8794j30674k88830j96933K04389
39030A167926M37389J80238j86418j53274J40495K02024l475q9406M5622R9819
39020A840940p0808k56722k83403j95482n1471J02543J02693j08507k16446O7411
39010I30748M41821L77408k5183j61017P7258J25852k56126n36819k94569Q5511
$$ plain form
39080 1589978 1670989 1821613 1969589 2017125 1866492 1577725 1369100 1346921 1365371 1281038
39070 1281038 1192210 1234127 1272165 1072232 732127 644366 963514 1366214 1475850 1329263
39060 1329263 1247155 1373139 1530654 1475673 1138821 664554 340882 421572 853686 1229714
39050 1229714 1193706 870746 699530 857608 1094227 1161278 1128187 1152411 1205472 1219983
39040 1219983 1290309 1495923 1693298 1717433 1638768 1579974 1449300 1160470 963537 1167926
39030 1167926 1605315 1785553 1599135 1445861 1586356 1788380 1784905 1695499 1741121 1840940
39020 1840940 1770132 1513410 1230007 1034525 983054 1085597 1188290 1079783 863337 930748
39010 930748 1372569 1749977 1724794 1563777 1641035 1766887 1510761 973942 679373 764884
39000G64884N6310k56644l63310j60423J08586L18994M24373K46377k13838n00985
38990D24324k34824K70543L95414P8498j86419j23983L9204O4104L1938R4462
38980H53261K11081K46229J44315l1299j20865P299K43396K84737L3908k37666
38970A634396k85356k17311k24233k55799k23958k37133l18278j98608K20657
38961a05623N09329K87440j04989p1284L09590M27580J09068k02523k29177j90603
38951G38808k58370k54479o6280J16465J52206J38042J37103R9767J07547K65810
38941A176619L33950j7450n25802n18384P0180M95437K79478j36819j85913j8593
38931I52703n8167k08472j03435J81518K52755M3522j61129k04551j41747J2974
$$ plain form
39000 764884 821194 564550 201240 40817 149403 468397 892770 1139147 925309 424324
38990 424324 189500 460043 855457 933955 747536 623553 662757 726861 758799 853261
38980 853261 1064342 1310571 1454886 1423587 1302722 1310021 1553417 1838154 1872062 1634396
38970 1634396 1349040 1131729 907496 651697 427739 190606 -127672 -326280 -105623
38961 -105623 403706 691146 586157 514873 824463 1252043 1361111 1158588 929411 738808
38951 738808 480438 225959 159679 276144 428350 566392 703495 803262 910809 1176619
38941 1176619 1510569 1493119 967317 448933 519113 1014550 1294028 1157209 971296 952703
38931 952703 894536 686064 582629 764147 1016902 1060424 899295 694744 552997 565971
38921E65971K26049K76090L0246k44473k13438K5368J41037J04569J10515J14109
38911A136043p8423l34080l00102M359J63248r297k37915k65361j54640M524K78996
38900B07352N84954N66112O5931n24156o76810l45650O5579K36058J95761J19127
38890D94258Q2933P0672O6899O3107K9194m9841j19755j03690k7746k6165j41588
38879C38278j95961j6498K53444K97068R5670k5098P8622J20195j16567l36382
38869D92771j47897K92295M71929K56682K204m6769l8597j28493k10493j78487
38859G65145j19959q2849N5984L06103M17102K30139m9997j54962j24158j38605
38849A103943j66000n8698J08016J06977n0602q2397J41385L69040K94828j9368
$$ plain form
38921 565971 792020 1068110 1098356 853883 640445 665813 806850 911419 1021934 1136043
38911 1136043 1057620 723540 423438 427797 591045 581748 343833 78472 -76168 -71644 207352
38900 207352 792306 1358418 1424349 900193 223383 -122267 -56688 179370 375131 494258
38890 494258 577191 647863 714762 777869 807063 757222 637467 533777 506031 479866 338278
38879 338278 142317 125819 379263 676331 772001 746903 825525 945720 829153 492771
38869 492771 344874 637169 1109098 1365780 1367984 1321215 1282618 1154125 943632 765145
38859 765145 645186 562337 618321 924424 1341526 1571665 1521668 1366706 1242548 1103943
38849 1103943 937943 879245 987261 1094238 1043636 961239 1102624 1471664 1766492 1747124
38839A747124k09247p0168J76251J48537k08519n18970m15580L445K90285J97080
38829A140238n1098q6842J35611L27582K54103N699j44160q3513J6413m2854j83999
38818A287180j57307M5508J14388r3835k42020J180L41671J93663l85848o41349
38808D63231j87232L86165L51331j30997l45341j05825J10583K6273q5296j5080
38798D67812P364j79453k80014l5020K68365K17873n2341r2787J08658J25991
38788E56448j60854l39945j36950J35060P3065j94161k30696M5432K84130K30167
38778B61696J4305j15727j06597n1179m9O1967J28737J48914P8127n7766j44628
38767B17800p2940J08224J98222Q0879j15873j87360j00676L3671J42547J93075
$$ plain form
38839 1747124 1537877 1467709 1643960 1792497 1583978 1065008 649428 652873 943158 1140238
38829 1140238 1089140 1002298 1137909 1465491 1719594 1725293 1581133 1497620 1514033 1471179 1287180
38818 1287180 1129873 1175381 1289769 1195934 953914 955094 1296765 1490428 1104580 463231
38808 463231 275999 662164 1013495 882498 537157 431332 541915 568188 482892 467812
38798 467812 475176 295723 15709 -19311 249054 466927 414586 321799 430457 556448
38788 556448 395594 55649 -81301 53759 126824 -67337 -298033 -252601 31529 261696
38778 261696 276001 160274 53677 2498 2449 64416 193153 342067 420194 362428 217800
38767 217800 144860 253084 451306 532185 416312 228952 128276 161947 304494 497569
38757D97569J11757j02118k54622j71647K0521P4217J9859P8260K06483J21355
38747F01634j67633k81602r4564M51k72022n58879l88944J02985L89138K73570
38737c95866j6798k81315m36108l08898J53827N56333M51738M4106n1390K31944
38727e2427L04043r8538m65542l40348M061J33684J65040L67319M86412J28644
38717F32348m37990n60877j86533R9758L1286r730K28625L96296J70742j56995
38707B06930j47827J03301K01442J04046O5607R5884k6445k44517k25683M7307
38697A80045J50287j19069l51363j11113L76551N11858J43768k90684m16441l17145
38687b43306k00360l2441K69160N28153M88866K08579R683M1490R7533p1451m04864
$$ plain form
38757 497569 609326 507208 252586 80939 101460 175677 195536 273796 480279 601634
38747 601634 434001 152399 57835 58286 -213736 -772615 -1161559 -1058574 -669436 -395866
38737 -395866 -412664 -693979 -1130087 -1438985 -1285158 -728825 -277087 -232981 -284371 -52427
38727 -52427 251616 153078 -312464 -652812 -648751 -515067 -350027 17292 503704 632348
38717 632348 194358 -366519 -553052 -453294 -422008 -431738 -203113 193183 363925 206930
38707 206930 59103 162404 363846 467892 533499 629383 602938 358421 132738 180045
38697 180045 330332 211263 -140100 -251213 125338 637196 780964 490280 73839 -243306
38687 -243306 -443666 -476107 -206947 321206 810072 1018651 1028334 1069824 1167357 1095906 691042
38676F91042n89969m24810m9754K07311J98775R9878J22024J78358K7642k70925
38666A89572l35099j5113L11505K46925n2420j40439L7865J37793K9445l1533
38656C78501Q2983J32818l1208j60190l7891J05068m0212l12159l01597K74J93484
38645I871R7233j3651R5123K26378P2420k86640m59759k50091J22261L15178K38233
38634A66556P3165Q842N2064R3805P3991K1446k8915q3577j53951k17461k09380
38623b03415m2187K87088N56400M37648o8811m60103k90476J66459K21466k17497
38613C86572m37428J4899N50395L29023m79964q81934m35266K14272L36779P4807
38603c27845M1768L67475O02079M06688n5409l96643m03113j44739J25253J75275
$$ plain form
38676 691042 101073 -323737 -373491 -166180 32595 132473 254497 432855 460497 189572
38666 189572 -145527 -160640 150865 397790 345370 204931 242796 380589 410034 378501
38656 378501 461484 594302 563094 402904 365013 470081 429869 117710 -183887 -183613 9871
38645 9871 107104 93453 188576 414954 487374 200734 -259025 -509116 -386855 -71677 166556
38634 166556 239721 248563 300627 394432 468423 489869 460954 377377 223426 5965 -203415
38623 -203415 -245602 41486 597886 1035534 966723 506620 216144 382603 604069 386572
38613 386572 -50856 -35957 514438 843461 363497 -518437 -953703 -739431 -402652 -327845
38603 -327845 -286077 81398 683477 1090165 1034756 638113 235000 90261 215514 390789
38593C90789K3174p7053K2842J38319K3822k38727l53115k50154j40973j17866
38583e78942p310K57151M02081K05422o3972O5428N63269Q14092L78049m00302
38573A634966p74146m76068L4010J96194l0007k81776l11184j64712M4103K63287
38563A34667L83691K52648o9152k63870j44489O3771L9487j57874j97894j1551
38553B9434J10677M555j12431k9468J04074N6124q5211q1198M9109J10613J00572
38542B56850J44242J52477m6420k62017j02485L43010M80196O2546m13655m58372
38532A56372k64817k33628k53714o197L31316L24830O2713M0223L13572M17745
38522H88415J79990k4398J7892j268l11024o31304o34163l79396k6153M10833
$$ plain form
38593 390789 413963 336910 359752 498071 521893 283166 -69949 -320103 -461076 -578942
38583 -578942 -586252 -329101 72980 278402 214430 279858 843127 1657219 2035268 1634966
38573 1634966 860820 384752 418762 614956 584949 303173 -8011 -172723 -128620 134667
38563 134667 518358 771006 701854 437984 293495 357266 396753 238879 40985 29434
38553 29434 140111 144666 32235 2767 106841 162965 77754 -3444 45665 156278 256850
38542 256850 401092 553569 507149 245132 142647 485657 965853 1028399 614744 156372
38532 156372 -108445 -342073 -595787 -601984 -270668 54162 116875 157098 470670 888415
38522 888415 1068405 1044007 1061899 1060631 749607 118303 -515860 -895256 -921409 -510576
38512e10576P30421N11466j77768n49876j06213N57917N52709o1457m94217m17423
38502C4983j99571q6178Q6169L23540L23275L8176j83227j66714j01987n2117
38492A6349J65075M54048L93545n2380l51405k23692o6658j92553k43968J09055
38482G416M38777K14951k16360j13272M21931N52363N7457k99651o533L84830
38472A441909J73450l56205l91441J22294L82546o6220o52846n73846J25670O43424
38462H48735M46118j46182m41373j88502K46383M03158K28932J0199o6546j25815
38452A215107l38930n81094n28495j11669L11122L65565J19239o3103l5378K1058
38442C73422j0304l483R1613P7951j25915k35139j3020K83707K36145j07539l29428
$$ plain form
38512 -510576 219845 731311 553543 3667 -102546 455371 1008080 946623 452406 34983
38502 34983 -164588 -250766 -164597 158943 482218 520394 337167 170453 68466 16349
38492 16349 181424 635472 1029017 976637 625232 401540 334882 142329 -101639 7416
38482 7416 446193 661144 444784 331512 753443 1305806 1363263 1063612 1057079 1441909
38472 1441909 1615359 1259154 867713 990007 1372553 1306333 653487 79641 205311 848735
38462 848735 1294853 1148671 707298 518796 765179 1168337 1397269 1407468 1340922 1215107
38452 1215107 876177 295083 -233412 -345081 -33959 331606 450845 387742 352364 373422
38442 373422 363118 359635 451248 529199 403284 168145 155125 438832 674977 567438 238010
38431B38010k83300k12049k36605j78371K2706J39711P0730M4575K14306L74383
38421A94096L03804J01664l7788j09163j40999m4859J46997J91144L5764j3523
38411F27137J63913J69348k73653o95283m84755J12890K91917r1972l21569M5522
38401d56505N38182N60546K23597k3652j22177k65945l63394j71580J86960L22503
38391D28535J42772p6957j59648j93975k37640k09323j14916n4878L4181K98864
38381a42985N67517M33949r3027m36575k33773J05295K5493k95399k41757K21948
38371h9314M57143J32231l04286l62528j99001j97577k78337j07840K42973L54056
38361c52480R3032k25825l12464j84239K3798K15351K79509J58345j3365o4883
$$ plain form
38431 238010 -45290 -257339 -493944 -672315 -649609 -509898 -439168 -394593 -180287 194096
38421 194096 497900 599564 561776 452613 311614 266755 413752 604896 640660 627137
38411 627137 791050 960398 686745 -8538 -493293 -380403 -88486 -180458 -502027 -456505
38401 -456505 81677 642223 865820 842168 719991 454046 90652 -80928 106032 428535
38391 428535 571307 494350 334702 140727 -96913 -306236 -421152 -476030 -441849 -142985
38381 -142985 424532 858481 765454 328879 95106 200401 225894 -69505 -311262 -89314
38371 -89314 367829 500060 195774 -166754 -365755 -563332 -841669 -949509 -706536 -352480
38361 -352480 -259448 -485273 -797737 -981976 -958178 -742827 -463318 -304973 -318338 -383221
38351c83221m3241p0045n8101J02501K03103p844k94904j99563J84721K90730
38341b75864m514j96979o7270n6760l90926n50597j47874L22540K84973P2665
38331a010606K95943O63212M11141l10185n35320o366M13396J11601l93493l85644
38321g46321n866J91836J62837K15855L16094J74931j57397l29459k35788r7846
38311e11124n2238k1472L9153Q2399J36548K54158L09736J14990k46125m33509
38301c27484k61327P5217K44588J42068l8367m1151J59442L06255J47855k35404
38291A71692n13269n12935l63543j99593K7962L09851M05970J62913j72407k38424
38281i21783m6607J04320J22704J99512L81346M12069J34229k15449l08841j60082
$$ plain form
38351 -383221 -426462 -496507 -554608 -452107 -249004 -256848 -551752 -751315 -566594 -275864
38341 -275864 -280378 -477357 -544627 -601387 -992313 -1542910 -1690784 -1368244 -1083271 -1010606
38331 -1010606 -714663 -51451 359690 49505 -485815 -492181 -78785 32816 -360677 -746321
38321 -746321 -752187 -560351 -397514 -181659 134435 309366 151969 -177490 -413278 -511124
38311 -511124 -563362 -584834 -545681 -463282 -326734 -72576 237160 352150 106025 -327484
38301 -327484 -588811 -513594 -269006 -126938 -165305 -206456 -47014 259241 407096 171692
38291 171692 -341577 -854512 -1218055 -1417648 -1389686 -1079835 -673865 -510952 -683359 -921783
38281 -921783 -968390 -864070 -741366 -541854 -160508 251561 385790 170341 -138500 -298582
38271b98582n3971j32170k44389j86790P0654L98058O07855N29522J40626l05446
38261E25367m31660j52572J69560J54558r4271j52393R2809K77195J18713j64341
38251C42965j98571K9700K68390M00539M31401K44665k24781o44307n48705m844
38241I6452L85171K58995q9994k23388j28801n2858o6244q2816j03004j52904
38231a59391j20626R0131L39917M01069K37508l9218l65098o60306o96750l17011
38221a289775K38375M96399L13871P1127J83368N45878O40297J99488l98399n59453
38211D41176k28426O3308j4377j11228J85914N79987M57904q6594l10078J7204
38201I94790K29515j33715n23744k35769M39666O16901R8761m31653m13652J1583
$$ plain form
38271 -298582 -352553 -484723 -729112 -915902 -845248 -447190 160665 690187 830813 525367
38261 525367 93707 -58865 110695 265253 170982 18589 111398 388593 507306 342965
38251 342965 144394 174094 442484 843023 1274424 1519089 1294308 650001 101296 96452
38241 96452 481623 740618 650624 427236 298435 245577 179333 96517 -6487 -159391
38231 -159391 -280017 -189886 150031 551100 788608 749390 384292 -276014 -972764 -1289775
38221 -1289775 -1051400 -555001 -241130 -170003 13365 559243 1199540 1399028 1000629 441176
38211 441176 212750 276058 261681 150453 336367 916354 1374258 1287664 977586 994790
38201 994790 1224305 1090590 566846 331077 770743 1387644 1486405 1054752 641100 652683
38191F52683M29098O09287M68959N7409k99124k38756J34913L36706J60445j01473
38181B210147j76692j60041j95758j80336k00K13527K85160K39861J72689O4530
38171B472887j07794k45312k57643j83886q6656K1254P2233m3243k61652l30364
38161A049824j21928J87812L41868K51223k5864l54507n13017l45483k0881R8752
38151E47799l7613o9019J99987M07948J20333m82393p55863l95586K08542M73597
38141B17732K60053r3722k31938j31891j2769j7268q4290j08909q0667m284J55582
38130a32371L23241K79216j6268k36211j10221J15400K1255k84243k90533Q5672
38120b45063L41747J94506j4632J8828M7816j72180l10535J418M25759L54655
$$ plain form
38191 652683 1081781 1691068 2160027 2217436 1918312 1679556 1814469 2151175 2311620 2210147
38181 2210147 2033455 1873414 1677656 1497320 1497120 1710647 1995807 2235668 2408357 2472887
38171 2472887 2365093 2119781 1862138 1678252 1591596 1612850 1685083 1641840 1380188 1049824
38161 1049824 927896 1115708 1457576 1708799 1682935 1328428 815411 469928 449047 547799
38151 547799 510186 441167 641154 1049102 1169435 687042 -68821 -464407 -255865 217732
38141 217732 477785 384063 152125 20234 7465 -9803 -94093 -203002 -283669 -287953 -132371
38130 -132371 190870 470086 453818 217607 107386 222786 244041 -40202 -330735 -245063
38120 -245063 96684 291190 276558 295386 343202 171022 -139513 -138095 287664 642319
38110F42319j13489k97667L3090M03212M57001L96285L95532J82324m12983r21707
38100G63917p42540J785N40791L67122k28216n66076l20352K19840N21400L63230
38090I20901J2960j38000k7312J04302J20246J35093K06470J39049k09913n93756
38080F70040o04286k03885J97128K41008K0200j23304n6582N3654O0991M6187
38070C01151J19650J74999L0581k34168l10204q2227J87454K26279J15715Q7531
38060F16761J07375m4849l24566l85716r0631K22951J78001j23530k51060k5005
38050a20269K86764L52313J58198o1123j41463j25039j27716j70978j71089n7893
38040a78295J27647K58544K36331Q0618q2207j16727Q646J85186K61889K00806
$$ plain form
38110 642319 528830 231163 264253 667465 1124466 1520751 1916283 2098607 1685624 763917
38100 763917 21377 23162 563953 931075 702859 136783 -183569 36271 557671 920901
38090 920901 933861 795861 768549 872851 993097 1128190 1334660 1473709 1263796 670040
38080 670040 65754 -138131 58997 300005 320205 196901 140319 193973 254964 301151
38070 301151 420801 595800 626381 392213 82009 -218 187236 413515 529230 616761
38060 616761 724136 679287 354721 -30995 -121626 101325 279326 155796 -95264 -120269
38050 -120269 166495 518808 677006 615883 474420 349381 221665 50687 -120402 -178295
38040 -178295 -50648 207896 444227 524845 442638 325911 334557 519743 781632 982438
38030I82438R8268K3222q8916k86630m17598k73203P1942K67666J26620j33869
38020C69940k30790j98440k03883j69605N5554K48193J6755m74667n21927J09028
38010i99842O89893N08223q0981k22353J06473J53289k60188l84559J67623O53791
38000C31369L23417l64649m32523J37283M77266K01161j66220j53976M0469Q9024
37990D82621L2830j4280j23971k45659j17642K36221L64417M2681l38217l58946
37980c9945j59646r0799j34338o8865Q1693J63552K08633K58139J30678k24618
37970A24484m04725p1011M05961L67283j61470m82969k37202J49845J81199j8421
37960a47026m354K97068N09830L15422j67520n13818m43633j30367P462j51529
$$ plain form
38030 982438 1080706 1103928 1015012 728382 310784 37581 109523 377189 503809 369940
38020 369940 139150 -59290 -263173 -432778 -377224 -129031 -112276 -586943 -1108870 -999842
38010 -999842 -309949 198274 117293 -105060 1413 154702 -105486 -490045 -322422 331369
38000 331369 654786 290137 -142386 -5103 472163 673324 507104 353128 393597 482621
37990 482621 515451 501171 377200 131541 13899 250120 614537 657218 319001 -39945
37980 -39945 -199591 -290390 -424728 -493593 -411900 -248348 -39715 218424 349102 124484
37970 124484 -280241 -351252 54709 421992 260522 -222447 -459649 -309804 -128605 -147026
37960 -147026 -151380 145688 655518 970940 803420 289602 -154031 -284398 -276936 -428465
37950d28465k64326k8041L45290M07378R6698k08416k08032J2462J78294J12057
37940A4899j49640l47834j85584K90930O11872M09885j00883m22339l96215k24823
37930d99732k6746K31410M33370L52924J3304l14012m58299m16622j69704K20100
37920f34007M34934K36675j05047j49191M9263R4369l4968j4943J29670M2427
37910D9182k13565j59080K01065K62164j26693k98860J13448M81244J94393l14481
37900A88817k99972Q9848J66278j22603k33681l7921N7772o5075p8343P7314M1634
37889b15932k52144l53779k4976L27582K36468j83225m42594k79377J44252M61014
37879e82711M05394N4165k16145j66395j2038p4725k49456j76332J35339K88688
$$ plain form
37950 -428465 -692791 -720832 -375542 31836 128534 -79882 -287914 -275452 -97158 14899
37940 14899 -134741 -482575 -668159 -377229 234643 644528 543645 121306 -274909 -499732
37930 -499732 -526478 -295068 138302 491226 504530 190518 -267781 -684403 -854107 -634007
37920 -634007 -199073 37602 -67445 -216636 -167373 -73004 -107972 -122915 6755 49182
37910 49182 -164383 -323463 -122398 139766 13073 -285787 -172339 308905 503298 188817
37900 188817 -111155 -21307 144971 22368 -211313 -249234 -191462 -256537 -334880 -257566 -215932
37889 -215932 -468076 -821855 -846831 -519249 -282781 -466006 -908600 -1187977 -1043725 -582711
37879 -582711 -177317 -123152 -339297 -505692 -517730 -592455 -841911 -1018243 -882904 -594216
37869e94216J25994n7855k2345J02079J45080J69193K30375K04345O3929L0211
37859C96790K11440L53961K13814m7231j32921j11149k92344o56765p59546l32734
37849a156685K65899M44812J33169j35121L1832L34318K47264j62281l25273n1684
37839c73750K03852J14183l0632N6294P5736k87783o35518l77084K66861N17868
37829d69973J92835j29849r8772n02o1503o3733R6469J13426j44468l11092j15637
37818i92799J88565K98707K92446K88606J75366j3226J8226K21056P5948m87598
37808F5297o89830m2367O98314N23050l15905o88764k44954K49927J88170j62457
37798d19519l40541l06763j54086J32627L66884J88998l15827n36652j62719L63106
$$ plain form
37869 -594216 -468222 -526077 -548422 -446343 -301263 -132070 98305 302650 366579 396790
37859 396790 608230 962191 1176005 1128774 995853 884704 592360 -64405 -823951 -1156685
37849 -1156685 -890786 -445974 -312805 -447926 -416094 -81776 165488 3207 -322066 -373750
37839 -373750 -169898 -55715 -86347 -30053 45683 -242100 -877618 -1254702 -987841 -469973
37829 -469973 -277138 -406987 -505759 -506261 -567764 -631497 -535028 -421602 -566070 -877162 -992799
37818 -992799 -804234 -505527 -213081 75525 250891 237665 255891 476947 552895 65297
37808 65297 -624533 -666900 31414 554464 238559 -450205 -695159 -445232 -257062 -419519
37798 -419519 -760060 -1066823 -1220909 -1088282 -721398 -532400 -848227 -1384879 -1547598 -1184492
37788a184492N03502L11401J44878R5995O6706R4649K20325K52095J5653l10824
37778B09888m00826k04582M9739J51226K2667k93154n76438n36451j76999J16309
37768a638621O2221j22844n7508K45418M39043L57965J80754J06732J23542J18241
37758a85057L4615j08665k34382k41439j14232L1985Q6522O2108J6487m1027q6086
37747g79171n4636J2563n0838k72020m01782k20567J39876L65326L38330J63584
37737g59335n6677k43287k47613j2863K27245J85705o3036j80220p6538k6202
37727a252821j94779l48191k02502J44875L41037K34277K9250Q401K07250L84253
37717f48950K92752j6588k14649q1669J89675K15274q4100l73864l21065K7069
$$ plain form
37788 -1184492 -680990 -369589 -224711 -128716 -62010 32639 252964 505059 520712 209888
37778 209888 -190938 -395520 -345781 -194555 -171888 -465042 -1041480 -1577931 -1754930 -1638621
37768 -1638621 -1576400 -1699244 -1756752 -1511334 -1072291 -714326 -533572 -426840 -303298 -185057
37758 -185057 -150442 -259107 -493489 -734928 -849160 -817175 -730653 -668545 -652058 -693085 -779171
37747 -779171 -833807 -821244 -872082 -1144102 -1545884 -1766451 -1626575 -1261249 -922919 -759335
37737 -759335 -816012 -1059299 -1306912 -1319775 -1092530 -906825 -969861 -1150081 -1226619 -1252821
37727 -1252821 -1447600 -1795791 -1998293 -1853418 -1512381 -1278104 -1248854 -1240453 -1033203 -648950
37717 -648950 -356198 -372786 -587435 -669104 -479429 -264155 -348255 -722119 -1043184 -1016115
37707a016115L34988L40652P7871j78186j59766J29107M00947M04344J99016Q340
37697E41198j00423j98068k44550j31893M5661P1058j1299P3656L16854L10352
37687F72546j34434n86896n38541j05844J71948Q1676j05281j49409j10795o3135
37677h68165Q1294L13036L84132J37532k03504k91215j00872Q1036Q3287N7755
37667c25684J88973L58013K84195k9639k23116o3986J93994J73967m7444p5468
37657D33805J30701J57781j70965m54178l38936r0899j29479l00154j27967L58845
37647e31446O03919L21948j51626l80129k90014l0849K51953L91222K73921M8802
37637E07701l0032o939j28743l20821k02933K56370N66178L98095J3648k25283
$$ plain form
37707 -1016115 -681127 -340475 -262604 -440790 -600556 -471449 -70502 333842 532858 541198
37697 541198 440775 242707 -1843 -133736 -88075 -17017 -28316 45340 362194 672546
37687 672546 538112 -48784 -587325 -693169 -521221 -439545 -544826 -694235 -805030 -868165
37677 -868165 -786871 -473835 -89703 47829 -155675 -446890 -547762 -466726 -383439 -325684
37667 -325684 -136711 221302 505497 475858 252742 188756 382750 556717 509273 433805
37657 433805 564506 722287 551322 97144 -241792 -332691 -462170 -762324 -890291 -531446
37647 -531446 72473 394421 242795 -137334 -427348 -458197 -206244 184978 458899 507701
37637 507701 477669 470730 341987 21166 -181767 74603 640781 1038876 1052524 827241
37627H27241l30255l81056k05438K34692N28517L49309q753r3685j0171j58448
37617G51953m93731o07813m09228j75148j7358J64008K61424O4212k24873j56659
37607h43213K22546L72718J18763q0544P7881K66179J53516j8975Q6423K74575
37597F29869J54785j74888k81107q0207R6801P4027M6730J77896L13972K32061
37587A189939l6218k65818l25367k88697k65480j99556N9072M45802N93142K34006
37577A140825l79825o94725m86777n9426J85662J36198p3327k20627q9794L07801
37567b34015N88369L95818m2883j71765M2432M0492l78707o38807k87851K31929
37557d54988K57043p7341j30328K02132M16853K69410O6632O6415J33955Q7387
$$ plain form
37627 827241 496986 115930 -89508 145184 673701 1023010 1014257 920572 910401 751953
37617 751953 258222 -349591 -758819 -933967 -951325 -787317 -525893 -461681 -686554 -843213
37607 -843213 -620667 -247949 -129186 -209730 -131849 134330 287846 268871 355294 629869
37597 629869 784654 609766 328659 248452 345253 419280 466010 643906 957878 1189939
37587 1189939 1153721 887903 562536 273839 8359 -191197 -132125 313677 906819 1140825
37577 1140825 761000 66275 -420502 -479928 -294266 -158068 -231395 -452022 -541816 -234015
37567 -234015 354354 750172 707289 535524 577956 618448 239741 -399066 -686917 -454988
37557 -454988 -197945 -275286 -405614 -203482 213371 482781 549413 615828 749783 837170
37547H37170n2785k30086l90981l52020k5830K51380Q4219l04381l01759J39444
37537c45629L85020J23285j52705J3793L13712K46824n6822j44185k0091k8236
37527C34966j66811j16104J39143K63082J42940K5798M7291P4555P6649J97651
37517A019160L53849K21184j86118l70501o7533K88520J83741k17135l77737k18432
37507F28998j17649j94776j55686R2763K14487K8085j48341l4436J20743l1256
37497D02932l15432k98199j10J39515m1206k29208j79304l0144M1067J07255K60177
37486a42657L87202L59475K08679j5067l09099n23541m04655o844K42235J05000
37476i9272j33244j42366m5758j09914k12446l7546L60494O00141N01736K28061
$$ plain form
37547 837170 784385 554299 163318 -188702 -214532 36848 121067 -183314 -485073 -345629
37537 -345629 39391 162676 9971 23764 337476 584300 527478 383293 363202 334966
37527 334966 168155 52051 191194 454276 597216 623014 670305 744860 821509 1019160
37517 1019160 1373009 1594193 1408075 1037574 970041 1258561 1442302 1225167 847430 628998
37507 628998 511349 316573 160887 253650 468137 496222 347881 313445 434188 402932
37497 402932 87500 -210699 -210809 -71294 -112500 -341708 -521012 -551156 -510089 -402834 -142657
37486 -142657 244545 604020 812699 797632 488533 -35008 -439663 -446507 -204272 -99272
37476 -99272 -232516 -374882 -420640 -530554 -743000 -780546 -420052 180089 681825 909886
37466I09886k8220j74815j27037P7427J51068j05441m07504l05185J39391L88121
37456E17691J59915k47005m23725l00799n1298J54707K09834J21573M9440R4752
37446B85085J08115n4169k10671j30544J4577p9507k40306l5944M17573M94217
37436E68426K1698m09188l25690L243J15848J2785p4901j13042j06082P1658L42356
37425A07111L37086q138k09742R388J85884j51870o24604m96102K27562Q08189
37415A84764P63976L18203o9496j67980k1350J06682p9561m92377o30468k60435
37405c48042J76297K20519Q8817J94328L50030J28517k66831k77715J2850p066
37395B71704l90276m99839q1112L40002L45518J70279R2635j0070j72043q2686
$$ plain form
37466 909886 881666 706851 579814 657241 808309 702868 295364 -9821 129570 517691
37456 517691 677606 430601 6876 -293923 -345221 -190514 19320 140893 190333 285085
37446 285085 393200 339031 128360 -2184 12393 -67114 -307420 -343364 74209 568426
37436 568426 590124 180936 -144754 -141511 -25663 -12878 -87779 -200821 -306903 -235245 107111
37425 107111 444197 436059 226317 235705 421589 269719 -354885 -850987 -623425 184764
37415 184764 948740 1266943 1197447 1029467 1008117 1114799 1035238 542861 -87607 -348042
37405 -348042 -171745 48774 137591 331919 681949 810466 543635 265920 278770 271704
37395 271704 -118572 -618411 -699523 -359521 -14003 156276 248911 238841 66798 -15888
37385a5888K89214M38159J17341j97888j08787L0477k00254m60942k03322L39077
37375B7187M54199L5248l29854k65169N321J59458J48961N5894q282J06150L31042
37364G20155K49663l35250q63346o16794K13627P00050M58292Q4183J22975K78937
37354A012492M6745m12484n55210k81536M4727K10275K98148L08433R7848k59235
37344E10203m13074j56685L18494O51019O28951K81701j53963l59816k33802o3561
37334A009467j79169m41124l77427J06319N11191M30341J13530L5573J74436J42558
37324A525695j17056k53229j18279J6215l7799r7639q441O0958l7137j35039p8841
37313G19408k9757j23904j53188L7259J52042p7749l00124j6702N30061O24053
$$ plain form
37385 -15888 273326 711485 828826 630938 522151 552628 352374 -108568 -311890 27187
37375 27187 481386 516634 186780 -78389 -73068 86390 235351 291245 282963 389113 720155
37364 720155 969818 634568 -228778 -845572 -631945 68105 526397 610580 733555 1012492
37354 1012492 1059237 646753 91543 -189993 -145266 65009 363157 671590 769438 510203
37344 510203 97129 -59556 258938 909957 1538908 1820609 1666646 1306830 1073028 1009467
37334 1009467 830298 389174 11747 118066 629257 1059598 1173128 1208701 1383137 1525695
37324 1525695 1408639 1155410 1037131 1053346 1015547 917908 909467 970425 933288 798249 719408
37313 719408 689651 565747 412559 449818 601860 524111 223987 207285 737346 1361399
37303A361399J78279j58923q1375l2995k78964l48506J05259N53253L63267j57526
37293A503168k47086R3007J78777j70145l63634q1992J77470p2722n23583n56354
37283f3094j30457K68148L27743J40618j14449l11862k74610P0682M23091L69579
37273G05389n161j50470J45776L84518J13301k99434j82774L26824L85210k55121
37263A168058p57806m10026K94719M09245n8981k86477R597K30199j4496l21355
37253B62677l04404k37278m13986m95946j06040L89945L79403q393j02018K59276
37243c76764N37218L60389j5600k13032j98295j00620J5805L8357j75107m91947
37233f19596n28462j59240K54532L28543J37006M4563K03933L96894L18132p9712
$$ plain form
37303 1361399 1539678 1380755 1299380 1266385 987421 638915 744174 1297427 1660694 1503168
37293 1503168 1256082 1349089 1527866 1357721 994087 912095 1089565 1016843 493260 -63094
37283 -63094 -193551 74597 402340 542958 428509 116647 -157963 -87281 335810 705389
37273 705389 700228 549758 695534 1080052 1193353 893919 711145 1037969 1423179 1168058
37263 1168058 410252 226 294945 704190 645209 358732 368329 598528 584032 262677
37253 262677 -41727 -279005 -692991 -1188937 -1294977 -905032 -525629 -534022 -636040 -376764
37243 -376764 160454 520843 505243 292211 93916 -6704 9101 47458 -127649 -619596
37233 -619596 -1148058 -1307298 -1052766 -724223 -587217 -542654 -338721 58173 376305 296593
37223B96593n06960o06861l41893l0312P6553R3576K17456L45231K68364R4936
37213i3317J01599K33923J64842j38795l24357k11173m6740p0190j83038k24732
37203g91978k34691k33194n8819L21482O01723N08855J84979n3815j52001k37397
37193a44856k71401r9788J95792K88794J2176l95925n25305k15487K77440N27497
37183c51063L69076M8498j06603p6090o2100j17610j08120n747O4433Q4416J53605
37172a07305K08515O3509k03834k75276j07742j9487r5042K8421M83683P50681
37162G26123L70689k82809n05911k93490k42966n29477o44040k60628K33676L50468
37152a078365J91746J69448L31904L75927K02655O6466J24330J49828j16364n03747
$$ plain form
37223 296593 -210367 -817228 -1159121 -1189433 -1112880 -1019304 -801848 -456617 -188253 -93317
37213 -93317 8282 242205 407047 268252 -56105 -267278 -314018 -384208 -567246 -791978
37203 -791978 -1026669 -1259863 -1318682 -997200 -395477 113378 298357 244542 92541 -144856
37193 -144856 -416257 -516045 -320253 -31459 -19283 -415208 -940513 -1156000 -878560 -351063
37183 -351063 18013 66511 -40092 -116182 -178282 -295892 -404012 -409759 -345326 -260910 -107305
37172 -107305 101210 164719 -39115 -314391 -422133 -441620 -536662 -508241 -24558 726123
37162 726123 1096812 814003 308092 14602 -228364 -757841 -1401881 -1662509 -1428833 -1078365
37152 -1078365 -886619 -717171 -385267 -9340 193315 259781 384111 533939 417575 -86172
37142h6172n67204k01378J70184J65682k6974K7307L11591L77751O2496k45628
37132a2345j93175O7972K12376K03317J60734P0115p9051j28901l0392k2273k15518
37121C2859k94019k1886K46761O3005l44290l70729J7993K58300Q8443j36291
37111d59854j13554m123j503J26Q6715J02410k8025j22987q5325o7362j23222
37100h16704o5932J46682K64481J86568J65296L38294M37308K23399j48124m49951
37090B81317o82778p82955m76885J98813O61497N26988K06149K41285M17245J77910
37080G68586l42193m60563m8408K59162O0140k72188k71854m7871M5662j1619
37070c21146m893J05977J78542J36141J8240j03885j48731q7875l5073j07164
$$ plain form
37142 -86172 -653376 -854754 -684570 -518888 -545862 -518555 -206964 170787 233283 -12345
37132 -12345 -205520 -137548 74828 278145 438879 508994 429943 301042 270650 248377 32859
37121 32859 -261160 -283046 -36285 26720 -317570 -688299 -670306 -412006 -323563 -459854
37111 -459854 -573408 -577531 -579034 -578908 -492193 -389783 -417808 -540795 -626120 -693482 -816704
37100 -816704 -882636 -735954 -471473 -284905 -119609 218685 655993 879392 731268 281317
37090 281317 -401461 -1184416 -1661301 -1462488 -800991 -274003 -67854 173431 590676 768586
37080 768586 426393 -34170 -82578 176584 236724 -35464 -307318 -355189 -309527 -321146
37070 -321146 -326039 -220062 -41520 94621 112861 8976 -139755 -227630 -262703 -369867
37060c69867j90734p9658J43074J57336r3314k69298j35949R8124J23602l5179
37050f51863j23005j263K65409M94149M45444J9854m93685o24700l13432q313
37040i91405j0745p5734P3740K11325O522l18878k53419K00394M95760L23272
37030c39168l2729k00923j79251j35824r2790j1390M1884O625m1260k028J20662
37019h66192K68954L68069K85585n2457m47580n43711k56236J02243K28362J68791
37009g44172J31057J47835J07570j2785j20941j40238m9334J27130K82860K93039
36999B2021J83604R7065L2350j63300m31706m18660L218L82923K32992k27555
36989b87048l12403J61498N94121M35597r0801l71146k36315n7854j10685k09701
$$ plain form
37060 -369867 -560601 -640259 -497185 -339849 -433163 -702461 -838410 -740286 -616684 -651863
37050 -651863 -774868 -776131 -510722 -16573 428871 448725 -44960 -669660 -983092 -991405
37040 -991405 -1002150 -1077884 -1004144 -792819 -786297 -1105175 -1358594 -1158200 -662440 -339168
37030 -339168 -371897 -572820 -752071 -887895 -980685 -992075 -950191 -943566 -984826 -986854 -866192
37019 -866192 -597238 -229169 56416 3959 -443621 -987332 -1243568 -1141325 -912963 -744172
37009 -744172 -613115 -465280 -357710 -370495 -491436 -631674 -681008 -553878 -271018 22021
36999 22021 205625 302690 335040 171740 -259966 -678626 -675408 -292485 -59493 -287048
36989 -287048 -599451 -437953 156168 591765 500964 129818 -106497 -164351 -275036 -484737
36979d84737p7036J89947K41559j5673k66490k10172M4838J81504J57874K24669
36969a3717M48715N20100J94202l11489n92486n55807l87299j73706J11664L17111
36959d42712J81205k43658n39780m10759m412L27105L84632J87263q8607j66850
36949h16573R7043M64970N33511K66121K7655J1580r446j98749l17509j63068
36939a04465J2105q1940k18637l327L98931M32861L4745j95423J40848O36961
36929A052659O11711j6558o52930p13687k14314K90756K84754j66311m81392k63961
36919b69273J78213K28532k02927n60465l98996O7792L26221K08027l1256j04982
36909e59114M6254K91419M25115K98410l0482l02665l02681p3108J53670J90526
$$ plain form
36979 -484737 -561773 -371826 -130267 -145940 -412430 -622602 -577764 -396260 -238386 -13717
36969 -13717 434998 955098 1149300 837811 245325 -310482 -697781 -871487 -759823 -442712
36959 -442712 -261507 -505165 -1044945 -1455704 -1460116 -1133011 -748379 -561116 -649723 -816573
36949 -816573 -719530 -254560 278951 545072 572727 584307 574861 376112 58603 -104465
36939 -104465 -92360 -174300 -392937 -396264 2667 435528 470273 274850 415698 1052659
36929 1052659 1664370 1647812 994882 281195 66881 357637 642391 476080 -5312 -269273
36919 -269273 -91060 137472 -65455 -625920 -1024916 -957124 -630903 -422876 -454132 -559114
36909 -559114 -512860 -221441 203674 502084 471602 168937 -133744 -206852 -53182 137344
36899A37344M4731j01296n5163J62663K89276J25968j72351k81009j37448L2889
36889D5604J04896J80565K74571J95828r8276l17026k37934o9902j45909m07920
36879d75503m84209k10938J72946L38613J94876q2831k16823n4484K60725M00333
36869a57295K15114j08016l23601l91018l39241r5574L09824N50454L38024j28150
36859a29479l66465k52702j40054k86199m55790k53675L17240Q01738P62649K37088
36849B34351k84513l60542p0912J24855R891j43777o7615O8867M324r7482Q9969
36838d92584M22100M15947P871l25792k98902j75419k13389k21227K5246L04837
36828e51312K66927l0480k56122k90497k46844j68566l0065Q5220J08101J61562
$$ plain form
36899 137344 182075 80779 25616 188279 477555 603523 431172 150163 12715 45604
36889 45604 150500 331065 605636 801464 703188 386162 148228 78326 -67583 -475503
36879 -475503 -959712 -1170650 -997704 -659091 -464215 -547046 -763869 -818353 -557628 -157295
36869 -157295 57819 -50197 -373798 -764816 -1104057 -1199631 -889807 -339353 -1329 -129479
36859 -129479 -495944 -748646 -888700 -1174899 -1630689 -1884364 -1567124 -765386 -2737 234351
36849 234351 -50162 -410704 -481616 -356761 -346870 -490647 -558262 -489395 -485071 -582553 -492584
36838 -492584 -70484 345463 353334 27542 -271360 -446779 -660168 -881395 -856149 -551312
36828 -551312 -284385 -314865 -570987 -861484 -1108328 -1276894 -1306959 -1221739 -1113638 -952076
36818i52076L22551L59773O5701k79283k03864K37192M92806L00326r549j05750
36808B27827j04371k08793l10877k55925j72924j89952j03841K49382N16593K33506
36798a19375l74453n55317q5219L74928K37286j61749j09897L70731N26542k4726
36788G8751p05908p21632p1661M89742L95654j18294l89499j33378K82329L51338
36778e42558O5344j23387L7224K18294r889m79859n66844n7848M91006M76467
36768d92050L6248k14189n6779J30175L9707j15164j701K83132L52294R1968j92916
36757a39275k03582q384J04801J0212j44157j71896p6328O931K2805M8650J38124
36746d12099K25153K37992K19193K42981K67775J67441j07063m57243p01340o79256
$$ plain form
36818 -952076 -629525 -269752 -204051 -483334 -687198 -450006 42800 343126 333577 227827
36808 227827 123456 -85337 -396214 -652139 -825063 -1015015 -1118856 -869474 -352881 -119375
36798 -119375 -493828 -1049145 -1134364 -759436 -522150 -683899 -793796 -423065 103477 78751
36788 78751 -627157 -1348789 -1420450 -930708 -535054 -653348 -1042847 -1176225 -893896 -542558
36778 -542558 -477214 -600601 -563377 -345083 -354972 -834831 -1401675 -1459523 -968517 -492050
36768 -492050 -455802 -669991 -726770 -596595 -556888 -672052 -673753 -390621 -38327 53641 -139275
36757 -139275 -342857 -351241 -246440 -236228 -380385 -552281 -628609 -621678 -598873 -550223 -412099
36746 -412099 -186946 51046 270239 513220 780995 948436 841373 384130 -317210 -996466
36736i96466l74815Q111J95287J50761J08515J90096J82855q4626l37652j82981
36726a140915K43453L84899P1150k17159p0885K60705L04430O8150p6657j8567
36716a91396J6315n9729o5832N0951O8176j08276k01236L3036L60564L37224m2464
36705A97333k83912p1699K65148K15170j47957k34665J85682N82203L86288k04091
36695H89500n42905m45508k68845j70865Q9638M97223N64014J05487l14227j83395
36685B20117J59555J02221k27339k18716J53706K96399J9922j75492l607J44819
36675D71585l5316j87529N0911L43418J83744k30610k87210O7660K72886M6720
36665F96259k32415j53072J79367M02801L63363J28862j87032m15482l67011p9037
$$ plain form
36736 -996466 -1371281 -1363170 -1167883 -1017122 -908607 -718511 -535656 -620282 -957934 -1140915
36726 -1140915 -897462 -512563 -441413 -658572 -729457 -468752 -164322 -96172 -172829 -191396
36716 -191396 -175081 -234810 -300642 -249691 -181515 -289791 -491027 -457991 -97427 239797 197333
36705 197333 -86579 -158278 106870 322040 174083 -60582 125100 707303 1093591 889500
36695 889500 346595 -98913 -367758 -538623 -448985 48238 612252 717739 403512 220117
36685 220117 379672 481893 254554 35838 189544 485943 505865 330373 326766 471585
36675 471585 436269 248740 299651 643069 826813 596203 308993 376653 649539 696259
36665 696259 463844 310772 490139 892940 1256303 1385165 1198133 782651 415640 336603
36655C36603J32823N2454j52803k06636j33410j56533k83105k74770m3684J88756
36645e40305K26677J77424K36971L54980L19848J02310r9785j55585j47444j85554
36635B89537k47178k61573j98739r223L41226O72662O36908J58284l37825l84878
36625F59201n0368K18108K29214J93349K43170J87537j25656n02666o47246n05974
36615a01331k23739M4511J43480k5513k78113k19255K18079N31201K59116l30317
36605A8119n39766j63619K80789K89331k2321k06401j05598M9367M1378o2996
36595d21717p2560K4264L1155j40365k33518O3803N68961O48888L6381o59567
$$ plain form
36655 336603 469426 521880 369077 162441 29031 -127502 -410607 -685377 -729061 -540305
36645 -540305 -313628 -136204 100767 455747 775595 877905 778120 622535 475091 289537
36635 289537 42359 -219214 -417953 -427176 -85950 586712 1223620 1381904 1044079 659201
36625 659201 608833 826941 1056155 1249504 1492674 1680211 1554555 1051889 404643 -101331
36615 -101331 -325070 -280559 -137079 -162592 -440705 -659960 -441881 89320 348436 18119
36605 18119 -521647 -685266 -404477 -115146 -137467 -343868 -449466 -400099 -358721 -421717
36595 -421717 -494277 -470013 -438858 -579223 -812741 -748938 -179977 468911 505292 -154275
$$ [...]
##END NTUPLES=NMR SPECTRUM
##END=
