##TITLE=31Pdec_LR-675-C-2-3-6
 CDCl3, 24 sc
 30.5.2019
##JCAMPDX= 6.0         $$ Bruker NMR JCAMP-DX V2.0
##DATA TYPE= NMR SPECTRUM
##DATA CLASS= NTUPLES
##ORIGIN= UXNMR, Bruker Analytische Messtechnik GmbH
##OWNER= root
$$ XWIN-NMR		Version 3.5
$$ Thu May 30 13:35:11 2019 Russian Standard Time (UT+4h)  she@DPX200
##.OBSERVE FREQUENCY= 81.013821
##.OBSERVE NUCLEUS= ^31P
##.ACQUISITION MODE= SIMULTANEOUS
##.ACQUISITION SCHEME= undefined
##.AVERAGES= 24
##.DIGITISER RES= 17
##SPECTROMETER/DATA SYSTEM= spect
##.PULSE SEQUENCE= zgpg30
##.SOLVENT NAME= CDCl3
##.SHIFT REFERENCE= (INTERNAL, CDCl3, 0, 182.463)
##AUDIT TRAIL= $$ (NUMBER, WHEN, WHO, WHERE, WHAT)
$$ ##TITLE= Audit trail, XWIN-NMR		Version 3.5
$$ ##JCAMPDX= 5.01
$$ ##ORIGIN= Bruker BioSpin GmbH
$$ ##OWNER= she
$$ F:/spectra/data/she/nmr/P31/1/pdata/1/auditp.txt
$$ ##AUDIT TRAIL=  $$ (NUMBER, WHEN, WHO, WHERE, WHAT)
(   1,<2019-05-30 13:34:05.81 +0400>,<she>,<DPX200>,
      <created by zg, POWCHK disabled, PULCHK disabled
       configuration hash MD5:
       00 E9 B6 7A A2 85 ED C7 34 08 36 98 17 FE 4E 26
       data hash MD5: 32K
       E6 50 CE C1 C0 A2 D8 A6 13 66 6E EC D0 71 4E B8>)
(   2,<2019-05-30 13:34:08.76 +0400>,<she>,<DPX200>,
      <Start of raw data processing
       efp BC_mod = 2 LB = 1 FT_mod = 6 PKNL = 1 PHC0 = -2143.148 PHC1 = -3.800903 SI = 64K 
       data hash MD5: 64K
       C4 DB C8 22 EC EE AB 0D DB C6 4F DF D4 A9 C6 C9>)
(   3,<2019-05-30 13:34:26.76 +0400>,<she>,<DPX200>,
      <pk PHC0 = -31.94983 PHC1 = 75.6 
       data hash MD5: 64K
       2C FA FA E2 D8 2B 70 43 9B A6 9C BC 09 9A 7F D3>)
(   4,<2019-05-30 13:34:30.07 +0400>,<she>,<DPX200>,
      <abs ABSG = 5 
       data hash MD5: 64K
       FE F7 5A D3 B5 F4 39 9C F7 5B 81 F0 F3 CC 97 54>)
$$ ##END=
$$ 
$$ hash MD5
$$ 5A 4E 57 3C 08 1D 0F C1 1B 4A BE CE 0B 31 00 23
##$RELAX= 
##$RELAX= 
##$RELAX= 
##$RELAX= 
##$RELAX= 
##$RELAX= 
##$RELAX= 
##$RELAX= 
$$ Bruker specific parameters
$$ --------------------------
##$DU= <F:/spectra>
##$EXPNO= 1
##$NAME= <P31>
##$PROCNO= 1
##$TYPE= <nmr>
##$USER= <she>
##$AMP= (0..31)
100 100 100 100 100 100 100 100 100 100 100 100 100 100 100 100 100 100 
100 100 100 100 100 100 100 100 100 100 100 100 100 100 
##$AQSEQ= 0
##$AQ_mod= 1
##$AUNM= <au_zg>
##$AUTOPOS= <>
##$BF1= 81.014009
##$BF2= 200.13
##$BF3= 200.13
##$BF4= 200.13
##$BF5= 200.13
##$BF6= 200.13
##$BF7= 200.13
##$BF8= 200.13
##$BYTORDA= 1
##$CFDGTYP= 0
##$CFRGTYP= 5
##$CHEMSTR= <none>
##$CNST= (0..31)
1 1 145 1 1 1 1 1 1 1 1 1 1 1 1 1 1 1 1 1 1 1 1 1 1 1 1 1 1 1 1 1 
##$CPDPRG= <waltz16>
##$CPDPRG1= <>
##$CPDPRG2= <waltz16>
##$CPDPRG3= <>
##$CPDPRG4= <mlev>
##$CPDPRG5= <mlev>
##$CPDPRG6= <mlev>
##$CPDPRG7= <mlev>
##$CPDPRG8= <mlev>
##$CPDPRGB= <>
##$CPDPRGT= <>
##$D= (0..31)
0 1 0 0 0 0 0 0 0 0 0 0.03 2e-05 3e-06 0 0 0 0 0 0 0 0 0 0 0 0 0 0 0 0 
0 0 
##$DATE= 1559208845
##$DBL= (0..7)
120 120 120 11 120 120 24 19 
##$DBP= (0..7)
150 150 150 150 150 150 150 150 
##$DBP07= 0
##$DBPNAM0= <>
##$DBPNAM1= <>
$$ [...]
##$SUBNAM3= <"">
##$SUBNAM4= <"">
##$SUBNAM5= <"">
##$SUBNAM6= <"">
##$SUBNAM7= <"">
##$SUBNAM8= <"">
##$SUBNAM9= <"">
##$SW= 369.568048894756
##$SWIBOX= (0..15)
0 1 3 0 0 0 0 0 0 0 0 0 0 0 0 0 
##$SW_h= 29940.119760479
##$TD= 32768
##$TD0= 1
##$TE= 0
##$TE2= 300
##$TE3= 300
##$TEG= 300
##$TL= (0..7)
0 120 53 12 22 120 120 120 
##$TP= (0..7)
150 150 150 150 150 150 150 150 
##$TP07= 0
##$TPNAME0= <>
##$TPNAME1= <>
##$TPNAME2= <>
##$TPNAME3= <>
##$TPNAME4= <>
##$TPNAME5= <>
##$TPNAME6= <>
##$TPNAME7= <>
##$TPOAL= (0..7)
0.5 0.5 0.5 0.5 0.5 0.5 0.5 0.5 
##$TPOFFS= (0..7)
0 0 0 0 0 0 0 0 
##$TUNHIN= 0
##$TUNHOUT= 0
##$TUNXOUT= 0
##$USERA1= <user>
##$USERA2= <user>
##$USERA3= <user>
##$USERA4= <user>
##$USERA5= <user>
##$V9= 5
##$VALIST= <valist>
##$VCLIST= <CCCCCCCCCCCCCCC>
##$VD= 0
##$VDLIST= <DDDDDDDDDDDDDDD>
##$VPLIST= <PPPPPPPPPPPPPPP>
##$VTLIST= <TTTTTTTTTTTTTTT>
##$WBST= 1024
##$WBSW= 4
##$XGAIN= (0..3)
0 0 0 0 
##$XL= 0
##$YL= 0
##$YMAX_a= 171131
##$YMIN_a= -199998
##$ZGOPTNS= <>
##$ZL1= 120
##$ZL2= 120
##$ZL3= 120
##$ZL4= 120
##$ABSF1= 182.463
##$ABSF2= -187.1042
##$ABSG= 5
##$ABSL= 3
##$ALPHA= 0
##$AQORDER= 0
##$ASSFAC= 0
##$ASSFACI= 0
##$ASSFACX= 0
##$ASSWID= 0
##$AUNMP= <proc_1d>
##$AZFE= 0.1
##$AZFW= 0.5
##$BCFW= 0
##$BC_mod= 2
##$BYTORDP= 0
##$COROFFS= 0
##$CY= -3
##$DATMOD= 1
##$DC= 0
##$DFILT= <>
##$DTYPP= 0
##$F1P= 0
##$F2P= 0
##$FCOR= 1
##$FTSIZE= 65536
##$FT_mod= 6
##$GAMMA= 0
##$GB= 0
##$INTBC= 1
##$INTSCL= 5.30512e-09
##$ISEN= 30
##$LB= 1
##$LEV0= 0
##$LPBIN= 0
##$MAXI= 10000
##$MC2= 0
##$MEAN= 0
##$ME_mod= 0
##$MI= 50
##$NCOEF= 0
##$NC_proc= -4
##$NLEV= 6
##$NOISF1= 182.463
##$NOISF2= 159.3651
##$NSP= 0
##$NTH_PI= 0
##$NZP= 0
##$OFFSET= 182.463
##$PC= 4
##$PHC0= -2175.098
##$PHC1= 71.7991
##$PH_mod= 1
##$PKNL= yes
##$PPARMOD= 0
##$PSCAL= 0
##$PSIGN= 0
##$REVERSE= no
##$SF= 81.0140089999434
##$SI= 65536
##$SIGF1= 159.3651
##$SIGF2= -187.1042
##$SINO= 113.3802
##$SIOLD= 16384
##$SREGLST= <1H.CDCl3>
##$SSB= 0
##$STSI= 65536
##$STSR= 0
##$SW_p= 29940.119760479
##$SYMM= 0
##$S_DEV= 0
##$TDeff= 32768
##$TDoff= 0
##$TI= <>
##$TILT= no
##$TM1= 0
##$TM2= 0
##$TOPLEV= 0
##$USERP1= <user>
##$USERP2= <user>
##$USERP3= <user>
##$USERP4= <user>
##$USERP5= <user>
##$WDW= 1
##$XDIM= 65536
##$YMAX_p= 425714748
##$YMIN_p= -4098976
$$ End of Bruker specific parameters
$$ ---------------------------------
##NTUPLES= NMR SPECTRUM
##VAR_NAME=  FREQUENCY,     SPECTRUM/REAL,   SPECTRUM/IMAG
##SYMBOL=    X,             R,               I
##VAR_TYPE=  INDEPENDENT,   DEPENDENT,       DEPENDENT
##VAR_FORM=  AFFN,          ASDF,            ASDF
##VAR_DIM=   65536,         65536,           65536
##UNITS=     HZ,            ARBITRARY UNITS, ARBITRARY UNITS
##FACTOR=    0.456856943014862, 1,           1
##FIRST=     14782.0589164792, 0,            0
##LAST=      -15158.0608439998, 0,           0
##MIN=       -15158.0608439998, -4098976,    0
##MAX=       14782.0589164792, 425714748,    0
$$ Real data points
##PAGE= N=1
##DATA TABLE= (X++(R..R)), XYDATA
$$ [...]
42554f91164L15429K1887j21304J0690O2043n8851k8333K31019L36019Q1203j89303
42543c0665j07809J71444K36497L408k29485k08982k344J36650N5377j66931l30373
42532d73213l13320j41821Q0081K18173J44406j10124k71017j08897J93756K35775
42522e46201j8339j81763n7067P9900j8599j78591j71200j10040j65280k04299
42512a571479o6221R3325Q7973N3076J50416K14959Q9648l892J19260J56904j66933
42501h42964m58891k01326K97619K82498k20686m01697L3451M11729K12700j36203
42491a023770k9891L57458M26009O1097l25850m26808k77262k3907J97858K55245
42481h09821J41641J7936k7125j01667k53528k99154r7176J98883L58431L71585
$$ plain form
42554 -691164 -375735 -353848 -475152 -464462 -402419 -461270 -489603 -258584 77435 158638 -30665
42543 -30665 -138474 32970 269467 272875 43390 -165592 -167936 -31286 24091 -142840 -473213
42532 -473213 -786533 -928354 -848273 -630100 -485694 -595818 -866835 -975732 -781976 -546201
42522 -546201 -564540 -746303 -803370 -723470 -742069 -920660 -1091860 -1201900 -1367180 -1571479
42512 -1571479 -1637700 -1544375 -1456402 -1403326 -1252910 -1037951 -948303 -952195 -832935 -676031 -842964
42501 -842964 -1301855 -1503181 -1205562 -923064 -1143750 -1545447 -1511996 -1100267 -887567 -1023770
42491 -1023770 -1053661 -696203 -270194 -209097 -534947 -961755 -1239017 -1262924 -1065066 -809821
42481 -809821 -668180 -650244 -677369 -779036 -1032564 -1331718 -1428894 -1230011 -871580 -499995
42471d99995L39752K45544N0770j16753j05877P467J1223j41100k71171j98912
42461f79052P0529L53132M21610J86902j98933m49970l77738j6401M08714N90164
42451C08957L52519j14508l74695k58168q4787j62499k89551j04999K56542L29756
42441a41433N6841j44297o3462N5764L6478L2957J18080P6687j74894l70881l12604
42430h30764j36071J2190J74771K94649J72643q8163q1927K12254K79079p1661
42420f3000k77215P4288M74718K59556l16528n03562k33766p7731k04063k19189
42410a086492l2198m8595l34455l49536J55793O12261M46321m9913j73420J62958
42400f97276L86085J36787k87884m31131k58509o4964p198L3794J63463K70701
$$ plain form
42471 -499995 -160243 85301 136071 19318 -86559 -79092 -67869 -208969 -480140 -679052
42461 -679052 -608523 -255391 166219 353121 154188 -295782 -673520 -689921 -281207 308957
42451 308957 661476 546968 172273 -85895 -170682 -333181 -622732 -727731 -471189 -141433
42441 -141433 -84592 -228889 -292351 -236587 -200109 -167152 -49072 27615 -147279 -518160 -830764
42430 -830764 -966835 -954645 -779874 -485225 -312582 -400745 -482672 -270418 8661 -63000
42420 -63000 -340215 -265927 208791 468347 151819 -351743 -585509 -663240 -867303 -1086492
42410 -1086492 -1118690 -1167285 -1501740 -1851276 -1695483 -1083222 -636901 -686814 -860234 -697276
42400 -697276 -311191 -174404 -462288 -893419 -1151928 -1216892 -1224090 -1190296 -1026833 -756132
42390g56132K19010R2767O7522J09772M1891j04219q0101J59828L24036K16661
42380B91035K4688k7165l2272j49392k50334j50137J5999J3187n7397N5283K48138
42369a8367J94782o1957j28095P0772J16718k16796n31548l60038J42357M18299
42359c73873K58950k9181j61433k11020k99593k74136J4427K77978N7555n13203
42349a253529o53526M3728Q85879Q82255Q6950m87467k95717J09175R8199q8335
42339f72388Q3801M61604M57273l200m13008m46004k54009o1335P9288J44723
42329f23255J24282J13989J52267Q7069j31556k59168j72379j58229l71432l79333
42319a617745J69318P64260O56146K5194k89556r8852p654k48754l18230L5138
$$ plain form
42390 -756132 -537122 -444355 -376833 -267061 -225170 -329389 -409490 -249662 74374 291035
42380 291035 315723 288558 256286 106894 -143440 -293577 -277578 -264391 -321788 -266505 -18367
42369 -18367 176415 114458 -13637 57135 173853 -42943 -574491 -934529 -792172 -373873
42359 -373873 -114923 -144104 -305537 -516557 -816150 -1090286 -1075859 -797881 -740326 -1253529
42349 -1253529 -1907055 -1863327 -977448 -95193 -8243 -495710 -791427 -682252 -584053 -672388
42339 -672388 -588587 -126983 330290 327090 -85918 -531922 -785931 -847266 -767978 -623255
42329 -623255 -498973 -384984 -232717 -145648 -277204 -536372 -708751 -866980 -1238412 -1617745
42319 -1617745 -1448427 -684167 -28021 -2827 -292383 -391235 -398889 -647643 -965873 -930735
42309i30735L52900L19206K59229L99661L86328k896l47063k85204j16321j79870
42299a44765k19121P0116L79672K87716k0622j30976j06535k18282l27295j57505
42289e87597J07440J07237n6705l3618J54950K42114K15385J60509r2246n73293
42279c55824p50589k10683M99529N05142r1221l81305n6721K62160J82254J03018
42269b94240L44226N23381K31100k98223o14403o37989m51198j4966N01737N97600
42259a12975J17835l43759k15107K18287K70502j18075l83428k31415L8333J08500
42249f51302M9026L5967N6245N3863P9193J19944J1083k91919n12725l50723R0803
42238a310545L87772L14885Q5649J142N3455N0421j6810k328O0231j7402j81218
$$ plain form
42309 -930735 -577835 -258629 600 400261 786589 783693 436630 151426 35105 -144765
42299 -144765 -363886 -293770 85902 373618 352996 222020 115485 -102797 -430092 -587597
42289 -587597 -480157 -372920 -429625 -463243 -308293 -66179 149206 309715 217469 -355824
42279 -355824 -1106413 -1317096 -817567 -312425 -403646 -784951 -841672 -579512 -397258 -294240
42269 -294240 49986 573367 804467 506244 -108159 -746148 -1197346 -1212312 -710575 -112975
42259 -112975 4860 -338899 -554006 -335719 -65217 -183292 -566720 -798135 -759802 -651302
42249 -651302 -602276 -566309 -510064 -456201 -377008 -257064 -245981 -537900 -1050625 -1401348 -1310545
42238 -1310545 -922773 -607888 -522239 -521097 -467642 -417221 -434031 -436359 -376128 -393530 -574748
42227e74748j27942J60170K50995r9223m83650l91126N2367L11275K01780k9727
42217g29829k12410l22956j87571K98524P08294M89010j22303k84869J77676M32773
42207B46339q7129p72179p50663j53336K24718J47252O6910K02140K35054j4772
42197f55666k45840j96863m2907l3488q2920J6968K02961K19932j414k42814k66749
42186a328800p9820R8232R6181j9542n4734N0554J69870J88968J18109j959j29806
42175h92747j32728J05003M06445L95451Q685l45591l30636j20626n2607j02542
42165a061893l9628J05018J16668K7318P1352K49166K98073J06656j57580l41734
42155f26584m28555l65300r2701K24079L11021J90530J64903L21621L75639J36661
$$ plain form
42227 -574748 -702690 -542520 -291525 -390748 -874398 -1265524 -1213157 -901882 -700102 -729829
42217 -729829 -942239 -1265195 -1452766 -1154242 -445948 43062 -79241 -364110 -186434 246339
42207 246339 159210 -612969 -1363632 -1516968 -1292250 -1144998 -1078088 -875948 -640894 -655666
42197 -655666 -901506 -1098369 -1141276 -1174764 -1257684 -1240716 -1037755 -817823 -819237 -1062051 -1328800
42186 -1328800 -1408620 -1310388 -1214207 -1233749 -1288483 -1237929 -1068059 -879091 -760982 -762941 -892747
42175 -892747 -1025475 -920472 -514027 -118576 -109891 -455482 -786118 -906744 -959351 -1061893
42165 -1061893 -1101521 -996503 -879835 -852517 -781165 -531999 -233926 -127270 -284850 -626584
42155 -626584 -1055139 -1420439 -1513140 -1289061 -978040 -787510 -622607 -300986 74653 211314
42145B11314j61439j90441K6706J94285J29163q7668k55789k53303j48806j25259
42135f61237k10361j67346J59300M93637M29003L4093k15008j33098l0572j08169
42125d09758j17748J16862K79917O0926k56876j79369K16472L69989N0059l58874
42115b28400m23147j48560J81765L60112L29548J34869p5352j41759p1516j8783
42105a01223o5585j42913j75971j70433j37992o6297J4674M0102j3620j40278
42095i59536l32757m87157l81264N2530N04060N82746L17481R8681J17150J66538
42085c21528P7521J1051J21153K06078q572l93748n29514k54349J43146K93161
42075f55601J21974j57514k83624j53662Q9690J77237K2034j26303J7460L50551
$$ plain form
42145 211314 49875 -140566 -113860 80425 209588 121920 -133869 -387172 -535978 -661237
42135 -661237 -871598 -1038944 -879644 -386007 42996 77089 -137919 -271017 -301589 -409758
42125 -409758 -527506 -410644 -130727 -69801 -326677 -506046 -289574 80415 130474 -228400
42115 -228400 -651547 -800107 -618342 -258230 71318 206187 130835 -10924 -82440 -101223
42105 -101223 -166808 -309721 -485692 -656125 -794117 -860414 -845740 -805638 -819258 -959536
42095 -959536 -1292293 -1779450 -2160714 -2108184 -1604124 -1021378 -703897 -605216 -488066 -321528
42085 -321528 -244007 -232956 -111803 94275 85703 -308045 -837559 -1091908 -948762 -655601
42075 -655601 -533627 -691141 -974765 -1128427 -1038737 -861500 -839466 -965769 -948309 -597758
42065e97758M63850J75348k40536m45483m24479l13650q0771L19613O25518N09186
42055i162J33492L0880L00721L87819m0994m44789j61515M80737N15141k33406
42045I58924q28642n75498L429K8615m33063n85825j38669L74514M53897K01204
42035e41114n1608j77211j71260l1918J29212J59310J25491K00167K73229P1538
42025a4164k95134l74487p6394J54972O0927o0141K4989M0324k08418l23902L1245
42014a040183L96792J27068n20650o67941j06003M39952M14793J09643J7743J17044
42004g11742J31134N0929J8456n971j19518k24613j76485k8139P9025J18648J11963
41993g56313K8889r0634r6838L9104J40772J14192J04277J96809K01332l7780
$$ plain form
42065 -597758 -133908 41440 -199096 -644579 -1069058 -1382708 -1463479 -1143866 -518348 -9162
42055 -9162 124330 155210 455931 843750 802756 357967 196452 677189 1192330 958924
42045 958924 130282 -445216 -441787 -413172 -846235 -1432060 -1570729 -1196215 -742318 -541114
42035 -541114 -592722 -769933 -941193 -973111 -843899 -684589 -559098 -358931 -85702 -14164
42025 -14164 -309298 -683785 -760179 -605207 -544280 -604421 -579432 -539108 -747526 -1071428 -1040183
42014 -1040183 -643391 -516323 -1036973 -1704914 -1810917 -1370965 -956172 -846529 -828786 -711742
42004 -711742 -580608 -529679 -511223 -517194 -636712 -861325 -1037810 -1065949 -986924 -868276 -756313
41993 -756313 -727424 -818058 -914896 -875792 -735020 -620828 -516551 -319742 -118410 -156190
41983a56190l17802l35052j15196Q4873J78784K58815K86726J08794k02030l18802
41973e27080q6183K32806K73934J5502k29511k14485k6830P6017R834p3288o4943
41962f14227p7381k15703l19040j62272J57128L21540K75814K77919M00040L50882
41952C94700j2426l37147k39696J31395L31787K44926J22791J19486J41083J17693
41942A014592R1691K8732j54798l38263k59383Q1341L23164J81991j86086l89680
41932C93301k64995j6292O9427l2436o7769J40863L88963L12707o1371k45307
41922F17091O5155N10612N14788N9462l18970k49128R1803L36730L67247K93304
41912B288094K14940J35125J2131j57841k71235j92393K5256J25460n659j47780
$$ plain form
41983 -156190 -473992 -809044 -924240 -839367 -660583 -401768 -115042 -6248 -208278 -527080
41973 -527080 -613263 -380457 -106523 -91021 -320532 -535017 -561847 -485830 -475996 -549284 -614227
41962 -614227 -691608 -907311 -1226351 -1388623 -1231495 -909955 -634141 -356222 43818 394700
41952 394700 382274 45127 -194569 -63174 268613 513539 636330 755816 896899 1014592
41942 1014592 1106283 1135015 980217 641954 382571 463912 787076 969067 782981 393301
41932 393301 128306 112014 181441 149005 81236 222099 611062 923769 862398 617091
41922 617091 682246 1192858 1707646 1767108 1448138 1199010 1290813 1627543 1994790 2288094
41912 2288094 2503034 2638159 2650290 2492449 2221214 2028821 2054077 2179537 2173878 2026098
41902B026098r5548j966r7338k67553k74164k08590k74131k72104J16758N93488
41892A244950M67177k54731o97078l38625K38717K69908q2454j28833K38843N09732
41882A467606M13640J71811l6345k61215m17389k77350O0484J72334o1708k44312
41872I87556p8289J74172J16654j88726l68052k88165j38306m4676Q1357K77090
41862E30615L62050J66361k02053m51888m30469k51012j06831n9360m7993j7071
41852e07651N6560J97709L66658L89843J24000k77164m33356j79240J94614K78853
41842B10826L8237j82422j07302J63472L16834J91779p3202k19025j44619J7702
41832B12280J00010J02916J28214J64959Q9225j09227k51259j92332j5488Q1124
$$ plain form
41902 2026098 1930550 1928584 1831246 1563693 1289529 1080939 806808 534704 651462 1244950
41892 1244950 1712127 1457396 760318 421693 660410 930318 847864 719031 957874 1467606
41882 1467606 1881246 2053057 2016712 1755497 1338108 1060758 1121242 1293576 1231868 987556
41872 987556 909267 1083439 1200093 1011367 643315 355150 216844 172168 253525 530615
41862 530615 892665 1059026 856973 405085 -25384 -276396 -383227 -442587 -490580 -507651
41852 -507651 -451091 -253382 113276 503119 627119 349955 -83401 -262641 -68027 210826
41842 210826 249063 66641 -40661 122811 439645 631424 558222 339197 194578 212280
41832 212280 312290 415206 543420 708379 797604 688377 437118 244786 229298 310422
41822C10422K2160p7728m0674J89057M30399L88423J9955k91107j46256L00551
41812A105202M78234J56198k65371l76205l16781m23126n95705m49061K4096L75969
41802b86550L31705J30040J03115J97252J25014j52202l22033j18680K99874M68211
41792G75746J32412m08515n93708k41068K49799M04691K20286N0840Q4521J66593
41782H41597J17761m821n1545m2763j52240m39729o84981n69530n8813M65213
41772e79851N66555K35768j22551j87752m2012N9200M6118K7505N1883M4595m4931
41761E4527j37979q5079J67152M40723M33434P4581l17917m18389l24975l37528
41751d51450m07200k13170K20853M70452L77693K64738K81412J00102l82344n97838
$$ plain form
41822 310422 332582 254854 214180 403237 833636 1222059 1242014 950907 804651 1105202
41812 1105202 1583436 1739634 1474263 1098058 781277 358151 -237554 -686615 -662519 -286550
41802 -286550 45155 175195 278310 475562 600576 448374 126341 7661 307535 775746
41792 775746 908158 499643 -94065 -335133 -85334 319357 539643 590483 675004 841597
41782 841597 959358 954537 902992 860229 707989 268260 -416721 -986251 -1045064 -579851
41772 -579851 -13296 222472 99921 -87831 -129843 -70643 -24525 2980 54863 99458 54527
41761 54527 -83452 -168531 -1379 439344 872778 947359 629442 211053 -113922 -451450
41751 -451450 -858650 -1071820 -850967 -380515 -2822 261916 543328 643430 261086 -336752
41741c36752j21273N01785M36549j84481m40255L256M52429K80346j96050k83965
41731A11589R0234L86677K49183q7010j87171K2669K09378R2140j93742k99731
41721C94216j32206R9042K50772L53204L38973P1772k54037k14935J41143K18305
41711A266249j94862m85683j67469L00706K64214o9365q6757J28154K8799l22799
41701F61187l54328l7379P9939j15820j57887P1767J44139o2555j58640m6874
41691B3549q7417k84461j80185K17345L06786k0262j08188K74210M52350N6362
41681F50089k62143K3112L67052J41455k52030j51340J82231J14281j96019j79736
41671D36952L6950o5850l18657j18979M03106M83191l4687m64023l62019n1224
$$ plain form
41741 -336752 -458025 43760 480309 295828 -144427 -141171 311258 591604 395554 111589
41731 111589 201823 588500 837683 750673 563502 586171 795549 887689 693947 394216
41721 394216 262010 361052 611824 965028 1304001 1375773 1121736 906801 1047944 1266249
41711 1266249 1071387 585704 418235 718941 983155 913790 827033 955187 983986 661187
41701 661187 306859 269480 349419 233599 75712 147479 291618 229063 70423 23549
41691 23549 -63868 -348329 -528514 -311169 -4383 -24645 -132833 141377 593727 650089
41681 650089 387946 411058 778110 919565 667535 516195 698426 812707 616688 436952
41671 436952 473902 408052 89395 -29584 373522 856713 822026 358003 -4016 -55240
41661e5240P7204Q7229J44943J97569J78794J32027N5712n5231p5131L2035M1517
41650G61428j27235j27899K32918M89394J83840l14140l74970j67253k81281n38827
41640b64025k14435N79635Q19272J20260o18819n43459J3974K42134M0431j02642
41630G2326P703R1918p4914l46583l86152m0920L96148L98350j08513m90091k24004
41619g04732K85707K97992r1392j46072K34055L47905p1472l80678j07127L25694
41609a0120L89240K37010K03221J49715j42545m45278m69867l52756k95096j45277
41599h81753K03764M16550J95953j84526k77298q8698P4156Q2606k1480j92176
41589f72902k56885l422L64857L35732q6948k52950R1830L15747m0269m23788
$$ plain form
41661 -55240 21964 109193 254136 451705 630499 762526 818238 763007 687876 719911 761428
41650 761428 634193 506294 739212 1228606 1412446 1098306 723336 556083 274802 -264025
41640 -264025 -478460 101175 920447 1040707 421888 -121571 -107597 134537 174968 72326
41630 72326 80029 171947 97033 -249550 -635702 -676622 -280474 117876 9363 -480728 -704732
41619 -704732 -419025 -121033 -212425 -358497 -124442 223463 151991 -228687 -335814 -10120
41609 -10120 379120 616130 819351 969066 826521 381243 -88624 -441380 -736476 -881753
41599 -881753 -677989 -261439 -65486 -250012 -527310 -616008 -541852 -459246 -480726 -672902
41589 -672902 -929787 -933209 -568352 -232620 -319568 -572518 -480688 -164941 -205210 -628998
41579f28998j88657K82836K32688j88856k39557J40077L40396J98591J48017K90683
41569C87220K24577j25453l18297j73243j2542O488J07989K99998K50630m9155
41559E98212j71173k1433m5543l71377m40428O8246N63801L66757k45546m47008
41549a45492n1439L21187J80377k61408m99856l33444N6861L60371L63342R0897
41539H1396j88490j95255P1096L29478L23584P8631j65159k25014j32254l3523
41529e5510j5370p2420j64503j98123l3906L07890N13692L11960o8731j18203
41519D06776K00029L08683j52959p36224p60927k06042L53623M97399K73534o9428
41509A14464k88849k04531J05900K77752J21193p3121k5115M433l34979p25120
$$ plain form
41579 -628998 -817655 -534819 -302131 -490987 -730544 -590467 -250071 -51480 96537 387220
41569 387220 611797 486344 168047 -5196 -17738 -11250 96739 396737 647367 598212
41559 598212 427039 405606 360063 -11314 -451742 -383496 180305 547062 301516 -145492
41549 -145492 -196931 124256 304633 43225 -456631 -790075 -733214 -372843 -9501 81396
41539 81396 -107094 -302349 -231253 98225 421809 500440 335281 110267 -21987 -55510
41529 -55510 -70880 -143300 -307803 -505926 -539832 -231942 281750 593710 524979 406776
41519 406776 606805 915488 762529 26305 -734622 -940664 -587041 -89642 183892 114464
41509 114464 -174385 -378916 -273016 4736 125929 52808 27693 32126 -302853 -1027973
41499a027973n18236K11465O32794L12735k00155k17818J57708L19084M7951k69159
41489e51604k13681J48491L57382J05259l39161l89641Q3317M79406K29988m06586
41479d96830p08203m68472j25230r622j9776n6043k15585m20478l57172J5073
41469b862338L12524K72998Q3328k859r681l1970k3482M2476R3419J40126K39576
41458a745883K51454J1411k47562j22765K68498L74966Q4307r8649P9721K33403
41448i11099R9414J7407K36942L74307P9351k95223k58791M2387J89730K01909
41438b23666K68742J81612k75214o80064m67535J25198L40419K8511k19398n0776
41428i72171K27877K96540K66327L06915L27600K16749L0049j69491l38047l05678
$$ plain form
41499 -1027973 -1546209 -1334744 -701950 -389215 -589370 -807188 -649480 -330396 -282445 -551604
41489 -551604 -765285 -616794 -259412 -154153 -493314 -882955 -799638 -320232 -90244 -496830
41479 -496830 -1205033 -1673505 -1798735 -1808357 -1828133 -1884176 -2099761 -2520239 -2877411 -2862338
41469 -2862338 -2549814 -2276816 -2193488 -2196347 -2206028 -2237998 -2261480 -2219004 -2125585 -1985459 -1745883
41458 -1745883 -1494429 -1483018 -1730580 -1853345 -1584847 -1209881 -1125574 -1224223 -1144502 -911099
41448 -911099 -811685 -794278 -557336 -183029 -103678 -398901 -657692 -615305 -425575 -223666
41438 -223666 45076 226688 -48526 -728590 -1196125 -1070927 -730508 -701997 -921395 -972171
41428 -972171 -744294 -447754 -181427 125488 453088 669837 699886 530395 192348 -113330
41418a13330K5803L52089K59477j32456k68923M2532L85109L80861J43194n5846
41408A018510j54561j73610r8036n0626k21046m68369l77441J03599M75103L72600
41398D26123O5751j9629P0569L1864j31166j65088m4703L389r6216j69739j02899
41387a31744J2979O7571N7341k152j12592k02107j51618J7261Q9853j00423m05603
41376h61234m44465k7054N42345P25307L62640j22943k59029r4111j4486j27202
41366c20232j65197Q249J76293J61324J01850J43141J45592l4585k08583j21646
41356a13794R5400R5293j29059k25421n2580R3104l3342k27876j81019J4448L7105
41345f27741j01124o4750K07155L29200R1388j21140J03923M73213L21494l83613
$$ plain form
41418 -113330 -87527 264562 524039 391583 122660 165192 550301 931162 1074356 1018510
41408 1018510 863949 690339 592303 541677 320631 -147738 -525179 -421580 53523 426123
41398 426123 491874 472245 542814 574678 443512 278424 233721 237110 140894 -28845 -131744
41387 -131744 -118765 -51194 6147 3995 -108597 -310704 -462322 -445061 -355208 -455631 -861234
41376 -861234 -1305699 -1332753 -790408 -65101 297539 174596 -84433 -178544 -193030 -320232
41366 -320232 -485429 -477180 -300887 -139563 -37713 105428 251020 216435 7852 -113794
41356 -113794 -18394 76899 -52160 -277581 -330161 -237057 -270399 -498275 -679294 -664846 -627741
41345 -627741 -728865 -793615 -586460 -257260 -165872 -287012 -183089 290124 611618 228005
41335B28005q99711o97759j16241K26405K59191L17269M70564M63714K13175o3004
41325D01608k11152k92696l34068k23895N8274L25268L75983J85212j01080k56691
41315g3237j36382J21101J74452o5042k33412j7943L29294L33060K809k27068
41305B07632j83706j03620r5161L0004K79495L38811J13841l9903J01780K34899
41295H84072M2807k48010k25258N4826J90973O0145q5418p9765m1207r2128j62126
41284B98911j35698k3854N7916m242k19020m30489m34496k17947J7667J22347
41274i68905J41154J35281O3731m8956n0592P3233Q8841j30646l41477k56285
41264a294621L2018K01558J42909J1453l9937M3627K59465M60264L81983N395
$$ plain form
41335 228005 -671706 -1369465 -1485706 -1259301 -1000110 -682841 -212277 251437 464612 401608
41325 401608 190456 -102240 -436308 -660203 -601929 -276661 99322 284534 183454 -73237
41315 -73237 -209619 -88518 85934 20892 -212520 -230463 98831 431891 434700 207632
41305 207632 23926 -79694 -174855 -144851 134644 473455 587296 547393 649173 884072
41295 884072 926879 678869 453611 508437 699410 759555 674137 594372 553165 461037 298911
41284 298911 163213 139359 197275 193033 -25987 -456476 -890972 -1108919 -1091252 -968905
41274 -968905 -827751 -692470 -628739 -677695 -728287 -655054 -566213 -696859 -1038336 -1294621
41264 -1294621 -1262603 -1061045 -918136 -906683 -946620 -902993 -643528 -183264 198719 204114
41254B04114k86132j99781N561q8534l83398m32340j80527j2640n7857R56K94980
41243a135598M78992L17128Q5422O3660M6415k19251m49378k00058L55332N77231
41233h0105K70331o5278j666K45673K42863r173j66626r6664l805n0418j40279
41222A44853j34543o6449k7615J4508J35610K59005K06583l2241k14981j16681
41212A68049J83191L86184L19337Q3629j44420l17449m40737m18285j58117J90813
41202a47805L07466R0602j63581j09147K17500M66397M15843J66587q7643k72508
41192H83711l55625k59381j038K02065J40460j07817k32891l5238L47237N50734
41182A132217L27909j58436m17989j64935K41511J43396n35594j050486p05637
$$ plain form
41254 204114 -82018 -281799 -276238 -364772 -748170 -1180510 -1361037 -1373677 -1431534 -1430578 -1135598
41243 -1135598 -656606 -339478 -254056 -190396 -143981 -363232 -812610 -1012668 -657336 -80105
41233 -80105 190226 124948 123282 368955 611818 602645 436019 339355 335550 285132 144853
41222 144853 10310 -56139 -83754 -69246 66364 325369 531952 499711 284730 168049
41212 168049 351240 737424 1056761 1140390 995970 678521 237784 -180501 -338618 -147805
41202 -147805 159661 250263 86682 -22465 195035 661432 1077275 1243862 1156219 883711
41192 883711 528086 268705 267667 469732 610192 502375 269484 234246 581483 1132217
41182 1132217 1460126 1301690 883701 718766 960277 1103673 568079 -482407 -1188044
41173a188044K70721J016678J021160M91356j06892m68835m67034j67382J13946
41164E15674R5799q5020o9716J61906K85252J79763O3467L3158p2303k42659k08619
41153F56702M6382J67342L4416j6752J44558J14566l11463o14104l07288K25247
41143A39606K93632l5200j39445J16077K76066J36755l0086r8029k36346l65406
41133E7624j49027L03344L89755o2953m37694k38054J79707K25773j4291j9815
41123B34369K82494M15272P1756m67004o90479m13157O4361K59439J0518l12724
41113e45155k40775J68088L88195J55804j92138k47978o7246N5840N8141P3745
41103c93479J47266K46692L74564M26436J59350m08927p80315n16910J26515M76137
$$ plain form
41173 -1188044 -917323 99355 1120515 1611871 1504979 1036144 569110 401728 515674
41164 515674 611473 526453 456737 618643 903895 1083658 1147125 1180283 1107980 865321 656702
41153 656702 703084 870426 904842 888090 1032648 1147214 835751 221647 -85641 139606
41143 139606 433238 398038 258593 374670 650736 787491 757405 659376 423030 57624
41133 57624 -91403 211941 601696 538743 101049 -137005 42702 268475 254184 234369
41123 234369 516863 932135 1003891 536887 -153592 -566749 -502388 -242949 -232431 -545155
41113 -545155 -785930 -617842 -229647 -73843 -265981 -513959 -581205 -525365 -467224 -393479
41103 -393479 -246213 479 375043 801479 960829 551902 -228413 -745323 -618808 -142671
41093a42671K86932l1114l3100K38545M22383K86004q0683l64138k82739J20816
41083D20235M40637L06116j74881n05748l46772J36148M75531L78039k96k26374
41073I02635q1841J50803N7571k76616l28022O1222L39868M0122m24227k73129
41063A68386M67895Q91890L96438n32158r36166m62482L97310R03380O93767q441
41053A979819o03934o18047j32134L32382L97118J74288o031l5664o1752j85642
41043A240403k83604j48266K29409N54731M91899Q1689k30509j14182K27766L51614
41033B400950J58820p2770j51715j45073j18415m5544M403o9035j23213N4525
41023A892933K62724N8274m51369n52891J6782N14164K13674m53944m85626K08552
$$ plain form
41093 -142671 144261 113147 80047 318592 740975 1026979 946296 582158 299419 420235
41083 420235 860872 1166988 992107 486359 139587 275735 751266 1129305 1129009 902635
41073 902635 820794 971597 1029168 752552 424530 485752 825620 865742 441515 168386
41063 168386 636281 1528171 1924609 1392451 456285 -6197 391113 1294493 1988260 1979819
41053 1979819 1375885 757838 625704 958086 1355204 1529492 1523461 1487797 1426045 1240403
41043 1240403 956799 808533 1037942 1592673 2084572 2166261 1935752 1821570 2049336 2400950
41033 2400950 2559770 2487000 2335285 2190212 2071797 2026253 2030656 1961621 1838408 1892933
41023 1892933 2155657 2213931 1762562 1209671 1226453 1740617 1954291 1500347 1014721 1223273
41013A223273O91636L96664j18379r4966L40766M79385Q0467l65103l45494O9309
41003B357558M02691L42527K0480k25789k62812k37817k62669k18388j1840J60785
40993B064726O4766j78119k55052j54373j38834k45397k16398P287J49671R9892
40983A198169J18978L19478L64557K1613l55964l21514k5300M6573j85745l93301
40973G87544m28422m16447l45410q7110J87314J45483r6152l7314L94452O29673
40963G33611K91016k42548m16418k24894k47J48388K71491K55102J2823k02812
40953F25512j14735J08641J14852m5186l9361J36828J56692n3442k01430j41949
40943E46422m8656k22J40847L04762J53572l17778n64232k15378L35725M61452
$$ plain form
41013 1223273 1914909 2311573 2193194 2098228 2438994 2918379 2998846 2633743 2288249 2357558
41003 2357558 2760249 3102776 3123256 2897467 2634655 2396838 2134169 1915781 1903941 2064726
40993 2064726 2129492 1951373 1696321 1541948 1403114 1157717 941319 948606 1098277 1198169
40983 1198169 1317147 1636625 2001182 2022795 1666831 1345317 1320017 1366590 1180845 787544
40973 787544 359122 -57325 -402735 -489845 -302531 -157048 -253200 -290514 103938 733611
40963 733611 1024627 782079 365661 140767 140520 288908 560399 815501 828324 625512
40953 625512 510777 619418 734270 689084 649723 786551 943243 889801 688371 546422
40943 546422 497766 497544 638391 943153 1096725 778947 214715 -663 335062 796514
40933G96514J54091p4365K1332J79003J31567n0056j72233j73904q5346M8085
40923G74688J40226J34119J13773J72682J93311j1951l36066m29795j96547L6849
40913E91289j1317j85468j80000j6620M5046m0341n6387P3684J40121K706j50110
40902B12603p6312J41879K04366P704k46500l45679k82537j45789K3749J75360
40892c31156J95109N5612o4814K9730K68228L56154J26139k51044m37598k58059
40882c11699J40337M02920K71415j44604m22103k53472J85057M10429J95328j73188
40872C00420k57932J2982K99940K79342Q448j84914j36432n6218k02671m25884
40862c62919k95253K36328O07546L68396j24050j72050K20642L35997j53353o65865
$$ plain form
40933 796514 950605 876240 897572 1076575 1208142 1158086 985853 811949 726603 774688
40923 774688 914914 1049033 1162806 1335488 1528799 1516848 1180782 750987 554440 591289
40913 591289 579972 394504 214504 197884 242930 202589 146202 219886 360007 362713 212603
40902 212603 136291 278170 482536 490240 243740 -101939 -384476 -530265 -506516 -331156
40892 -331156 -136047 -80435 -145249 -115519 152709 508863 635002 383958 -53640 -311699
40882 -311699 -171362 231558 502973 358369 -63734 -317206 -132149 278280 473608 300420
40872 300420 42488 55470 355410 634752 643200 458286 321854 265636 62965 -362919
40862 -362919 -658172 -421844 185702 554098 430048 257998 478640 814637 661284 -4581
40852d581n96240j91134o4700k33915k33638L3355K12575K02705K88751M80941
40842a05881L60062j62482m97960j92951L52423M65052J84220J11366M31176O67356
40832A612381M53810L5764j79707j81521k10702l22897l61312k21806O3300L96603
40822A083913O03638M76730K8477l93239m52319k26394n9041p0223o5797O7015
40812I92760J57092M5840j41996j81086m6695J14850J97908J85167R2789k984
40802A413645Q396R9925R3403n2018j19834k365K2650k99126o69600n45212N6397
40791F261N11298M35831J30499j838l1880j78891k91014j00058K29469K84323
40781I94000N0944o3514J35896L80751L94697K39631P3466j26150l98739n84649
$$ plain form
40852 -4581 -600821 -791955 -856655 -1090570 -1324208 -1290853 -1078278 -875573 -586822 -105881
40842 -105881 254181 91699 -406261 -599212 -246789 218263 402483 513849 945025 1612381
40832 1612381 2066191 2101955 1922248 1740727 1530025 1207128 845816 624010 687310 1083913
40822 1083913 1687551 2164281 2192758 1799519 1347200 1120806 1061765 991542 925745 992760
40812 992760 1149852 1195692 1053696 872610 825915 940765 1138673 1323840 1416629 1413645
40802 1413645 1422041 1521966 1615369 1563351 1443517 1441152 1463802 1164676 495076 -50136 6261
40791 6261 517559 953390 1083889 1082051 1050171 871280 580266 480208 709677 994000
40781 994000 1044944 981430 1117326 1498077 1892774 2132405 2205871 2079721 1680982 1096333
40771A096333m92849j77794J02815J37849r6302m18630m98685j05639N56341R10249
40761A013688N94725r0983n12040m08782q2226J02873J38484J90090K20064N1310
40751A217203k52338l52187r1434K21795J99207p5262j57500R5654K98786J21328
40741A225252j86718j47295K31436M59213K63461p7043k04036j65076k06602l06882
40731H85710k14770J15659L98023L64353P6094j70325j52079Q3705K52459Q6929
40721A725758l31150n50582k54240K43558K93343k12451o05151l32979K39453
40712B15559L62537J2595j34884J72148L62991K3408l73449k08860K95204M48991
40702A176240J37203j64755k19938k07823j82489l1353O9369j48802m09660k06807
$$ plain form
40771 1096333 603484 425690 528505 666354 570052 151422 -347263 -452902 103439 1013688
40761 1013688 1608413 1517430 1005390 596608 514382 617255 755739 945829 1165893 1217203
40751 1217203 964865 612678 521244 743039 942246 866984 709484 805138 1103924 1225252
40741 1225252 1038534 891239 1122675 1581888 1845349 1768306 1564270 1399194 1192592 885710
40731 885710 670940 786599 1184622 1548975 1625069 1454744 1302665 1386370 1638829 1725758
40721 1725758 1394608 844026 589786 833344 1126687 914236 309085 -23894 215559
40712 215559 578096 590691 455807 627955 990946 1014354 640905 432045 727249 1176240
40702 1176240 1313443 1148688 928750 720927 538438 507085 576454 427652 17992 -188815
40692a88815K26837J53963l26627k18675P01793J248948N64492m92382o40881
40683A028653n4344J79882j38644l14891j74456j85749l07410Q678O11849O65196
40673A318764N6954l40652j09464J17914j14904l34189j30600P5872j06325k81753
40663A51617m5462K38884J28891j10166q9902j5091j22512o3248L93029O69933
40653A135973K47248l53134l48048M0831O1893k61879l35178j56050j90986l14692
40643d74022k598N25550N03684k1291j79660K29856L90405j02574n78881m97830
40633b07361k63922k73119j30637M49211Q20591L68041l50508l63774K36649N14880
40623H00051J47519k45152j91544K2079l737j58429j19731J20117K96027K45453
$$ plain form
40692 -188815 38022 191985 -134642 -353317 348476 1597424 2161916 1669534 1028653
40683 1028653 974309 1154191 1015547 700656 526200 340451 33041 41719 653568 1318764
40673 1318764 1375718 1035066 925602 1043516 928612 594423 463823 539695 433370 151617
40663 151617 106155 345039 473930 363764 273862 258771 136259 73011 466040 1135973
40653 1135973 1383221 1030087 682039 722870 784763 522884 187706 31656 -159330 -474022
40643 -474022 -476620 48930 552614 531323 351663 581519 971924 869350 290469 -207361
40633 -207361 -471283 -744402 -875039 -425828 394763 762804 412296 48522 285171 800051
40623 800051 947570 702418 510874 532953 529216 370787 251056 371173 667200 912653
40613I12653P2230J1662J82373M38367N10639L12570j4211l51631o68572q02362
40603F03718n25504J3728K85202P6279j46351P3634M42824L42027j98098m84280
40593D83179j27984M47047O11337L08123P119M4199K22357J09463l41752o35064
40583A128024l53090J89429K79732j84988n07497k31072J47911k5873m81131m08487
40573d47042K51550O61041L04313l15564m62183j21303J87701J82942J2521j01190
40563A52786o0076J40978L66225L62921P7043j58019q536L57394M42018Q4682
40553A757416l36481m41051l02569j99299j48341K0417K37526J99989j29997l54711
40543C02899j72493J62809K10288J3945K1327L50896N67057L38925n0027j33743
$$ plain form
40613 912653 984883 996545 1178918 1617285 2127924 2440494 2426283 2074652 1406080 603718
40603 603718 78214 91942 377144 453423 307072 380706 823530 1165557 967459 483179
40593 483179 355195 802242 1413579 1721702 1728821 1773020 1995377 2104840 1763088 1128024
40583 1128024 774934 964363 1244095 1059107 551610 320538 468449 442576 -38555 -447042
40573 -447042 -195492 465549 769862 454298 -7885 -129188 58513 241455 253976 152786
40563 152786 92710 233688 599913 962834 1039877 881858 873322 1230716 1672734 1757416
40553 1757416 1420935 979884 677315 478016 329675 350092 587618 787607 657610 302899
40543 302899 130406 293215 503503 517448 538775 889671 1456728 1795653 1745626 1611883
40533A611883O6688J62392K4313j07547j03545j31889k78361l32607j50888L4716
40523G95155o3227l21012l59561j07699J07916Q9374O5804K66146M52750K34823
40513A160469k54629m23677n1314L56921K89096m8454j13394J14903J67417j04833
40503A092505k97595j29309J39216J81119R4111J21629K00158J22456n8655j15217
40493A350418j871J42208K36383K64431J53484j12193l52148l88713k98469k62864
40483G30666k70542j80921P364J57111J80201N8754j91520m05268l00044J35853
40473g8346M73771L54503k272j30980K75M9224p2068j04266K2873M5493j23879
40462D34328j73838J08306M58126N03733K68220N3824j407l923l6178m0099J9123
$$ plain form
40533 1611883 1678571 1840963 1865276 1757729 1654184 1522295 1243934 911327 760439 795155
40523 795155 731928 410916 51355 -56344 51572 140946 206750 472896 925646 1160469
40513 1160469 905840 482163 430849 787770 1076866 1028412 915018 1029921 1197338 1092505
40503 1092505 794910 665601 804817 985936 1080047 1201676 1401834 1524290 1465635 1350418
40493 1350418 1348547 1490755 1727138 1991569 2145053 2032860 1680712 1291999 993530 730666
40483 730666 460124 279203 286567 443678 623879 682633 491113 85845 -214199 -78346
40473 -78346 395425 749928 747656 616676 616951 666175 594107 489841 512714 558207 434328
40462 434328 260490 368796 826922 1330655 1598875 1652699 1651292 1647369 1611191 1571092 1590215
40451A590215K9631j29005l50132l26326O1113M53940L75478r6936l62812j44352
40441A100814J18521K5131r4176K14564O06026L82087l06281n73328j80521R4479
40431A387316k20904m68984M8811Q29280Q13808o6455p90749o32814K3303L70514
40421A293126J82656j10965r0240J69718K73814P5794p9199J52681N07980L99831
40411B775196j60045m40916m3504M46443L07927k35410l95743k1727K75414J35577
40401B643212r9401p7710K4892o3016k02144j23890Q3631J32275J3106p015J80576
40390B504516L57673K90800M9901q1674L2544K14707K23716R9575R7547K77769
40380D067074L88078K66973J26447K17006M06721L83642J45442l8404p7013j16749
$$ plain form
40451 1590215 1619846 1490841 1140709 814383 875496 1329436 1704914 1607978 1245166 1100814
40441 1100814 1219335 1244466 1150290 1364854 1970880 2352967 2046686 1473358 1292837 1387316
40431 1387316 1166412 697428 746239 1575519 2389327 2322872 1532123 899309 922612 1293126
40421 1293126 1475782 1364817 1274577 1444295 1718109 1793903 1714704 1867385 2375365 2775196
40411 2775196 2615151 2174235 2130731 2577174 2885101 2649691 2253948 2232221 2507635 2643212
40401 2643212 2543811 2466101 2490993 2427977 2225833 2101943 2185574 2317849 2330955 2323940 2504516
40390 2504516 2862189 3152989 3202890 3121216 3153760 3368467 3592183 3691758 3789305 4067074
40380 4067074 4455152 4722125 4848572 5065578 5472299 5855941 6001383 5962979 5885966 5769217
40370E769217j61451p951L54272O13373N54621L41387K13486J46179J9413n3678
40360G788868J78027P27270J269167J439234J164004P10856M35665M35119M37331
40351A4585541J02429n62099j164145j319581j021484o20541m88195o69745q35589
40342H006591o59584k79951j93190n58549q62930n80115L3388K33673j84594o35336
40332D319403n82730j71837J55509K47052J76773l9727l27801m18607j80752J04382
40322C281665J18285l1354o4330n4635k67796n72588n18820o3591K55195P4916
40312B156947k49692j70619K54812M76289K55997m3006n3790N2814j14588m82584
40302B082580n05010Q5895Q05325R31458L69073k73310m54776k73406j73213l22681
$$ plain form
40370 5769217 5607766 5599815 5954087 6567460 7122081 7463468 7676954 7823133 7842546 7788868
40360 7788868 7966895 8694165 9963332 11402566 12566570 13277426 13713091 14148210 14585541
40351 14585541 14687970 14125871 12961726 11642145 10620661 10000120 9511925 8842180 8006591
40342 8006591 7347007 7067056 6873866 6315317 5452387 4872272 4905660 5139333 4954739 4319403
40332 4319403 3736673 3564836 3720345 3967397 4144170 4104443 3776642 3358035 3177283 3281665
40322 3281665 3399950 3368596 3304266 3249631 2981835 2409247 1890427 1826836 2082031 2156947
40312 2156947 1907255 1736636 1991448 2467737 2723734 2680728 2626938 2679752 2565164 2082580
40302 2082580 1577570 1663465 2468790 3400248 3769321 3496011 3041235 2767829 2594616 2271935
40292B271935m86158l96387o1643K74763L71455K07815J0298r248N5813m9658
40282B188985k68790j87915L34671P71669N23620k29662o92454m52042R4714L75588
40272B458384K79686r065l90393p27926o74566p5623N89901O33838M4197m52798
40262A675635l17269J75076M09040K19929p6679k30768k79146k83639j82266K9857
40252A139770K01742K05844P5805p6680j39146O616L47244N59734K65775l84996
40242B201708o87607k21128N16663O86656J78135l36209l74290j71539j11189
40233A681200j28613m544J25516k038k43315j97601J54443L78165K06193j18376
40223A851030k40198j44289m2039k3765k2222J0844O4501J19594J16359k3204
$$ plain form
40292 2271935 1785777 1389390 1327747 1602510 1973965 2181780 2192078 2182830 2238643 2188985
40282 2188985 1920195 1732280 2066951 2838620 3362240 3132578 2440124 1988082 2082796 2458384
40272 2458384 2738070 2729005 2338612 1610686 936120 860497 1450398 2084236 2128433 1675635
40262 1675635 1358366 1533442 1942482 2162411 2085732 1854964 1575818 1292179 1109913 1139770
40252 1139770 1341512 1547356 1623161 1546481 1407335 1413951 1761195 2320929 2586704 2201708
40242 2201708 1514101 1292973 1809636 2496292 2674427 2338218 1963928 1792389 1681200
40233 1681200 1552587 1548043 1673559 1671521 1428206 1230605 1385048 1763213 1969406 1851030
40223 1851030 1610832 1466543 1424504 1400739 1378517 1389361 1453862 1573456 1689815 1666611
40213A666611k15967k01341J02785L52345J66488k79133l93811P084L82884K14803
40203A802748k37219l30654p190J75993q436r4107K26628M57091M3494o19035
40193A409313o45212Q055M42218J60877k50050j35702K18789J79220j38369j10547
40183A138592K91470M33631O7296k78594j61559J26654J24043n6389M579K95659
40173A985382L78579N3905l54609m29497j32615K24995L46512K11036K1569o4921
40163B240336j10080k38001l70125k92233n452J96061J06460r5629p5875K34307
40153A589769N70569O20164K94030k00340m99350m01253q6834J02584J08518J59039
40143B256896L04649K81056q322k21736q2309J42438M7506k46501k95343o6268
$$ plain form
40213 1666611 1450644 1249303 1352088 1704433 1870921 1591788 1197977 1205061 1587945 1802748
40203 1802748 1565529 1234875 1227685 1403678 1395242 1301135 1527763 1984854 2028348 1409313
40193 1409313 764101 772156 1214374 1375251 1125201 989499 1208288 1387508 1249139 1138592
40183 1138592 1430062 1863693 1930989 1652395 1490836 1617490 1741533 1685144 1689723 1985382
40173 1985382 2363961 2417866 2063257 1633760 1501145 1726140 2072652 2283688 2305257 2240336
40163 2240336 2130256 1892255 1522130 1229897 1224445 1420506 1526966 1431337 1355462 1589769
40153 1589769 2160338 2780502 3074532 2874192 2374842 1973589 1886755 1989339 2097857 2256896
40143 2256896 2561545 2842601 2834279 2612543 2530234 2672672 2720178 2473677 2178334 2112066
40133B112066M3357q2299p8854K39143M94706K98061j67278m24453l37833j56330
40123A940286o7333q819J14842K63972L36872K89240J68555P5720N9210M2465
40113C215010o0724j80618j87823j29635j49586j67767N8922M70986O36699L40904
40103C846368o5627j66828m7308k5993p4722O3178L08602K76360j12769m55176
40093C546085l96527l1721L17826M53591L33490J1971l26314m57723l43093j29355
40083B978230P6740K49791K83137N4467l05924m84069l93397k59610k26111j65530
40073A807724O616J34448J03024M2828P1870R6644O1555J17331L05481L56105
40063C103626R8483j80287j44142L0113q3512m52610n89780k68753J66304L04147
$$ plain form
40133 2112066 2155423 2073124 1994270 2233413 2728119 3026180 2858902 2434449 2096616 1940286
40123 1940286 1872953 1864134 1978976 2242948 2579820 2869060 3037615 3113335 3172545 3215010
40113 3215010 3154286 2973668 2785845 2656210 2506624 2338857 2397779 2868765 3505464 3846368
40103 3846368 3780741 3613913 3566605 3540612 3465890 3529068 3837670 4114030 4001261 3546085
40093 3546085 3149558 3117837 3435663 3889254 4222744 4234715 3908401 3450678 3107585 2978230
40083 2978230 3054970 3304761 3587898 3642365 3336441 2852372 2458975 2199365 1973254 1807724
40073 1807724 1814340 1948788 2051812 2094640 2166510 2263154 2324709 2442040 2747521 3103626
40063 3103626 3202109 3021822 2877680 2907793 2824281 2371671 1781891 1513138 1679442 1983589
40053A983589J58918J7180K0800O0948k1422k25190l51101k06690J01030K08354
40043A746416l4500k94340j77139K18411M48790L29303P5803j00725k01204k38181
40033A772634j61805l9089k2070r4469j14257j03203j75645j90332J17282N86600
40023A575646O64156J66790l90110m66010j41943J64082K82787K81485J68723
40014B305606k9959j23714k0598N7246o1439j44781N4650K75761Q7414l53358
40004B046828l96871J85075Q16731Q17539J88529m71322o44728l49886j8757j0999
39994B162139k36078l07866r1740J00574J972j72300o6593K28486L13414J10485
39984B042493m4896O2444K71721L53830K42443n8226m52254o30413l59711P3244
$$ plain form
40053 1983589 2142507 2159687 2180487 2241435 2220013 1994823 1643722 1437032 1538062 1746416
40043 1746416 1711916 1417576 1240437 1458848 1907638 2236941 2312744 2212019 2010815 1772634
40033 1772634 1610829 1571740 1549670 1455201 1340944 1237741 1062096 871764 989046 1575646
40023 1575646 2239802 2406592 2016482 1550472 1408529 1572611 1855398 2136883 2305606
40014 2305606 2275647 2151933 2131335 2188581 2127142 1982361 2037011 2312772 2400186 2046828
40004 2046828 1649957 1835032 2651763 3469302 3657831 3186509 2541781 2191895 2173138 2162139
39994 2162139 1926061 1618195 1526455 1627029 1629001 1456701 1390108 1618594 1932008 2042493
39984 2042493 1997597 2060041 2331762 2685592 2928035 2869809 2417555 1787142 1427431 1500675
39974A500675J47077r6695o2157M13756O62289J55735o23397q29520m16477k8821
39964H22465N4676J62340M25607M62014J13289j06276K49603P72318P02728L5949
39954C694713m58012l37065l9102r1660k74669o2622L97936M10620j70370o16135
39944B453634l58112K02262L47417Q0281m8510J30699K82924K50884K15952J79209
39934C736640p5771m07940l54197O7941K39711q4649l33579o9368K50784N6472
39924C026044l34015k40419K19627L26224n6012l13181j15054J48224J05692p9954
39914B687176j53799j58630j38918M8422L68388M92896L07102J25526J63445K09373
39904C950981Q1867k7531J6843l1952l03428m02566K96N14156N29315J32484q6342
$$ plain form
39974 1500675 1647752 1551057 1488900 1902656 2564945 2720680 2097283 1267763 851286 822465
39964 822465 877141 1039481 1465088 1927102 2040391 1934115 2183718 2956036 3658764 3694713
39954 3694713 3236701 2899636 2860534 2768874 2494205 2431583 2829519 3240139 3069769 2453634
39944 2453634 2095522 2297784 2645201 2725482 2676972 2807671 3090595 3341479 3557431 3736640
39934 3736640 3660869 3252929 2898732 2966673 3206384 3121735 2788156 2718788 2969572 3026044
39924 3026044 2692029 2451610 2671237 2997461 2941449 2628268 2513214 2661438 2767130 2687176
39914 2687176 2533377 2374747 2235829 2284251 2652639 3145535 3452637 3578163 3741608 3950981
39904 3950981 4032848 4005317 4022160 3990208 3686780 3284214 3284510 3798666 4327981 4460465 4374123
39893D374123P106j9436l24712n00232k74965N6620J72465K14490M07764N61630
39883D674853L51798j20994m34851m05222k29560j28882j06807n2064J16996L92746
39873D058013O10728N10731N6215l72937l49551M5698K92344J04615k19783k53685
39863D482388q609J72390J35369M4398K4336l0897j88885k45324K4548M64730
39853D874444O17142K62662k59698m00526k5977M29052M69849J01747k23788j70625
39843E674282J35636L55408L49755K15330N5925n9244M335K98116N35195L11389
39833G876127k94108o54334l61512K09833M20494K29695J26313L07647M20183
39824H280338J96145j00694r3358J55229K72542P8161k61002m58326l49819l2509
$$ plain form
39893 4374123 4381229 4361793 4037081 3536849 3261884 3318504 3490969 3705459 4113223 4674853
39883 4674853 5026651 4905657 4470806 4065584 3836024 3707142 3600335 3548271 3665267 4058013
39873 4058013 4668741 5179472 5235687 4862750 4513199 4558897 4851241 4955856 4736073 4482388
39863 4482388 4473779 4646169 4781538 4825936 4850272 4819375 4630490 4385166 4409714 4874444
39853 4874444 5491586 5754248 5494550 5094024 5068047 5497099 5966948 6068695 5844907 5674282
39843 5674282 5809918 6165326 6515081 6730411 6786336 6727092 6731427 7029543 7564738 7876127
39833 7876127 7582019 6927685 6566173 6776006 7196500 7426195 7552508 7860155 8280338
39824 8280338 8476483 8375789 8282431 8437660 8710202 8788363 8527361 8069035 7719216 7686707
39814G686707J61043P999k31622p0091M72495P56947L83275k18769m13269k19820
39804H314895p6455m2488J42489L67818K30765j72814k46507J44700L87326R6881
39794I146610k50369r6303L41449N27933M64050M54969L93732O275m02905k38188
39784A0347253L81636O63398K96305j40199j36099O5782Q7352R2072L60272O69801
39774A2687573O48600M14934L38627M12994L71585K27167J92463K35693K14998
39765A5744634K76459N62475O97905K47014l93608l40402M50663J016554P99267
39756A9060961M02595M92532P33959N13393R2861J77439P11562J002361Q57954
39747B4045617P23118P25475M75511m6813k43904J53321N99427N86732L83759
$$ plain form
39814 7686707 7847750 7855749 7624127 7554036 8026531 8783478 9166753 8947984 8534715 8314895
39804 8314895 8238440 8195952 8338441 8706259 8937024 8764210 8517703 8662403 9049729 9146610
39794 9146610 8896241 8799938 9141387 9669320 10133370 10588339 10982071 10988346 10585441 10347253
39784 10347253 10728889 11392287 11688592 11548393 11412294 11478076 11565428 11657500 12017772 12687573
39774 12687573 13336173 13751107 14089734 14502728 14874313 15101480 15293943 15529636 15744634
39765 15744634 16021093 16583568 17281473 17528487 17134879 16794477 17245140 18261694 19060961
39756 19060961 19463556 19956088 20690047 21203440 21296301 21473740 22185302 23187663 24045617
39747 24045617 24768735 25494210 25969721 25922908 25679004 25832325 26431752 27018484 27402243
39738B7402243M72212P51823Q15841O41643M98842M46281L94320M41303O86861
39729C2551369Q86203P34517L66830J71084K31520L52555M92310P27535Q90931
39720C7404854P28480L98709L47815O44975Q70835P41486M43977K55814K12960
39711D2049905K83938N18895Q54348J047491R57934O90024M03152K23180L30772
39702D7359639P89856J260883J287967R51725Q05295J041645J213576J000737
39694E5711323P51734R14573J358451J676660J812792J951172K086453K153493
39686F8416651K319110K675877K896417K710076K501468K839761L558279L965022
39678I1882661L937057M093659M747676N386715N529557N517735N978670O887833
$$ plain form
39738 27402243 27874455 28626278 29442119 30083762 30582604 31028885 31423205 31864508 32551369
39729 32551369 33437572 34172089 34538919 34710003 34941523 35294078 35786388 36513923 37404854
39720 37404854 38133334 38532043 38879858 39524833 40395668 41137154 41581131 41836945 42049905
39711 42049905 42333843 42852738 43707086 44754577 45712511 46402535 46805687 47028867 47359639
39702 47359639 48149495 49410378 50698345 51650070 52455365 53497010 54710586 55711323
39694 55711323 56463057 57377630 58736081 60412741 62225533 64176705 66263158 68416651
39686 68416651 70735761 73411638 76308055 79018131 81519599 84359360 87917639 91882661
39678 91882661 95819718 99913377 104661053 110047768 115577325 121095060 127073730 133961563
39670A33961563P683281Q116859Q502698R145158R919109J0535394J0988745J1569907
39662B10422714J2476444J3526157J4346170J4837794J5287932J5896713J6383505
39655C13177429J6339459J5847192J5350450J4894419J3937331J2093783R685436
39648D11325499P270923M906813K211513r82271m341595p354627r744633j1608967
39640C91682655j3260443j4845872j6076978j6543296j6363065j6194769j6387302
39633B82010930j6466077j5831258j4675453j3701844j3098298j2399466j1389699
39626A84448835j0507762j0099076r796713r077439q086626p401610p135250o804192
39618A15540167o121247n433277n153471n121157m873194m358153l978198l937969
$$ plain form
39670 133961563 141644844 149761703 158264401 167409559 177328668 187864062 198852807 210422714
39662 210422714 222899158 236425315 250771485 265609279 280897211 296793924 313177429
39655 313177429 329516888 345364080 360714530 375608949 389546280 401640063 411325499
39648 411325499 418596422 423503235 425714748 424732477 420390882 413036255 403291622 391682655
39640 391682655 378422212 363576340 347499362 330956066 314593001 298398232 282010930
39633 282010930 265544853 249713595 235038142 221336298 208238000 195838534 184448835
39626 184448835 173941073 163841997 154045284 144967845 136881219 129479609 122344359 115540167
39618 115540167 109418920 103985643 98832172 93711015 88837821 84479668 80501470 76563501
39610G6563501l942399l683098l296589l069859k925706k576410k094369j900661
39602E3074410k107458k265425j983751j496034j300243j435608j490950j274680
39594C9720261j094910j259214j575599j578494j152985p24626p74835j261247
39586C0298351j624625j401886p61642l28180m79575r41621j129446p88368k11476
39577B2631532J08064n2407m87999q00954p81591n65420m14963m16548m67735
39568A8751979m72116l93236j99714K1800k6381n11178j038122r64618k65822
39559A4902592L18683K25486k38431m54456l64615l36718m37932l86693j25399
39550A3102517O6152L9908m9165o7310m5373Q885J05664R2353j75119m94877n14542
$$ plain form
39610 76563501 72621102 68938004 65641415 62571556 59645850 57069440 54975071 53074410
39602 53074410 50966952 48701527 46717776 45221742 43921499 42485891 40994941 39720261
39594 39720261 38625351 37366137 35790538 34212044 33059059 32334433 31559598 30298351
39586 30298351 28673726 27271840 26510198 26182018 25702443 24760822 23631376 22843008 22631532
39577 22631532 22739596 22687189 22199190 21398236 20616645 20051225 19636262 19219714 18751979
39568 18751979 18279863 17886627 17686913 17708713 17682332 17171154 16133032 15168414 14902592
39559 14902592 15221275 15446761 15208330 14753874 14389259 14052541 13614609 13227916 13102517
39550 13102517 13168669 13208577 13159412 13092102 13046729 13055614 13161278 13253631 13078512 12583635 12069093
39539A2069093k50496l6692J2910N3745L9247k72203p54228r03784n81299k46042
39529I130251k21560k44942n3221J02308m5614k14384j9522L35863L51942q402
39519I112719l54884m90879n02213l69684k8006K53452J01394l08990l59477J14124
39509G167556N12562L03424k40841m75424k79477j08202k41209l97307k29473
39500F011609J00103J40539j56360l32836j18194J33327K41k98017k35172J23267
39490E368507J73004k16285m02209L3268N84203N62619O3068l31617m20127l86403
39480E028028k46780P2242L04490J36649j74616r5996L28546N28312K94658K511
39470F178044q6993j17937j47698k089K14714Q9476l80533o20254l27494M2456
$$ plain form
39539 12069093 11818597 11781905 11794815 11848560 11887807 11615604 10861376 9957592 9376293 9130251
39529 9130251 8908691 8663749 8610528 8712836 8667222 8452838 8433316 8769179 9121121 9112719
39519 9112719 8757835 8266956 7764743 7395059 7367053 7620505 7721899 7412909 7053432 7167556
39509 7167556 7680118 7983542 7742701 7267277 6987800 6879598 6638389 6241082 6011609
39500 6011609 6111712 6252251 6095891 5763055 5644861 5778188 5778429 5480412 5245240 5368507
39490 5368507 5541511 5325226 4923017 4956285 5540488 6103107 6166175 5834558 5414431 5028028
39480 5028028 4781248 4853490 5157980 5294629 5120013 5024017 5352563 5880875 6175533 6178044
39470 6178044 6091051 5973114 5825416 5823327 6038041 6127517 5746984 5126730 4799236 4841692
39460D841692j5514l41563m74185l16001o9597J30349J84597j8630l06246k49859
39450C365043J88900M50495J70870k51130l00819j20768j23016k30604j08843
39441C040128J55171K33276J84378K80892M05373K51735m6150j41681j58068m14722
39431C790332o20323k07701N36074O34926q7166o40723l75232P6140n9468m42256
39421B604603l14449J85348L34495O4693o5838N1862j8204k82849j91083L11636
39411B680214M69239j21350p46858n61849J74759N17925J89129j97443j77649
39402B226117r911m4579j00291J60894N79091O44788J92845l90020o48662n01343
39392B108929j78009N9758P1644j04300k51723j66164P7664J85616M5851j07712
$$ plain form
39460 4841692 4826178 4484615 4010430 3694429 3624832 3755181 3939778 3921148 3614902 3365043
39450 3365043 3553943 4004438 4175308 3924178 3623359 3502591 3379575 3148971 3040128
39441 3040128 3195299 3428575 3612953 3893845 4299218 4550953 4504803 4363122 4205054 3790332
39431 3790332 3170009 2962308 3498382 4133308 4046142 3405419 3030187 3106327 3046859 2604603
39421 2604603 2290154 2475502 2809997 2874690 2808852 2860714 2842510 2559661 2368578 2680214
39411 2680214 3149453 3028103 2281245 1719396 1894155 2412080 2601209 2403766 2226117
39402 2226117 2216206 2171627 2071336 2232230 2811321 3456109 3648954 3258934 2610272 2108929
39392 2108929 1930920 1990678 2062322 1958022 1706299 1540135 1617799 1803415 1849266 1741554
39382A741554o6250J8117r6958k88721k15859J16822L01444J20862j33358j17585
39372A380068P1387J18516o192q1181m7850n0565r0759J8223K82328M16317K47037
39361B257329j2244p4472K0115L0524q6807j50643q0302j8474r7277k47999k98733
39350A241017j60860J02400L08441K75961K7473j56930l7416K51992L50643J50847
39340B353568j00486k20406l21735m84082m89624j60532K51544L47107J30927
39331A306281n5602p9759j22741k42174k24873J6969K45461K50228J17296o688
39321A204398j31412k29924j34615J34779K30041l2296k87941j03432L48550N02608
39311A500756J86857k17611l67145k98396j55769L3602K20446K93262K67267K31909
$$ plain form
39382 1741554 1675304 1693421 1596463 1307742 1091883 1208705 1510149 1631011 1497653 1380068
39372 1380068 1451455 1569971 1563779 1482598 1434748 1384183 1293424 1311647 1593975 2010292 2257329
39361 2257329 2245085 2170613 2190728 2221252 2134445 1983802 1903500 1885026 1787749 1539750 1241017
39350 1241017 1080157 1182557 1490998 1766959 1794432 1637502 1600086 1852078 2202721 2353568
39340 2353568 2253082 2032676 1710941 1226859 737235 576703 828247 1175354 1306281
39331 1306281 1250679 1170920 1048179 806005 581132 598101 843562 1093790 1211086 1204398
39321 1204398 1072986 843062 708447 843226 1073267 1040971 753030 649598 998148 1500756
39311 1500756 1687613 1470002 1102857 804461 648692 682294 902740 1196002 1463269 1695178
39301A695178Q7563l04926o74482n12701J30393N15045J96941l00062k47354K09049
39291G94644L14513j28723m92898k65497K74161N00444J97242l14616n54970k74567
39281D9733L10720O24668L15810k55153m27290j28110R0956l1623r6081J57097
39271F10727K84789j10550n66695l86656K32966M78563J90984K3871K71934M01885
39261A431818M7369l18235k03098N2624j16009n09844m94565l7071K97372K56452
39251D06813J43560J71070J87183J11294R4110J40784O4910q1302j6741K14166
39241A435847J99472j64640m54400l80640j76830q2811M7005L01981L86175J34252
39231A245411r8946j3336J02901q2712k90930j16896K00138J89313L5791K60141
$$ plain form
39301 1695178 1782741 1477815 803333 290632 421025 936070 1133011 832949 585595 794644
39291 794644 1109157 980434 487536 222039 496200 996644 1193886 879270 324300 49733
39281 49733 360453 985121 1300931 1045778 618488 490378 581334 549711 453630 610727
39271 610727 895516 784966 218271 -168385 64581 543144 734128 757999 1029933 1431818
39261 1431818 1479187 1160952 957854 1010478 894469 384625 -109940 -147011 150361 406813
39251 406813 550373 721443 908626 1019920 1114030 1254814 1319724 1238422 1221681 1435847
39241 1435847 1635319 1470679 1016279 635639 458809 375998 423003 724984 1111159 1245411
39231 1245411 1146465 1133129 1236030 1153318 862388 745492 945630 1134943 1170734 1430875
39221A430875O86840O16862K7060l15886j14165j588l75784o28277j49043N86419
39211A763313P00736K32974m5776J06636J66620j38455l66037j45730J90741J53240
39201B618262j44484k07842O8164K91028K00535K1564N6748K00346J14491k13646
39191C005166l90532j75285J22992L6517l83935n74548j87782M34525O76774L85424
39181B949316j6330j04737O0593J09605j10077l48371l15730p4941P2028R159
39171B230515q6529o4356M922K6296L7543M5930m8472j98833j48526J43459K96723
39160B238672M9830k69717k30906m595n9850l36365l43100k0415J66056M7470
39150A237080j6228J12899N9594l15326n21166j90833L21456N14503M10220K34282
$$ plain form
39221 1430875 2117715 2734577 2761637 2445751 2331586 2329998 1954214 1325937 1176894 1763313
39211 1763313 2464049 2697023 2651247 2757883 2924503 2786048 2420011 2274281 2465022 2618262
39201 2618262 2473778 2265936 2334100 2625128 2825663 2847227 2903975 3104321 3218812 3005166
39191 3005166 2614634 2439349 2562341 2598858 2214923 1640375 1452593 1887118 2563892 2949316
39181 2949316 2932986 2828249 2888842 2998447 2888370 2539999 2224269 2149328 2221356 2230515
39171 2230515 2143986 2079630 2084552 2110848 2148391 2194321 2145849 1947016 1798490 1941949 2238672
39160 2238672 2288502 2018785 1787879 1783284 1723434 1387069 1043969 1023554 1189610 1237080
39150 1237080 1220852 1333751 1393345 1078019 556853 366020 687476 1201979 1612199 1846481
39140A846481m3641l66314l21642J90517N12066J20370m66848m37632L9753J60317
39130A233427j55600k11927K12539N29014L74724J03006J7754p7734k85208l12236
39120A427759r7786l6741k24318j80804K44564M14462q2563o12967m04465K42603
39110F89744M45952Q9152j60045j874J56786K9026j26802o1892P6036J13192J42186
39099A391461K46775L05897K36244J17256k8776k56745m21459k53271J65048L73440
39089A875870J60054j41217j75179l1404N9762J39774K92529L06408r499l64039
39079B113059k94634J35413L84744J89042j38436k42297j76468j48423j38071
39070A683929l0220Q6268L5835j25720j62198p770J32003O5457j29377j98170
$$ plain form
39140 1846481 1802840 1436526 1114884 1305401 1817467 1937837 1470989 1033357 1073110 1233427
39130 1233427 1077827 865900 1078439 1607453 1982177 2085183 2102937 2025203 1739995 1427759
39120 1427759 1329973 1293232 1068914 888110 1132674 1547136 1464573 851606 447141 689744
39110 689744 1135696 1224848 1064803 1062929 1219715 1248741 1121939 1060047 1136083 1249275 1391461
39099 1391461 1638236 1944133 2180377 2297633 2268857 2012112 1590653 1337382 1502430 1875870
39089 1875870 2035924 1894707 1719528 1688124 1747886 1887660 2180189 2486597 2477098 2113059
39079 2113059 1818425 1953838 2338582 2527624 2389188 2146891 1970423 1822000 1683929
39070 1683929 1653709 1739977 1775812 1650092 1487894 1480124 1612127 1677584 1548207 1350037
39060A350037k1049K06437J48160k58812o27318n23368l8079K83529J61199o2721
39050F18015J8708K54022K23057m3156r2700K18715M79194L17738j12171m13877
39040A467545m26906k55528n9584K4640l4239m6700J86688M56659K83095l45971
39030A249699p56859m29367K68516N76270L19517m4331j75054j58064j35600r8971
39020F15756p5116j31738j61305o259J90625J27190j47179k59631j14271m0077
39010b005k03122k96299n4386K84946L49859J97322J53120K43045J53066k40389
39000E85157n97587n13627o0515K48258Q4815k40329j63163L28076O12529L11571
38990E95185j38728j38826J84389K53644k0047k04375j54368j54270k17069L214
$$ plain form
39060 1350037 1328988 1535425 1683585 1424773 797455 274087 236008 519537 680736 618015
39050 618015 636723 890745 1113802 1070646 977946 1196661 1675855 1993593 1881422 1467545
39040 1467545 1040639 785111 725527 750167 715928 669228 855916 1312575 1595670 1249699
39030 1249699 492840 63473 331989 908259 1227776 1183445 1008391 850327 714727 615756
39020 615756 540640 408902 247597 241338 431963 559153 411974 152343 38072 -2005
39010 -2005 -205127 -501426 -555812 -270866 78993 276315 429435 672480 825546 585157
39000 585157 -12430 -526057 -586572 -338314 -253499 -493828 -656991 -328915 283614 595185
38990 595185 456457 317631 502020 755664 735617 531242 376874 222604 5535 8749
38980H749M09269L48371l18070p56869l24895M19598N35240N7494k07301N7591
38970B29177L92996M01231J59786j70313n13689o40806l45855Q3633J21541k09248
38960d91547l46145o6359K16502J90513R0562J35493P9579k67077n24519k61521
38950a244519K58315L84444Q832l17598k10798O0305P4527j04217q3348K25443
38940i48614M62882L53817J04303O7580J92932J30855j50630k52689J3051K58714
38930B32201R2875k57537l03007m3597J07468K0503m3455K0299L9430K6835K09460
38919A01475M74482L61102j61163m66204j70590K54239K15983j06468j60509M3299
38909C85646L9489k41490l93082k54098r1100k0443J61660M49664M89061J74449
$$ plain form
38980 8749 418018 766389 448319 -308550 -633445 -213847 321393 378887 171586 229177
38970 229177 622173 1023404 1183190 1012877 499188 -141618 -487473 -403840 -282299 -491547
38960 -491547 -837692 -904051 -687549 -497036 -406474 -270981 -191402 -458479 -982998 -1244519
38950 -1244519 -986204 -601760 -592928 -910526 -1121324 -1061019 -986492 -1090709 -1174057 -948614
38940 -948614 -485732 -131915 -27612 39968 232900 363755 213125 -39564 -26513 232201
38930 232201 325076 67539 -235468 -279065 -171597 -151094 -194549 -174250 -134820 -107985 101475
38919 101475 575957 937059 775896 309692 139102 393341 609324 502856 342347 385646
38909 385646 425135 183645 -209437 -463535 -554635 -575078 -413418 36246 525307 699756
38899F99756j12669j17234q9807k44542l05443j7944K85911J64619j71393j67936
38889g6682J59249K54333m2982k34218L817K99730K01710j50826l33961k56272
38879a76102p7132J89229N37314O52197K31734m44842p38827m63319o8187L0882
38869c27053q8145j62420j31089m1736J15120K78254K70951P2177q0187k3177
38859a17305J03634J21484P6305N7240j7559k08054l44711k60769p1554J8578
38849f42711L8502J30738K46494K25791P6890q0333k46732m49743n14920k47449
38839a463473J87178L69730J51381j68107k25398L3234L72602M90998K48606j52146
38829a55395k85103j0971K39466j976n09633n82116k8863N18689M77448P9449
$$ plain form
38899 699756 587087 469853 380046 135504 -169939 -187883 98028 262647 91254 -76682
38889 -76682 82567 336900 293918 59700 63517 363247 564957 414131 80170 -176102
38879 -176102 -253234 -64005 473309 1125506 1357240 912398 173571 -289748 -357935 -327053
38869 -327053 -415198 -577618 -708707 -750443 -635323 -357069 -86118 -13941 -94128 -117305
38859 -117305 -13671 107813 184118 241358 223799 15745 -328966 -589735 -661289 -642711
38849 -642711 -604209 -473471 -226977 -1186 75704 -4629 -251361 -701104 -1216024 -1463473
38839 -1463473 -1276295 -906565 -755184 -923291 -1148689 -1115455 -742853 -251855 -3249 -155395
38829 -155395 -440498 -451469 -212003 -213979 -723612 -1305728 -1334591 -815902 -338454 -259005
38819b59005p2532R3540J33454j10170k37954L0897L32091J51807l65984n48514
38809h52370j43268L01438K27925j29710j46010K25705M25192J87125j08920j26525
38799a39418n4289j27643j78672m2290M2418j02440j38725K22405N54285K81322
38789C16953l25059m57959N648L52203J51105k02529k46197q8581r836J3041N4701
38778d36510j7804k22914k76536l7427K04290J66507j8705r0334k4864J13651
38768f40646L33572M82122K47097l02256n66728j82219M09294N51792K25303j22505
38758D34826k98757m18223m41860k03927J64421L05799J34930r5097j95747j75057
38748g88692k3778K61814M65031L26867l6880k31681j23502N1380J42381K63003
$$ plain form
38819 -259005 -331537 -237997 -104543 -214713 -452667 -421770 -89679 62128 -303856 -852370
38809 -852370 -995638 -694200 -466275 -595985 -741995 -516290 -91098 96027 -12893 -139418
38799 -139418 -193707 -321350 -500022 -542312 -499894 -602334 -741059 -518654 35631 316953
38789 316953 -8106 -466065 -460417 -108214 42891 -159638 -405835 -494416 -504252 -491211 -436510
38778 -436510 -454314 -677228 -953764 -991191 -786901 -620394 -639099 -729433 -754297 -640646
38768 -640646 -307074 175048 422145 119889 -446839 -629058 -219764 332028 557331 434826
38758 434826 136069 -282154 -724014 -927941 -763520 -457721 -322791 -417888 -613635 -788692
38748 -788692 -812470 -550656 -85625 241242 204362 -27319 -150821 -99441 42940 305943
38738C05943M03558K74687k01071n62077l49851J82251L20168j42331n91307m32696
38728g92726R1756K84982o34k21539k0951K70679K43027M8808M1501J33420K5683
38717A04006j67741r9150J49436J81449M227M910J94644J38270k51332n10287
38707b51568m02851k52960k56053j28598K27691L77353R2970j72882m1041J56462
38697f51477L2812j27750O8230L37178J94573j84564k92322j42652r0784r0862
38687i47618J34197M08681L21893k8434j92761j16151p1018l3165J75601L16655
38677c2120P4223j99450P8803O39623O24290n8738n73330m67881k08628j75194
38667b98402o6596L04201M89545J97548j22402m1414J26611m6437k95547j36558
$$ plain form
38738 305943 709501 984188 783117 221040 -128811 53440 373608 231277 -360030 -792726
38728 -792726 -700970 -415988 -416622 -638161 -659112 -388433 -145406 -96598 -55097 78323 104006
38717 104006 -63735 -162885 -13449 168000 172227 177137 371781 510051 258719 -251568
38707 -251568 -654419 -907379 -1163432 -1292030 -1064339 -686986 -594016 -766898 -807939 -651477
38697 -651477 -618665 -746415 -678185 -341007 -146434 -330998 -623320 -765972 -856756 -947618
38687 -947618 -813421 -404740 -82847 -111281 -304042 -420193 -491211 -524376 -348775 -32120
38677 -32120 42103 -157347 -78544 561079 1185369 1126631 553301 85420 -123208 -298402
38667 -298402 -364998 -60797 428748 626296 503894 462480 589091 542654 247107 110549
38657A10549K54618L04728n2051l38096k83001q6341L9656J46467L02308L83017
38647G81854K37429p4285k99198k46680j4390J07463j39j57697k21989l10281
38637a97913m71420m23560K180M07270L01240j44499l41099j34960J42397L29087
38627e31277M94248M59994L545m88562l62213K39800M66699N1397l30020k16987
38617b13376j2424j14304k29676k9720K33185K64067K43527L36530K99341K8676
38607H05826j24655l7621j33686n29271n95353R416N68164L07914m11610o83452
38597h24328l51187L1037J33999L9557j55077k86956n3565M44155N51594L5939
38587d34832l59442k1677M95567L78060j13486k03226K5701o3818l62849k18875
$$ plain form
38657 110549 365167 669895 617844 279748 -3253 -89594 -49938 96529 398837 781854
38647 781854 1019283 944998 645800 399120 384730 492193 492054 334357 112368 -197913
38637 -197913 -669333 -1092893 -1090713 -683443 -382203 -526702 -867801 -1002761 -860364 -531277
38627 -531277 -37029 422965 426510 -62052 -424265 -184465 282234 333631 3611 -213376
38617 -213376 -225800 -340104 -569780 -599500 -366315 -102248 141279 477809 777150 805826
38607 805826 681171 643550 509864 -19407 -614760 -605344 -37180 270734 -140876 -824328
38597 -824328 -1175515 -1144478 -1010479 -970922 -1125999 -1412955 -1466520 -1022365 -470771 -434832
38587 -434832 -794274 -815951 -320384 57676 -55810 -259036 -233335 -297153 -660002 -878877
38577h78877K65286L36350n1412j41748K78787N38252K74634l0974R446J13114
38567G12858q21j34546j16740j14704j77831p6228J90174K87322J15721n0197
38557F35008q3556j27907j72922q0299j2128k10058m03468j36649L67305M37699
38547B13025K6472k60611j93346j20244j34817L7069K63795R7606k68104j64791
38537e03946K93543K50527l61412n54476M6772N17389J95803k70207j82192M2460
38527e25739j44606l01348J07547N46655K47725m37140n91561j46283K54728L74055
38517f15967M32817M04136J26700j74868k34306k69636m94275n54209j58266K48037
38507a289837K06203P7699L04171M49156j2348n25247k49526M30604M70695p4201
$$ plain form
38577 -878877 -613591 -277241 -328653 -470401 -191614 346638 621272 590298 599744 712858
38567 712858 712037 577491 460751 346047 168216 91988 282162 569484 685205 635008
38557 635008 551452 423545 250623 170324 158196 -51862 -455330 -591979 -224674 213025
38547 213025 239497 -21114 -214460 -334704 -469521 -432452 -168657 -71051 -339155 -503946
38537 -503946 -210403 40124 -321288 -875764 -828992 -311603 -115800 -386007 -568199 -525739
38527 -525739 -670345 -971693 -864146 -317491 -69766 -506906 -1098467 -1244750 -990022 -615967
38517 -615967 -183150 220986 347686 172818 -61488 -331124 -825399 -1379608 -1537874 -1289837
38507 -1289837 -1083634 -1005935 -701764 -252608 -264956 -790203 -1039729 -609125 -138430 -212631
38497b12631k06559K45231M11598j2483l08137j08473M1218j46339j58172K27007
38487b27740L94560K429l35356j00998K36181N9440l68119m16917r4234J22938
38477g27816O6120p0464j53520j54494k7165J63311K62300L22856M90871N33040
38467G05039P0830n89312o10177R6857N49392J30926m34767k26493M32922N41316
38457F66533k2318m30088k20481J66959K05657m2189k04388r3397J98114M00651
38447F25053K52698j82694m73924l38272m7791k4272k07558j98043R2852L32663
38437a69288K79259N9975q2026o4231L4159P7912K766p1346K4288J83655Q1941
38426C57064k98701n08022k37625K15562M06190L50094K90622J61842k05740n53104
$$ plain form
38497 -212631 -419190 -173959 237639 225156 -82981 -191454 -150236 -296575 -454747 -227740
38487 -227740 166820 169249 -166107 -267105 -30924 28516 -339603 -756520 -850754 -727816
38477 -727816 -661696 -732160 -885680 -1040174 -1067339 -904028 -641728 -318872 171999 705039
38467 705039 775869 186557 -423620 -326763 222629 353555 -81212 -307705 125217 666533
38457 666533 644215 214127 -6354 160605 366262 324073 119685 26288 224402 625053
38447 625053 877751 695057 221133 -117139 -164930 -189202 -396760 -594803 -501951 -169288
38437 -169288 109971 169946 87920 23689 57848 135760 138526 67180 91468 275123 357064
38426 357064 58363 -449659 -687284 -471722 -65532 284562 575184 737026 531286 -21818
38416b1818m45239J1623K52782O7165j84259k15005j63574j63451n5307K31008
38406f86075M07586K36805p9195k02005j28939q2687r7512j5522J69093K33259
38396b45192L7559k50650l30958j08791K00837L10620J60447o8325k04795k38035
38386g37283k02499q4422O7664J13616M5757O6027K48800L18517M5156k97039
38376d15706k41194J63713L71763J21153k06205j67785J36865K86589J25093j28642
38366D5644k19708r5098J14743K03398N9493j65718j76050Q6556L24259K71412
38356D48931L7259j01747r0634o0981l4722P1496J96102J54743n7625k04921j15860
38345B42041J08303K47200J88037l6899k94829l88803k00076J31014K91225J35918
$$ plain form
38416 -21818 -467057 -455434 -202652 -135487 -319746 -534751 -698325 -861776 -917083 -686075
38406 -686075 -278489 -41684 -120879 -322884 -451823 -534510 -632022 -647544 -478451 -245192
38396 -245192 -207633 -458283 -789241 -898032 -697195 -386575 -226128 -294453 -499248 -737283
38386 -737283 -939782 -1024204 -956540 -842924 -797167 -731140 -482340 -163823 -118667 -415706
38376 -415706 -656900 -493187 -121424 -271 -206476 -374261 -237396 49193 174286 45644
38366 45644 -174064 -269162 -154419 48979 108472 -57246 -233296 -146740 177519 448931
38356 448931 486190 384443 293809 232828 198106 269602 465704 620447 562822 357901 242041
38345 242041 350344 597544 785581 748682 453853 65050 -135026 -4012 287213 423131
38335D23131j61563l45178l17504r9890K38653M89924L73037q4663m21682k84929
38325a90664N5181R4366j16140o5018L08934M01007q5941n13360j87146N18534
38315B19753O21895j7208m78611j54696L83697L09444k27841m06113J4727M15949
38305F80996K97486o0145j28769R8053K09919L7554j44345m2686K83649N41308
38295A773020N36253L10684L8269j25433j16903K7622K01860K89914K40078J05487
38285C280851M22j7748k1464j12089k27030j49379J77766M29471K16403l42556
38275C234647o30999k94009K45091L20731q3411l73753k26291L9502O7003k7097
38265B271414P88O7462j392j04576j10322j74808l91127m10703M3420N12774L24368
$$ plain form
38335 423131 261568 -83610 -401114 -501004 -262351 227573 600610 515947 94265 -190664
38325 -190664 -135483 -41117 -157257 -222275 86659 487666 401725 -111635 -298781 219753
38315 219753 841648 824440 345829 191133 574830 884274 656433 250320 265047 680996
38305 680996 978482 918337 789568 887621 1097540 1135094 990749 948063 1231712 1773020
38295 1773020 2309273 2619957 2658226 2532793 2415890 2443512 2645372 2935286 3175364 3280851
38285 3280851 3281273 3263525 3242061 3129972 2902942 2753563 2931329 3360800 3577203 3234647
38275 3234647 2603648 2309639 2554730 2875461 2792050 2418297 2192006 2231508 2298511 2271414
38265 2271414 2272202 2339664 2338272 2233696 2123374 1948566 1557439 1146736 1190156 1702930 2027298
38254B027298l05979m40912J93207P38057M44144k76652n32136j93517J23921
38245A777431K9133k73656m61077m41151k42845N3421K45465J63989p1712j69496
38235F09502l4971J52634K04677R7684p5631j85137j43365j7759K2015m3740l3239
38224E52670J25777K28805J07972p6900o9221J20124K83846L05502J85995n3568
38214A711002l06033l93595l30704l55894n16638n08810j74854J70448K41236
38205d63842K50412M40055M95566K1686o38671p44005k27690K34581K39525Q7627
38195c04756J07263J76478J12959M304o5987j65195k19414m0184K16272J36804
38185d1456k25837k87702J52481N19849L40158n1664j34060k2299j16496l26294
$$ plain form
38254 2027298 1721319 1280407 1473614 2211671 2655815 2379163 1847027 1653510 1777431
38245 1777431 1806564 1532908 1071831 630680 387835 441256 686721 850710 778998 609502
38235 609502 574531 727165 931842 1029526 953895 768758 625393 607634 629649 585909 552670
38224 552670 678447 907252 1015224 938324 869103 989227 1273073 1578575 1764570 1711002
38214 1711002 1404969 1011374 680670 324776 -191862 -700672 -875526 -705078 -463842
38205 -463842 -213430 226625 722191 743877 105206 -638799 -866489 -631908 -392383 -304756
38195 -304756 -197493 -21015 91944 96248 30261 -134934 -354348 -394532 -178260 -41456
38185 -41456 -267293 -554995 -402514 117335 457493 405829 271769 249470 132974 -193320
38175a93320k58206P3035K94972K85021K24198J67208K2794j33908j50786j11681
38165B19327j84639k74061j85828J1953J57358L12354M93006L55673k79476q26253
38155b00586n74687J63014L55727k28981o61465k78320L51270L93383j849j03350
38145g85844K08733M08207K60900Q1387P9439O8239p6252j67433q6581j2066p3732
38134i5003j00978N4414J97125O6080k12962k43900Q5676M08895L29338p5918
38124D12767l43073j78740K01211L46878J04805k35496l09285p8189J75114J77275
38114B73267o0104k55025j30496K73484N76070M40467j7827l41870k81791o5262
38104D10913l4951j95102k88250j97103n6017p513m1669p7291m9528Q1164K68690
$$ plain form
38175 -193320 -451526 -378491 -83519 201502 425700 592908 615702 481794 331008 219327
38165 219327 34688 -239373 -425201 -413248 -255890 56464 549470 905143 625667 -200586
38155 -200586 -775273 -612259 -256532 -485513 -1146978 -1425298 -1074028 -680645 -682494 -785844
38145 -785844 -577111 -168904 91996 173383 252822 321061 244809 77376 -9205 -21271 -95003
38134 -95003 -195981 -141567 55558 121638 -91324 -335224 -249548 159347 488685 412767
38124 412767 69694 -109046 92165 439043 543848 308352 -933 -79122 95992 273267
38114 273267 213163 -41862 -172358 101126 677196 1117663 1099836 757966 476175 410913
38104 410913 375962 180860 -107390 -304493 -360510 -368023 -409692 -486983 -536511 -455347 -186657
38093a86657L43641J83814q8476k32001j90411r5576K506J67018L17858K36805
38083D58521n8517k29282r3358O4946p9029l60616l47791K1716L65678L91796
38073A34064J93008j2954j45813j90047j07262O9550K16450K53483J74013k4668
38063E59824k54953k74783p216J58719j86746p30959o82430Q5814P14327N09128
38053a09275j29553m05667k55174j32330o2896K68504O54377M75133k38417o67583
38043f02881l82113O9957J05682l3011J29676M15753L49712L6340k5196J57472
38033B21391N3132m68175q14194n03448J27381L70302M7454l56265l65734l2216
38023a720372K67894L30242K37966P3301k08699n18425n16234m7819M64425M51802
$$ plain form
38093 -186657 156984 340798 252322 20321 -170090 -265666 -263160 -96142 221716 458521
38083 458521 400004 170722 77364 142310 63281 -297335 -645126 -623410 -257732 134064
38073 134064 327072 314118 168305 -21742 -129004 -59454 156996 410479 584492 559824
38063 559824 304871 30088 22872 181591 -5155 -736114 -1418544 -1332730 -618403 -109275
38053 -109275 -238828 -644495 -899669 -1031999 -1094895 -826391 -172014 303119 64702 -602881
38043 -602881 -984994 -915037 -809355 -842366 -712690 -296937 52775 89115 63919 221391
38033 221391 274523 -193652 -1007846 -1511294 -1383913 -1013611 -966157 -1322422 -1688156 -1720372
38023 -1720372 -1452478 -1122236 -884270 -810969 -1019668 -1538093 -2054327 -2102146 -1637721 -1185919
38013a185919j1581k65084K9842M68349N47804L07817P0055p2734j76203j77070
38003d64724o8956p2317k64853l14620J2760L47848K05183k24919l14322P6745
37993a082175M55431M57623K32996K3613j59970l36486m26345m21677l63422j55786
37983a776198K34491M73481K42801j27736j8616M53158M78095j75740o86501l86570
37973a289335K25825K79222j76296l71342j8194L98720M42130K22264M0305m13
37963b47114N4247J17794P8460n9237r6416O6809J83647j010k97170l13016o3023
37952e76029O1398r0501k33898j27484R7213J92387J18369R422j309J23159K59380
37941a67893J92720q7181k74474j56826K5721m2402j89294k8383L12240L10529
$$ plain form
38013 -1185919 -1197500 -1462584 -1432742 -964393 -416589 -108772 -38717 -111451 -287654 -464724
38003 -464724 -533680 -605997 -870850 -1185470 -1172710 -824862 -619679 -844598 -1158920 -1082175
37993 -1082175 -626744 -169121 63875 87488 -72482 -408968 -835313 -1256990 -1620412 -1776198
37983 -1776198 -1541707 -1068226 -825425 -953161 -971777 -518619 -40524 -216264 -902765 -1289335
37973 -1289335 -1063510 -784288 -960584 -1331926 -1350120 -951400 -509270 -287006 -246701 -247114
37963 -247114 -192867 -75073 3387 -55850 -152266 -85457 98190 97180 -199990 -513006 -576029
37952 -576029 -514631 -605132 -839030 -966514 -869301 -676914 -558545 -549123 -550432 -427273 -167893
37941 -167893 24827 -62354 -336828 -493654 -467933 -510335 -699629 -728012 -415772 -105243
37931a05243o8079k44170K5891K12143r9299m57862k61978J98836J35451m71701
37921a136011p41796j52910O85123Q40268K42343l42658l43520L412J11964j59395
37911i93180l71143j11738M44438P23741M47158m7000k49801r0524P9007L2475
37901a36567l9728J29631M24749M26124m4079o18982p61385l86112N7628J49377
37891g99344m8156k08466k12658j69616j06628M1728J76559J08523p2717m8770
37881a339545K07952L23563J08426j05031J3780K45883J64483j96533m17042l07939
37871a302003o5399J24268K55582K92935J47487r0713j94901j20875l3110j2487
37861i99216q986o4579k59214m27286k88348Q0432K69447J32967j4963N1861J11162
$$ plain form
37931 -105243 -173322 -417492 -391601 -179458 -278757 -736619 -998597 -799761 -664310 -1136011
37921 -1136011 -1877807 -2030717 -1345594 -505326 -262983 -605641 -949161 -945749 -833785 -993180
37911 -993180 -1364323 -1476061 -1031623 -307882 139276 92276 -157525 -248049 -169042 -136567
37901 -136567 -176295 -46664 378085 804209 760130 141148 -620237 -1006349 -948721 -799344
37891 -799344 -847500 -1055966 -1268624 -1438240 -1544868 -1503140 -1326581 -1218058 -1290775 -1339545
37881 -1339545 -1131593 -808030 -699604 -804635 -790855 -544972 -380489 -577022 -994064 -1302003
37871 -1302003 -1367402 -1243134 -987552 -694617 -547130 -637843 -832744 -953619 -986729 -999216
37861 -999216 -1008202 -1072781 -1331995 -1759281 -2047629 -1967197 -1697750 -1564783 -1579746 -1527885 -1416723
37850a416723r2622m06796n22677m10944k35380n4061J28399K01286R7128m8610
37840b761000q8597n3261N30J01691J75558M7226j71614p5414L70977N79527J63138
37829a711239l92897m25232j10441j22331n02271o21820k12745K91232M90990
37820c316754M37323K39111p8670k22794J61939P58239P63183O3505m97295l57037
37810b049250M977o676j64314j3458K55517K67203K47254N35670P44848K88945
37800A10716n22733q15747m33192l4312K2598M3421K16038K99166K27705K64901
37790f21439L73364J62232l25985m93088j19825K62824K42652Q4459O1047p0824
37780d44583m40676n62566p7196N20434N51222J55589k1687J69749L59882L86571
$$ plain form
37850 -1416723 -1509345 -1916141 -2438818 -2849762 -3085142 -3139203 -3010804 -2809518 -2712390 -2761000
37840 -2761000 -2849597 -2902858 -2902328 -2800637 -2625079 -2577853 -2749467 -2824881 -2453904 -1874377 -1711239
37829 -1711239 -2104136 -2529368 -2639809 -2762140 -3264411 -3886231 -4098976 -3807744 -3316754
37820 -3316754 -2879431 -2640320 -2718990 -2941784 -2779845 -2021606 -1258423 -1194918 -1692213 -2049250
37810 -2049250 -2044273 -2050949 -2215263 -2228721 -1973204 -1706001 -1458747 -923077 -178229 110716
37800 110716 -412017 -1227764 -1660956 -1695268 -1672670 -1629249 -1413211 -1114045 -886340 -621439
37790 -621439 -248075 -85843 -411828 -904916 -1024741 -761917 -519265 -434806 -373759 -444583
37780 -444583 -885259 -1447825 -1525021 -1004587 -453365 -297776 -319463 -149714 210168 596739
37770E96739L76900K46722k15467p90289r43038n44306J005L58283N35491N38991
37760A61031K47492k55531o15980o10095l42377j3239K34912K69878R6503O731
37750h20675K55296O07952N82331J25010l38785n16745m87771l36260m0268K10717
37740g59198J03941k42692l11010M2773L37205K24918n122l65P8920k8061j37286
37729f95977J5131K22583J65327K6508J59736L61669J39543l89241n63679k04762
37719g63162J04787k8916k15698M08L61845L46533L7188m4666J85714K59728m8944
37708A94817l48690k61979j0288k3625k39354k24230R1207K53808k4669l96922
37698i89925l50926R5067M74789N04733L02777M9628k02776l56232k59316L147
$$ plain form
37770 596739 973639 1220361 1004894 214605 -728433 -1272739 -1271734 -913451 -377960 161031
37760 161031 408523 152992 -462988 -1073083 -1415460 -1428699 -1193787 -923909 -827406 -820675
37750 -820675 -565379 42573 624904 749914 411129 -105616 -593387 -929647 -969915 -759198
37740 -759198 -655257 -897949 -1208959 -1166186 -828981 -604063 -609185 -609550 -530630 -558691 -695977
37729 -695977 -680846 -458263 -292936 -266428 -106692 254977 394520 5279 -558400 -763162
37719 -763162 -658375 -687291 -902989 -902581 -540736 -194203 -157015 -201681 -15967 243761 194817
37708 194817 -153873 -415852 -426140 -449765 -689119 -913349 -822142 -568334 -593003 -989925
37698 -989925 -1340851 -1245784 -770995 -266262 36515 86143 -116633 -472865 -732181 -729034
37688g29034J23924K8151P830K06639L02824J8367l44996l07958K7807J22798
37678e43648j39248k60127P5985M90149M68691Q3084k00501k04311j44056j47968
37668e21950p0443J48110K63482O8583k28441k08564K03179N87192N08481K0012
37658G69641m34399n50494m31795l23464k69646j49488P8047L20703M70837M39743
37648h0315J64431k39544m18164j31274L45342M58633Q7311k82499k37135P835
37638c25379k0k34063k50877J07343M74305N01288K99143J64965J30189L1723
37628H98617j26347j69815o8679J5442L5073J58296M33052N59625K42797l08925
37618A669136n19086j53382L31317L29302j49340m93614k67687K60056M85042
$$ plain form
37688 -729034 -605110 -576959 -569129 -362490 -59666 -41299 -386295 -694253 -666446 -543648
37678 -543648 -682896 -943023 -867038 -376889 91802 174886 -25615 -229926 -373982 -521950
37668 -521950 -592393 -444283 -180801 -112218 -340659 -549223 -346044 241148 749629 769641
37658 769641 335242 -215252 -647047 -970511 -1240157 -1389645 -1311598 -990895 -520058 -80315
37648 -80315 84116 -155428 -573592 -704866 -359524 99109 186420 -96079 -333214 -325379
37638 -325379 -325399 -559462 -810339 -702996 -228691 272597 571740 736705 866894 898617
37628 898617 772270 602455 533776 549218 584291 742587 1175639 1735264 1978061 1669136
37618 1669136 1150050 996668 1327985 1657287 1507947 1014333 746646 1006702 1491744
37609A491744K11900j65029k02344O3368K30331P6737j74143j72993R5671L08525
37599A763767K32242k021j21170p1221j1241k1097O2J33836K99117L56425K40875
37588B799574l1178l49551m80692k42578K01274M13900J94499j56162k52069j20384
37578A976633l9790m7677M6009K26356K49025Q6900J4372J23954J36612r8483
37568B673911k75552j12943J41032Q3505j76201j95501N6766J49139p6226k23538
37558B044392N459L12548K67326l9655j76312k1054J35205P4506r0692j65424
37548B346299j15482l413J18576J78701R7664r5243k56166k83005k03295r5450
37538A689186r279K6747O031l5462o0806p3787n9363M0252J73793J08510k73659
$$ plain form
37609 1491744 1703644 1538615 1336271 1399639 1629970 1706707 1532564 1359571 1455242 1763767
37599 1763767 1996009 1993988 1872818 1801597 1790356 1769259 1769321 1903157 2202274 2558699 2799574
37588 2799574 2768396 2418845 1938153 1695575 1896849 2310749 2505248 2349086 2097017 1976633
37578 1976633 1936843 1889166 1935175 2161531 2410556 2497456 2511828 2635782 2772394 2673911
37568 2673911 2398359 2285416 2426448 2509953 2333752 2138251 2195017 2344156 2267930 2044392
37558 2044392 2049851 2362399 2629725 2590070 2413758 2392704 2527909 2602415 2511723 2346299
37548 2346299 2230817 2227404 2345980 2524681 2622345 2527102 2270936 1987931 1784636 1689186
37538 1689186 1679907 1706654 1712685 1677223 1616417 1542630 1483267 1523519 1697312 1805822 1532163
37527A532163o55340n46280O8112O15358O20754K64294M2148P6767O9878j46695
37517A941159l51331k84516q211K07792J99825L650k36217l40491j90430J21712
37507A062942L17377K39665P1880R5301K77050L03988M6270k45665l21616k85626
37497A561566l46593l86617j22154L35907M76798Q7152l84130m15154j03081O9248
37487G72942k8269q9260L4081J06708k9875j81664j69511j26713j90061j94458
37477i6080K4749K67600K55122J04947J42206L39694L53711J02742r5574l6675
37467A362442R7162J10234R4690J57795J51613n5059k61353j96986M0269J16492
37457A617299m0936j76438j30004m6991r6674k02706j68400N7441L24428M15172
$$ plain form
37527 1532163 876823 330543 398655 1014013 1634767 1899061 1941209 2017976 2087854 1941159
37517 1941159 1589828 1305312 1297101 1504893 1704718 1708368 1472151 1131660 941230 1062942
37507 1062942 1380319 1619984 1691864 1787165 2064215 2368203 2414473 2168808 1847192 1561566
37497 1561566 1214973 828356 706202 1042109 1518907 1606059 1221929 806775 703694 772942
37487 772942 744673 655413 689494 796202 766327 584663 415152 288439 98378 -96080
37477 -96080 -71331 196269 451391 556338 698544 1038238 1391949 1494691 1399117 1362442
37467 1362442 1459604 1569838 1664528 1822323 1973936 1918877 1657524 1460538 1500807 1617299
37457 1617299 1576363 1399925 1269921 1222930 1126256 923550 755150 812591 1137019 1552191
37447A552191K18792j36223l39161k18597K3180P9746O840J27474M24940M18369
37437B157551j13518o33840m95554J18199M19820J35428j74871n2093J84031N7652
37427A602805k30137j42349K76005M37784J26603k16286k26762j07504j45407
37418A374752j95755p098K59918K48795l2071k41077k06162o5576M5863J48454
37408A330043K59601L33861L59022L09499O1829m01354p66836o67086j71709K79735
37398I26605M24139L53288J76414j01247l13558j84822J96966L69932J70411j510
37388B016618J36162K43445m5443m10315k89575K05025M32544J88189q4401o9666
37378B322583J8803m9709j41358j11614r4620j85129k16321j10831q2885k10218
$$ plain form
37447 1552191 1770983 1634760 1295599 1077002 1100182 1179928 1186768 1314242 1739182 2157551
37437 2157551 2044033 1410193 914639 1032838 1452658 1588086 1413215 1361122 1545153 1602805
37427 1602805 1372668 1230319 1506324 1944108 2070711 1854425 1627663 1520159 1374752
37418 1374752 1178997 1171899 1431817 1680612 1648541 1407464 1201302 1135726 1181589 1330043
37408 1330043 1589644 1923505 2282527 2592026 2653855 2252501 1485665 818579 646870 926605
37398 926605 1350744 1704032 1880446 1779199 1465641 1280819 1477785 1847717 2018128 2016618
37388 2016618 2152780 2396225 2350782 1940467 1650892 1855917 2288461 2476650 2392249 2322583
37378 2322583 2341386 2291677 2150319 2038705 1944085 1758956 1542635 1431804 1348919 1138701
37368A138701j81514J74631M55600K23878k75206m23668j05591K19142K41550
37359A467523J10656J201j43838l18875l17547q2469J14152L5783j98579l18689
37349C49318k33461k9245J75801K60080J56519k1778q5179n4975j31043l14799
37339G1238l43072j16363J01098Q9335k081L1969P9168n1988k29635j71204J05033
37328d36502L14095L06738J55286p6154l45314m71480k78531R3461K94483K11159
37318b32759P1118P8183J69344J76481M2384j60951k91989k34627n7551N741j16095
37307e50721j76836L341J96909J24112n3968j8801J00101o1902l76931l38561
37297a153257O6053K74637R3515J4137K91664M26294M1953l69523k23956J55297
$$ plain form
37368 1138701 957187 1131818 1587418 1811296 1536090 1112422 1006831 1225973 1467523
37359 1467523 1578179 1579380 1435542 1116667 799120 716651 830803 866586 668007 349318
37349 349318 115857 86612 262413 522493 679012 657234 572055 517080 386037 71238
37339 71238 -271834 -388197 -287099 -197764 -199845 -167876 -88708 -140696 -370331 -541535 -436502
37328 -436502 -122407 184331 339617 263463 -81851 -553331 -831862 -738401 -443918 -232759
37318 -232759 -161641 -83458 85886 262367 304751 143800 -148189 -382816 -440367 -434626 -550721
37307 -550721 -727557 -724216 -527307 -403195 -457163 -475964 -375863 -437765 -814696 -1153257
37297 -1153257 -1087204 -812567 -719052 -704915 -413251 13043 54996 -314527 -538483 -383186
37287c83186O5348m02362n18739p0619M18043N71188N41809M66385K20874j41020
37277G67721k98938j85775q8618j01664o87K03453J57659j71432k91833N5416
37267D5302M39861L90618M6016k11935l37314m24281l36224k41K59489J62989
37257C4280l6802J3571J35564l2207k95849j59224K95115M34525J8131m79257
37247g2153n87934l60963l8360K97288N29078M26689K0144l00527k89413j34072
37237e10223n8089N808J25096J30258l9264j06772P6972J73574j15227m45134
37227g63001k75482K49014M34293M3650l78768l17084N6848K60896J70521J8934
37217e00179k7263M153O2775J26369J25126j0455k34006m02595l87036j50229
$$ plain form
37287 -383186 -317838 -720200 -1238939 -1309558 -891515 -320327 221482 687867 908741 767721
37277 767721 468783 283008 194390 92726 92039 295492 453151 281719 -10114 45302
37267 45302 485163 875781 921797 709862 372548 -51733 -387957 -388198 -128709 34280
37257 34280 -2522 11049 146613 114406 -181443 -340667 -45552 388973 407104 -72153
37247 -72153 -660087 -1021050 -1059410 -762122 -233044 193645 213789 -86738 -376151 -510223
37237 -510223 -568312 -562504 -437408 -307150 -346414 -453186 -376214 -202640 -317867 -763001
37227 -763001 -1038483 -789469 -355176 -311526 -690294 -1007378 -950530 -689634 -519113 -500179
37217 -500179 -527442 -523289 -460514 -334145 -209019 -219474 -453480 -856075 -1243111 -1393340
37207a393340J84165L32998R5570l44397n44702l26821K5095K02840K62720L67000
37197a138872L91732J40221j98065k11067J22946L68410K51145o878j06960j00206
37187d87594j73773k66966j80482P4464K93756L69343L45233K47093O8037j03253
37177A85858j41089q5158j20205l13712m94171m39481j19723K67825M61595L41037
37167d57224J1969l13893n12416n65374m34940r3611K94546M41520K95398J28167
37157a205858J21954R9377j22011l46887k85610l7390P4083J5997n436j3707k00994
37146a906482m14427k45278K46713M39076L6357m28638l48160J08577L42751K16536
37136a952975P8470P4750j3536k49920l51138j47001J28927J82781N3799J706
$$ plain form
37207 -1393340 -1209175 -876177 -780607 -1125004 -1669706 -1996527 -1971432 -1768592 -1505872 -1138872
37197 -1138872 -747140 -606919 -804984 -1016051 -893105 -524695 -273550 -280428 -387388 -487594
37187 -487594 -661367 -928333 -1108815 -1034351 -740595 -371252 -26019 221074 289111 185858
37177 185858 44769 -40389 -160594 -474306 -968477 -1407958 -1527681 -1259856 -798261 -457224
37167 -457224 -445255 -759148 -1271564 -1836938 -2271878 -2365489 -2070943 -1629423 -1334025 -1205858
37157 -1205858 -1083904 -984527 -1106538 -1453425 -1739035 -1776425 -1702342 -1686345 -1691781 -1705488 -1906482
37146 -1906482 -2320909 -2566187 -2319474 -1880398 -1844041 -2272679 -2620839 -2512262 -2169511 -1952975
37136 -1952975 -1874505 -1799755 -1813291 -2063211 -2414349 -2561350 -2432423 -2249642 -2195843 -2194137
37126b194137J50508L66762M11755J68885k08555l91801k15989J17614K92665
37117a502293K49973J46272M1760j20843k66826k12575J1276J21779k9396k39008
37107a799881k26105N2533M39451P34384P28181L09500l04756o42816m76333r6421
37097a282263R1043P5737J05179J93566J21330j04351j67970N8572K59015J25263
37087e24879j74511k57256r0827L7209M6401J63476M17099M34470P033m42299
37077c84084l53617J49768L80405M3900l65377l04993O0105J76037n9202j92757
37067h49815O7094M07382L46306r8762m10355k16543K44932M27754J67464j39851
37057e4394j24804L4048n4833l10183k65621J46161L96246J56261j70609q4635
$$ plain form
37126 -2194137 -2043629 -1676867 -1265112 -1096227 -1304782 -1696583 -1912572 -1794958 -1502293
37117 -1502293 -1252320 -1106048 -1064288 -1185131 -1451957 -1664532 -1653256 -1531477 -1560873 -1799881
37107 -1799881 -2025986 -1973453 -1534002 -799618 -71437 238063 -66693 -709509 -1185842 -1282263
37097 -1282263 -1191220 -1115483 -1010304 -816738 -695408 -799759 -967729 -909157 -650142 -524879
37087 -524879 -699390 -956646 -1047473 -1010264 -963863 -800387 -383288 51182 58215 -384084
37077 -384084 -737701 -587933 -207528 -163628 -529005 -833998 -773893 -597856 -657058 -849815
37067 -849815 -782721 -375339 -29033 -127795 -538150 -754693 -509761 -82007 85457 -54394
37057 -54394 -179198 -145150 -199983 -510166 -775787 -629626 -233380 -77119 -247728 -332363
37047c32363K24219K25551o6525j47555J13798K66287L1331k58120k04123O9588
37037g7912J61132m4984l22521m41862l47471j13694J13900K11371J98362J83931
37027d79748J79089J10600J5445J3715P5054N0055m2399l1031P0132N8237n9827
37016d0678l5509J35357J15324j74827l07959m0177J81386j14233n81906m96088
37006a359310J37414N48010K94667j95839l27605o3839K67234M64858M67158K12635
36996D45383j81240l50582j32384J05304o5719m57888m66125O2177N67411N38089
36986F4426J83556O0008K49270L00564m3751m58233n17235k65962n8751k8051
36976e14159k4444J4188k4426j32190j13329R7605L04568L38563K48272J12279
$$ plain form
37047 -332363 -108144 117407 50882 -96673 17125 283412 314743 56623 -147500 -77912
37037 -77912 83220 38236 -284285 -726147 -1073618 -1187312 -1073412 -862041 -663679 -479748
37027 -479748 -300659 -190059 -174614 -160899 -85845 -35790 -78189 -109220 -39088 19149 -40678
37016 -40678 -76187 59170 174494 -333 -308292 -348469 -167083 -281316 -863222 -1359310
37006 -1359310 -1221896 -673886 -379219 -575058 -902663 -966502 -699268 -234410 232748 445383
36996 445383 264143 -86439 -218823 -113519 -179238 -637126 -1103251 -1041074 -473663 64426
36986 64426 247982 307990 557260 857824 814073 355840 -161395 -427357 -486108 -514159
36976 -514159 -538603 -524415 -548841 -681031 -794360 -696755 -392187 -53624 194648 306927
36966C06927p9988k38476j53340J44091K82271O1532j96523j19587J31500J28495
36956B66902j50267l44713l17328k71497k72315j20151K00186L80777K79735J69985
36946a78686K72444L79123K31921J563L1539K65680L03358o606l47925l73725
36936E78686j29810O2480M096k10367l54398l12781j62145n0593l3325m7097k1831
36925f77085L7252Q2839Q9179O3340K2046l2745j17040k12066k12770k5412K45813
36914g36649L47194K07560O7689J23950K16414J14980m4105M2936K97386L27270
36904I64625O7134r6055M1069J77099L7612j86017k27638j99641k86813l23374
36894c1999j18785P5736n6896k69407r0106L17982L06211k06297n16649k01315
$$ plain form
36966 306927 226939 -11537 -164877 -20786 261485 323017 126494 6907 138407 266902
36956 266902 116635 -228078 -545406 -816903 -1089218 -1209369 -1009183 -628406 -348671 -178686
36946 -178686 93758 472881 704802 706365 737904 1003584 1306942 1300336 952411 578686
36936 578686 448876 511356 515452 305085 -49313 -362094 -524239 -574832 -608157 -655254 -677085
36925 -677085 -639833 -556994 -467815 -404475 -382429 -415174 -532214 -744280 -957050 -982462 -736649
36914 -736649 -389455 -181895 -114206 9744 226158 341138 297033 339969 637355 964625
36904 964625 1031759 935704 976773 1153872 1191484 1005467 777829 578188 291375 -31999
36894 -31999 -150784 -75048 -131944 -401351 -491457 -173475 132736 -73561 -590210 -791525
36884g91525K42053K06677r9014o5896L34848N70111L77276L5435j56589k03118
36874D50258j82279j01436n0229j39979k11245M3780N45258P63822L97602j80512
36864A335040m04288k18994k4309o7908k05683k20476j03463K8055J07926J47875
36854C73775J86589K49965L10323K96064J88667O5380j2468q9280k18289l44254
36844A006472l70406k75495q3774J84380M23094M19970R7200k99381m35516k71821
36834C94723m3431Q8025J54358J79027R6712p2755j66608p8446J15403K73272
36824I40280L08263J76404j03645l84007m77183l49011j24684P1784J61768P5178
36814B95147j36224k28323n6892J36193M1644j81663j01989K57855L88794J12027
$$ plain form
36884 -791525 -549472 -342795 -441809 -507705 -172857 397254 774530 809965 653376 450258
36874 450258 267979 166543 116314 -23665 -234910 -191130 354128 1117950 1515552 1335040
36864 1335040 930752 711758 687449 619541 413858 193382 89919 117974 225900 373775
36854 373775 560364 810329 1120652 1416716 1605383 1670763 1658295 1569015 1350726 1006472
36844 1006472 636066 360571 276797 461177 884271 1304241 1401441 1102060 666544 394723
36834 394723 351292 439317 593675 772702 869414 796659 630051 551605 667008 940280
36824 940280 1248543 1424947 1321302 937295 460112 111101 -13583 58201 219969 295147
36814 295147 158923 -69400 -126292 9901 51545 -130118 -232107 25748 414542 526569
36804E26569j05137Q7887L48143K11483j77267l60471k58201q2803J45189M64615
36794H00007N85592K19714l21868m38415j04870J27764j197j57877n6636J28510
36784G80724J54379N5249o8413k07300k52863n4542K05647J34572k20718l18976
36774B07759N0459L70602J51610l41294n10524k44246R9935K76770L17042K87238
36764F65351K38308K58785L10851J96357p3196j40875J53677L92388J43978l44393
36754A801231m93918k40824j7273l370M5279K28569K96824J13607j19512k13461
36744A397152j90504o5994J74854L29682J56856j15873K6629N31434O71540J07187
36734C022963m99742m05364J47898L85165J77010M2316J35590K9395l95495n88130
$$ plain form
36804 526569 421432 509319 857462 1068945 891678 531207 273006 190203 335392 800007
36794 800007 1385599 1605313 1283445 845030 740160 867924 866727 708850 652214 780724
36784 780724 935103 990352 921939 714639 461776 407234 612881 747453 526735 207759
36774 207759 258218 628820 780430 439136 -71388 -315634 -215699 61071 378113 665351
36764 665351 903659 1162444 1473295 1669652 1596456 1455581 1609258 2001646 2145624 1801231
36754 1801231 1307313 1066489 1049216 1045846 1091125 1319694 1616518 1730125 1610613 1397152
36744 1397152 1206648 1140654 1315508 1645190 1802046 1686173 1712802 2244236 2915776 3022963
36734 3022963 2523221 2117857 2265755 2650920 2827930 2870246 3005836 3035231 2639736 2051606
$$ [...]
##END NTUPLES=NMR SPECTRUM
##END=
