##TITLE=31Pdec_LR-673-R2-HCR6
 D2O, 24 sc
 23.12.2019
##JCAMPDX= 6.0         $$ Bruker NMR JCAMP-DX V2.0
##DATA TYPE= NMR SPECTRUM
##DATA CLASS= NTUPLES
##ORIGIN= UXNMR, Bruker Analytische Messtechnik GmbH
##OWNER= root
$$ XWIN-NMR		Version 3.5
$$ Mon Dec 23 16:29:33 2019 Russian Standard Time (UT+4h)  she@DPX200
##.OBSERVE FREQUENCY= 81.013821
##.OBSERVE NUCLEUS= ^31P
##.ACQUISITION MODE= SIMULTANEOUS
##.ACQUISITION SCHEME= undefined
##.AVERAGES= 24
##.DIGITISER RES= 17
##SPECTROMETER/DATA SYSTEM= spect
##.PULSE SEQUENCE= zgpg30
##.SOLVENT NAME= CDCl3
##.SHIFT REFERENCE= (INTERNAL, CDCl3, 0, 182.463)
##AUDIT TRAIL= $$ (NUMBER, WHEN, WHO, WHERE, WHAT)
$$ ##TITLE= Audit trail, XWIN-NMR		Version 3.5
$$ ##JCAMPDX= 5.01
$$ ##ORIGIN= Bruker BioSpin GmbH
$$ ##OWNER= she
$$ F:/spectra/data/she/nmr/P31/1/pdata/1/auditp.txt
$$ ##AUDIT TRAIL=  $$ (NUMBER, WHEN, WHO, WHERE, WHAT)
(   1,<2019-12-23 16:28:05.71 +0400>,<she>,<DPX200>,
      <created by zg, POWCHK disabled, PULCHK disabled
       configuration hash MD5:
       00 E9 B6 7A A2 85 ED C7 34 08 36 98 17 FE 4E 26
       data hash MD5: 32K
       60 26 EC D7 B2 13 AA 8D 75 85 34 AF 50 B3 DE 9C>)
(   2,<2019-12-23 16:28:07.95 +0400>,<she>,<DPX200>,
      <Start of raw data processing
       efp BC_mod = 2 LB = 1 FT_mod = 6 PKNL = 1 PHC0 = -1711.872 PHC1 = 147.6012 SI = 64K 
       data hash MD5: 64K
       6C 39 A7 F5 12 84 8C 67 94 D3 F8 EA 8C C8 D1 C6>)
(   3,<2019-12-23 16:28:21.93 +0400>,<she>,<DPX200>,
      <pk PHC0 = -3.928038 PHC1 = 0 
       data hash MD5: 64K
       33 81 2A A7 D5 31 05 42 D6 24 6E 50 AF 5E B9 C9>)
(   4,<2019-12-23 16:28:26.59 +0400>,<she>,<DPX200>,
      <abs ABSG = 5 
       data hash MD5: 64K
       FB 52 53 D4 88 90 75 5D 45 39 28 1C 8F 96 7D 0E>)
$$ ##END=
$$ 
$$ hash MD5
$$ 8D 14 A5 E7 37 EA B6 CE 6A 53 F5 AB BC D4 04 B0
##$RELAX= 
##$RELAX= 
##$RELAX= 
##$RELAX= 
##$RELAX= 
##$RELAX= 
##$RELAX= 
##$RELAX= 
$$ Bruker specific parameters
$$ --------------------------
##$DU= <F:/spectra>
##$EXPNO= 1
##$NAME= <P31>
##$PROCNO= 1
##$TYPE= <nmr>
##$USER= <she>
##$AMP= (0..31)
100 100 100 100 100 100 100 100 100 100 100 100 100 100 100 100 100 100 
100 100 100 100 100 100 100 100 100 100 100 100 100 100 
##$AQSEQ= 0
##$AQ_mod= 1
##$AUNM= <au_zg>
##$AUTOPOS= <>
##$BF1= 81.014009
##$BF2= 200.13
##$BF3= 200.13
##$BF4= 200.13
##$BF5= 200.13
##$BF6= 200.13
##$BF7= 200.13
##$BF8= 200.13
##$BYTORDA= 1
##$CFDGTYP= 0
##$CFRGTYP= 5
##$CHEMSTR= <none>
##$CNST= (0..31)
1 1 145 1 1 1 1 1 1 1 1 1 1 1 1 1 1 1 1 1 1 1 1 1 1 1 1 1 1 1 1 1 
##$CPDPRG= <waltz16>
##$CPDPRG1= <>
##$CPDPRG2= <waltz16>
##$CPDPRG3= <>
##$CPDPRG4= <mlev>
##$CPDPRG5= <mlev>
##$CPDPRG6= <mlev>
##$CPDPRG7= <mlev>
##$CPDPRG8= <mlev>
##$CPDPRGB= <>
##$CPDPRGT= <>
##$D= (0..31)
0 1 0 0 0 0 0 0 0 0 0 0.03 2e-05 3e-06 0 0 0 0 0 0 0 0 0 0 0 0 0 0 0 0 
0 0 
##$DATE= 1577104085
##$DBL= (0..7)
120 120 120 11 120 120 24 19 
##$DBP= (0..7)
150 150 150 150 150 150 150 150 
##$DBP07= 0
##$DBPNAM0= <>
##$DBPNAM1= <>
##$DBPNAM2= <>
$$ [...]
##$SUBNAM3= <"">
##$SUBNAM4= <"">
##$SUBNAM5= <"">
##$SUBNAM6= <"">
##$SUBNAM7= <"">
##$SUBNAM8= <"">
##$SUBNAM9= <"">
##$SW= 369.568048894756
##$SWIBOX= (0..15)
0 1 3 0 0 0 0 0 0 0 0 0 0 0 0 0 
##$SW_h= 29940.119760479
##$TD= 32768
##$TD0= 1
##$TE= 0
##$TE2= 300
##$TE3= 300
##$TEG= 300
##$TL= (0..7)
0 120 53 12 22 120 120 120 
##$TP= (0..7)
150 150 150 150 150 150 150 150 
##$TP07= 0
##$TPNAME0= <>
##$TPNAME1= <>
##$TPNAME2= <>
##$TPNAME3= <>
##$TPNAME4= <>
##$TPNAME5= <>
##$TPNAME6= <>
##$TPNAME7= <>
##$TPOAL= (0..7)
0.5 0.5 0.5 0.5 0.5 0.5 0.5 0.5 
##$TPOFFS= (0..7)
0 0 0 0 0 0 0 0 
##$TUNHIN= 0
##$TUNHOUT= 0
##$TUNXOUT= 0
##$USERA1= <user>
##$USERA2= <user>
##$USERA3= <user>
##$USERA4= <user>
##$USERA5= <user>
##$V9= 5
##$VALIST= <valist>
##$VCLIST= <CCCCCCCCCCCCCCC>
##$VD= 0
##$VDLIST= <DDDDDDDDDDDDDDD>
##$VPLIST= <PPPPPPPPPPPPPPP>
##$VTLIST= <TTTTTTTTTTTTTTT>
##$WBST= 1024
##$WBSW= 4
##$XGAIN= (0..3)
0 0 0 0 
##$XL= 0
##$YL= 0
##$YMAX_a= 10084
##$YMIN_a= -9475
##$ZGOPTNS= <>
##$ZL1= 120
##$ZL2= 120
##$ZL3= 120
##$ZL4= 120
##$ABSF1= 182.463
##$ABSF2= -187.1042
##$ABSG= 5
##$ABSL= 3
##$ALPHA= 0
##$AQORDER= 0
##$ASSFAC= 0
##$ASSFACI= 0
##$ASSFACX= 0
##$ASSWID= 0
##$AUNMP= <proc_1d>
##$AZFE= 0.1
##$AZFW= 0.5
##$BCFW= 0
##$BC_mod= 2
##$BYTORDP= 0
##$COROFFS= 0
##$CY= -3
##$DATMOD= 1
##$DC= 0
##$DFILT= <>
##$DTYPP= 0
##$F1P= 0
##$F2P= 0
##$FCOR= 1
##$FTSIZE= 65536
##$FT_mod= 6
##$GAMMA= 0
##$GB= 0
##$INTBC= 1
##$INTSCL= 5.30512e-09
##$ISEN= 30
##$LB= 1
##$LEV0= 0
##$LPBIN= 0
##$MAXI= 10000
##$MC2= 0
##$MEAN= 0
##$ME_mod= 0
##$MI= 50
##$NCOEF= 0
##$NC_proc= -7
##$NLEV= 6
##$NOISF1= 182.463
##$NOISF2= 159.3651
##$NSP= 0
##$NTH_PI= 0
##$NZP= 0
##$OFFSET= 182.463
##$PC= 4
##$PHC0= -1715.8
##$PHC1= 147.6012
##$PH_mod= 1
##$PKNL= yes
##$PPARMOD= 0
##$PSCAL= 0
##$PSIGN= 0
##$REVERSE= no
##$SF= 81.0140089999434
##$SI= 65536
##$SIGF1= 159.3651
##$SIGF2= -187.1042
##$SINO= 113.3802
##$SIOLD= 16384
##$SREGLST= <1H.CDCl3>
##$SSB= 0
##$STSI= 65536
##$STSR= 0
##$SW_p= 29940.119760479
##$SYMM= 0
##$S_DEV= 0
##$TDeff= 32768
##$TDoff= 0
##$TI= <>
##$TILT= no
##$TM1= 0
##$TM2= 0
##$TOPLEV= 0
##$USERP1= <user>
##$USERP2= <user>
##$USERP3= <user>
##$USERP4= <user>
##$USERP5= <user>
##$WDW= 1
##$XDIM= 65536
##$YMAX_p= 431309112
##$YMIN_p= -45631421
$$ End of Bruker specific parameters
$$ ---------------------------------
##NTUPLES= NMR SPECTRUM
##VAR_NAME=  FREQUENCY,     SPECTRUM/REAL,   SPECTRUM/IMAG
##SYMBOL=    X,             R,               I
##VAR_TYPE=  INDEPENDENT,   DEPENDENT,       DEPENDENT
##VAR_FORM=  AFFN,          ASDF,            ASDF
##VAR_DIM=   65536,         65536,           65536
##UNITS=     HZ,            ARBITRARY UNITS, ARBITRARY UNITS
##FACTOR=    0.456856943014862, 1,           1
##FIRST=     14782.0589164792, 0,            0
##LAST=      -15158.0608439998, 0,           0
##MIN=       -15158.0608439998, -45631421,   0
##MAX=       14782.0589164792, 431309112,    0
$$ Real data points
##PAGE= N=1
##DATA TABLE= (X++(R..R)), XYDATA
$$ [...]
42688d857213j39687J994557J222259m42656L27661J988172Q07325k019767j806964
42679b926313J672336L637707K091206K73693J33679p51889l395441m084885m21408
42670c771315L798332L900093J172657R0630J209493J311293p88458k834984l136717
42661I51024k453802j739730p67866N53502J484363J511722R03814J79379j97547
42652D24859k9274J15572n36059j432427j131090J21464J94356j398849j970516
42643e641964M55781L640985L917162J181515j363625j693403q50763o12047j191705
42634b158064j480945n65892J015178J464298Q2430q61752J213762M538403M174268
42625G421686q68143n151036l816817J009222L797352K854963N69842j162733
$$ plain form
42688 -4857213 -4996900 -3002343 -1780084 -2222740 -1895079 93093 900418 -1119349 -2926313
42679 -2926313 -1253977 2383730 4474936 4748629 4882308 4130419 734978 -3349907 -3771315
42670 -3771315 27017 3927110 5099767 5190397 6399890 7711183 6922725 4087741 951024
42661 951024 -1502778 -3242508 -4010374 -3456872 -1972509 -460787 443027 622406 424859
42652 424859 395585 511157 -24902 -1457329 -2588419 -2466955 -2272599 -3671448 -5641964
42643 -5641964 -5186183 -1545198 2371964 3553479 2189854 496451 -354312 -966359 -2158064
42634 -2158064 -3639009 -4204901 -3189723 -1725425 -1642995 -2504747 -1290985 3247418 7421686
42625 7421686 6553543 1402507 -2414310 -1405088 2392264 5247227 5817069 4654336
42617D654336j880438q47524J524179K081051j095417m477597l320069R64235
42609b397244K558532o3485k361027j078398J625104K615059J880921N63377j190150
42600B152689k587129j839978P30142K224875J343690J20470J50057K28682o40944
42591A882554j034098J10049J206559N66563j053390k134162k383400j626157
42583d465482P70307L791809M649191K510553K6812m88654j2827l36228j107989
42574E337492j157921n97406m7318K12591n55990k631506l665481j071072K746603
42565a430008K290619k385516m502158p68063L269945K404104K15399K098841
42557A193163N075497K676104l297071m831903m22993K984622J369962j146877
$$ plain form
42617 4654336 2773898 1926374 3450553 5531604 4436187 -41410 -3361479 -2397244
42609 -2397244 161288 97803 -2263224 -3341622 -1716518 898541 2779462 3342839 2152689
42600 2152689 -434440 -2274418 -1544276 680599 2024289 2144759 2294816 2523498 1882554
42591 1882554 848456 958505 2165064 2731627 1678237 -455925 -2839325 -4465482
42583 -4465482 -3695175 96634 4745825 7256378 7283190 6794536 6781709 6445481 5337492
42574 5337492 4179571 3582165 3534847 3747438 3191448 559942 -3105539 -4176611 -1430008
42565 -1430008 860611 -1524905 -6027063 -6795126 -3525181 -1121077 -905678 1193163
42557 1193163 6268660 8944764 5647693 815790 392797 3377419 4747381 3600504
42549C600504m79078J178049M11719j757346k662910k072828o38300J824168M039691
42540C443669L181282m12905k242338j0503K700007J934544j030272k688483k548939
42531B326062j979851q36202J107869J901661K47022j584425j103395L58796M91157
42522I28694M04187J967615L002980K75286l984480m091098N83988M362851L377042
42513F827065J37955j460863j270627q84069l66137L33692k34567k377955l405245
42504b700751j244153K048280L211827K494440K337021K679309J213634j955604
42496H084003l556500k004272o0421q51971l186610l079338P60772N041407N873198
42487G020268L287460P34603N49511J283314K06347k596751m258220l090558o08568
$$ plain form
42549 3600504 3121426 4299475 4711194 2953848 290938 -1781890 -2420190 -596022 3443669
42540 3443669 6624951 6212046 3969708 3959205 6659212 8593756 7563484 4875001 2326062
42531 2326062 346211 -489991 617878 2519539 2766561 1182136 78741 437537 928694
42522 928694 1332881 3300496 6303476 6578762 2594282 -1496816 -912828 3450023 6827065
42513 6827065 6965020 5504157 4233530 3349461 2983324 3317016 3082449 704494 -2700751
42504 -2700751 -3944904 -1896624 1315203 3809643 6146664 8825973 10039607 8084003
42496 8084003 4527503 2523231 2462810 1610839 -1575771 -4655109 -3894337 1147070 7020268
42487 7020268 10307728 11042331 11591842 12875156 13081503 10484752 6226532 3135974 2527406
42478B527406J016466J523030J260624n45694l745895n094040j739796L460691
42470a337208M189338p18390m847757k760847K495308M104631J226946p64260
42462A587761R80438K948401J421775j849217k828545j199874J7075n67588j206841
42453f96615k56621J485965K194868J309251j57782q72776m43427K60417J18225
42444B941505p95254j283153p29266J17741M88719O99682J168085J339708O41279
42435D589046l14379o07236m14108m08863m48259r8487J81111k15895o66445k33723
42425A362762M90541K23857n65455q4042J702633K526242J144107p25990j095890
42416D978765o96872j457170l075791l369924j801509l08464J8675Q21245L328094
$$ plain form
42478 2527406 3543872 5066902 6327526 5781832 2035937 -3058103 -4797899 -1337208
42470 -1337208 2852130 2133740 -2714017 -5474864 -2979556 1125075 2352021 1587761
42462 1587761 2568199 5516600 6938375 5089158 2260613 1060739 1077814 510226 -696615
42453 -696615 -953236 532729 2727597 4036848 3879066 3006290 2562863 2823280 2941505
42444 2941505 2146251 863098 133832 251573 740292 1439974 2608059 3947767 4589046
42435 4589046 4274667 3667431 3253323 2844460 2396201 2297714 2478825 2262930 1596485 1362762
42425 1362762 1853303 2077160 1511705 1427663 3130296 5656538 6800645 6074655 4978765
42416 4978765 4281893 2824723 -251068 -3620992 -5422501 -5730965 -5712290 -4891045 -1562951
42407a562951N086953K722269k450973m894366k029017K083072K469749Q617r65399
42398D67954P6558l81724l166797m393966j592892K385225L813581K901838J690133
42389A799910M64822q32724p38081Q86528J062846j558353l145112l82624L065463
42380F22675J487013l357392m267780K46497L780014K145280j009717j287629
42372a641039k20715r55256k072932n19428K433850K946541O52655j182049p37451
42363a295824N24833Q39543K90613j56359n3629K88547K77158K1230O58192K455454
42353C849758L113519L97183l678532m527140j364552J713371K022956J549353
42345C075916K135842J881411o46582k612170j182039J553656J916287K51057
$$ plain form
42407 -1562951 3524002 6246271 3795298 -1099068 -3128085 -1045013 1424736 1433353 467954
42398 467954 544512 162788 -3004009 -7397975 -8990867 -6605642 -2792061 109777 1799910
42389 1799910 2264732 1432008 693927 1580455 2643301 1084948 -2060164 -2442788 622675
42380 622675 2109688 -1247704 -5515484 -5268987 -1488973 656307 -353410 -1641039
42372 -1641039 -1861754 -2817010 -4889942 -5409370 -2975520 -28979 623676 -558373 -1295824
42363 -1295824 -770991 68552 359165 202806 149177 437724 714882 736112 1394304 3849758
42353 3849758 6963277 7360460 3681928 -845212 -2209764 -496393 1526563 3075916
42345 3075916 5211758 7093169 6446587 3834417 2652378 4206034 6122321 6373378
42337F373378p37483p79374j069145q01144J019362K343543J042417q58558m57242
42328F075754N89772r28209l228129k022244J507760J789565j959282m132649
42320b307662j559687K036510K414233M35157j081665j663929j844941j237895
42312d809879j77773r3370o46717K11672K182247K395252M44122n35604P31134
42303b98916J602110N90069j74228L89233J35637j266076m21810L264399M524282
42294H344700J85325m664960l841997O60723K423430L81982j359190j190034j187834
42285b47855j926128j860216j165330j133268o75181J676420L573577K006012
42277B48031o51191K57523L435927L197608q75178l028358j038400N78660p58085
$$ plain form
42337 6373378 5635895 4856521 3787376 2986232 4005594 6349137 7391554 6532996 6075754
42328 6075754 6665526 5737317 2509188 486944 1994704 3784269 1824987 -2307662
42320 -2307662 -3867349 -1830839 583394 1018551 -63114 -1727043 -3571984 -4809879
42312 -4809879 -4987652 -5081022 -5727739 -5516067 -3333820 -938568 -494446 -1030050 -298916
42303 -298916 1303194 1893263 1719035 2108268 2243905 977829 556019 3820418 8344700
42294 8344700 8530025 3865065 23068 683791 3107221 3489203 2130013 939979 -247855
42285 -247855 -2173983 -4034199 -5199529 -6332797 -7007978 -5331558 -1757981 248031
42277 248031 -403160 -145637 3290290 6487898 5612720 2584362 1545962 2124622 1366537
42268A366537j138969K046328M390191J557227l147729l915593j270743q5212
42260a97963j530261k644661k206587j692146j224039N76396K908329L263728
42252b747204J728298R90602J738943J675657j90199j643936q49299R67968J824013
42243C494843J677283J319257M70128j243713k672098k371224r87655p68365k401855
42234c483399l514677j312645L513399O715859N077194K15328l484343m068213
42226c41497l175110k300252p56272J761918L485817L311953K720911K651908
42218G359376J036581l240685o131333k797115M506637P860256L835676k243386
42210A0186007m036977k124496j159723k200216k089486N78635K911937J937716
$$ plain form
42268 1366537 227568 2273896 6664087 8221314 5073585 1157992 -112751 -197963
42260 -197963 -1728224 -4372885 -6579472 -8271618 -9495657 -8919261 -6010932 -2747204
42252 -2747204 -1018906 -28304 1710639 3386296 3196097 1552161 702862 1670830 3494843
42243 3494843 5172126 6491383 6961511 5717798 3045700 674476 -313179 -1081544 -3483399
42234 -3483399 -6998076 -8310721 -4797322 1918537 6995731 7211059 3726716 -341497
42226 -341497 -3516607 -5816859 -6573131 -4811213 -1325396 1986557 4707468 7359376
42218 7359376 8395957 5155272 -976061 -3773176 733461 8593717 12429393 10186007
42210 10186007 6149030 4024534 2864811 664595 -1424891 -846256 2065681 4003397
42202D003397j244408l003530j686578P53774J475556J77170q35419J05256J737032
42193A482250J690025j92209j931988k522217k899411l409491k560165L41153
42185a0002053L110816L194972J218009R0911J106024K708638K954490J565071
42177E946878m99456k069754k160384o03952J318494J860965Q31664j33278L02200
42168D793377J397648J218766q48293k828941j891071K147568N489780L989060
42160A3467894j556971n527298m061482K11171J927821p0192k324506k378333
42152c11896j331055n45999O11892K335177K744869Q99286q86627k39578J471329
42143D747398J198185j151630k939275k883337k033028r94701P24977K283466
$$ plain form
42202 4003397 2758989 -244541 -1931119 -1177345 298211 475381 -360038 -254782 1482250
42193 1482250 3172275 2980066 1048078 -1474139 -4373550 -7783041 -10343206 -10002053
42185 -10002053 -6891237 -3696265 -2478256 -2387345 -1281321 1427317 4381807 5946878
42177 5946878 5447422 3377668 1217284 613332 1931826 3792791 4624455 4491177 4793377
42168 4793377 6191025 7409791 6561498 3732557 1841486 3989054 9478834 13467894
42160 13467894 11910923 6383625 2322143 2533314 4461135 4390943 2066437 -311896
42152 -311896 -1642951 -2188950 -1577058 758119 3502988 4402274 3515647 3276069 4747398
42143 4747398 5945583 4793953 1854678 -1028659 -3061687 -4056388 -3331411 -1047945
42135a047945J534530j329219k882476j009126J820029J989105k00721j507353
42127b633176p98969j57288q95104j396683r0825J731756J983693J149501J207840
42118A00745J855733O05794k773139m608294k068002K237007L205067K16523j977712
42109c206278m6530L247863L224012m5471k224736j019624J171526J317527k54530
42100B163759j258102r67232o05726j102911j955265k110532j122375M02064J093375
42091e462945N2910j795372k264622l81756K351865L770219L368983K066309M56522
42082B162113j486020l312148l956335k874925o22276J720873L130670K914465
42074b323583J297206k69930l21632Q04324J137823m38112k464065k426548J54006
$$ plain form
42135 -1047945 486585 -842634 -3725110 -4734236 -2914207 -925102 -1125823 -2633176
42127 -2633176 -3432145 -3589433 -4484537 -5881220 -5972045 -4240289 -2256596 -1107095 100745
42118 100745 1956478 2562272 -210867 -4819161 -6887163 -4650156 -1445089 -1228566 -3206278
42109 -3206278 -3252808 -4945 3219067 3173596 948860 -70764 1100762 2418289 2163759
42100 2163759 905657 -61575 -667301 -1770212 -3725477 -5836009 -6958384 -6556320 -5462945
42091 -5462945 -5410035 -7205407 -9470029 -9851785 -7499920 -3729701 -360718 1705591 2162113
42082 2162113 676093 -2636055 -6592390 -9467315 -10089591 -8368718 -5238048 -2323583
42074 -2323583 -1026377 -1296307 -1617939 -813615 324208 -113904 -2577969 -5004517 -4850511
42065d850511K974103L641758K454983J584590J754160J237590j130358l461471
42057D204844l106648o30873P87489j15595j228464p65689J10574j93173q26468
42048a764003k02954J154472J789678J942908K505288K543355P50816j428196
42040G291364j325894N63955J046966p17078k053059j401486o11158j209480j734706
42031a50576q15075R6841m49063r65819K31968J578531P03267j416392k045905
42022c232223j085187m82124l33863Q00724K315794K008115j1973j379316j390443
42013b790496j262889o23135J969944M607198L091423k080203m815300k054405
42005c957863J529105R40230j663195j597228K70513J2102j579011m39253K790628
$$ plain form
42065 -4850511 -1876408 1765350 4220333 5804923 7559083 8796673 7666315 4204844
42057 4204844 1098196 467323 1254812 1139217 -89247 -854936 -744362 -937535 -1764003
42048 -1764003 -1966957 -812485 977193 2920101 5425389 7968744 8719560 7291364
42040 7291364 5965470 6529425 7576391 6859313 4806254 3404768 2793610 1584130 -150576
42031 -150576 -965651 -868810 -1317873 -2283692 -2051724 -473193 230074 -1186318 -3232223
42022 -3232223 -4317410 -4799534 -5133397 -4332673 -2016879 -8764 -20737 -1400053 -2790496
42013 -2790496 -4053385 -4676520 -2706576 1900622 4992045 2911842 -1903458 -3957863
42005 -3957863 -2428758 -1488528 -3151723 -4748951 -4478438 -4466336 -6045347 -6484600 -3693972
41996c693972L199052J94395j123510J400728L424041J743350m83044J57132J197260
41987F015432j005680m405039m361809j022479J481600J527519R46331O72838
41979a51287L3179l98441L64303O31982j721137m385976k992735J427186K779053
41970d413873r15538l987987j399516M039221O237097M031376Q95775r17074j741939
41961A827542j580917N5899J813973J408393r66125k703876k401021j238707o34627
41952d419466m78331o4094P03297J421443J634116J166783N50866N68571R08678
41943A991863M02293p14624m37532J831136L553141K381589m40273k262939k989597
41934C315057l978176m292580j710088K702911M616590J950122k314085l905947
$$ plain form
41996 -3693972 -494920 -300525 -1424035 -23307 3400734 5144084 4661040 4818172 6015432
41987 6015432 5009752 604713 -3757096 -4779575 -3297975 -1770456 -824125 -151287
41979 -151287 -118108 -516549 -152246 479736 -1241401 -5627377 -8620112 -7192926 -4413873
41970 -4413873 -5329411 -9317398 -10716914 -6677693 -440596 3590780 4486555 3569481 1827542
41961 1827542 246625 302524 2116497 3524890 2558765 -145111 -2546132 -3784839 -4419466
41952 -4419466 -4897797 -4961891 -4258594 -2837151 -1203035 -36252 514614 1083185 1991863
41943 1991863 2394156 1679532 1242000 3073136 6626277 9007866 8567593 6304654 3315057
41934 3315057 -663119 -4955699 -6665787 -3962876 653714 2603836 289751 -3616196
41926c616196j889526J334157K992183K179972L27357l05962N63152O92277j087162
41917A190252k282516l60514K499732K089225j021397j873444J175117L798809
41909E215264K390460q85687k172875j393519p39376o89490n95082q50837j607346
41900a328488j456014m6038K92282j663417l102440j350339J390340J326582q44271
41891f781803j412676K10731J403244J487324K129302K763210O88658l415201
41883b927211m878710j697182K322589L223352K041143J718161K117530J347577
41875C267249k34609p78711m23940q68720k030953j956324n9839J960785K889584
41866A764522L595974M888391N327034K877961j601747m256434k563975J149421
$$ plain form
41926 -3616196 -5505722 -4171565 -1179382 1000590 1327947 1021985 1585137 2277414 1190252
41917 1190252 -1092264 -1452778 1046954 3136179 2114782 241338 1416455 5215264
41909 5215264 7605724 6720037 4547162 3153643 2414267 1724777 1129695 278858 -1328488
41900 -1328488 -2784502 -2830540 -2538258 -4201675 -7304115 -8654454 -7264114 -5937532 -6781803
41891 -6781803 -8194479 -7983748 -6580504 -5093180 -2963878 -200668 487990 -2927211
41883 -2927211 -7805921 -9503103 -7180514 -3957162 -1916019 -197858 1919672 3267249
41875 3267249 3032640 2253929 1829989 961269 -1069684 -3026008 -3085847 -1125062 1764522
41866 1764522 5360496 10248887 15575921 18453882 16852135 12595701 10031726 11181147
41858A1181147K133839r03242m231338m185711j836753q09289j977453k830526
41850c459326j487466J120239K998616K947523Q06465k092353k964224m08569
41842b539095K892169K840784o42066l550259l316596j340866M57070K061049
41834c137810L109177J867559j357255k884975m54019L070286L570096J271341
41826E054400l92575O3096J057368R81207j92838j656480k200024q59736J262326
41817C116744J340796j237773l248225k167887r9071j97806j367762l23898K606143
41808a578739L964628K619879O04555r25373k281649k211380Q48137M182298K722192
41799G944548l082542o439801l547008J079013J758040l09419m16661J695265
$$ plain form
41858 11181147 13314986 12411744 8180406 3994695 2157942 1348653 -628800 -3459326
41850 -3459326 -4946792 -3826553 -827937 2119586 2926051 833698 -2130526 -2539095
41842 -2539095 353074 3193858 2551792 -998467 -4315063 -5655929 -5198859 -3137810
41834 -3137810 -28633 1838926 481671 -2403304 -2857323 212963 3783059 5054400
41826 5054400 4661825 4724921 5782289 6763496 6570658 4914178 2714154 1854418 3116744
41817 3116744 4457540 3219767 -28458 -2196345 -2295416 -2493222 -3860984 -4184882 -1578739
41808 -1578739 2385889 5005768 5610323 4684950 2403301 191921 1040058 5222356 7944548
41799 7944548 4862006 -1577795 -5124803 -4045790 -2287750 -2597169 -3013830 -1318565
41791a318565K392337P67794m57190k01504n42011k317966l091369j003199K070541
41782c701132L023826J569346J33271M03411J278472M80853k185287l864999j805942
41773d668181K702311N109105K905873j497744m164237m002026k229964L77126
41765e467737L098186L764204J086638k128378j672388J971253L770207J236699
41757E658684k191888k616264j149546j049453j949359q16071K376349L885731
41749B148183J566692k181739l968764l402580k063398o39691Q98280J771592
41741e871425J336064P11412J215881J784213N27962j388525o63220K651216M146841
41732D450419J584427j004348P40426M090161K684326l566088p549432m864638
$$ plain form
41791 -1318565 1073772 1841566 1384376 1182872 640861 -1677105 -4768474 -5771673 -3701132
41782 -3701132 -677306 892040 1025311 1428722 2707194 3188047 1002760 -2862239 -4668181
41773 -4668181 -1965870 3143235 6049108 4551364 387127 -3614899 -5844863 -5467737
41765 -5467737 -2369551 1394653 2481291 352913 -1319475 651778 4421985 5658684
41757 5658684 3466796 850532 -299014 -1348467 -3297826 -4113897 -1737548 2148183
41749 2148183 3714875 1533136 -2435628 -5838208 -7901606 -8541297 -7643017 -5871425
41741 -5871425 -4535361 -3823949 -2608068 -823855 -295893 -1684418 -2347638 303578 4450419
41732 4450419 6034846 5030498 5770924 9861085 12545411 8979323 1429891 -3434747
41724c434747M96498K744963K026437J913634K729552K109133K89194p9244J081602
41715I877022R43814j160653k366322j123606J02581j120494l170925k795825
41707h14408N8851K192293J354975j246787k697289j620665O00852J621585Q84196
41698C33603k9754k8817k23929j768653l191710k080575J003738K701805J226886
41689b057406j494724k508904r24606J888546L389118J268683l816498o879184
41681a1134975l124193N251314J0046121O630375l75475l331609r04212J890233
41673D947579J211445j541039k930742k003983q40292j595661l365086k533282
41665h651061K348102O757035M660165k660229o661276k705546L453756M325678
$$ plain form
41724 -3434747 -2938249 -193286 1833151 3746785 6476337 8585470 8874664 8795420 9877022
41715 9877022 10820836 9660183 7293861 6170255 6272836 5152342 1981417 -814408
41707 -814408 -755557 1436736 2791711 1544924 -1152365 -2773030 -2172178 -550593 333603
41698 333603 303849 275032 51103 -1717550 -4909260 -6989835 -5986097 -3284292 -2057406
41689 -2057406 -3552130 -6061034 -6985640 -5097094 -1707976 -439293 -4255791 -11134975
41681 -11134975 -14259168 -9007854 1038267 7668642 7293167 3961558 3057346 4947579
41673 4947579 6159024 4617985 1687243 -316740 -1157032 -2752693 -6117779 -8651061
41665 -8651061 -6302959 454076 5114241 2454012 -4207264 -6912810 -3459054 866624
41657H66624J405522J242893L935677L321047j930877n405414l026047Q36129
41649A245554P49544j781856j986676N02247K167577J321179o22916j921905j481519
41640a808771J248360M661375N210756J961935j199084q80214O74638n15391l322388
41631F031216l314683k41709J499301J0853j517171n63232R46986P04846k2793
41622C533614P15838J713254Q30616r95774j239236k5417L13976n97162n90434
41613C659275J158584K432596J291469r81535j845997j104242o99218j447353
41605B463579j886083p63236Q77878J184704J76982m17257K76068J294484J649237
41596D856356J730888K093673J906367q2537l364585n607285m957201j839976
$$ plain form
41657 866624 2272146 3515039 7450716 10771763 8840886 3435472 409425 1245554
41649 1245554 1995098 213242 -1773434 -1271187 896390 2217569 1594653 -327252 -1808771
41640 -1808771 -560411 4100964 9311720 11273655 10074571 9194357 9868995 9353604 6031216
41631 6031216 2716533 2474824 3974125 3984978 2467807 1904575 2851561 3556407 3533614
41622 3533614 4249452 5962706 6793322 5797548 4558312 4532895 4846871 4249709 3659275
41613 3659275 4817859 7250455 8541924 7560389 5714392 4610150 3910932 2463579
41605 2463579 577496 -185740 692138 1876842 2053824 1636567 1912635 3207119 4856356
41596 4856356 6587244 8680917 10587284 10504747 7140162 1532877 -3424324 -5264300
41588e264300J539972L056042K184118K53667q02659l11803O10795O48459J6615
41579A930906j1102Q69506J277078j37175k684366m033107k837315m59841O53113
41570e432303Q9218k85552N28633J078082K80230j05585J647097L343595J518482
41561B661897k415613l028327J112475M700395L262335n96393j901538p60428
41553C034803p05872k129518k398675j160685m60282j58814J650310L662028K240713
41544C574008j764515k697053J150794L787142K46032n344819n442795o6538L580413
41535b977331J702255j385267m65448L050478L818805M80553k715517k178917
41527f70389J98692L26168j772248k051643J069724L747591K162734j819831l483568
$$ plain form
41588 -5264300 -3724328 -668286 1515832 1769499 966840 655037 1265832 1914291 1930906
41579 1930906 1919804 2789310 4066388 3929213 1244847 -2788260 -5625575 -6085416 -5432303
41570 -5432303 -5343085 -5628637 -5100004 -4021922 -3741692 -3847277 -2200180 1143415 2661897
41561 2661897 246284 -2782043 -1669568 3030827 6293162 5696769 3795231 3034803
41553 3034803 2328931 199413 -2199262 -3359947 -3820229 -3979043 -2328733 1333295 3574008
41544 3574008 1809493 -887560 263234 4050376 4296408 -1048411 -6491206 -6557744 -2977331
41535 -2977331 -1275076 -2660343 -3125791 -75313 3743492 4224045 1508528 -670389
41527 -670389 -471697 -145529 -1917777 -3969420 -2899696 847895 3010629 1190798 -2292770
41518b292770j817636M06053J774325L128097L806637J774207j901011l310290
41510A567612j641936l51373r43336n75661J820730K395033r02920l437706q15663
41501b885220L345835K669759j735691l022702N75753L426286J504912k209680
41493A669252l011084n06033K538622L852153K553437o36429k864685j619706
41485A975527J426908K030643m70377k113952o31646R99073m24683l062706k917539
41476c188752J44224K540159K191472P14343M02515J173127J252551p8617j308942
41467C842080n52974J704499K806410J417121o06382j177132j216377k630190
41459C587055m364374l657203p50290J057862L10815q82549o07372M89452J407924
$$ plain form
41518 -2292770 -4110406 -3704353 -1930028 1198069 5004706 6778913 4877902 1567612
41510 1567612 -74324 -425697 -1369033 -1944694 -123964 2271069 1368149 -2069557 -2885220
41501 -2885220 460615 3130374 1394683 -1628019 -1052266 2374020 3878932 1669252
41493 1669252 -1341832 -1847865 690757 4542910 7096347 6459918 3595233 1975527
41485 1975527 3402435 5433078 4962701 2848749 2217103 3216176 2791493 -271213 -3188752
41476 -3188752 -3044528 -504369 1687103 2401446 2803961 3977088 5229639 5151022 3842080
41467 3842080 3289106 4993605 7800015 9217136 8610754 7433622 6217245 3587055
41459 3587055 -777319 -4434522 -5184812 -4126950 -3816135 -4698684 -5306056 -4816604 -3408680
41450c408680K329070K918866K027467J68858o18369m12152j625541m277892m761367
41441g659740j460321J991323J940225N7710P3087J765815K078548N29979l75844
41432a059218N74429J914400K142236J204566l95655j935270k354990j435234
41424a344736l17885L96085J527719K868746K195479r44053k966849j059561J937722
41415B292667J497890j421737k023099K53481P94939k178665m037925q26721M190013
41406a459157M807718M16202l558958l050599J06144J619459L58985j073174m38046
41397b271426J379134K229862J826659J400058J034010k87197j872879j359525
41389B078696J314532K704012O20154k322297k546262q42906o14717k225782k817821
$$ plain form
41450 -3408680 -1079610 1839256 3866723 4035581 3417212 3005060 1379519 -2898373 -7659740
41441 -7659740 -9120061 -7128738 -5188513 -5130803 -5057716 -3291901 -1213353 -683374 -1059218
41432 -1059218 -484789 1429611 3571847 4776413 4380758 2445488 90498 -1344736
41424 -1344736 -1662621 -1266536 261183 3129929 5325408 4381355 1414506 354945 2292667
41415 2292667 3790557 2368820 345721 599202 1394141 -784524 -4822449 -5649170 -1459157
41406 -1459157 3348561 3764763 205805 -2844794 -2738650 -1119191 -760206 -1833380 -2271426
41397 -2271426 -892292 1337570 3164229 4564287 5598297 5311100 3438221 2078696
41389 2078696 3393228 6097240 6717394 4395097 1848835 1005929 391212 -1834570 -4652391
41380d652391j292955J59198o7091o71353N4411J665824K517978J840441K69838
41371a76100p83010l60702P47304P32568m85106r00685K3799l8548j986604k568876
41361e795960N91506M028497L134874l44108j112482P92751M84920k538145k869266
41352c627413J364058M451587J920519k441142k834043j23639P82089r92937k057153
41343c558074q54187P21401J250015J525645K206870K420055J189421j112618
41335C788528k843213k273339N36231L120800L360987K410711K540222K810610
41327A3451537O34897k642632k735572K03843R08644k256202m029890j230998
41319B303627J283133j084689m091175j427301M119144M488410q46716m323808
$$ plain form
41380 -4652391 -5945346 -5786148 -5853239 -6524592 -6470181 -4804357 -2286379 -445938 -176100
41371 -176100 -959110 -1319812 -572508 160060 -325046 -1225731 -1201932 -1240480 -3227084 -5795960
41361 -5795960 -5204454 -1175957 1958917 1614809 502327 1295078 1779998 -758147 -3627413
41352 -3627413 -2263355 2188232 4108751 1667609 -1166434 -1290073 -507984 -1500921 -3558074
41343 -3558074 -4412261 -3690860 -2440845 -915200 1291670 3711725 4901146 3788528
41335 3788528 945315 -1328024 -791793 2329007 5689994 8100705 10640927 13451537
41327 13451537 14086434 11443802 8708230 8912073 9820717 7564515 3534625 2303627
41319 2303627 3586760 2502071 -1589104 -3016405 1102739 5591149 4744433 420625
41311D20625k223209Q60281P38110m26015M52780J932540J528573L28576N62853
41302D175114J530791J164996k79582p88765K52661J397946J138908m09273j571781
41293F611015r07847O61534N31851j823989l470935k130525L51445J192475J100921
41284B115945K005885K439730j85332l897930l934734n3827K897846K176053J56160
41275C719796n94858o06936p23951l91938m73q71301j901324m76831K395576K675995
41265C223755J10682r15571R96810J715949p21719k077066M72984K599082J5328
41256E420234l588971k186361K595752L939307L14362l058969k596958l99406
41248D38990M14806l09144j226483j469276o34180P19779Q49397p77189k076869
$$ plain form
41311 420625 -1802584 -942303 -204193 -630208 -177428 1755112 3283685 3612261 4175114
41302 4175114 5705905 6870901 6591319 5802554 6055215 7453161 8592069 8182796 6611015
41293 6611015 5703168 6364702 6896553 5072564 1601629 -528896 -177451 1015024 2115945
41284 2115945 4121830 6561560 6376228 2478298 -1456436 -1510263 1387583 3563636 3719796
41275 3719796 3124938 2518002 1794051 1402113 1401640 530339 -1370985 -1847816 547760 3223755
41265 3223755 3334437 2418866 3415676 5131625 4409906 2332840 2805824 5404906 5420234
41256 5420234 1831263 -355098 2240654 6179961 6494323 3435354 838396 438990
41248 438990 853796 544652 -681831 -2151107 -2785287 -2065508 -1216111 -1993300 -4070169
41239d070169j636754j318756k537704k565052J102046N008227L935194m79288
41231b562256j535801K174670M662610K124285j555289j663345K71251J77421
41223B093546j670230j885353J63544J869481J797117J116606P91851J04706j484504
41214B896764k841114k405255j95294K052962K633286J438389l94017k005390
41206A180331l136855l173514j582128K66807k2987j892218j310299L383545P593799
41197A306481N945679q5147m188208l900332k612669k902827k838649m25171K474049
41188g226794L036289J421399k55129o67262N04750K872935M560228L372826r2387
41179G526855k774798l361428l367163l263144j292320K139735K989276m48086
$$ plain form
41239 -4070169 -5706923 -7025679 -9563383 -12128435 -11026389 -6018162 -2082968 -2562256
41231 -2562256 -4098057 -1923387 2739223 4863508 3308219 1644874 1916125 2093546
41223 2093546 423316 -1462037 -1298493 570988 2368105 3484711 4276562 4381268 2896764
41214 2896764 55650 -2349605 -2544899 -491937 2141349 3579738 3185721 1180331
41206 1180331 -1956524 -5130038 -6712166 -6445359 -6468346 -8360564 -9670863 -6287318 1306481
41197 1306481 7252160 7167013 2978805 -921527 -3534196 -6437023 -9275672 -9700843 -7226794
41188 -7226794 -4190505 -2769106 -3024235 -3691497 -3186747 -313812 4246416 7619242 7526855
41179 7526855 4752057 1390629 -1976534 -5239678 -6531998 -4392263 -1402987 -1851073
41171a851073l571616j478165L538211M924364J005221l224196l301983l92738
41163d351975J648907J359948M14933Q62554K682650L613383J439764l081089
41155D589075o305376n527900j814638J888312M155605N158930M680191K242716
41147I066915j125544l080779k196333O74356K966265K158702j809331n460741
41139A193510m889644p04176K314313J548846k65296j1207R69609K27525o12222
41130b28742J392534M421098L829305l62498l185321k379627j147093j865964
41122D73692k182710l0525J925455O12530j972370j865157M11463R49014r58582
41113b637190j740239O25745L523689L705843J509156n82431j467954j659655
$$ plain form
41171 -1851073 -5422689 -6900854 -3362643 1561721 2566942 -657254 -3959237 -4351975
41163 -4351975 -2703068 -1343120 -928187 -65633 2617017 6230400 7670164 4589075
41155 4589075 -1716301 -7244201 -9058839 -7170527 -3014922 2144008 6824199 9066915
41147 9066915 7941371 4860592 2664259 3338615 6304880 8463582 6654251 1193510
41139 1193510 -3696134 -4400310 -2085997 -537151 -802447 -813654 155955 383480 -228742
41130 -228742 1163792 5584890 9414195 9051697 5866376 3486749 2339656 473692
41122 473692 -1709018 -1739543 185912 798442 -1173928 -3039085 -2627622 -1678608 -2637190
41113 -2637190 -4377429 -3751684 -227995 3477848 4987004 4404573 2936619 1276964
41105A276964j431201p03226n4817j31095m13183p8541K82194m45561j430879
41096c129345n15148K112049L214670J014102j712166j404865J010243J760599
41088B350139K70330k31817J562471K731188J159524p42580r9426J443098K53060
41079H695987l403268n563567m054063o99432J804076K547425J853810M67962
41071A648930l30447L16556J494695J551675K80983j338274k866179m018169l479047
41062f739277n92689K399801K653715R28070M29496J584313J563771m48857j455741
41053C22602L03029K097109R46777j738801k589169j241049k138l6370o51950
41044b589960j350177j962816j479254P46050L070043L267627J928416J684785
$$ plain form
41105 1276964 -154237 -857463 -912280 -1043375 -1456558 -1535099 -1252905 -1698466 -3129345
41096 -3129345 -3644493 -1532444 1682226 2696328 984162 -420703 589540 2350139
41088 2350139 2620469 2388652 3951123 6682311 7841835 7099255 6999829 8442927 8695987
41079 8695987 5292719 -270848 -4324911 -5024343 -3220267 -672842 1180968 1648930
41071 1648930 1318483 1635039 3129734 4681409 4962392 3624118 757939 -3260230 -6739277
41062 -6739277 -7331966 -4932165 -2278450 -1350380 -920884 663429 2227200 1778343 322602
41053 322602 625631 2722740 3669517 1930716 -658453 -1899502 -1901640 -1938010 -2589960
41044 -2589960 -3940137 -5902953 -7382207 -6636157 -3566114 -298487 1629929 3314714
41036C314714K922424K870899n7760l237258k941019O50983L494862K588104p83829
41027H822120l200920l180937j927733q29032K807O04517M43082l36441n37311
41018a39848J01120J48042r06539j178259M52160J758924O73225n85195J102894
41009A426524L672141K361616k030759l404236q7439K039439q64869m008421j800717
41000b696721K821508L237282j99850j530819N25322J167448j466794l067919
40992a210543q28665J873398J541992K17413J187022K960736K020178r23802k060450
40983D777279p43834k22309j924231k883523l84272L489203M274264J069933k204289
40974E248221j850457R70721K052561j16244k484289j891172O31912J770124P21553
$$ plain form
41036 3314714 6237138 9108037 9050277 5813019 2872000 3522983 7017845 9605949 8822120
41027 8822120 5621200 2440263 512530 -316502 -313695 290822 733904 397463 -139848
41018 -139848 -38728 109314 -797225 -1975484 -1523324 235600 908825 323630 1426524
41009 1426524 5098665 7460281 5429522 2025286 1937847 3977286 3112417 -896004 -2696721
41000 -2696721 124787 3362069 3162219 1631400 2156722 3324170 1857376 -1210543
40992 -1210543 -2039208 -165810 1376182 1593595 2780617 5741353 7761531 6837729 4777279
40983 4777279 4033445 3811136 1886905 -996618 -1380890 2108313 6382577 7452510 5248221
40974 5248221 3397764 4368485 6421046 6304802 3820513 1929341 2561253 4331377 5052930
40965E052930m63693q46115j935047m300986n433586k818886K198171N442761
40957c104451M408353N98833k383341k331409j75048J331611P04073o82401o04953
40948b238733Q82703J604834M46614j249522j900695j597806q76556P58391L446104
40939g24666N229391L805037j34796l137846l011529j219635n44179j481875k147447
40930c367545j224494M08203J245695J153463R80791R77836P46546L96497M52373
40921A769365O33301J10437p35563l12438J692795L177758K079644r96230l625925
40912C793144m196786k805438n49563J054952R77106M2176K85670J927402K517694
40903C046357N00495k120728k635335j457610o74148l11843R57462K498577K391951
$$ plain form
40965 5052930 4589237 3743122 1808075 -2492911 -7926497 -10745383 -8547212 -3104451
40957 -3104451 1303902 1902735 -480606 -2812015 -2987063 -1655452 -951379 -1633780 -2238733
40948 -2238733 -1356030 248804 695418 -554104 -2454799 -4052605 -4929161 -4170770 -724666
40939 -724666 4504725 8309762 8174966 5037120 2025591 805956 261777 -1220098 -3367545
40930 -3367545 -4592039 -4183836 -2938141 -1784678 -803887 173949 920495 1316992 1769365
40921 1769365 2402666 2513103 1777540 1465102 3157897 6335655 8415299 7419069 3793144
40912 3793144 -403642 -3209080 -3758643 -2703691 -1726585 -1684409 -1398739 528663 3046357
40903 3046357 3546852 1426124 -1209211 -2666821 -3340969 -3652812 -2695350 -196773 2195178
40894B195178Q62758j19417j75826k86022N7631J726528K636821J20599l474804
40885C543446k900734J364929K479933k414670p056035n210927J83124K322624
40877g688310R81660J216832L862554M276126O55493k541959j320486K203277
40869A645187L311755R07247k153487l174427j992877j0667J567672K325087K048329
40860D473819L57926k231782l426613j354900K043645K434286r57083l676989
40852b337691k273466Q59586J743047R19348J317785K447437J615276n07635q35428
40843B948259J53927j128299m586585n613340k391418J170620J848233J552666
40835f045937K639941L341030J531628o46553j28162J763976J563201o13466j672305
$$ plain form
40894 2195178 3057936 2938519 2762693 2476671 2534302 4260830 6897651 7018250 3543446
40885 3543446 642712 2007641 4487574 2072904 -4983131 -10194058 -10010934 -7688310
40877 -7688310 -6706650 -5489818 -1627264 2648862 3304355 762396 -558090 1645187
40869 1645187 4956942 5864189 3710702 536275 -1456602 -1467269 100403 2425490 4473819
40860 4473819 4831745 2599963 -826650 -2181550 -137905 2296381 1339298 -2337691
40852 -2337691 -4611157 -3751571 -2008524 -1089176 228609 2676046 4291322 3783687 2948259
40843 2948259 3102186 1973887 -2612698 -8226038 -10617456 -9446836 -7598603 -6045937
40835 -6045937 -3405996 -64966 1466662 820109 691947 2455923 4019124 3405658 1733353
40826A733353p45798Q7491j98904l66569K28492M73136m19634j761727k432732
40817c402892j513776J449736M942642N352958J070252m043776m548941o80011
40809a373808J847199o5036k761512j697594J849976L060826O03166k152493k406634
40800c095910j114852l07452L3827R06005J902902J841049R19928L91224L58143
40791A834864k20589j115054m31873K274644M173944K297131k325437n600477
40783H87153n172801k460699M7767J484032K064498J808313R29720K14577p0414
40774b67854o56707j813468k469124j709190j61750R97468J416251J125872j4143
40765c552645j387593j510026j89731O09394k49737p12480J498496M677493M886138
$$ plain form
40826 1733353 987555 1075046 876142 509573 738065 1211201 791567 -970160 -3402892
40817 -3402892 -4916668 -3466932 1475710 6828668 7898920 3855144 -693797 -1373808
40809 -1373808 473391 408355 -2353157 -4050751 -2200775 860051 1463217 -689276 -3095910
40800 -3095910 -4210762 -4518214 -4484387 -3578382 -1675480 165569 1085497 1476721 1834864
40791 1834864 1614275 499221 67348 2341992 6515936 8813067 6487630 887153
40783 887153 -4285648 -6746347 -6698580 -5214548 -3150050 -1341737 -412017 -197440 -267854
40774 -267854 -924561 -2738029 -5207153 -6916343 -7078093 -6080625 -4664374 -3538502 -3552645
40765 -3552645 -4940238 -6450264 -6639995 -6030601 -6280338 -6992818 -5494322 -816829 4069309
40756D069309J617124j389448j439879p383N06995K77143N00283P30840J40109
40747E005093l11933L99019P49705j234072l992680l946967j149619J85391j940332
40738f236395l842670j505186L332177N706324M246025J762603J03677j370118
40730B196437k261050o90387K374164K719462q34572l644896j912748J310717
40722g42873R13046k181239k705481N78935L447674K978627Q82264n03426j103637
40713A563890j009955L88626J940397J244398j107401j658286K70351J286023
40705B918043j00701q51939Q50582J972392K7853k325690k028645q38517j341292
40696a717914j642807P31475L040644J389189j994928j872943J381287K744056
$$ plain form
40756 4069309 5686433 4296985 2857106 2849723 3356718 3633861 4134144 4864984 5005093
40747 5005093 4693160 5092179 5841884 4607812 615132 -3331835 -4481454 -4296063 -6236395
40738 -6236395 -10079065 -11584251 -8252074 -2545750 1700275 3462878 3566555 2196437
40730 2196437 -64613 -755000 1619164 4338626 3504054 -140842 -2053590 -742873
40722 -742873 170173 -2011066 -4716547 -4137612 -689938 2288689 3170953 2667527 1563890
40713 1563890 553935 942561 2882958 4127356 3019955 1361669 1632020 2918043
40705 2918043 2817342 1965403 2815985 4788377 4816230 2490540 461895 -376622 -1717914
40696 -1717914 -3360721 -2629246 411398 1800587 -194341 -2067284 -685997 2058059
40688B058059J020661k50330P8621n40157k231439j909242M36905J052758o46716
40679i30880p64186J763339K936722J011163m22288M74109J47475l144296m808915
40670c737757j350451L233421L712668J373468R4823n98680k504913l019616P05076
40661b091961N051516M388016l0699k396652j680942j641671k846362k015570
40653c264325R38375K239962J106036Q17831K182701K111441k19033j721033j201823
40644B990132j123367k195732j883336J29849O60367r86756j406984N29390J448491
40635a837946r2641q33162Q42820J766510K86828m31486R97342P22157k784086
40626a363664m297189n54661K951793O66007l310696k082221K320979K988076
$$ plain form
40688 2058059 3078720 2828390 2907011 2366854 135415 -1773827 -1336922 -284164 -930880
40679 -930880 -1695066 68273 3004995 4016158 3593870 4067979 4215454 1071158 -3737757
40670 -3737757 -5088208 -1854787 1857881 3231349 3326172 2727492 222579 -2797037 -2091961
40661 -2091961 2959555 7347571 7316872 4920220 3239278 1597607 -1248755 -3264325
40653 -3264325 -2325950 -85988 1020048 1837879 4020580 6132021 5912988 4191955 2990132
40644 2990132 1866765 -328967 -2212303 -2082454 -1422087 -2408843 -3815827 -3286437 -1837946
40635 -1837946 -1930587 -2763749 -1920929 -154419 132409 -299077 698265 1420422 -1363664
40626 -1363664 -5660853 -6215514 -3263721 -2597714 -5908410 -7990631 -5669652 -2681576
40618b681576K92805M11933L736500M502679J426015o38929m2806l69991k121837
40609D514793j294104J941169K009590j913433l290986N23589L006565n71658
40601D925525m873914l430194J036040K293869R34414J389788L047112K226054
40593G548694r6036k64958N13684j837141o040568o527462k287260K068052L968241
40584b954754N040811N361329K369538l060443n689791l294819J83148J035148
40576a009833M83943O00084K26402j815220l198439j329300K304782L999952K446317
40567B708688n67411k551634k036307M89545K468071J842977m9331m79147J50143
40558A975594o57710k064621m27643L652090M341373o48734n497184m473141k62031
$$ plain form
40618 -2681576 -2388771 -1976838 1759662 6262341 7688356 7049427 7006621 6636630 4514793
40609 4514793 3220689 5161858 7171448 5258015 1967029 2490618 5497183 4925525
40601 4925525 51611 -3378583 -2342543 -48674 885740 2275528 5322640 7548694
40593 7548694 7452658 7187700 7701384 5864243 -176325 -6703787 -8991047 -6922995 -2954754
40584 -2954754 2086057 7447386 9816924 6756481 1066690 -2228129 -2044981 -1009833
40576 -1009833 -525890 74194 300596 -1514624 -4713063 -6042363 -3737581 262371 2708688
40567 2708688 2141277 -410357 -2446664 -1957119 510952 2353929 2304598 1825451 1975594
40558 1975594 1317884 -746737 -1174380 2477710 6819083 6170349 673165 -3799976 -4062007
40549d062007Q32091j440892k070921O85763L204191K507832j94327k166882j906093
40540d611245O40188L679079L946245L44234l612929l938069j632457o49613j567037
40531g401604j356057J003936K891123K386838O78121l89221j95209J247291K871906
40522A737124K099833j786549m661084k251001K780661L644058n71582l602224
40514b610764j898450N88574K54395J76157L913393P916404O069832r07749o210224
40505G291568n856023k207930P30692J458836N20228q12621j107792l8547J213005
40496A191416J980534K982031L809481K169634k058427m892505l532208p80560
40488H69396m63078j345523k62132J482742O78112r34976P62656L899755K569598
$$ plain form
40549 -4062007 -3229916 -4670808 -6741729 -6055966 -2851775 -343943 -538270 -2705152 -4611245
40540 -4611245 -3971057 -291978 3654267 3998501 385572 -3552497 -5184954 -5834567 -7401604
40531 -7401604 -8757661 -7753725 -4862602 -2475764 -1797643 -2186864 -2382073 -1134782 1737124
40522 1737124 3836957 2050408 -2610676 -4861677 -2081016 1563042 991460 -2610764
40514 -2610764 -4509214 -3920640 -3666245 -3490088 423305 8339709 14409541 13501792 7291568
40505 7291568 1435545 -772385 -41693 1417143 1937371 1124750 16958 -21589 1191416
40496 1191416 3171950 6153981 9963462 12133096 10074669 5182164 1649956 869396
40488 869396 406318 -939205 -1201337 281405 959517 24541 787197 4686952 7256550
40479G256550k501579l663158J023004L410396j869608p871592n473095K700038
40471f989044O565697L339812m54223m21937N60926m48864j390586J5637J878915
40462B656333J756174P31855P66686J017410o8148j240274k27729K199136K758030
40453A0349473p2334m195898o185708m345059J9860L501810L436961O19714j591389
40444A537430j370704k74746j76008j87214J468668L793329L746296N20972l081365
40435E976658m080872k555369p49173j21554j80531L23282J781953L213764L155767
40426F763925J253268j075239j952508j065431L1591k20687j538526k100034p31759
40417f35400J399878J783843l72002k687587k322710J62912J390897n8411j616864
$$ plain form
40479 7256550 4754971 1091813 2114817 5525213 3655605 -4215987 -9689082 -6989044
40471 -6989044 -423347 2916465 2462242 2040305 2601231 2152367 761781 777418 2656333
40462 2656333 4412507 5144362 5911048 6928458 6860310 5620036 5392307 7591443 10349473
40453 10349473 10277139 6081241 -104467 -4449526 -4429666 -927856 2509105 3128819 1537430
40444 1537430 166726 -108020 -284028 -471242 997426 4790755 8537051 9058023 5976658
40435 5976658 1895786 -659583 -1408756 -1530310 -1710841 -1387559 394394 3608158 6763925
40426 6763925 8017193 6941954 4989446 3924015 3955606 3734919 2196393 96359 -635400
40417 -635400 764478 2548321 2176319 -511268 -2833978 -2671066 -1280169 -1338580 -2955444
40408b955444q00523Q51259L54887j765843k416264j206372r59236k380712k210897
40399a3489145J335697M794315M268870J457420R06783K702338K473484j183337
40391C266425l829230j596659K981971M425034J525488j925169k691214j417342
40383G39304l63859l91448j037721j690864j492825N25697L722812N186760K684813
40374G882669j827466l552389m91004L761247M260000P75011k312490j947410
40366F548168M6038K96627j182752j502886L72013J779640O761l722404n363255
40357b722050k914966J065596K518382Q77334l56020J431779L960413L019484
40349F879952j165048l492791r22063K989724K859306j201742m198397l208348
$$ plain form
40408 -2955444 -3755967 -2904708 -2549821 -4315664 -6731928 -7938300 -8897536 -11278248 -13489145
40399 -13489145 -12153448 -7359133 -3090263 -1632843 -726060 1976278 4449762 3266425
40391 3266425 -562805 -2159464 822507 5247541 6773029 4847860 2156646 739304
40383 739304 375445 -16003 -1053724 -2744588 -4237413 -3711716 11096 5197856 7882669
40374 7882669 6055203 2502814 2011810 5773057 10033057 10808068 8495578 6548168
40366 6548168 6594206 6890833 5708081 4205195 4577208 6356848 6363609 2641205 -2722050
40357 -2722050 -5637016 -4571420 -2053038 -1175704 -1531724 -99945 3860468 6879952
40349 6879952 5714904 2222113 1300050 4289774 7149080 5947338 1748941 -1459407
40341a459407k55027J793118K687395L049540K182632l34615k759449k953727
40333A950460j095286P76504J136861J2427j329926j050942J543770M294799M006832
40324A0245499R06791r57404O93688K872060J841411j203428k413644j554476
40316A0430497j678989l075293k366270J268124L478744R54299l125497l266891
40308B618724O90653L666744K334008j209203k963895j653439R23881K367669
40300F775142J682521m2097n27173J100921K608548J080196k761506m698109k403584
40291B814859J381033K739897J757083J245593J651258P15426j855118l109030
40283G341001j500306M51448K40643o98298O0595J393003O06971j503392j621280
$$ plain form
40341 -1459407 -1714434 78684 2766079 5815619 7998251 7663636 4904187 1950460
40333 1950460 855174 1631678 2768539 2780966 1451040 400098 1943868 6238667 10245499
40324 10245499 11152290 10194886 10888574 13760634 15602045 14398617 11984973 10430497
40316 10430497 8751508 5676215 3309945 4578069 8056813 9011112 5885615 2618724
40308 2618724 3309377 6976121 9310129 8100926 5137031 3483592 4407473 6775142
40300 6775142 8457663 8415566 7888393 8989314 11597862 12678058 9916552 5218443 2814859
40291 2814859 4195892 6935789 8692872 9938465 11589723 12305149 10450031 7341001
40283 7341001 5840695 6292143 6532786 5834488 5895083 7288086 7895057 6391665 4770385
40274D770385N13529J511141k70684k463860k739453j649410k35939J725431L479244
40265D640384K744028m11641k358004j089810N25532l09833j322663Q60686M267149
40256G545828L980920k18550l488264l057353j326137j274703k581481l315572
40248c735312k524373l30243K131110K706906O95238j060834L18578K747411J830091
40239B778572j640470k078848J815713M041366L82107m464111l412198K747814
40231A69945O757265M874746N87488j333443l29724J119228J191822M3144j062654
40222A2017817j199539q29377j076049j679553j007218J167521K734343K381136
40214A2509081J649515K069691K339771P95724j161915j085159M05507O80295
$$ plain form
40274 4770385 5283914 6795055 6524371 4060511 1321058 -328352 -564291 1161140 4640384
40265 4640384 7384412 6972771 4614767 3524957 4050489 3740656 2417993 3278679 7545828
40256 7545828 11526748 11308198 7819934 4762581 3436444 2161741 -419740 -3735312
40248 -3735312 -6259685 -6589928 -4458818 -1751912 -1056674 -2117508 -1798930 948481 2778572
40239 2778572 1138102 -940746 874967 4916333 5298440 834329 -2577869 169945
40231 169945 6927210 11801956 12389444 11056001 10726277 11845505 13037327 13080471 12017817
40222 12017817 10818278 9988901 8912852 7233299 6226081 7393602 10127945 12509081
40214 12509081 14158596 16228287 18568058 19363782 18201867 17116708 17522215 18202510
40206A8202510n96682j401943j013571m82591K42615K172148M037240K810385
40198B3970111j478636m619167l517727j23170J635277P32624r70103j949155
40190A3680054k161099j858729j051822P7217J224004K144392K281941R29517
40182A5265475j553038l357120k920848p63837R40908N96625j204069k306153
40174D697943j366227N21555J272643Q60324J422059L643524M987776L263868
40166A9303465K23775q77365M2088O20509L58720N41996M71662j760356m329571
40157A4594923k499029L749070P682184M632265j191309k815241j65376J372180
40149B5359667j09740j235734N311J333820R00308K78972R54000J582776R13111
$$ plain form
40206 18202510 17605828 16203885 15190314 14707723 14950338 17122486 21159726 23970111
40198 23970111 22491475 17872308 14354581 14231411 15866688 16599312 15629209 13680054
40190 13680054 11518955 9660226 8608404 8685621 9909625 12054017 14335958 15265475
40182 15265475 13712437 10355317 7434469 6670632 7611540 8208165 7004096 4697943
40174 4697943 3331716 3853271 5125914 5986238 7408297 11051821 16039597 19303465
40166 19303465 19527240 18649875 18691963 19312472 19671192 20213188 20684850 18924494 14594923
40157 14594923 12095894 15844964 23527148 28159413 26968104 24152863 23987487 25359667
40149 25359667 25249927 24014193 24019504 25353324 26253632 26532604 27486604 29069380 29982491
40140B9982491L83056J492390K996783L003608J888958J005732L48766l31854
40132D0769930Q1777K151767L965193L747768K940345L813392N392215N165659
40124F8028046L835599M317977O278510O157949L404636K089367M450241P184021
40116A05746346P046609O248332Q396587J2138042J3409624J1971398J0937968
40109A75894906J1193586J1342346J2441319J7081041K3281158K5122097K1302841
40102B97659294J7761420J9052859K2017708K1597662J8400179J5720420J2704607
40095D24914149O394963j399974n504406n465253o672708j2396969j9360160k2879556
40087C57630086k2637856k1421749k1131213k1948158k3062738k2592216j8974756
$$ plain form
40140 29982491 30365547 31857937 34854720 37858328 39747286 40753018 41101784 40769930
40132 40769930 40851707 43003474 46968667 50716435 53656780 57470172 62862387 68028046
40124 68028046 71863645 76181622 82460132 88618081 92022717 94112084 98562325 105746346
40116 105746346 112792955 119041287 127437874 139575916 152985540 164956938 175894906
40109 175894906 187088492 198430838 210872157 227953198 251234356 276356453 297659294
40102 297659294 315420714 334473573 356491281 378088943 396489122 412209542 424914149
40095 424914149 431309112 429909138 424404732 418939479 412266771 399869802 380509642 357630086
40087 357630086 334992230 313570481 292439268 270491110 247428372 224836156 205861400
40080B05861400j3839709j1147653j1975147j2688256j0243919o756309o121207
40073A33089200q190141r577327q982353q169466q037874p277606n544343m797337
40065G2512753o015527p015636n452019k322766m60454o49993j383968j837274
40057D7375116k715008m011501m199146k563864o37921j45070q39367j547131
40049C0716108k022907k333852j724273q360R52108n78659l229087m063376k552656
40040A5155046m65185J511851L717904M471695J405404l394502m268051m0966
40032A8093196L267910Q43753l907130m708810j335757J533358J811829J225425
40024A6823774O19524q40345k471714k659719k178772k782803l253648j256538
$$ plain form
40080 205861400 192021691 180874038 168898891 156210635 145966716 139210407 133089200
40073 133089200 124899059 115321732 106339379 98169913 90132039 82854433 77310090 72512753
40065 72512753 66497226 59481590 54029571 51706805 51246351 50596358 49212390 47375116
40057 47375116 44660108 40648607 36449461 33885597 33247676 33102606 32263239 30716108
40049 30716108 28693201 26359349 24635076 24626716 25578824 25000165 21771078 17707702 15155046
40040 15155046 14689861 16201712 19919616 24391311 25796715 22402213 18134162 18093196
40032 18093196 21361106 22204859 18297729 13588919 12253162 13786520 15598349 16823774
40024 16823774 17443298 16602953 14131239 11471520 9292748 6509945 3256297 1999759
40016A999759J706115K088760M46466M45572J974761J140998k320303l761996
40008C720132j186755J778990K372192K368899K950091J798850j540342l022964
40000I239093o21993J638041K94651j744080n80396J965890K106724O70294O24210
39991A3592434J279301K93059j312052j282175o90135j359366j493466Q40871
39983I868471K733635Q38054j902120n68715K788300J883782l194949n795274
39975F651184l273126k88536l57012j158433l68293J94857r64180j778876p64615
39966b107030J75261j95746J98522K629294M652459M044781K257064J406462R76277
39957A4037344q2180r20417p87124p49361j337549j079536P12820K276321K307131
$$ plain form
40016 1999759 3705874 5794634 6241100 6686672 8661433 9802431 7482128 3720132
40008 3720132 2533377 4312367 6684559 9053458 12003549 13802399 12262057 9239093
40000 9239093 8617100 10255141 10549792 8805712 8225316 10191206 12297930 12968224 13592434
39991 13592434 14871735 15164794 13852742 12570567 11880432 10521066 9027600 9868471
39983 9868471 12602106 13440160 11538040 10969325 13757625 15641407 12446458 6651184
39975 6651184 3378058 3089522 2732510 1574077 1205784 1400641 436461 -1342415 -2107030
39966 -2107030 -1931769 -2127515 -1928993 700301 5352760 9397541 11654605 13061067 14037344
39957 14037344 13955164 13034747 12247623 11498262 10160713 9081177 9793997 12070318 14377449
39948A4377449K022981K671794L454114L417795L004256K478656J259814l20212
39940C2366647j174515j715723k883138l141863o21154J990046J87571m235431
39932B0772440m393233P15899L682733K85174l806201k687734M18434k89250l313732
39923A1384530l740478k144237k037635k395452m81993J309239m47873k317522
39915h71421J004601O131210M981636j806484n429018k953547o26645j838217
39907a407885k178722N43719J449799j717037l336033n1122K350304r41477m384034
39898i672488r78419N603168O746893K310246q46183o56711q66476j952765m38755
39889g51490K748601K153581k565121m881994j631862K204414J999985K76787
$$ plain form
39948 14377449 16400430 19072224 22526338 25944133 28948389 31427045 32686859 32366647
39940 32366647 31192132 29476409 26593271 23451408 22830254 24820300 25007871 20772440
39932 20772440 16379207 17095106 20777839 21063013 17256812 14569078 14987512 14698262 11384530
39923 11384530 7644052 5499815 3462180 1066728 584735 1893974 1446101 -871421
39915 -871421 133180 6264390 11246026 9439542 4010524 1056977 430332 -1407885
39907 -1407885 -3586607 -3042888 -1593089 -3310126 -6646159 -6697281 -4346977 -5288454 -9672488
39898 -9672488 -10650907 -5047739 1699154 4009400 3163217 2506506 1640030 -312735 -751490
39889 -751490 1997111 4150692 1585571 -3296423 -4928285 -2723871 -723886 -447099
39881d47099J107712L200780L080751J049132m33352j162684k031738k193280
39873B170222j040856m29399j376784j251264J872052M678508K935174j686194
39865E871459l832937k018503P80161K661577L730736K644349j715634n403067
39857B718141k946694L365208M773705j175235o363390m340018L57817P91962
39849b818504j016025Q23510M410153L012845k467186l932110O20608L704661
39841B337952P21036k873480j131401K819490K546648j533089l978272k953304
39833d044420j142772j38767O78461Q76873n20170j835049l33599L158311M905918
39824A604786L425775P79124j025066j784579j523127k82944N83284j79224j178913
$$ plain form
39881 -447099 660613 3861393 6942144 7991276 7557924 6395240 4363502 2170222
39873 2170222 1129366 699967 -676817 -1928081 -56029 4622479 7557653 5871459
39865 5871459 2038522 20019 800180 3461757 7192493 9836842 8121208 2718141
39857 2718141 -228553 3136655 7910360 6735125 371735 -3968283 -3610466 -2818504
39849 -2818504 -3834529 -3011019 1399134 4411979 1944793 -1987317 -1366709 2337952
39841 2337952 3058988 185508 -945893 1873597 4420245 2887156 -1091116 -4044420
39833 -4044420 -5187192 -5325959 -4647498 -3770625 -4290795 -6125844 -6459443 -3301132 1604786
39824 1604786 5030561 5809685 4784619 3000040 1476913 1193969 1777253 1598029 419116
39815D19116j11372K211687K662313N77952j407119j495223o23614M6175N02443
39806B782358M22735o14699j175997N18936K829409K147334j204039k663291m40864
39797B601882J451016m27378l482022l283041j22298K283400K394749J521777
39789B938085N43172n17623q06680J46938M64579j578683l878069k833158R41593
39780d579846K889539R64520j600755j170585J511501L122808K234854R0156j725078
39771A737114k513960k017581l43952J587890K446840J618992k37639j731962
39763E45742j876803r10482J19166P29428J426441K295167K044068k66436k991923
39754A114368l131293j24196L112609L727165K199569Q93120M25896o49147k726002
$$ plain form
39815 419116 307744 2519431 5181744 5759696 4352577 2857354 2233740 2279915 2782358
39806 2782358 3205093 2590394 1414397 1933333 4762742 6910076 5706037 3042746 2601882
39797 2601882 4052898 3625520 143498 -3139543 -3261841 -978441 1416308 2938085
39789 2938085 3481257 2963634 2156954 2303892 2768471 1189788 -2688281 -5521439 -4579846
39780 -4579846 -1690307 -725787 -2326542 -3497127 -1985626 1137182 3372036 3462192 1737114
39771 1737114 -776846 -2794427 -3138379 -1550489 896351 2515343 2277704 545742
39763 545742 -1331061 -2241543 -2122377 -1392949 33492 2328659 4372727 4106291 1114368
39754 1114368 -2016925 -2141121 971488 4698653 6898222 7791342 8217238 7568091 4842089
39745D842089l774548k128889P03274J666412J21746j526698j302375k7847M78047
39736i48789m1132p36920j273403j416269k89710J940424K811558O55444j884359
39727a183156q53658K588075K879834j620797n381577l517448R58517J868390
39719d261820q72370j954247M81635K383789J005158o63023P55998L225142K500830
39710B601092j175610l429419j946506J098049K874577L125875K643347J092884
39702F884289j712596l835920k878922N12219K801026J849689n24100j384849
39694A710836p01007o56251j671658j619167N55536K770255K687647Q95368m26854
39685C544705o20924m83171k34529L15118L81302p25128j677824p67545Q41717
$$ plain form
39745 4842089 1067541 -1061348 -358074 1308338 1430084 -96614 -1398989 -1426836 -948789
39736 -948789 -989921 -1726841 -3000244 -4416513 -4706223 -2765799 45759 701203 -1183156
39727 -1183156 -2036814 551261 3431095 1810298 -3571279 -7088727 -6130210 -4261820
39719 -4261820 -5134190 -7088437 -6606802 -4223013 -3217855 -3880878 -3124880 100262 2601092
39710 2601092 1425482 -2003937 -3950443 -2852394 22183 3148058 5791405 6884289
39702 6884289 5171693 1335773 -1543149 -1030930 1770096 3619785 3095685 1710836
39694 1710836 1009829 353578 -1318080 -2937247 -2381711 388544 3076191 3971559 3544705
39685 3544705 2923781 2440610 2206081 2521199 2902501 2177373 499549 -267996 573721
39676E73721L60931j884479k176716R72078M007061L227571k4574j784416j217843
39667B053334p20225j187945p20527J553111L341750K247200r19980l295538l328671
39658i77491j856659n56118k56326m01896K76560K102235L411740K213694q28605
39649C127134k534868j264025O11299o2944k559256l141412m23317K656725L036859
39640e53805J460472N61121P47577L65970q62426j239545j19991Q64151M39024
39631A662548n01765q69416j187094j779067j031990K068354M916723L837837
39623G116130o64465m244117m529189l398442k614275q36025K752469N072550
39615a345364L042233j062659k182542L32261K139636O34710j791357k307928
$$ plain form
39676 573721 934652 -949827 -3126543 -2154465 1852596 5080167 5055593 3271177 2053334
39667 2053334 1333109 145164 -575363 977748 4319498 6566698 5646718 2351180 -977491
39658 -977491 -2834150 -3390268 -3646594 -4048490 -3771930 -1669695 1742045 3955739 3127134
39649 3127134 592266 -671759 -60460 -123404 -2682660 -5824072 -6247389 -3590664 -553805
39640 -553805 906667 1467788 2215365 2581335 1718909 479364 359373 1223524 1662548
39631 1662548 1160783 291367 -895727 -2674794 -3706784 -1638430 3278293 7116130
39623 7116130 6451665 2207548 -2321641 -5720083 -8334358 -9170383 -6417914 -1345364
39615 -1345364 1696869 634210 -1548332 -1216071 923565 1558275 -233082 -2541010
39607b541010j656600j557694j285080M17466K282762K321110J137355O76883
39599b04808Q82841L63850o18903p15892k89195o76888j234725l25136J078630
39590a740226M14445j639015j342165K027545M263123K395090q10563j249147
39582B319087O00523J372103J81376j150367j742927k154834k141377j010336
39574c726752L34998M42951j17311K38925J216747J372297R75592J246314J407355
39565C391116k41460k647730k877285p65641P40210K50518n33055n22704p97879
39556d003910j415357m22055K281199L574497J709661q12069j161067q3043M53043
39547A20899O31358J104243O14099j579040l137109j815985O29705J056420j15875
$$ plain form
39607 -2541010 -4197610 -5755304 -7040384 -6622918 -4340156 -2019046 -881691 -204808
39599 -204808 678033 1041883 422980 -292912 -582107 -1258995 -2493720 -2818856 -1740226
39590 -1740226 -1325781 -2964796 -4306961 -2279416 1983707 4378797 3568234 2319087
39582 2319087 2919610 4291713 4473089 3322722 1579795 -575039 -2716416 -3726752
39574 -3726752 -3391754 -2948803 -3066114 -2827189 -1610442 -238145 737447 1983761 3391116
39565 3391116 3149656 501926 -2375359 -3141000 -2400790 -2150272 -2683327 -3206031 -4003910
39556 -4003910 -5419267 -5841322 -3560123 14374 1724035 911966 -249101 -332144 120899
39547 120899 752257 1856500 2470599 891559 -2245550 -4061535 -3431830 -2375410 -2491285
39538b491285n9866J525215K249112J213274J0499k35445P4517O59126J379720
39529D324867J057085j030894l027002k720622j224593j211893k121060r95411
39521f949523J928153K750433K4706k637159j856672Q95475K072290Q32772j055789
39512c995314k052708j668130q4675J502536J623357O57370N11304J415340J368745
39503g22175j38305n97285J482165L537119K384178j188544l688976l345510j132658
39494c409991J170865J883369k6086l049263l466939o7608L203600K317015q04667
39485b249705j148565J568886K544871m34418l620540l207093o51236M06847m69759
39476g260712j164660r75094q25129o82981K86321J472788J389513M31090N79756
$$ plain form
39538 -2491285 -2551151 -1025936 1223176 2436450 2446949 2211504 2286021 2945147 4324867
39529 4324867 5381952 4351058 1324056 -1396566 -2621159 -3833052 -5954112 -6949523
39521 -6949523 -5021370 -2270937 -2246231 -4883390 -6740062 -5844587 -3772297 -2939525 -3995314
39512 -3995314 -6048022 -7716152 -7800827 -6298291 -4674934 -4017564 -3506260 -2090920 -722175
39503 -722175 -860480 -1457765 24400 3561519 5945697 4757153 1068177 -2277333 -3409991
39494 -3409991 -2239126 -355757 -381843 -3431106 -6898045 -6965653 -3762053 -1445038 -2249705
39485 -2249705 -3398270 -1829384 715487 281069 -3339471 -6546564 -7197800 -6790953 -7260712
39476 -7260712 -8425372 -9400466 -10225595 -10908576 -10622255 -9149467 -7759954 -7328864 -6749108
39467f749108K030528K542207J049960l36123M59136K047489J571539q99660k546059
39458h30091k176201j653596k162956j822419R53298L842373L404898M76793p21038
39449f88939R75717J822453o97366l271155j370593L651407N947599L166659p13777
39440H822005j382932K30193L82390j705063l243477k377250p52508r34956k779986
39431c741584l579315j511220J995441L846261K920612J229249J018464J764239
39423C942147J452610K50062N77513K918515M015723J218390l095786m211624
39415G067550j459952J131019O97634j149836j948517k086563k607136k024303
39407b380104J224468M667144M093425k25295l367141k473189q3942N73025J11150
$$ plain form
39467 -6749108 -4718580 -2176373 -1126413 -1462536 -1003400 1044089 2615628 1715968 -830091
39458 -830091 -3006292 -4659888 -6822844 -8645263 -7691965 -3849592 -444694 32099 -688939
39449 -688939 286778 2109231 1411865 -1859290 -3229883 421524 6369123 9535782 8822005
39440 8822005 7439073 7669266 8051656 6346593 3103116 725866 -26642 -961598 -3741584
39431 -3741584 -7320899 -8832119 -6836678 -2990417 -69805 1159444 2177908 3942147
39423 3942147 5394757 5644819 6222332 9140847 13156570 14374960 11279174 7067550
39415 7067550 5607598 6738617 7436251 6286415 4337898 2251335 -355801 -2380104
39407 -2380104 -1155636 3511508 7604933 7379638 4012497 1539308 1455366 2028391 2139541
39398B139541M17609O11410r77880k773659j917296M78599K03192l388411n462470
39389a0669365k293329L205262N240450K733126J49299J087440L782553L988904
39381G224340O20946l123624l845887j690429M63645N87070p51004j879923k013979
39372d408845j385900m59483J85113j56979j513736k709735k415195o37648J337535
39363a2164873K343554K255153J694387J210029Q12164L88200N31979K082324
39355h47083M110669L686059l61700m393176l704186P99878L333120J383710j084431
39346B922860n15272P08750q12369l100509k289308M28948R94498l34939q2378
39337b079719J268395j76152l902967m545079o28144K734110K186930R63075K171157
$$ plain form
39398 2139541 2557150 3168560 2190680 -582979 -2500275 -2021676 -1818484 -5206895 -10669365
39389 -10669365 -12962694 -9757432 -4516982 -1783856 -1634557 -547117 3235436 7224340
39381 7224340 7845286 4721662 875775 -814654 -351009 236061 -514943 -2394866 -4408845
39372 -4408845 -5794745 -6254228 -6069115 -6226094 -7739830 -10449565 -12864760 -13502408 -12164873
39363 -12164873 -9821319 -7566166 -5871779 -4661750 -3849586 -3461386 -2929407 -847083
39355 -847083 3263586 6949645 6587945 2194769 -1509417 -709539 2623581 4007291 2922860
39346 2922860 2407588 3116338 2303969 -796540 -3085848 -2656900 -1662402 -1997341 -2079719
39337 -2079719 -811324 -987476 -4890443 -9435522 -10063666 -7329556 -5142626 -4179551 -2008394
39328b008394L161073R28321j884773j490613M67509K01040j363008m95984K603823
39319A18994M306073L508070K208357R99670j306122l929279m371972k497605
39311i63814o75084N8294N43825O08748o66788k009144j094245J327948K233979
39302f36281J361512J385122K577847J707906k265552n439729m212350j93636
39294e715161K498388K403745Q67266r23466k526118l080902j805310O87128K791488
39285d802942L305065K015369k06910j621616j100339L68157R31732N72673P46904
39276B08093J345955N29780j710325k517619k79846K482143K455222J53777j129483
39267A537697j6211J688278K113337J479003P44557o1846j151820j784775j157056
$$ plain form
39328 -2008394 1152679 2081000 196227 -1294386 -826877 -625837 -1988845 -2484829 118994
39319 118994 4425067 7933137 10141494 11141164 9835042 5905763 1533791 -963814
39311 -963814 -1638898 -1580604 -1036779 -428031 -1094819 -3103963 -4198208 -2870260 -636281
39302 -636281 725231 2110353 4688200 6396106 4130554 -1309175 -5521525 -5715161
39294 -5715161 -3216773 -813028 54238 -869228 -3395346 -6476248 -8281558 -7594430 -4802942
39285 -4802942 -1497877 517492 310582 -1311034 -2411373 -2043216 -1111484 -538811 208093
39276 208093 1554048 2083828 373503 -2144116 -2423962 58181 2513403 2667180 1537697
39267 1537697 1521486 3209764 5323101 6802104 7546661 7484815 6332995 4548220 3391164
39258C391164j06107m19966k049556k518300l80717K023636J506529r82484j423789
39249i59590R47288K159051j9812k092825n56742J898233O74940k586242k029072
39240b564771K827756N630152K527069k496023m004204k215962n74816p925N38119
39231c40605M20987j720347m484233m718466j700917K239255M901845N784080
39223C81599M909344K471917k40152j602481j760834k353040l608504l308390
39215e110541J82842M783986O275208L259391q94217k219017j189436j444506
39207C643710l756973m406298r89049L140038L171365l69465k674794j510351
39199c751817O74265J303866P64516M20503O03598J260440K042782J465575j337727
$$ plain form
39258 3391164 3285057 2865091 815535 -1702765 -2083482 -59846 1446683 464199 -959590
39249 -959590 -12302 2146749 2126937 34112 -522630 1375603 2050543 -535699 -2564771
39240 -2564771 262985 5893137 8420206 5924183 1919979 -295983 -870799 -878724 -340605
39231 -340605 80382 -1639965 -6124198 -10842664 -12543581 -10304326 -5402481 381599
39223 381599 5290943 7762860 7522708 5920227 4159393 1806353 -1802151 -5110541
39215 -5110541 -4927699 -143713 6131495 9390886 8496669 6277652 5088216 3643710
39207 3643710 -113263 -4519561 -5508610 -2368572 802793 433328 -2241466 -3751817
39199 -3751817 -3077552 -1773686 -1009170 -588667 14931 1275371 3318153 4783728 3446001
39190C446001l997650l226754P2630J611311R3746j230661m32234N2338j705153
39181e316426l215720j431788K484500N028638M619592J803216k228730n132521
39173c389239m137663K71037L802071L667408J875602J209759J103542J42740
39165D545257n81048J37262P30708k81527j271503p23186n26114k178350k720524
39156b869025P91618N204081M986590M94719k855192k779186k091845k626091
39148a744331k473767j83601K609441L891041L332131J169674j857749l451097
39140A291742j982761L39886J18847j688557j003445K514153M460968K476761
39132F527594m74260j250590q32065j259404j845666j130295N0240J07235n41930
$$ plain form
39190 3446001 -551649 -3778403 -3705773 -2094462 -2000716 -3231377 -3663611 -3611273 -5316426
39181 -5316426 -8532146 -9963934 -7479434 -2450796 2168796 3972012 1743282 -3389239
39173 -3389239 -7526902 -7255865 -3453794 213614 2089216 3298975 4402517 4545257
39165 4545257 3964209 4101471 4832179 4550652 3279149 2555963 2029849 -148501 -2869025
39156 -2869025 -2077407 3126674 8113264 8607983 5752791 2973605 881760 -1744331
39148 -1744331 -4218098 -4401699 -1792258 2098783 5430914 6600588 4742839 1291742
39140 1291742 -691019 -351133 -232286 -1920843 -2924288 -410135 4050833 6527594
39132 6527594 6053334 4802744 3970679 2711275 865609 -264686 -214446 -107211 -649141
39123f49141n36039k6337j81024j167497j998773j776814m48999J015204J226492
39114d542928J04625n55428L48098J099719k18986k056547j334265J530554K961424
39105b663734J565087k95361n86521J22287R67823J986298K380808J031464n86516
39096C921635L57833L047284L220331l09642l436999k945973r13094n30522j305111
39087A105742j351091j141725j667696j561146N52217K916631L012234J362460
39079C227626K24656J40099L17341O93275J114510K92184j897571k968622j299034
39070a55536R28439J032576o2794k03504k17738j735565k611551N56697N876378
39061C407402P166349K371065l370782m729089k648629j508916k574519l271022
$$ plain form
39123 -649141 -1185180 -1211517 -1392541 -2560038 -4558811 -6335625 -6784624 -5769420 -4542928
39114 -4542928 -4438303 -4993731 -4645633 -3545914 -3764900 -5821447 -7155712 -5625158 -2663734
39105 -2663734 -1098647 -1394008 -1980529 -1858242 -890419 1095879 3476687 4508151 3921635
39096 3921635 4279468 7326752 10547083 10237441 6800442 3854469 2941375 2410853 1105742
39087 1105742 -245349 -1387074 -3054770 -4615916 -4063699 -1147068 1865166 3227626
39079 3227626 3452282 3592381 3909722 4602997 5717507 6009691 4112120 1143498 -155536
39070 -155536 772903 1805479 1742685 1539181 1321443 -414122 -3025673 -2468976 3407402
39061 3407402 10573751 12944816 9574034 4844945 2196316 687400 -1887119 -5158141
39053e158141j765373N81095J581521J141887P38488P78619j5214k091910l275919
39044g484947j194112K921242M994756L114464k46259j832578j370459m74724
39036a572617J56326O25327N21409k66416n96257K19235Q92607K24449n00372
39027b96309O02377K604941K713415M20593j541281q04559J667619K830755R86706
39018I184257k407592m232077l153764j211679j010531j954002j359054Q61396
39010e283046J668423j07658j540163k13079K009467K298344J175564N87761J89230
39001G84843j047404j674579m1396J953866J407964n58845n35973J313960J661466
38992C263902m44n03105J298632K527959J326783j99456K1189O29790k25217j429502
$$ plain form
39053 -5158141 -6923514 -6342419 -4760898 -3619011 -2880523 -2101904 -2117118 -4209028 -7484947
39044 -7484947 -8679059 -5757817 -763061 2351403 2105144 272566 -1097893 -1572617
39036 -1572617 -1416291 -790964 -269555 -535971 -1132228 -912993 -20386 204063 -296309
39027 -296309 306068 2911009 5624424 6045017 4503736 3699177 5366796 8197551 9184257
39018 9184257 6776665 2544588 -609176 -1820855 -2831386 -4785388 -6144442 -5283046
39010 -5283046 -3614623 -3722281 -5262444 -5475523 -3466056 -1167712 7852 595613 784843
39001 784843 -262561 -1937140 -1978536 -24670 1383294 824449 288476 1602436 3263902
38992 3263902 3263458 2760353 4058985 6586944 7913727 7714271 7735460 8365250 8140033 6710531
38982F710531j002694M27121Q77568L99526P06214J957306K061255m59698m108705
38973G568424n651990l627477r1144J801449J602806J418143J880179R40192j957810
38964C882772l542003j408982J571804J435108m19789J77852K490501J720716
38956E907979k387961m170194j034228K188339J067973j577616j066570J190420
38948A18142N65603k557835l194246L32989L942154L815375R82150j201691j302315
38939A500326k76900M21831J10167p67252j081445l84009N19807J050841J904363
38930B997729L310610L403556M43856l852676n504183k971295J154147L432579
38922B414323K903164Q58469r99546j577528r76557o93829k007749l671521k750005
$$ plain form
38982 6710531 5707837 6134958 7012526 7412052 8118266 10075572 12136827 11677129 7568424
38973 7568424 1916434 -1711043 -1802187 -738 1602068 3020211 4900390 5840582 3882772
38964 3882772 340769 -1068213 503591 1938699 1518910 1696762 4187263 5907979
38956 5907979 3520018 -650176 -1684404 503935 1571908 -5708 -1072278 118142
38948 118142 683745 -1874090 -5068336 -4735347 -793193 3022182 4004332 2802641 1500326
38939 1500326 1223426 1645257 1755424 988172 -93273 -477282 42525 1093366 2997729
38930 2997729 6308339 9711895 10155751 6303075 798892 -2172403 -1018256 2414323
38922 2414323 5317487 6175956 5176410 3598882 2622325 1928496 -79253 -3750774 -6500779
38913f500779J309513M964577M513587P44496k231739k263586j009387l01645
38905g74963O86354K973533M504639K259810k826272n969162m311200k88099J966990
38896a778370J550851M58813O0976J52479N12939J083314R86540n27153k300515
38887A99874k382801r20007m0934o79979j332142m08272J670797L165567K692946
38878A965049K54458k220837j917914J470845M013793J766215l461805n690822
38870c821018k662568J274486J618128l82766q74066M11849P66101k76611l60222
38861d306687J164453J792345J1482j931697j237612J268879K329532R18391m16364
38852d07278P24507L143311L566337R38584k263053l169914j726412j16976M7009
$$ plain form
38913 -6500779 -5191266 -226689 4286898 5031394 2799655 536069 -473318 -774963
38905 -774963 -88609 2884924 7389563 9649373 6823101 853939 -3457261 -3745360 -1778370
38896 -1778370 -227519 231294 292270 444749 957688 2041002 3027542 2500389 199874
38887 199874 -2182927 -3102934 -3143868 -3823847 -5155989 -5564261 -3893464 -727897 1965049
38878 1965049 2219507 -1330 -1919244 -448399 3565394 5331609 1869804 -3821018
38870 -3821018 -6483586 -5209100 -3590972 -3973738 -4847804 -4435955 -3669854 -3946465 -4306687
38861 -4306687 -3142234 -1349889 -1338407 -3270104 -4507716 -3238837 -909305 9086 -407278
38852 -407278 317229 3460540 7026877 7965461 5702408 2532494 806082 689106 736115
38843G36115r35016j698580j121251P62017K478194K348547N75292q36534q95477
38834A413307r06854j755850j700900R45026M277037M704250J806728j381852
38826G400892k624809k297549j089796J094390L404567L929306K249759L2011
38818A2098771j524243k783050l835769l833818k721961j562414p56251J6836
38810d901899J68051r39494j688899M5723K793313K821091L4046j586671m19267
38801c674006M67360q12295j488407O47460K932076K344816N48351L58004N03596
38792A826955j448352l545707j939806K483243M797318K869720o03023k635983
38784A804365k849994j876686j95598J169541J357764J075496J268828J089560
$$ plain form
38843 736115 -198901 -1897481 -3018732 -2256715 221479 2570026 3145318 2308784 1413307
38834 1413307 506453 -1249397 -2950297 -2005271 2271766 6976016 8782744 7400892
38826 7400892 4776083 2478534 1388738 2483128 5887695 9817001 12066760 12098771
38818 12098771 10574528 7791478 3955709 121891 -2600070 -4162484 -4918735 -4901899
38810 -4901899 -4733848 -5673342 -7362241 -7316518 -4523205 -1702114 -1668068 -3254739 -3674006
38801 -3674006 -3206646 -4018941 -5507348 -4859888 -1927812 417004 965355 1323359 1826955
38792 1826955 378603 -3167104 -5106910 -2623667 2173651 5043371 4440348 1804365
38784 1804365 -1045629 -2922315 -3117913 -1948372 -590608 484888 1753716 2843276
38776B843276n81662k522177k578053q93011O00508R65916L80156j083538k390213
38767e258798j127562K888898N556384L526922n82058j976483q00000p66181k230187
38758g69065k144383k90974K67737p64147k20440K171717K483675n43426k758759
38749b568065j277426J070720J051602K57214J304029K635578J432847r67167
38741B939332r05663J828995L762365K490914j075972m445964n359356k938839
38733c704188R98399K932673J630503l81354q94158j233935k977740l965453j327319
38724h922572L011988M145288J262366j200358k12595J871046J684553p0318o43491
38715I25907j40215r85309l182562l558790n52326L007095L642274J769782K54721
$$ plain form
38776 2843276 2261614 -260563 -2838616 -3731627 -3131119 -2165203 -1785047 -2868585 -5258798
38767 -5258798 -6386360 -3497462 2058922 5585844 5003786 3027303 2227303 1461122 -769065
38758 -769065 -2913448 -3204422 -2936685 -3700832 -3921272 -1749555 734120 190694 -2568065
38749 -2568065 -3845491 -2774771 -1723169 -1465955 -161926 2473652 3906499 2939332
38741 2939332 2033669 3862664 7625029 10115943 9039971 4594007 -765349 -3704188
38733 -3704188 -2705789 226884 1857387 1476033 581875 -652060 -3629800 -7595253 -8922572
38724 -8922572 -5910584 -1765296 -502930 -1703288 -1915883 -44837 1639716 1569398 925907
38715 925907 785692 -199617 -3382179 -6940969 -7493295 -4486200 -843926 925856 1180577
38706A180577p9030n31576q99415N19869K871759K670202n57575k407909j41332
38697B625570K532922J170716j975786j504342K001665K572741j443435m497126
38689A482925k397630J655779K569480O09309n33338M0828J51961r78517j519429
38680A081368j50000K029680L089406K532208J590122J504551J668781K79631
38672A3625747k612068m261567l028670j155749j143840j392302O37038K711008
38664C379597P38613l309553k948496K404031N429547J907710k961885l306476
38656A333088j478827k564790m949134l255534K189187N653307M535223J692019
38648C154539j87844j224893j484722l02939J187164R03476n71435q19507R7659
$$ plain form
38706 1180577 1101547 569971 -329444 190425 3062184 5732386 5174811 2766902 2625570
38697 2625570 5158492 6329208 4353422 2849080 4850745 7423486 5980051 1482925
38689 1482925 -914705 741074 3310554 3919863 3386525 3427353 3579314 2600797 1081368
38680 1081368 931368 2961048 6050454 8582662 10172784 11677335 13346116 13625747
38672 13625747 11013679 6752112 3723442 2567693 1423853 31551 668589 3379597
38664 3379597 4118210 808657 -2139839 264192 5693739 7601449 4639564 1333088
38656 1333088 -145739 -2710529 -7659663 -10915197 -8726010 -3072703 1462520 3154539
38648 3154539 2966695 1741802 257080 -45859 1141305 2044781 1473346 653839 751498
38639G51498j19499j539966j679483L4886J160408J67058j773824l256075l683653
38630i938650j844781K758629O763750N341771r56650n616969m224337L55462
38622g361775K897539K496575J537926R22923j5224m79177J082729L527497L602153
38613H211166O55705j881183j138793J011085O11772k397214l653925o22365L215654
38604D011902K823575j254873l575965j436784J776393J950348l97304k123818
38596A773474k045159j019552L79508J650878J517677k43218j600701j032033
38588f19126K57356R11409J856431L559482L511622n0319m161089m794412k692280
38579b220926j518380j918625j714196m56603P16073K265861M561269M729280
$$ plain form
38639 751498 631999 -907967 -2587450 -2552564 -1392156 -1225098 -2998922 -6254997 -9938650
38630 -9938650 -11783431 -9024802 -2261052 3080719 2124069 -3492900 -7717237 -7361775
38622 -7361775 -4464236 -1967661 -429735 493188 477964 -1213 1081516 4609013 8211166
38613 8211166 8866871 6985688 5846895 6857980 7469752 5072538 1418613 796248 4011902
38604 4011902 6835477 5580604 2004639 567855 2344248 4294596 3897292 1773474
38596 1773474 -271685 -1291237 -911729 739149 2256826 2013608 412907 -619126
38588 -619126 -361770 549639 2406070 5965552 9477174 9426855 5265766 471354 -2220926
38579 -2220926 -3739306 -5657931 -7372127 -7828730 -7112657 -4846796 -285527 4443753
38571D443753P03537l206185j316032L849927M381059o36898l675926j024877
38563C518358J964507Q18275j097600l7104J140301q66850k963530j372938J013863
38554B117282k54906l012146k401222M43030Q83498o01206K45285L001335K956805
38545C377755k97328j751951O89410K999547J727591j276557k648313j838388
38537I81766r7710J364887J157786j115718k937307j502513J634275K405912O79847
38528B571225J76456J524080Q86355k810995m848591j993686J936642J731811
38520h26703j655439l432351k130885j98477P18101J042257R57150L57402K64958
38511d903987J227283J327542j035989l446242k225652J615451L171824P28219
$$ plain form
38571 4443753 5147290 1941105 625073 4475000 8856059 8219161 4543235 3518358
38563 3518358 5482865 6301140 5203540 5166436 6306737 5439887 2476357 1103419 2117282
38554 2117282 1862376 -1149770 -3550992 -3107962 -2224464 -2825670 -2580385 420950 3377755
38545 3377755 3080427 1328476 2017886 5017433 6745024 5468467 2820154 981766
38537 981766 884056 2248943 3406729 2291011 -646296 -2148809 -514534 1891378 2571225
38528 2571225 2747681 4271761 5158116 2347121 -2501470 -4495156 -2558514 -826703
38520 -826703 -2482142 -5914493 -8045378 -8243855 -7525754 -6483497 -5526347 -5168945 -4903987
38511 -4903987 -3676704 -2349162 -3385151 -6831393 -9057045 -7441594 -4269770 -3541551
38503c541551j858769j119851J179263J300558r31918k483675j590218N33557
38495h512604J916150J865721R05922P8808L87713J956946L583285L670357J698611
38486G550909j324134l530014l330992p68343J942734K210581J0270j943773j607794
38477g90556P9063J252938J838216K362155J592187j733931n435333n546978j949600
38468h331839R32127L10775j247516l39499J954985K283825M62949p99967m59040
38459e233200J08359L57972J122191J922593J138931p27382j241417j55521K7250
38450b680224j351943j542068Q25913K937115K371098J211618K135937L166398
38442G073844P91249l311625l807919M2610K705022N18853k826628j982899J930733
$$ plain form
38503 -3541551 -5400320 -6520171 -5340908 -4040350 -4972268 -7455943 -9046161 -8512604
38495 -8512604 -6596454 -4730733 -3824811 -3746003 -3358290 -1401344 2181941 5852298 7550909
38486 7550909 6226775 2696761 -634231 -1402574 540160 2750741 2761011 817238 -790556
38477 -790556 -711493 541445 2379661 4741816 6334003 4600072 -835261 -6382239 -8331839
38468 -8331839 -7399712 -7088937 -8336453 -8675952 -6720967 -4437142 -3974193 -4774160 -5233200
38459 -5233200 -5124841 -4766869 -3644678 -1722085 -583154 -1310536 -2551953 -2707474 -2680224
38450 -2680224 -4032167 -5574235 -4748322 -1811207 559891 1771509 3907446 7073844
38442 7073844 7865093 4553468 745549 788159 3493181 4012034 1185406 -797493 1133240
38433A133240K935933j088004n274758m291292Q44636M478084L420273j8489j955408
38424A84215j601877q60310q24643o75022K75864J290065J407017O71965l46142
38415d78868j248321j555324p40523R20854K273385K449059J496186j27642j691409
38406A297397j936662j49741K333830L228549K131329O11936n51938j932583k968134
38397B063983j963173L19185M33197k310754l587907l87620L528548K862533q38573
38388A19419j521097J506418K212658k356772o637366m288084K588797O298714
38380b077313L694204p23793j550833J178265L394126K448272n02036k700544
38372C160348k831738j587636j77315P63841R54445K57395q55233j443992j239192
$$ plain form
38433 1133240 4069173 2981169 -2293589 -6584881 -5740245 -1262161 2158112 2139623 184215
38424 184215 -1417662 -2277972 -3102615 -3777637 -3501773 -2211708 -804691 -132726 -478868
38415 -478868 -1727189 -3282513 -4023036 -3102182 -828797 1620262 3116448 2988806 1297397
38406 1297397 -639265 -789006 1544824 4773373 6904702 7516638 6964700 5032117 2063983
38397 2063983 100810 419995 853192 -1457562 -5045469 -5433089 -1904541 957992 119419
38388 119419 -1401678 104740 2317398 -39374 -6676740 -10964824 -8376027 -2077313
38380 -2077313 1616891 893098 -657735 520530 3914656 6362928 5860892 3160348
38372 3160348 328610 -1259026 -1436341 -672500 281945 539340 -315893 -1759885 -2999077
38363b999077q80038o26188M1465R68339R94559N5639j40833J028953J573093
38354A5912K76084n61708J181198K989601J115395k730202l130226M97908K546543
38345B200505m0799k971668j623154J693596J874962p31915j300100J719240M665241
38336E485908M402181J908336m66467j935755k447976j719889m39879l15163j569323
38327B901973k099249m89339J602082J674923l7251j100252o29075n02332k182998
38318h61518l925049k770249J190643M423157M313114K247722J077319R23967
38310F619106l28007k980248m575938l471563j033112P81931J992342L194043
38302A98554L296274Q58739k987055n018575l550965l50882J419695N43006j224171
$$ plain form
38363 -2999077 -3879115 -4505303 -4463838 -3495499 -2500940 -2445301 -2586134 -1557181 15912
38354 15912 291996 -269712 911486 3901087 5016482 2286280 -843946 -346038 2200505
38345 2200505 2159706 -811962 -2435116 -741520 1133442 401527 -898573 820667 5485908
38336 5485908 9888089 11796425 11329958 9394203 6946227 5226338 4786459 4471296 2901973
38327 2901973 802724 313385 1915467 3590390 3553139 2452887 1823812 1321480 -861518
38318 -861518 -4786567 -7556816 -6366173 -1943016 2370098 4617820 5695139 6619106
38310 6619106 6291099 3310851 -1265087 -4736650 -5769762 -4987831 -2995489 198554
38302 198554 3494828 4353567 1366512 -3652063 -7203028 -7553910 -6134215 -5591209 -6815380
38293f815380j323876N18797J940082J162632m54797n97932K75670k5352j142510
38284f462666m52052J891614K344860Q8062o87998K291797M495561J324740l779549
38275A054369m041233O7084J920824l53587j728057k1068J70842l502322n572024
38266a2005172j491683L984680L822412j32137n18291L429025N095360J493542
38258C677736k526294k581759p25843m32498j004208l77062O59012O04373M03902
38249b302641J096944J119523o39131j634582O71756L886127L507730l57752l034530
38240B313444j766704J240887K448177Q80639j798133k942398r08513K597554
38232B064953L098739j140965n415946l935136J941258N106008K336822k112908
$$ plain form
38293 -6815380 -8139256 -7620459 -5680377 -4517745 -4972542 -5570474 -5294804 -5320156 -6462666
38284 -6462666 -6914718 -5023104 -2678244 -2590182 -3278180 -986383 3509178 4833918 1054369
38275 1054369 -2986864 -2919780 -998956 -1352543 -3080600 -3101668 -2930826 -6433148 -12005172
38266 -12005172 -13496855 -9512175 -5689763 -5821900 -6340191 -2911166 2184194 3677736
38258 3677736 1151442 -1430317 -2156160 -2588658 -3592866 -3969928 -3310916 -2706543 -2302641
38249 -2302641 -1205697 -86174 -725305 -2359887 -1688131 2197996 5705726 5347974 2313444
38240 2313444 546740 1787627 4235804 5116443 3318310 375912 -532601 2064953
38232 2064953 5163692 4022727 -1393219 -5328355 -3387097 1718911 4055733 1942825
38224A942825l440910k082700o85312K90910J197862J116934J70739O96284L015360
38215B221992L264049q59506n120166l995914J157026L976124J979596j221136
38207A402065k257668j781133j184929J82418K752494M634414L753301N92926
38199H093888k325940k838216r10536J019114R5623l300568n126268k669395J555595
38190f406703L326633K443255J681901J505584J5532k343815k462348N31352L772379
38181B063770M678193L224139J34571l544147n052763k316430J856008K363815
38173C407156q05419k547350q25847N51299r63245k494399j455159L7140p880
38164e103704O50794L510434M979827J989028k071284k396925m08778o78501k898805
$$ plain form
38224 1942825 -1498085 -3580785 -4266097 -3975187 -2777325 -1660391 -1489652 -793368 2221992
38215 2221992 5486041 4626535 -493631 -4489545 -3332519 643605 2623201 1402065
38207 1402065 -855603 -2636736 -3821665 -3639247 -886753 3747661 7500962 8093888
38199 8093888 5767948 2929732 2019196 3038310 3133933 -166635 -5292903 -7962298 -6406703
38190 -6406703 -3080070 -636815 1045086 2550670 2566202 222387 -2239961 -1708609 2063770
38181 2063770 6741963 9966102 10100673 6556526 1503763 -812667 1043341 3407156
38173 3407156 2601737 54387 -771460 -220161 -1183406 -3677805 -5132964 -5095824 -5103704
38164 -5103704 -4452910 -942476 4037351 6026379 3955095 1558170 1149392 470891 -2427914
38155b427914k885446P6553K560119K724823J738472L60683j298181j645762L01226
38146d95427J974353Q84931n91301Q16391K586708N8272m687823n010127n30637
38137d994660K126488M82432q1477L513153N996006K437392l413644m997050k396212
38128a327572l21606k19473j0745O78822L49855n78143l03581P71015P05792l62009
38118f17645n19324N52379J370120J324968J052348O22584l97423j539883j978538
38109a30414j890758j730213j072599K89172J251397R98669N03097R01211J669550
38100G89112J809244J311688K03467j796507l312040j802122J978403L284584
38092B465829J20088k740172o31795L202764K245544k862311n015119j477252
$$ plain form
38155 -2427914 -5313360 -5236807 -2676688 48135 1786607 2147290 849109 -796653 -495427
38146 -495427 1478926 2363857 1772556 2588947 5175655 5233927 546104 -4464023 -4994660
38137 -4994660 -2868172 -2385740 -2467217 1045936 7041942 9479334 6065690 1068640 -1327572
38128 -1327572 -1649178 -1868651 -1879396 -1200574 -850719 -1428862 -1732443 -961428 -255636 -617645
38118 -617645 -1136969 -584590 785530 2110498 3162846 3785430 3388007 1848124 -130414
38109 -130414 -2021172 -3751385 -4823984 -4534812 -3283415 -2284746 -1781649 -880438 789112
38100 789112 2598356 3910044 4113511 2317004 -995036 -2797158 -818755 2465829
38092 2465829 2585917 -154255 -786050 2416714 4662258 1799947 -3215172 -4692424
38084d692424K525296K278153m16934k079663k916191l890592l032226R06209
38076a1318372M340067L172325o85950j741339J053692L174367J535410j473493
38068a943293k111141j77042J934676K667157J892069j01659k109279j827427
38060a775939J403607M320094K883713k049150m907869k436419J957069L030145
38052B425251Q00513m66775P30439J308814o91087k775348k393517j065113j131544
38043c258367j398289J21278J445010n73776l860733k998656K188789N451821
38035b882923L273502j1788N83909L003311K288094q80364j506410J256108K858833
38026G982272R71170j097461m48041O02851j061224l550072k641084J432572L899382
$$ plain form
38084 -4692424 -2167128 111025 -305909 -2385572 -5301763 -9192355 -12224581 -11318372
38076 -11318372 -6978305 -3805980 -4491930 -6233269 -5179577 -2005210 -469800 -1943293
38068 -1943293 -4054434 -4231476 -2296800 370357 2262426 2160767 51488 -1775939
38060 -1775939 -372332 3947762 6831475 4782325 -125544 -2561963 -604894 2425251
38052 2425251 3225764 2758989 3489428 4798242 4107155 1331807 -1061710 -2126823 -3258367
38043 -3258367 -4656656 -4535378 -3090368 -3664144 -7524877 -10523533 -8334744 -2882923
38035 -2882923 390579 378791 962700 3966011 6254105 5373741 3867331 5123439 7982272
38026 7982272 8953442 7855981 7407940 8010791 6949567 3399495 758411 2190983 6090365
38017F090365J928890k120699m410518l858669j796493K86714J299453N49115
38009b031842j259890k046774o62710J578965K680101K368400J671252J105778
38001C403280O67993P05968J160397P00057j476371l565689l130714q41272L50505
37992b025846j79663q6072J181289O48141k869221n127566k006510L470639M489157
37983b505652K67908k621003K4186L890480K857379j842689l734271o46216K825436
37974a484442K669917P07894N03196J574633R72051j314505k264699q19909M60307
37965A004443m25123j884769j460634N04447J896438K054603J811873J308105
37957D809383Q8286j092598q88779K74872O56049P6433L6755P12253M72494q96714
$$ plain form
38017 6090365 8019255 5898556 1488038 -2370631 -4167124 -3880410 -2580957 -2031842
38009 -2031842 -3291732 -5338506 -6001216 -4422251 -1742150 626250 2297502 3403280
38001 3403280 4071273 4777241 5937638 6637695 5161324 1595635 -1535079 -2376351 -2025846
37992 -2025846 -2205509 -2291581 -1110292 -462151 -3331372 -8458938 -10465448 -6994809 -2505652
37983 -2505652 -2237744 -4858747 -4834561 -944081 1913298 70609 -3663662 -4309878 -1484442
37974 -1484442 1185475 1893369 2396565 3971198 4943249 3628744 1364045 544136 1004443
37965 1004443 579320 -1305449 -2766083 -2261636 -365198 1689405 3501278 4809383
37957 4809383 4897669 3805071 2916292 3191164 3847213 3923646 3960401 4672654 5145148 4248434
37947D248434j385301n18025q54483l433710m618438r69169M714924O396525L019419
37938F600176n57157r08761J10744J9748k07674P39715R66200j394139l819743
37929A549109k482459J423916K701871m17532l852713l734570j287510K82546
37921e817342O89707J517334K418752J737111q7638r77458p22539r08667j398897
37912c549637l44974J681994J361435j892561l793046j300848K344428K471179
37904c022030K78255N30717L410943M144726Q93170k378480k401451j118402j272028
37895i34580j712487l46729J567794J708862Q25663J002497J672384Q98453p95700
37886C886157j285105m33816L09583P54000J277885O83936j674798k987420n01113
$$ plain form
37947 4248434 2863133 2345108 1490625 -1943085 -6561523 -7530692 -2815768 3580757 6600176
37938 6600176 6043019 5134258 5245002 5264750 5057076 5796791 6762991 5368852 1549109
37929 1549109 -933350 490566 3192437 2774905 -1077808 -4812378 -6099888 -5817342
37921 -5817342 -5127635 -3610301 -1191549 545562 457924 -519534 -1242073 -2150740 -3549637
37912 -3549637 -3894611 -2212617 -851182 -2743743 -6536789 -7837637 -5493209 -3022030
37904 -3022030 -2743775 -2213058 1197885 5342611 6235781 3857301 1455850 337448 -934580
37895 -934580 -2647067 -2993796 -1426002 282860 1108523 2111020 3783404 4681857 3886157
37886 3886157 2601052 2167236 2476819 3230819 4508704 5192640 3517842 530422 29309
37877B9309K964927K026437k711534m486283r6062N280787N424465R75727k992145
37868F415628l810846k344246r0383J394383K83517k956661m414791j330952L506121
37859c348230N083338K697755j07079j199545j763892k664330k594091q05346
37851d701420J165585J783563J471136J214273J015906P62492R38771J317143
37843D967449M88336j860608l464594k081111J052116K267855J44052k495514
37835i82019k094285J175898L721406K953117M6160k052535k103687j077291q0723
37826d93959P09257J228019J083284K65608o84910j428617j892791j694271o49815
37817c558195K92936J57268j00410J278862L491714L390385Q4914l136719l197870
$$ plain form
37877 29309 2994236 5020673 2309139 -2177144 -2273206 3007581 8432046 9407773 6415628
37868 6415628 2604782 260536 170153 1564536 1848053 -1108608 -5523399 -6854351 -3348230
37859 -3348230 1735108 4432863 4325784 3126239 1362347 -1301983 -3896074 -4701420
37851 -4701420 -3535835 -1752272 -281136 933137 1949043 2711535 3650306 4967449
37843 4967449 5455785 3595177 130583 -1950528 -898412 1369443 1513495 -982019
37835 -982019 -3076304 -1900406 1821000 4774117 4820277 2767742 664055 -413236 -493959
37826 -493959 215298 1443317 2526601 2792209 2107299 678682 -1214109 -2908380 -3558195
37817 -3558195 -3265259 -3107991 -3208401 -1929539 1562175 4952560 5037474 1900755 -1297115
37808a297115j318613m61876o30197L59707K560233L548210K235427K77979o21991
37799D651764n85423l44361j05186q9764o20540j300795j392350j010134o65797
37790a462586l0607J225852J945987R30332o09630n35016O03737L73389j137661
37781A303797j223850M59758P10933j712555l181696n98273L408422M184915J668923
37772E020374n08698r41125j324424k119658j581782M58157J565296N74908n29005
37763F14043J1782J005371N71633q59088j515506q71504K03614Q32520N24108
37754E16973p89706k082819j664583O06160K474068J842433n01834j844152q31004
37745b274464J116485J571860j79727k217787k061319N495P51465j490377l499669
$$ plain form
37808 -1297115 -2615728 -3077604 -3707801 -3348094 -787861 2760349 4995776 5273755 4651764
37799 4651764 4066341 3721980 3616794 3527030 2906490 1605695 213345 -796789 -1462586
37790 -1462586 -1493193 -267341 1678646 2608978 1999348 1464332 2068069 2441458 1303797
37781 1303797 79947 539705 1250638 -461917 -3643613 -4241886 -833464 3351451 5020374
37772 5020374 4511676 3570551 2246127 126469 -1455313 -997156 568140 1143048 614043
37763 614043 625825 1631196 2202829 1343741 -171765 -1043269 -839655 -7135 516973
37754 516973 -272733 -2355552 -4020135 -3413975 -939907 902526 400692 -1443460 -2274464
37745 -2274464 -1157979 413881 234154 -1983633 -4044952 -4039457 -3287992 -4778369 -8278038
37736h278038j247767L425535M460941O60139j847152J064371M560509K092695
37728D891233m020267n763788j593993J752983K38529j724807O82291M771882
37720g65937M910265J003934k403994l099255k614771k007530o00145J290772
37712d286661J992249J186731L01134J162l84080r10532p64808p3918J42477o1580
37702b857826L11195R93952N12527j192070k216001j366292L11289J261147J213263
37693c028816P69499N01446P96375J437751J356747J42734n27639J106800L586892
37684F141789L353908k80997l678506l516581q64505Q62088M17324n40757l11766
37675A581997Q81637J607329R38970o07818j632832j445233p59209l69270M5870
$$ plain form
37736 -8278038 -9525805 -6100270 -1639329 -979190 -2826342 -1761971 2798538 4891233
37728 4891233 870966 -4892822 -6486815 -4733832 -4495303 -6220110 -5537819 -765937
37720 -765937 4144328 5148262 2744268 -354987 -2969758 -4977288 -5577433 -4286661
37712 -4286661 -2294412 -1107681 -806547 -805385 -1189465 -2099997 -2864805 -2938723 -2796246 -2857826
37702 -2857826 -2546631 -1552679 -1040152 -2232222 -4448223 -5814515 -5503226 -4242079 -3028816
37693 -3028816 -2259317 -1757871 -961496 476255 1833002 1975736 1448097 2554897 6141789
37684 6141789 9495697 9214700 5536194 2019613 1155108 2017196 2434520 1893763 1581997
37675 1581997 2463634 4070963 5009933 4402115 2769283 1324050 564841 195571 241441
37666B41441Q15395J053144J60443n45003J40494P88478l07895j379421L47652
37657A314728L011364J880002k611872m085201L21263M993576L930132p75504
37649G978488l056266j749344j82777K68360N98318O6944k517779m523676k372656
37640e490388J752439K114450j394457k587464J160827M732480L593361M47043
37632D328291k77875M26103o43187k369634j502258R80476J197033j010667j882707
37623g54425N235J944314J988925J346681Q75395p20738l398554m087566j126395
37614c927128K280563K068901r46491k459234q62649J165169J264476M92130P72924
37605a51339J744143J984074J779795K378203L070481J430720k941093o751098
$$ plain form
37666 241441 1056836 2109980 2270423 1725420 1865914 2654392 2346497 967076 1314728
37657 1314728 4326092 6206094 3594222 -490979 -169716 4823860 8753992 7978488
37649 7978488 4922222 3172878 2990101 3258461 3856779 3923723 1405944 -3117732 -5490388
37640 -5490388 -3737949 -1623499 -3017956 -5605420 -4444593 287887 3881248 4328291
37632 4328291 4050416 4476519 3833332 1463698 -38560 941916 2138949 1128282 -754425
37623 -754425 -749190 1195124 3184049 4530730 5406125 4685387 1286833 -2800733 -3927128
37614 -3927128 -1646565 422336 -524155 -2983389 -3846038 -2680869 -1416393 -924263 -151339
37605 -151339 1592804 3576878 5356673 7734876 10805357 12236077 9294984 2543886
37597B543886o480590k661624Q17446J507290R33869J672928L242023K730446
37589D305674n70071l290822k171777J277531K679589R69016k97197J266337K900389
37580G068669J103297k339598k587568Q54635L213083J501447j527043k204003
37572E082919j162395j009869j554001q51345N43648R6989k202724l101581n65049
37563d723408L218641M322480J383034l153466n372871l398464Q00928L217478
37555c705648J851224j447850l351337k267325J040130M403039N166413K171984
37547C860630k004853k940898K6633K501923J254810j157421r04617R11797P29717
37538B277721j003863q16492J465414K523680J371321L02101j37521j916096m495032
$$ plain form
37597 2543886 -3936704 -6598328 -5780882 -4273592 -3339723 -1666795 1575228 4305674
37589 4305674 3735603 444781 -1726996 -449465 2230124 3199140 2901943 4168280 7068669
37580 7068669 8171966 5832368 3244800 4099435 7312518 8813965 7286922 5082919
37572 5082919 3920524 2910655 1356654 505309 1048957 1145946 -1056778 -4158359 -4723408
37563 -4723408 -1504767 2817713 4200747 1047281 -4325590 -7724054 -6923126 -3705648
37555 -3705648 -1854424 -3302274 -6653611 -8920936 -7880806 -3477767 1688646 3860630
37547 3860630 1855777 -1085121 -1058488 1443435 2698245 1540824 636207 1548004 2277721
37538 2277721 1273858 457366 1922780 4446460 5817781 6119882 5982361 4066265 -428767
37529d28767m331605r28563J642523J234773P55700K407462L668459K117369k49765
37520E887586j075435j788551l713022m046949m37920L766736L921025J078158
37512C591628n32846o27691j836795l344472j755876K211193L845470J628288
37504C178899j032213j869341k329538l026052j862177J403580L387109K208835
37496E9102L39048p862k97395j766110k087899M31314K666172R76826k636968
$$ plain form
37529 -428767 -4760372 -5688935 -4046412 -2811639 -2055939 351523 4019982 6137351 5887586
37520 5887586 4812151 3023600 -689422 -4736371 -5174291 -1407555 2513470 3591628
37512 3591628 3058782 2431091 594296 -2750176 -4506052 -2294859 1550611 3178899
37504 3178899 2146686 277345 -2052193 -5078245 -6940422 -5536842 -2149733 59102
37496 59102 398150 390288 92893 -1673217 -3761116 -3329802 -663630 313196 -2323772
$$ [...]
##END NTUPLES=NMR SPECTRUM
##END=
