##TITLE=31Pdec_LR-673-R2-HCR5
 D2O, 24 sc
 23.12.2019
##JCAMPDX= 6.0         $$ Bruker NMR JCAMP-DX V2.0
##DATA TYPE= NMR SPECTRUM
##DATA CLASS= NTUPLES
##ORIGIN= UXNMR, Bruker Analytische Messtechnik GmbH
##OWNER= root
$$ XWIN-NMR		Version 3.5
$$ Mon Dec 23 14:41:36 2019 Russian Standard Time (UT+4h)  she@DPX200
##.OBSERVE FREQUENCY= 81.013821
##.OBSERVE NUCLEUS= ^31P
##.ACQUISITION MODE= SIMULTANEOUS
##.ACQUISITION SCHEME= undefined
##.AVERAGES= 24
##.DIGITISER RES= 17
##SPECTROMETER/DATA SYSTEM= spect
##.PULSE SEQUENCE= zgpg30
##.SOLVENT NAME= CDCl3
##.SHIFT REFERENCE= (INTERNAL, CDCl3, 0, 182.463)
##AUDIT TRAIL= $$ (NUMBER, WHEN, WHO, WHERE, WHAT)
$$ ##TITLE= Audit trail, XWIN-NMR		Version 3.5
$$ ##JCAMPDX= 5.01
$$ ##ORIGIN= Bruker BioSpin GmbH
$$ ##OWNER= she
$$ F:/spectra/data/she/nmr/P31/1/pdata/1/auditp.txt
$$ ##AUDIT TRAIL=  $$ (NUMBER, WHEN, WHO, WHERE, WHAT)
(   1,<2019-12-23 14:40:26.70 +0400>,<she>,<DPX200>,
      <created by zg, POWCHK disabled, PULCHK disabled
       configuration hash MD5:
       00 E9 B6 7A A2 85 ED C7 34 08 36 98 17 FE 4E 26
       data hash MD5: 32K
       8D 15 20 CD C5 AD 08 D2 A6 7C 3D 98 5C D0 17 02>)
(   2,<2019-12-23 14:40:35.48 +0400>,<she>,<DPX200>,
      <Start of raw data processing
       efp BC_mod = 2 LB = 1 FT_mod = 6 PKNL = 1 PHC0 = -1668.725 PHC1 = 99.4012 SI = 64K 
       data hash MD5: 64K
       54 F5 F2 CA 1B B4 3F 27 FB 19 9A 79 D3 A0 AF 7D>)
(   3,<2019-12-23 14:40:49.23 +0400>,<she>,<DPX200>,
      <pk PHC0 = -27.345 PHC1 = 0 
       data hash MD5: 64K
       22 46 ED C2 94 DF CD 61 B3 6F 9F E4 5A 09 2B C4>)
(   4,<2019-12-23 14:41:05.43 +0400>,<she>,<DPX200>,
      <abs ABSG = 5 
       data hash MD5: 64K
       BA 5F 39 93 FD C0 8E 56 47 60 07 47 8D 16 2E 55>)
$$ ##END=
$$ 
$$ hash MD5
$$ A7 15 A6 7F C1 84 C2 F8 DC 31 D6 26 53 F4 44 DA
##$RELAX= 
##$RELAX= 
##$RELAX= 
##$RELAX= 
##$RELAX= 
##$RELAX= 
##$RELAX= 
##$RELAX= 
$$ Bruker specific parameters
$$ --------------------------
##$DU= <F:/spectra>
##$EXPNO= 1
##$NAME= <P31>
##$PROCNO= 1
##$TYPE= <nmr>
##$USER= <she>
##$AMP= (0..31)
100 100 100 100 100 100 100 100 100 100 100 100 100 100 100 100 100 100 
100 100 100 100 100 100 100 100 100 100 100 100 100 100 
##$AQSEQ= 0
##$AQ_mod= 1
##$AUNM= <au_zg>
##$AUTOPOS= <>
##$BF1= 81.014009
##$BF2= 200.13
##$BF3= 200.13
##$BF4= 200.13
##$BF5= 200.13
##$BF6= 200.13
##$BF7= 200.13
##$BF8= 200.13
##$BYTORDA= 1
##$CFDGTYP= 0
##$CFRGTYP= 5
##$CHEMSTR= <none>
##$CNST= (0..31)
1 1 145 1 1 1 1 1 1 1 1 1 1 1 1 1 1 1 1 1 1 1 1 1 1 1 1 1 1 1 1 1 
##$CPDPRG= <waltz16>
##$CPDPRG1= <>
##$CPDPRG2= <waltz16>
##$CPDPRG3= <>
##$CPDPRG4= <mlev>
##$CPDPRG5= <mlev>
##$CPDPRG6= <mlev>
##$CPDPRG7= <mlev>
##$CPDPRG8= <mlev>
##$CPDPRGB= <>
##$CPDPRGT= <>
##$D= (0..31)
0 1 0 0 0 0 0 0 0 0 0 0.03 2e-05 3e-06 0 0 0 0 0 0 0 0 0 0 0 0 0 0 0 0 
0 0 
##$DATE= 1577097626
##$DBL= (0..7)
120 120 120 11 120 120 24 19 
##$DBP= (0..7)
150 150 150 150 150 150 150 150 
##$DBP07= 0
##$DBPNAM0= <>
##$DBPNAM1= <>
##$DBPNAM2= <>
$$ [...]
##$SUBNAM3= <"">
##$SUBNAM4= <"">
##$SUBNAM5= <"">
##$SUBNAM6= <"">
##$SUBNAM7= <"">
##$SUBNAM8= <"">
##$SUBNAM9= <"">
##$SW= 369.568048894756
##$SWIBOX= (0..15)
0 1 3 0 0 0 0 0 0 0 0 0 0 0 0 0 
##$SW_h= 29940.119760479
##$TD= 32768
##$TD0= 1
##$TE= 0
##$TE2= 300
##$TE3= 300
##$TEG= 300
##$TL= (0..7)
0 120 53 12 22 120 120 120 
##$TP= (0..7)
150 150 150 150 150 150 150 150 
##$TP07= 0
##$TPNAME0= <>
##$TPNAME1= <>
##$TPNAME2= <>
##$TPNAME3= <>
##$TPNAME4= <>
##$TPNAME5= <>
##$TPNAME6= <>
##$TPNAME7= <>
##$TPOAL= (0..7)
0.5 0.5 0.5 0.5 0.5 0.5 0.5 0.5 
##$TPOFFS= (0..7)
0 0 0 0 0 0 0 0 
##$TUNHIN= 0
##$TUNHOUT= 0
##$TUNXOUT= 0
##$USERA1= <user>
##$USERA2= <user>
##$USERA3= <user>
##$USERA4= <user>
##$USERA5= <user>
##$V9= 5
##$VALIST= <valist>
##$VCLIST= <CCCCCCCCCCCCCCC>
##$VD= 0
##$VDLIST= <DDDDDDDDDDDDDDD>
##$VPLIST= <PPPPPPPPPPPPPPP>
##$VTLIST= <TTTTTTTTTTTTTTT>
##$WBST= 1024
##$WBSW= 4
##$XGAIN= (0..3)
0 0 0 0 
##$XL= 0
##$YL= 0
##$YMAX_a= 8889
##$YMIN_a= -8894
##$ZGOPTNS= <>
##$ZL1= 120
##$ZL2= 120
##$ZL3= 120
##$ZL4= 120
##$ABSF1= 182.463
##$ABSF2= -187.1042
##$ABSG= 5
##$ABSL= 3
##$ALPHA= 0
##$AQORDER= 0
##$ASSFAC= 0
##$ASSFACI= 0
##$ASSFACX= 0
##$ASSWID= 0
##$AUNMP= <proc_1d>
##$AZFE= 0.1
##$AZFW= 0.5
##$BCFW= 0
##$BC_mod= 2
##$BYTORDP= 0
##$COROFFS= 0
##$CY= -3
##$DATMOD= 1
##$DC= 0
##$DFILT= <>
##$DTYPP= 0
##$F1P= 0
##$F2P= 0
##$FCOR= 1
##$FTSIZE= 65536
##$FT_mod= 6
##$GAMMA= 0
##$GB= 0
##$INTBC= 1
##$INTSCL= 5.30512e-09
##$ISEN= 30
##$LB= 1
##$LEV0= 0
##$LPBIN= 0
##$MAXI= 10000
##$MC2= 0
##$MEAN= 0
##$ME_mod= 0
##$MI= 50
##$NCOEF= 0
##$NC_proc= -7
##$NLEV= 6
##$NOISF1= 182.463
##$NOISF2= 159.3651
##$NSP= 0
##$NTH_PI= 0
##$NZP= 0
##$OFFSET= 182.463
##$PC= 4
##$PHC0= -1696.07
##$PHC1= 99.4012
##$PH_mod= 1
##$PKNL= yes
##$PPARMOD= 0
##$PSCAL= 0
##$PSIGN= 0
##$REVERSE= no
##$SF= 81.0140089999434
##$SI= 65536
##$SIGF1= 159.3651
##$SIGF2= -187.1042
##$SINO= 113.3802
##$SIOLD= 16384
##$SREGLST= <1H.CDCl3>
##$SSB= 0
##$STSI= 65536
##$STSR= 0
##$SW_p= 29940.119760479
##$SYMM= 0
##$S_DEV= 0
##$TDeff= 32768
##$TDoff= 0
##$TI= <>
##$TILT= no
##$TM1= 0
##$TM2= 0
##$TOPLEV= 0
##$USERP1= <user>
##$USERP2= <user>
##$USERP3= <user>
##$USERP4= <user>
##$USERP5= <user>
##$WDW= 1
##$XDIM= 65536
##$YMAX_p= 538786107
##$YMIN_p= -113931334
$$ End of Bruker specific parameters
$$ ---------------------------------
##NTUPLES= NMR SPECTRUM
##VAR_NAME=  FREQUENCY,     SPECTRUM/REAL,   SPECTRUM/IMAG
##SYMBOL=    X,             R,               I
##VAR_TYPE=  INDEPENDENT,   DEPENDENT,       DEPENDENT
##VAR_FORM=  AFFN,          ASDF,            ASDF
##VAR_DIM=   65536,         65536,           65536
##UNITS=     HZ,            ARBITRARY UNITS, ARBITRARY UNITS
##FACTOR=    0.456856943014862, 1,           1
##FIRST=     14782.0589164792, 0,            0
##LAST=      -15158.0608439998, 0,           0
##MIN=       -15158.0608439998, -113931334,  0
##MAX=       14782.0589164792, 538786107,    0
$$ Real data points
##PAGE= N=1
##DATA TABLE= (X++(R..R)), XYDATA
$$ [...]
42599A061048J786050J031807J206555J290957r63196m652957n243422j062988
$$ 1061048 2847098 3878905 5085460 6376417 5413221 760264 -4483158 -5546146
42591e546146K997743J971293j856362k503704J087085M760653N707450M353519
$$ -5546146 -2548403 -577110 -2433472 -4937176 -3850091 910562 6618012 10971531
42583A0971531J169025l151865n420337l322194k36373j038674l920064k826742
$$ 10971531 12140556 8988691 3568354 246160 9787 -1028887 -4948951 -7775693
42575g775693K226162M535501J320208k385482k391376p85608n5414J201225L215250
$$ -7775693 -5549531 -1014030 306178 -2079304 -4470680 -5256288 -5311702 -4110477 -895227
42566h95227K462726j633079l756108j137336J288372m94709k110838J344913
$$ -895227 1567499 -65580 -3821688 -4959024 -3670652 -4165361 -6276199 -4931286
42558d931286N624224L677726k307528l964240L40917M072235L147533K10176
$$ -4931286 692938 4370664 2063136 -1901104 -1560187 2512048 5659581 5869757
42550E869757j713275k683897k399629K47709L258316K948303K5061j288759n58345
$$ 5869757 4156482 1472585 -927044 -679335 2578981 5527284 5552345 4263586 3705241
42541C705241j451042m054338l688018O60953L358878P32653l146449l076008
$$ 3705241 2254199 -1800139 -5488157 -4827204 -1468326 -735673 -3882122 -6958130
42533f958130j80408J374895J003970P14568P31960K78214K49719J426281K167535
$$ -6958130 -7138538 -5763643 -4759673 -4045105 -3313145 -3034931 -2785212 -1358931 808604
42524H08604J127598L106M41829O79338j274099l450872k811725l97127M69683
$$ 808604 1936202 1939308 2381137 3060475 1786376 -1664496 -4476221 -4873348 -4403665
42515d403665l31465j92976J243857J800947J046197Q18959J398871R10649j023469
$$ -4403665 -4735130 -4928106 -3684249 -1883302 -837105 -18146 1380725 2291374 1267905
42506A267905k445719k396316j870744r71103J440375M353936M473738J140480
$$ 1267905 -1177814 -3574130 -5444874 -6415977 -4975602 -621666 3852072 4992552
42498D992552j772008j057040J340091J496182r16746k936414k794075j436373
$$ 4992552 3220544 2163504 3503595 4999777 4083031 1146617 -1647458 -3083831
42490c083831l29795o4604o89642j454159o87002K112123M530063L765200O89180
$$ -3083831 -3413626 -3478230 -4167872 -5622031 -6309033 -4196910 333153 4098353 4787533
42481D787533r90691J51891J524717P79918o93605l53649J299158J573369k34813
$$ 4787533 3796842 3948733 5473450 6253368 5559763 5206114 6505272 8078641 7843828
42472G843828k034370k269506j713850j322432m35890J497445L033571K553920
$$ 7843828 5809458 3539952 1826102 503670 67780 1565225 4598796 7152716
42464G152716J130825J264388K748002K296162j519233n125465m159549J95704
$$ 7152716 8283541 9547929 12295931 14592093 13072860 7947395 3787846 3983550
42456C983550K128226j081580n141012m374676Q02169M755403M036054Q64104
$$ 3983550 6111776 5030196 -110816 -4485492 -3683323 1072080 5108134 5972238
42448E972238j000400q86393l18393J70054J048783J749970R49513j173648k686401
$$ 5972238 4971838 4085445 3767052 3937106 4985889 6735859 7685372 6511724 3825323
42439C825323k296525r21820m33021j412967k514125j968439K41580J982634J367332
$$ 3825323 1528798 606978 173957 -1239010 -3753135 -5721574 -5479994 -3497360 -2130028
42430b130028p14725j673040p71890J38079j94162p01543m52537l86756r17769
$$ -2130028 -2844753 -4517793 -5289683 -5151604 -5345766 -6047309 -6499846 -6886602 -7804371
42421g804371l01814K178054L761687K058626p23801j055013K85456K05344o53064
$$ -7804371 -8106185 -5928131 -2166444 -107818 -831619 -1886632 -1601176 -1395832 -2048896
42412b048896P86262L430714K859799p25220j824551J322627L412288P41772k881077
$$ -2048896 -1262634 2168080 5027879 4302659 2478108 3800735 7213023 7954795 5073718
42403E073718k914896j176143j215930j640872R6950J493111p88655l730649k096116
$$ 5073718 2158822 982679 -233251 -1874123 -1777173 -284062 -1072717 -4803366 -6899482
42394f899482K471635L788689J189772k87489P57570M43191k043418k372043O25169
$$ -6899482 -4427847 -639158 550614 263125 1020695 1463886 -579532 -2951575 -2326406
42385b326406K013121p62097l213616j588131Q40246Q9615j245623J139527N013462
$$ -2326406 -313285 -1075382 -4288998 -5877129 -5036883 -4947268 -6192891 -5053364 -39902
42376c9902M557673m94499m479629l863584q88184Q04421L54455q57768j193356
$$ -39902 4517771 4023272 -456357 -4319941 -5208125 -4403704 -4049249 -4907017 -6100373
42367f100373J7599J493240Q55203k036439l975720k436520R88677L231984L819056
$$ -6100373 -6082774 -4589534 -3734331 -5770770 -9746490 -12183010 -11194333 -7962349 -4143293
42358d143293L755523K514849n04457l111545k559351K72887K234135K499111
$$ -4143293 -387770 2127079 1622622 -1488923 -4048274 -3775387 -1541252 957859
42350I57859K482597K202745N30199j547220j824937p69037o18470q89986Q38444
$$ 957859 3440456 5643201 6173400 4626180 2801243 2032206 1413736 523750 1362194
42341A362194L529689L047119r13180l197209p10680K894046K949051K67245j538342
$$ 1362194 4891883 7939002 7025822 3828613 3117933 6011979 8961030 9228275 7689933
42332G689933j843276k100704j786285K83884K217916J078580k103794l383089
$$ 7689933 5846657 3745953 1959668 2243552 4461468 5540048 3436254 53165
42324E3165j539020J155969L344544N391562N727753J538849n267128p746558
$$ 53165 -1485855 -329886 3014658 8406220 14133973 15672822 10405694 2659136
42316B659136k781365L632250L969110q59558l772634j842874R81717J106844
$$ 2659136 -122229 3510021 7479131 6619573 2846939 1004065 1985782 3092626
42308C092626j65398n55508n19508p40596J48715K369340K795047m53748l731278
$$ 3092626 2927228 2371720 1852212 1111616 1260331 3629671 6424718 5970970 2239692
42299B239692k335125K294234M255981J508758j904402k294749p34512K28627
$$ 2239692 -95433 2198801 6454782 7963540 6059138 3764389 3029877 3258504
42291C258504M41104O85982M01710p67000j419593o68553k4028q00039j463044
$$ 3258504 3699608 4385590 4787300 4020300 2600707 1932154 1908126 1108087 -354957
42282c54957l4447K349966K955959J547790L28232L14544K85738p37958k124130
$$ -354957 -389404 1960562 4916521 6464311 6792543 7107087 7392825 6654867 4530737
42273D530737k870267k497638p26243K089197M220176L889831J456381j084484
$$ 4530737 1660470 -837168 -1563411 525786 4745962 8635793 10092174 9007690
42265I007690k648964l595043l868318k570997R7085K114919J842391L7167j133717
$$ 9007690 6358726 2763683 -1104635 -3675632 -3578547 -1463628 378763 415930 -717787
42256g17787o04002O32308Q91093j58841j015915k28197J486559K013524Q54858
$$ -717787 -1321789 -689481 201612 42771 -973144 -1201341 285218 2298742 3153600
42247C153600j01411M73665J245922L48368j797728l382226l675422k841255n85940
$$ 3153600 3052189 3525854 4771776 5120144 3322416 -59810 -3735232 -6576487 -7162427
42238g162427K750977M746417L187775n12083k659708j973983o21624n62000j276507
$$ -7162427 -4411450 334967 3522742 3010659 350951 -1623032 -2244656 -2806656 -4083163
42229d083163j505282j004139L2515J381199K065603J003212j083973k029063
$$ -4083163 -5588445 -6592584 -6560069 -5178870 -3113267 -2110055 -3194028 -5223091
42221e223091r51102Q16442J685846J197395l77585j923558j264713K462200O167073
$$ -5223091 -6174193 -5357751 -3671905 -2474510 -2852095 -4775653 -6040366 -3578166 2588907
42212B588907N364258J0247m894457n370171k442900Q42569L245675M397282L020312
$$ 2588907 7953165 7963412 3068955 -2301216 -4744116 -3901547 -655872 3741410 6761722
42203F761722j115992n183615n863053l119459L02358K188085K242529J322889
$$ 6761722 5645730 462115 -5400938 -8520397 -8218039 -6029954 -3787425 -2464536
42195b464536P00151J095058J501064L33274j573432j341983J332603K649194
$$ -2464536 -1764385 -669327 831737 1165011 -408421 -1750404 -417801 2231393
42187B231393M4094l344348k639623J928567N439354M736455J344529j781447
$$ 2231393 2275487 -1068861 -3708484 -1779917 3659437 8395892 9740421 7958974
42179G958974l444668l754827k902602j311064K19276J000578O96590l26249m71185
$$ 7958974 4514306 759479 -2143123 -3454187 -3234911 -2234333 -1537743 -1863992 -2335177
42170b335177J669887M329453L250719k473395p406687n830777N81847M763531
$$ -2335177 -665290 3664163 6914882 4441487 -2965200 -8795977 -8214130 -3450599
42162c450599L246586n83813k196505j060611P25276J587501R11036j072160k575523
$$ -3450599 -204013 -787826 -2984331 -4044942 -3319666 -1732165 -821129 -1893289 -4468812
42153d468812j633468Q85333J878340M08831j020520n71039L69903K65314K49282
$$ -4468812 -6102280 -5216947 -3338607 -2929776 -3950296 -4521335 -4151432 -3886118 -3636836
42144c636836J573948K545429Q90495k165839l046957o05097K519436L255000
$$ -3636836 -2062888 482541 1373036 -792803 -3839760 -4444857 -1925421 1329579
42136A329579J151377j818937l159263j701627J290916L032026K076076j18408
$$ 1329579 2480956 662019 -2497244 -4198871 -2907955 124071 2200147 2081739
42128B081739j237314r55376o28574q73116r38716k86675N38912P64029K42905
$$ 2081739 844425 -110951 -739525 -1612641 -2551357 -2838032 -2299120 -1535091 -1292186
42119a292186n87254j006849m43071Q42648J810456J898439J675610J628412J144791
$$ -1292186 -1879440 -2886289 -3329360 -2486712 -676256 1222183 2897793 4526205 5670996
42110E670996k15912j265033o43488O17027k1755k765756m457328k563158J221584
$$ 5670996 5455084 4190051 3546563 4163590 4141835 1376079 -3081249 -5644407 -4422823
42101d422823L032365J736264j58704l98780L41221M94053L38510R11734J483520
$$ -4422823 -1390458 345806 187102 -211678 129543 623596 962106 1873840 3357360
42092C357360N09309j360170j814588o12311l1974q34750p99866J067919J990516
$$ 3357360 3866669 2506499 691911 79600 47626 -787124 -1586990 -519071 1471445
42083A471445j40276k484544j221306K134048K876120N30855q55066K44873Q54619
$$ 1471445 1331169 -1153375 -2374681 -240633 2635487 3166342 2311276 2556149 3410768
42074C410768m19124p98010Q64087R18180k795986n925522l520010K235583N195995
$$ 3410768 2991644 2193634 3057721 3975901 1179915 -4745607 -8265617 -6030034 -834039
42065h34039L925074K037510J303891j23127k712806l853485k186433K28772J214054
$$ -834039 3091035 5128545 6432436 6309309 3596503 -256982 -2443415 -2214643 -1000589
42056a000589Q90692N8796r80604j423042n21451N13174p9895j324701p97895
$$ -1000589 -109897 -51101 -1031705 -2454747 -2976198 -2463024 -2542919 -3867620 -4665515
42047d665515R49726J094660k57383j09827J541851J096014j744328k139662J719655
$$ -4665515 -3715789 -2621129 -2878512 -2988339 -1446488 -350474 -2094802 -4234464 -2514809
42038b514809M200229O69788m390145l723513J595541M139681J444411j579675
$$ -2514809 1685420 2355208 -2034937 -5758450 -4162909 -23228 1421183 -158492
42030a58492j342830m8227k35676o69728O7230N44706l44696q74549L26174J676711
$$ -158492 -1501322 -1549549 -1785225 -2454953 -2387723 -1843017 -2187713 -3062262 -2736088 -1059377
42020a059377J602508J231122J752656J800219P6901j793072j784959p63576m57205
$$ -1059377 543131 1774253 3526909 5327128 5404029 3610957 1825998 1062422 605217
42011F05217j24102J576576L001746J477881j904284l083788p22645K080626K350431
$$ 605217 481115 2057691 5059437 6537318 4633034 1549246 826601 2907227 5257658
42002E257658P55205l65549k18387M01588O49312R4888j232959k526932k865329
$$ 5257658 6012863 5647314 5428927 5830515 6479827 6574715 5341756 2814824 -50505
41993e0505k510857k387408k168664o20796J672192K071175k26162j945468K65292
$$ -50505 -2561362 -4948770 -7117434 -7738230 -6066038 -3994863 -4221025 -6166493 -5901201
41984e901201M556110N430460R34998m305367m754543p82676K527813K396283
$$ -5901201 -1345091 4085369 5020367 715000 -4039543 -4822219 -2294406 101877
41976A01877J046780R68373Q66184j313586l788585l019743N21861K544408J143672
$$ 101877 1148657 2117030 2983214 1669628 -2118957 -5138700 -4616839 -2072431 -928759
41967i28759r49419j322015j195098j823617j363275J566892M286854L756963
$$ -928759 -1878178 -3200193 -4395291 -6218908 -7582183 -6015291 -1728437 2028526
41959B028526J474986O93296R08682k82181j647616j79579K357369R10590m304007
$$ 2028526 3503512 4196808 5105490 4823309 3175693 2996114 5353483 6264073 1960066
41950A960066o907284l736816P18355J842202J248202K035633K816064J133008
$$ 1960066 -4947218 -8684034 -7965679 -6123477 -4875275 -2839642 -23578 1109430
41942A109430j162703r71814O28406Q23374K34013P67773Q75664j617675m022796
$$ 1109430 -53273 -1025087 -396681 426693 660706 1428479 2304143 686468 -3336328
41933c336328k070063K544859L975918J129932j245511n11062P69389M25262l38647
$$ -3336328 -5406391 -2861532 1114386 2244318 998807 487745 1257134 1682396 1343749
41924A343749p08789j598034k071589k7512K388533L88893m622532m962419J399708
$$ 1343749 634960 -963074 -3034663 -3062175 -673642 -284749 -4907281 -9869700 -8469992
41915h469992O277886L559501j134123P6613M373906L469953k354662n094024
$$ -8469992 -2192106 1367395 233272 309885 4683791 8153744 5799082 705058
41907G05058k150405Q44391M71863q5539J286384J656549m34042j507908K60009
$$ 705058 -1445347 -600956 -129093 -214632 1071752 2728301 2294259 786351 1046360
41898A046360J141809j364610l300826o35825L488750L287148q72351l526063
$$ 1046360 2188169 823559 -2477267 -3113092 375658 3662806 2790455 -735608
41890g35608k260059L3681K89651j362149l090106l131529n06134L436361M999231
$$ -735608 -2995667 -2961986 -2672335 -4034484 -7124590 -10256119 -10762253 -7325892 -2326661
41881b326661K285285j631992k444235l92464Q54522J05852l63833N04961Q38426
$$ -2326661 -41376 -1673368 -4117603 -4510067 -3655545 -3549693 -3913526 -3408565 -2570139
41872b570139m90613j872214j762823o40816Q59098K977568M855397M387184J608009
$$ -2570139 -3060752 -4932966 -6695789 -7336605 -6477507 -3499939 1355458 5742642 7350651
41863G350651m51265j32177K51906j514659l420467k321117O65823J593127k51756
$$ 7350651 6899386 6767209 7019115 5504456 2083989 -237128 428695 2021822 1770066
41854A770066j512716k30079J424528J029441m83734r30451l15002m3060k57886
$$ 1770066 257350 27271 1451799 2481240 1997506 1067055 752053 708993 451107
41845D51107j49980J08636j04867r6213J140136K464672J545411j449479l441286
$$ 451107 301127 409763 304896 208683 1348819 3813491 5358902 3909423 468137
41836D68137k582799p07082k71518o89260K75449K566558L617290J934105j033080
$$ 468137 -2114662 -2821744 -3093262 -3782522 -3507073 -940515 2676775 4610880 3577800
41827C577800k966174l173075k477141j724033j111689m64204L27436J035596
$$ 3577800 611626 -2561449 -5038590 -6762623 -7874312 -8338516 -8011080 -6975484
41819f975484J345790J506861K130226K860442K189552l15171k491581j925764
$$ -6975484 -5629694 -4122833 -1992607 867835 3057387 2742216 250635 -1675129
41811a675129P13849K539694K346051J520479J052912J39281j488553k227377
$$ -1675129 -961280 1578414 3924465 5444944 6497856 6637137 5148584 2921207
41803B921207j012683O98198Q28586p29058k586420l591124l053703p80363J924173
$$ 2921207 1908524 2606722 3435308 2706250 119830 -3471294 -6524997 -7305360 -5381187
41794e381187K821235J550020K99914N11464Q82243J08335p45661o67373r99223
$$ -5381187 -2559952 -1009932 -710018 -198554 683689 792024 46363 -621010 -1620233
41785a620233k568008k944933j73707K806738J904854j229488j133173K796105
$$ -1620233 -4188241 -7133174 -7306881 -4500143 -2595289 -3824777 -4957950 -2161845
41777b161845M888630J704865k924165l723162r70774J189216O54533j189012
$$ -2161845 2726785 4431650 1507485 -2215677 -3186451 -1997235 -1342702 -2531714
41769b531714k031691m88006K980377N426624L646439j503389n224250m705664
$$ -2531714 -4563405 -5051411 -2071034 3355590 7002029 5498640 274390 -4431274
41761d431274k363530j340051p70371J607587M626596N076468K600654m7708r55825
$$ -4431274 -6794804 -8134855 -8905226 -7297639 -2671043 2405425 5006079 4958371 4002546
41752D002546o21643k18437n38406j926562l361731k754919m8007J674935M85463
$$ 4002546 3380903 3162466 2624060 697498 -2664233 -5419152 -5467159 -3792224 -3306761
41743c306761j023477K28001K394900J436455j946805k817267N16360M020844
$$ -3306761 -4330238 -4102237 -1707337 -270882 -2217687 -5034954 -4518594 -497750
41735d97750L958056J504390k33034o35923j004646j729647j943137r72113Q04108
$$ -497750 3460306 4964696 4731662 4095739 3091093 1361446 -581691 -1553804 -749696
41726g49696J941218J042077j108879j630366M79561K080515L60345k232313j539246
$$ -749696 1191522 2233599 1124720 -505646 -26085 2054430 2414775 182462 -1356784
41717a356784J188075R38735k507026l532911N17990N100097N405223K593817
$$ -1356784 -168709 770026 -1737000 -5269911 -4751921 348176 5753399 8347216
41709H347216J76479j322425k659420k757366j023835L80482m0799m88796L17266
$$ 8347216 8523695 7201270 4541850 1784484 760649 1141131 1100332 611536 928802
41700I28802L18258j455193j706244J473062L778474J002621l276198k693623
$$ 928802 1247060 -208133 -1914377 -441315 3337159 4339780 1063582 -1630041
41692a630041J764879L629204J423256j48023Q19214Q22723j577296k806618j018871
$$ -1630041 134838 3764042 5187298 5039275 5858489 6681212 5103916 2297298 1278427
41683A278427N34602k77085n76587J784696L692072J985867j001672j482477m73471
$$ 1278427 1813029 1535944 959357 2744053 6436125 8421992 7420320 5937843 5464372
41674E464372j472693m114741m537245j052403L934932P015705O424952K693183
$$ 5464372 3991679 -123062 -4660307 -5712710 -1777778 5237927 11662879 14356062
41666A4356062j276568k119056J08478J540425k69161k924188l159612j724576
$$ 14356062 13079494 10960438 11068916 12609341 12340180 9415992 6256380 4531804
41658D531804j332679j977607j850714j201588j366644j155512J500224M732615
$$ 4531804 3199125 1221518 -629196 -1830784 -3197428 -4352940 -2852716 1879899
41650A879899M109447m75269l485472j120818L299419L838031k84642m136162
$$ 1879899 5989346 5514077 2028605 907787 4207206 8045237 7760595 3624433
41642C624433l506335M29690L222653K483583N3390r24475R0147J062037O19677
$$ 3624433 118098 547788 3770441 6254024 6307414 5382939 5473086 6535123 7154800
41633G154800o09585j968562l656418m694060k756155J817057M352908J479034
$$ 7154800 6545215 4576653 920235 -3773825 -6529980 -4712923 -360015 1119019
41625A119019l275406l531107R36473L688461Q43878l479632l184126J554886
$$ 1119019 -2156387 -5687494 -4751021 -1062560 -218682 -3698314 -6882440 -5327554
41617e327554N200803M388616J361263m003Q88341J482027J7256k090290k319098
$$ -5327554 -126751 4261865 5623128 5619125 6507466 7989493 8006749 5916459 3597361
41608C597361p00306J25596j181035k582669j902980l25105j90809o31918J157934
$$ 3597361 2897055 3022651 1841616 -741053 -2644033 -2969138 -3159947 -3791865 -2633931
41599b633931M520257N066941J016287l529700l735759o6678L077734K980664
$$ -2633931 1886326 6953267 7969554 4439854 704095 637417 3715151 6695815
41591F695815O18331j619226k032309l34111J828163J817418r30365l717982m018920
$$ 6695815 7314146 5694920 3662611 3328500 5156663 6974081 6043716 2325734 -1693186
41582a693186k769249k156894j593819R79861M431969M853973J407883j681050
$$ -1693186 -4462435 -6619329 -8213148 -7233287 -2801318 2052655 3460538 1779488
41574A779488q34571J860395J890798j238155l816541l462603j749083q94534
$$ 1779488 944917 2805312 4696110 3457955 -358586 -3821189 -5570272 -6464806
41566f464806n70426N62632K044135K341577J510443J149654J810506K154407
$$ -6464806 -7035232 -6472600 -4428465 -2086888 -576445 573209 2383715 4538122
41558D538122J068458p51373j951703k154225j707838p89590L28420R02893O32212
$$ 4538122 5606580 4855207 2903504 749279 -958559 -1748149 -1419729 -516836 115376
41549A15376L10917N26827M12010r09873k195335j293446J468404L133223K071641
$$ 115376 426293 953120 1365130 455257 -1740078 -3033524 -1565120 1568103 3639744
41540C639744K29556Q4615R07218J20190k348561l541030j746561Q70192J354437
$$ 3639744 3869300 3953915 4861133 4981323 2632762 -908268 -2654829 -1784637 -430200
41531d30200J73139J68221J851364K412965K10963k275836k013010n0936L63906
$$ -430200 -257061 -88840 1762524 4175489 4386452 2110616 97606 46670 410576
41522D10576p29674k13094K241340K781607l65701l262352k040296R92398J211592
$$ 410576 -319098 -532192 1709148 4490755 4125054 862702 -1177594 -185196 1026396
41513A026396q48731j021792Q34210N82469k511810l748398m78926L614464M515975
$$ 1026396 177665 -844127 -9917 572552 -1939258 -5687656 -6166582 -2552118 1963857
41504A963857L522846L363209K805578l30251l875610m103340j916638j206914
$$ 1963857 5486703 8849912 11655490 11325239 7449629 3346289 1429651 222737
41496B22737k173400j448252J391491K641410N93788j845339k095537j267126
$$ 222737 -1950663 -3398915 -2007424 633986 1227774 -617565 -2713102 -3980228
41488c980228q00496K45290K114838K214479p69534l460566k081783J803829L446099
$$ -3980228 -4780724 -4535434 -2420596 -206117 -975651 -4436217 -6518000 -4714171 -1268072
41479a268072J507461j036833j827954j386385o00845N71945J383277L89521j747419
$$ -1268072 239389 -797444 -2625398 -4011783 -4612628 -4040683 -2657406 -2267885 -4015304
41470d015304k232699q4737K260275K513003J350449K47939r83699k418236k177940
$$ -4015304 -6248003 -6332740 -4072465 -1559462 -209013 38926 -944773 -3363009 -5540949
41461e540949O57823L006133J188713l289417m953874j535576L403918N715749
$$ -5540949 -4883126 -1876993 -688280 -3977697 -8931571 -10467147 -7063229 -1347480
41453a347480N247806L803772J642146j574707m387106m681511k313622J051805
$$ -1347480 3900326 7704098 9346244 7771537 3384431 -1297080 -3610702 -2558897
41445b558897L627741L853569R58971l024510l861076j98404L704511L173333
$$ -2558897 1068844 4922413 5881384 2856874 -1004202 -1202606 2501905 5675238
41437E675238n93418k767677j958222q97186q33039n676J855542K210410L18338
$$ 5675238 5081820 2314143 355921 -541265 -1374304 -1379980 475562 2685972 3004310
41428C004310r92088n8046R04531J4624r77175k43517O41290j40048j036742j45558
$$ 3004310 2012222 1954176 2858707 2873331 1896156 1652639 2293929 2153881 1117139 971581
41418I71581Q22101n19005k464085j667227J054291J781717k02994j406893L46986
$$ 971581 1793682 1274677 -1189408 -2856635 -1802344 -20627 -223621 -1630514 -1283528
41409a283528L030896L739332K012785q14639l193226l756963k122552L59917
$$ -1283528 1747368 5486700 7499485 6684846 3491620 -265343 -2387895 -2027978
41401b027978K008576K488485J836672n53464l780858m359067o99771L082269
$$ -2027978 -19402 2469083 4305755 3752291 -28567 -4387634 -5087405 -2005136
41393b005136K091838j875478k715853P45781L497100K706439J402587K136028
$$ -2005136 86702 -1788776 -4504629 -3758848 -261748 2444691 3847278 5983306
41385E983306K710678J064543o39401l03633M3017j661410l105813j520360J091391
$$ 5983306 8693984 9758527 9119126 8815493 8858510 7197100 4091287 2570927 3662318
41376C662318J082355q60038j313311J03582R32576N85266O12450J027789L04256
$$ 3662318 4744673 3884635 2571324 2674906 3607482 4192748 4805198 5832987 6137243
41367F137243j332208k084686j710103j311754o39469J080403K324363J075513
$$ 6137243 4805035 2720349 1010246 -301508 -940977 139426 2463789 3539302
41359C539302q63274M56456M586945N914944J068834o052768q718103m886902
$$ 3539302 2676028 3132484 7719429 13634373 14703207 8650439 -67664 -4954566
41351d954566J329587M438567K649484j033628k319873n23416R47499j65460j349174
$$ -4954566 -3624979 813588 3463072 2429444 109571 -413845 533654 368194 -980980
41342i80980N48174L588461L207894m93362k626385r77884J147727Q33022k99938
$$ -980980 -432806 3155655 6363549 5870187 3243802 2265918 3413645 4246667 3946729
41333C946729q6295J78496j133615k131068l22588K776680L493674J165149j569324
$$ 3946729 3860434 4038930 2905315 774247 451659 3228339 6722013 7887162 6317838
41324F317838k718221k520340j757664q43567k11996J21779Q31739J867553J943656
$$ 6317838 3599617 1079277 -678387 -1521954 -1733950 -1612171 -780432 1087121 3030777
41315C030777P67928J31602J067010J800754O93865p98005q19049p12291k405688
$$ 3030777 3798705 3930307 4997317 6798071 7491936 6693931 5874882 5162591 2756903
41306B756903l931753j977290J921833K654668o95162l278249j959622M15756
$$ 2756903 -1174850 -3152140 -1230307 1424361 729199 -2549050 -4508672 -4092916
41298d092916N12605k26242P72100J967483M61270k411068k856561o94356Q92036
$$ -4092916 -3580311 -3806553 -3034453 -1066970 -605700 -3016768 -5873329 -6567685 -5675649
41289e675649J105695K321372M671875M596792O50714l228606l051782m12030
$$ -5675649 -4569954 -2248582 2423293 7020085 7670799 4442193 1390411 978381
41281I78381M25438j069660j818881n43983P33622O67926O46260J805872K612137
$$ 978381 1403819 334159 -1484722 -2028705 -1295083 -627157 19103 1824975 4437112
41272D437112J076988k114737m186807l287163j55694K588111K577628L6603k007202
$$ 4437112 5514100 3399363 -787444 -4074607 -4230301 -1642190 935438 972041 -1035161
41263a035161j103306J224440J398890q83795j971809K32112L066259L271945
$$ -1035161 -2138467 -914027 484863 -398932 -2370741 -2138629 927630 4199575
41255D199575J604323O44350L23340j063862k964887l243575j871719o24760J47940
$$ 4199575 5803898 6448248 6771588 5707726 2742839 -500736 -2372455 -2997215 -2849275
41246b849275J078780J011727j318255l434447j665812K339758K914606p40738
$$ -2849275 -1770495 -758768 -2077023 -5511470 -7177282 -4837524 -1922918 -2663656
41238b663656k625326P31841M640443L781113L27464n99886M13716q32415l902661
$$ -2663656 -5288982 -4557141 83302 3864415 4191879 3591993 4005709 3173294 -729367
41229g29367m213670r92809J522507J278241J141458L139305M894763L782021
$$ -729367 -4943037 -5935846 -4413339 -3135098 -1993640 1145665 6040428 9822449
41221I822449P25532k053570l759552l928265j980170N14368N48254j561468j729914
$$ 9822449 10547981 8494411 4734859 806594 -1173576 -659208 -110954 -1672422 -3402336
41212c402336J405608L443238Q06090l248206l365818k7895K078863J703668J602368
$$ -3402336 -1996728 1446510 2252600 -995606 -4361424 -4389319 -2310456 -606788 995580
41203I95580K155655L16091l876423n122699j98765O347133P541233K793285k289136
$$ 995580 3151235 3467326 -409097 -5531796 -5730561 616572 8157805 10951090 8661954
41194H661954l624701k413764j287761m63756P86268J550354N52154j268890j751610
$$ 8661954 5037253 2623489 1335728 871972 1658240 3208594 3760748 2491858 740248
41185G40248o73521Q1939n16022j456709j750191j667950j239121L05522K280674
$$ 740248 66727 148666 -367356 -1824065 -3574256 -5242206 -6481327 -6175805 -3895131
41176c895131K014533j221167l702869j742147K589035L877972J058540j405537
$$ -3895131 -1880598 -3101765 -6804634 -8546781 -5957746 -2079774 -1021234 -2426771
41168b426771n48524J184081Q07454l83658K51534K018465K522075J766685J175627
$$ -2426771 -2975295 -1791214 -983760 -1367418 -1115884 902581 3424656 5191341 6366968
41159F366968K86271j886694l471498j750884J910574L116706O71121j895468
$$ 6366968 6653239 4766545 1295047 -455837 1454737 4571443 5242564 3347096
41151C347096j723227j36966L71612l74408j226393j619886j068021R34846L168779
$$ 3347096 1623869 1486903 1858515 1484107 257714 -1362172 -2430193 -1495347 1673432
41142A673432L174695Q46132r12593o09032m56254k171462l418767j523914J659778
$$ 1673432 4848127 5694259 4781666 4172634 3716380 1544918 -1873849 -3397763 -1737985
41133a737985K379748Q63551L98075J378048Q55608j690774k750814m97381J917815
$$ -1737985 641763 1505314 1903389 3281437 4137045 2446271 -304543 -801924 1115891
41124A115891J231581j036390j595776p14166q68697j715326n79207K341389L377294
$$ 1115891 2347472 1311082 -284694 -998860 -1867557 -3582883 -4162090 -1820701 1556593
41115A556593R86144j565016j024144J103138J224986q30486k088643j380704
$$ 1556593 2542737 977721 -46423 1056715 2281701 1451215 -637428 -2018132
41107b018132p41514j471540j753194K97668L214595L821019J374007j681903
$$ -2018132 -2759646 -4231186 -5984380 -5686712 -2472117 1348902 2722909 1041006
41099A041006k758828j520706O21306K127550K269156J401472O13567O24977J031033
$$ 1041006 -1717822 -3238528 -2617222 -489672 1779484 3180956 3794523 4419500 5450533
41090E450533J007528L72496o56826k160144l911419m550668k816086L71051K442401
$$ 5450533 6458061 6830557 6173731 4013587 102168 -4448500 -7264586 -6893535 -4451134
41081d451134K115888O36175j61561J98969J108490J746886J276858l86537j512905
$$ -4451134 -2335246 -1699071 -1860632 -1661663 -553173 1193713 2470571 2084034 571129
41072E71129k2779L128538M048394R27687k931223l292784o34626J150057O15031
$$ 571129 548350 3676888 7725282 8652969 5721746 2428962 1794336 2944393 3559424
41063C559424q0410L05756J79965j236357j858630m69721M23235j524001l830160
$$ 3559424 3479014 3784770 3964735 2728378 869748 400027 823262 -700739 -4530899
41054d530899k192628K640353N049914K286170j623781j659285J314401K392035
$$ -4530899 -6723527 -4083174 966740 3252910 1629129 -30156 1284245 3676280
41046C676280j63256k932529k578154q1233J445603J050846K11843n6097l14043
$$ 3676280 3513024 580495 -1997659 -2078892 -633289 417557 629400 573303 259260
41037B59260r95728j268620l21121J053790J056401r13505l082180k810961L82777
$$ 259260 -736468 -2005088 -2326209 -1272419 -216018 -1129523 -4211703 -7022664 -6639887
41028f639887L621173L410228j41222k927900j542114K550065M841249L176983
$$ -6639887 -3018714 391514 250292 -2677608 -4219722 -1669657 3171592 6348575
41020F348575l44352k645244k867955j853217l66580R71225J360014Q17447O19334
$$ 6348575 6004223 3358979 491024 -1362193 -1728773 -757548 602466 1419913 2039247
41011B039247J478278K047208O20903k176636l836675k942257m68119J828160
$$ 2039247 3517525 5564733 6185636 4009000 172325 -2769932 -3238051 -1409891
41003a409891L068429L085961J754059p18124l132340l607626j124045K881845
$$ -1409891 1658538 4744499 6498558 5780434 2648094 -959532 -2083577 798268
40995G98268N011633L171826p07171k729266j988765j308230k235362k270746
$$ 798268 5809901 8981727 8274556 5545290 3556525 2248295 12933 -2257813
40987b257813N44700L094624J306632k801111l261849O95250L114776N74668k408876
$$ -2257813 -1713113 1381511 2688143 -112968 -3374817 -2679567 435209 1009877 -1398999
40978a398999p55924K903673K534066j488908k962450L45079L443991J988702
$$ -1398999 -2154923 748750 3282816 1793908 -1168542 -823463 2620528 4609230
40970D609230j660697k877355j420925k27577r9880N85871K002561K267085P18100
$$ 4609230 2948533 71178 -1349747 -1577324 -1677204 -1091333 911228 3178313 3896413
40961C896413r98255j530602j270086p59176J75116J009766M37698j141093j124906
$$ 3896413 2898158 1367556 97470 -661706 -486590 523176 960874 -180219 -1305125
40952a305125J513703L736801K206544j569288k887404n24132J489148j22197
$$ -1305125 208578 3945379 6151923 4582635 1695231 1171099 2660247 2538050
40944B538050k990471k542001J480301M707766L806190J1733l133436l616430
$$ 2538050 -452421 -2994422 -1514121 3193645 6999835 7011568 3878132 261702
40936B61702k011705j69931M86390J77859M80247K121507L472918K544900J20932
$$ 261702 -1750003 -1919934 -1433544 -1255685 -775438 1346069 4818987 7363887 7484819
40927G484819r68780J84541J374228O52894j103034k015869j775442j112606l23423
$$ 7484819 6516039 6700580 8074808 8727702 7624668 5608799 3833357 2720751 2397328
40918B397328K69030j26916j255908j370569M9929Q23485n81246j968548n90168
$$ 2397328 2666358 2539442 1283534 -87035 -37106 786379 205133 -1763415 -2353583
40909b353583J983740J840413j002001k467545j019197L8656j435827k414125
$$ -2353583 -369843 1470570 468569 -1998976 -3018173 -2979517 -4415344 -6829469
40901f829469J02809L320413K521361j269952k488964M69876K950400J420879
$$ -6829469 -6726660 -3406247 -884886 -2154838 -4643802 -4173926 -1223526 197353
40893A97353j366232j246795Q66622J162188n06791o33309J768436L255441J342710
$$ 197353 -1168879 -2415674 -1549052 -386864 -893655 -1526964 241472 3496913 4839623
40884D839623j696549k489468j375121q80251j243324o94548O09655L70995j794912
$$ 4839623 3143074 653606 -721515 -1601766 -2845090 -3539638 -2929983 -2558988 -4353900
40875d353900l144800j702038J205724L599076N444082O676584N220386J20855
$$ -4353900 -7498700 -9200738 -7995014 -4395938 1048144 7724728 12945114 13065969
40867A3065969m956059n161700j090633J750970O52840r06251P19503L474000
$$ 13065969 8109910 2948210 1857577 3608547 4261387 3355136 4074639 7548639
40859G548639K999390l47802k000915k30157J367038m18828l495237l678206q33721
$$ 7548639 10548029 10200227 8199312 7969155 9336193 8917365 5422128 1743922 910201
40850I10201J166381Q3530j973034k155630q30868k29282o00302l5041K066978
$$ 910201 2076582 2160112 187078 -1968552 -2799420 -3028702 -3629004 -3664045 -1597067
40841a597067L570514K530302J7705j351952q79360k29566o48669j265879o00800
$$ -1597067 1973447 4503749 4521454 3169502 2290142 2060576 1411907 146028 -454772
40832d54772J361225L284763L917991K731100j51984l632595n615457m574962
$$ -454772 906453 4191216 8109207 10840307 10688323 7055728 1440271 -3134691
40824c134691j425276J134457J607693J171126J526124K283278J786841n8962
$$ -3134691 -4559967 -3425510 -1817817 -646691 879433 3162711 4949552 4890590
40816D890590j567344j940785k266528l146740l208350j337911J153398K346216
$$ 4890590 3323246 1382461 -884067 -4030807 -7239157 -8577068 -7423670 -5077454
40808e077454K387041K305881J465241j010386l092785j691894K179371L833294
$$ -5077454 -2690413 -384532 1080709 70323 -3022462 -4714356 -2534985 1298309
40800A298309J648955l25311J357375M118944L470723r480j831808m65862R82766
$$ 1298309 2947264 2621953 3979328 8098272 11568995 11559515 9727707 9261845 10244611
40791A0244611j16206k608648l961905l267171j119322J276703K194654N46428
$$ 10244611 10128405 7519757 3557852 290681 -828641 448062 2642716 3189144
40783C189144k303664l480114j944466M62405J647985J485007J018020P98797
$$ 3189144 885480 -2594634 -4539100 -4076695 -2428710 -943703 74317 873114
40775H73114N43902l07514j719935k321905n45757K546441L281221J42029l291496
$$ 873114 1417016 1109502 -610433 -2932338 -3478095 -931654 2349567 2491596 -799900
40766g99900k985594l28244M03773q70947l64351K408449L299093O24991j728720
$$ -799900 -3785494 -4113738 -3709965 -4580912 -4945263 -2536814 762279 1387270 -341450
40757c41450p49506R27556k3552j975811j645449J01353K3545j955827k959343
$$ -341450 -1090956 -163400 -186952 -2162763 -3808212 -3706859 -3683314 -5639141 -8598484
40748h598484j619731R28007L315597M433727L134339J28043j482120k03993J310358
$$ -8598484 -10218215 -9290208 -5974611 -1540884 1593455 1721498 239378 35385 1345743
40739A345743N45829n72487P47591K791869K033657o89578j617283m19312l3203
$$ 1345743 1891572 1319085 2066676 4858545 6892202 6202624 4585341 4166029 4132826
40730D132826r81692j130664p10335j995459l804154k199003K289031M028038
$$ 4132826 3151134 2020470 1310135 -685324 -4489478 -6688481 -4399450 -371412
40722c71412Q28752k436062j471344J268983J453761m82094j461265j031214n58525
$$ -371412 457340 -1978722 -3450066 -2181083 -727322 -1209416 -2670681 -3701895 -4260420
40713d260420J07511J441496J942722M29351j315171j192854q4478K69372L38401
$$ -4260420 -4152909 -2711413 -768691 -339340 -1654511 -2847365 -2931843 -2662471 -2324070
40704b324070Q34544L27555j737781k367049M84116L199887J238058l228158l998621
$$ -2324070 -1489526 -1161971 -2899752 -5266801 -4782685 -1582798 -344740 -3572898 -7571519
40695g571519l84771J918700K2911k008764k48489K959611L240445R51846o0906
$$ -7571519 -7956290 -6037590 -6014679 -8023443 -8271932 -5312321 -2071876 -1120030 -1180936
40686a180936J506911L089257K297324k73713k380272k712795j770674p47813
$$ -1180936 325975 3415232 5712556 5438843 3058571 345776 -1424898 -2172711
40678b172711R3349J449387L106951L242778R56613j588279j672845O0325P28750
$$ -2172711 -2079362 -629975 2476976 5719754 6676367 5088088 3415243 3475568 4204318
40669D204318k55465q70543o52281j454815l165738k647618R37465L394008J282901
$$ 4204318 3948853 3078310 2426029 971214 -2194524 -4842142 -3904677 -510669 772232
40660G72232k407202k384945R26133K059366j104881m136802k590369J810942
$$ 772232 -1634970 -4019915 -3093782 -1034416 -2139297 -6276099 -8866468 -7055526
40652g055526L964873K264224j05735j09458J405668J606065k60153k118349k064229
$$ -7055526 -3090653 -826429 -932164 -1041622 364046 1970111 1709958 -408391 -2472620
40643b472620o72817L82019R74131K284796M141785M423994J907943j657195l512170
$$ -2472620 -3145437 -2763418 -1789287 495509 4637294 9061288 10969231 9312036 5799866
40634E799866l053705j829040j040044m53926L88060J111717R01440n93032k624799
$$ 5799866 2746161 917121 -122923 -576849 -188789 922928 1824368 1231336 -1393463
40625a393463l381867j498702J741843K852636K26867l126944k910221Q44964
$$ -1393463 -4775330 -6274032 -4532189 -1679553 -1452686 -4579630 -7489851 -6644887
40617f644887L799249L095273O01821n29449o5637L70991O12469J593365K592736
$$ -6644887 -2845638 249635 851456 322007 256370 627361 1239830 2833195 5425931
40608E425931J572980j537697m098900l947065j692657P65632K346807K517614
$$ 5425931 6998911 5461214 1362314 -2584751 -4277408 -3511776 -1164969 1352645
40600A352645O75318k531883m428791k916730N30179K415941J736758Q67527J477572
$$ 1352645 2027963 -503920 -4932711 -7849441 -7319262 -4903321 -3166563 -2299036 -821464
40591h21464J889960M0244k791454l569057j892739j89439L22742J067726K795481
$$ -821464 1068496 1108740 -1682714 -5251771 -7144510 -7333949 -7011207 -5943481 -3148000
40582c148000L605753K066954J09620K88676J618813J151196r60208j392591R13342
$$ -3148000 457753 2524707 2634327 2923003 4541816 5693012 4732804 3340213 4253555
40573D253555K670522J195572j461406j848779m61204n93330k910947m540807
$$ 4253555 6924077 8119649 6658243 4809464 4348260 3754930 843983 -3696824
40565c696824l602889j539798j21193J121610K956553M107031K916807K00414
$$ -3696824 -7299713 -8839511 -8960704 -7839094 -4882541 -775510 2141297 2341711
40557B341711j488075r81663M80218J028751m4157j818210k233885J89074M068513
$$ 2341711 853636 -128027 352191 1380942 1336785 -481425 -2715310 -2526236 1542277
40548A542277N499068K243390k916932m766780j623909K782641L666332J92325
$$ 1542277 7041345 9284735 6367803 1601023 -22886 2759755 6426087 6618412
40540F618412m167948n261853j968514K832104M834292K588178r44040j983092
$$ 6618412 2450464 -2811389 -4779903 -1947799 2886493 5474671 4530631 2547539
40532B547539n25008K66406j064281k353268j490931K69771L91791j003142j368604
$$ 2547539 2022531 2288937 1224656 -1128612 -2619543 -2349772 -1957981 -2961123 -4329727
40523d329727M94782K701164K706536M72986j421069p06400J875169L304566J962769
$$ -4329727 -3834945 -1133781 1572755 2045741 624672 -81728 1793441 5098007 7060776
40514G060776l28047r88358m44586j162019l314170m172825k400899j19164O37334
$$ 7060776 6732729 5744371 5299785 4137766 823596 -3349229 -5750128 -5869292 -5231958
40505e231958P38530J262111P83422j671588l292360r94536L045343L638330J31484
$$ -5231958 -4493428 -3231317 -2447895 -4119483 -7411843 -8406379 -5361036 -1722706 -1591222
40496a591222k496519p48765L062064M909168L992903J823304n10143j959873
$$ -1591222 -4087741 -4836506 -1774442 3134726 7127629 8950933 8440790 6480917
40488F480917j086899J524633K604817M17774k367000k578415j206597j015455
$$ 6480917 5394018 6918651 9523468 9941242 7574242 4995827 3789230 2773775
40480B773775j423486J34271K669260K061538k452852o318276n631770j769809
$$ 2773775 1350289 1484560 4153820 6215358 3762506 -2555770 -8187540 -9957349
40472i957349J640744L354294L925812L095963N85918k018953k788873j967076
$$ -9957349 -8316605 -4962311 -1036499 2059464 2645382 626429 -2162444 -4129520
40464d129520r32907K64668K144138L599650L037887J164329J24093J91296j15289
$$ -4129520 -5062427 -4797759 -2653621 946029 3983916 5148245 5272338 5463634 5348345
40455E348345q21133l48377J090549J061039j088109k701286j860023k64223n2403
$$ 5348345 4527212 4178835 5269384 6330423 5242314 2541028 681005 416782 364379
40446C64379k27098J114905K978780L006840J528401Q22835J028383J17292k111291
$$ 364379 137281 1252186 4230966 7237806 8766207 9589042 10617425 10734717 8623426
40437H623426l278436k236566p30929l55249m64166k18848k32149p71588n82879
$$ 8623426 5344990 3108424 2377495 2022246 1558080 1339232 1107083 335495 -247384
40428b47384Q16006J649508N90149p14539R7194K531105L948486K961975L39732
$$ -247384 568622 2218130 2808279 2093740 2190934 4722039 8670525 11632500 11972232
40419A1972232k563570m433753l946955j208857J233080Q22892j791751l724176
$$ 11972232 9408662 4974909 1027954 -180903 1052177 1875069 83318 -3640858
40411c640858l614831k469898j076808J011839L540954M804285L766228J410867
$$ -3640858 -7255689 -9725587 -10802395 -9790556 -6249602 -1445317 2320911 3731778
40403C731778p77379k312148l024839k357929l71491J579233K167270J458174
$$ 3731778 2954399 642251 -2382588 -4740517 -5112008 -3532775 -1365505 92669
40395I2669L97299k44778N8089J481873L044867K934315O55300j950297k885834
$$ 92669 489968 245190 303279 1785152 4830019 7764334 8419634 6469337 3583503
40386C583503k426713k070809j752065j9972K850915L979160J443232k479834
$$ 3583503 1156790 -914019 -2666084 -2686056 164859 4144019 5587251 3107417
40378C107417l529749p61801K183495J752724j144954k821420j813181j69782
$$ 3107417 -422332 -1184133 999362 2752086 1607132 -1214288 -3027469 -3197251
40370c197251J32133j50701N40785J604431R95267j557436l579405k507295J308482
$$ -3197251 -3065118 -3215819 -2675034 -1070603 -75336 -1632772 -5212177 -7719472 -6410990
40361f410990M658425M558632J260150k083052k927769j867628j016183q90756
$$ -6410990 -1752565 2806067 4066217 1983165 -944604 -2812232 -3828415 -4719171
40353d719171m81100K95714M62470J66357M95620R16421k17427j985548j181321
$$ -4719171 -5200271 -4904557 -4442087 -4275730 -3780110 -2863689 -3081116 -5066664 -6247985
40344f247985K276975L947709J374901j680439j095416Q97505l22597l535074
$$ -6247985 -3971010 -23301 1351600 -328839 -1424255 -526750 -849347 -4384421
40336d384421l279927J167719M421470L203232M82489j47397O31814Q30774Q42731
$$ -4384421 -7664348 -6496629 -2075159 1128073 1610562 1463165 2094979 2925753 3768484
40327C768484J403566J153585q99353k944595k904807j337962K29597J613065
$$ 3768484 5172050 6325635 5426282 2481687 -423120 -1761082 -1531485 81580
40319H1580K541013J357791k219098m971013l614332P94276M156592M025766J208001
$$ 81580 2622593 3980384 1761286 -3209727 -6824059 -6029783 -1873191 2152575 3360576
40310C360576k022874l466326k050025Q19640K147353J086151J63498J171005
$$ 3360576 1337702 -2128624 -4178649 -3359009 -1211656 -125505 37993 1208998
40302A208998K031674K72923k343983k019867J210304L192499J297909k365110
$$ 1208998 3240672 3513595 1169612 -850255 360049 3552548 4850457 2485347
40294B485347l867165j690871K274147M588041L171454m48586k268920m71255
$$ 2485347 -1381818 -3072689 -798542 3789499 6960953 6512367 4243447 3772192
40286C772192J871030N53891l926853o596013m229760O98157L249133J935181
$$ 3772192 5643222 6197113 2270260 -4325753 -8555513 -7857356 -4608223 -2673042
40278b673042J9363Q94696L343056K995425j234887m592256k680666J752479K363831
$$ -2673042 -2653679 -1758983 1584073 4579498 3344611 -1247645 -3928311 -2175832 187999
40269A87999j194879k668904O98956L479343Q96386l085033j984089K739214M105761
$$ 187999 -1006880 -3675784 -2976828 502515 1398901 -1686132 -3670221 -931007 3174754
40260C174754O58679j786803M09027L668900L265454l30565l407382l952834k559310
$$ 3174754 3833433 2046630 2455657 6124557 9390011 9059446 5652064 1699230 -860080
40251h60080p41086P8068m23125o89586Q68303L145003L423645J171521j389524
$$ -860080 -1601166 -1523098 -1946223 -2635809 -1767506 1377497 4801142 5972663 4583139
40242D583139k438429k109734j122022j09110M4259n73808j64175J837301K604767
$$ 4583139 2144710 34976 -1087046 -1196156 -1151897 -1725705 -1889880 -52579 2552188
40233B552188J24180k279553m36572L028298J790605l585679n395033p93984L446190
$$ 2552188 2676368 396815 -39757 2988541 4779146 1193467 -4201566 -4995550 -1549360
40224a549360J826687j352927K0181L389151K514091j121484o12942M077535N046934
$$ -1549360 277327 -1075600 -1055419 2333732 4847823 3726339 3113397 7190932 12237866
40215A2237866r36225o650113m980904Q00588K604730m92206k022421J327302
$$ 12237866 11301641 4651528 -329376 471212 3075942 2583736 561315 1888617
40207A888617N000112L789977q87525l870990l329961j358150N93652K553013
$$ 1888617 6888729 10678706 9791181 5920191 2590230 1232080 1825732 4378745
40199D378745K902775o47149n826184o368571n62030M945594L784873j181765
$$ 4378745 7281520 6634371 808187 -5560384 -6122414 -1176820 2608053 1426288
40191A426288k513586P94583K981388J137435j250785j026644K17071K49560j39349
$$ 1426288 -1087298 -292715 2688673 3826108 2575323 1548679 1765750 2015310 1875961
40182A875961J98147M48394K14639O01337J224130q4727k888930l542515r80222
$$ 1875961 2074108 2522502 2737141 3338478 4562608 4477881 1588951 -1953564 -2933786
40173b933786J120106L60175n79157Q58660K474578J619158J62824Q62929K125226
$$ -2933786 -1813680 -1453505 -2032662 -1174002 1300576 2919734 3082558 3945487 6070713
40164F070713R93321j371553j876590r53910j213871k417472k260456p29096N26756
$$ 6070713 7064034 5692481 3815891 2861981 1648110 -769362 -3029818 -3758914 -3232158
40155c232158J735674L785072M985550L418241J110318J263399K552207J171069
$$ -3232158 -1496484 2288588 7274138 10692379 11802697 13066096 15618303 16789372
40147A6789372k273736l304703r40027Q98788J07397o53204O68540J800751K00484
$$ 16789372 14515636 11210933 10270906 11169694 11277091 10623887 11292427 13093178 13293662
40138A3293662k645294l507695j763623M91797J159559j57024j873573j536755
$$ 13293662 10648368 7140673 5377050 5868847 7028406 6871382 4997809 3461054
40130C461054J350355L949658L399382P80191o49025k93788k06054r03135q68090
$$ 3461054 4811409 8761067 12160449 12940640 12291615 11997827 11791773 10888638 10020548
40121A0020548q6700k33769r95788j08366K150422K371517p39309l982019m119330
$$ 10020548 9933848 9700079 8704291 8595925 10746347 13117864 12378555 8396536 4277206
40112D277206j753822O96055K083029K190512J013934j98746L38328K059874K436491
$$ 4277206 2523384 3219439 5302468 7492980 8506914 8308168 8646496 10706370 13142861
40103A3142861J096530M61788J202591P23955j912556l246906n35650L325496
$$ 13142861 14239391 14701179 15903770 16627725 14715169 11468263 10932613 14258109
40095A4258109L493792n1977k859074k196557J06187Q57453p34151k798229l018460
$$ 14258109 17751901 17699924 14840850 12644293 12750480 13607933 12873782 10075553 7057093
40086G057093q81018J836183K966406K188435O93661p28205j792371j617572K34697
$$ 7057093 6176075 8012258 10978664 13167099 13860760 13132555 11340184 9722612 9957309
40077I957309K001293J623701K32880P16660K802849L165582J014085l54134J094561
$$ 9957309 11958602 13582303 13815183 14531843 17334692 20500274 21514359 21160225 22254786
40068B2254786L085393L204616K399572K015339R37810j438974k605264n68240
$$ 22254786 25340179 28544795 30944367 32959706 33897516 32458542 29853278 29285038
40060B9285038K501077L442674K578161J874282J049994r22658k465050j390150
$$ 29285038 31786115 35228789 37806950 39681232 40731226 39808568 37343518 35953368
40052C5953368J119919K164723J683357J922194L292725M211903M419491N092121
$$ 35953368 37073287 39238010 40921367 42843561 46136286 50348189 54767680 59859801
40044E9859801N983070N547083L804651K460946K491386L949682P276270J2009733
$$ 59859801 65842871 71389954 75194605 77655551 80146937 84096619 91372889 103382622
40036A03382622J5226941J4678414J2836161J4088077J8132905K0286281J8923875
$$ 103382622 118609563 133287977 146124138 160212215 178345120 198631401 217555276
40029B17555276J8399365K2838103L0487309L6493353L8651731L7996714L5752114
$$ 217555276 235954641 258792744 289280053 325773406 364425137 402421851 438173965
40022D38173965L2359592K8291838K3235684J4997752J727276j4377847k7550151
$$ 438173965 470533557 498825395 522061079 537058831 538786107 524408260 496858109
40015D96858109l3782932l4681691l4824646l5981321l5747873l2092390k6960583
$$ 496858109 463075177 428393486 393568840 357587519 321839646 289747256 262786673
40008B62786673k3641265k2246634k0485521j7967819j6387312j5564912j3187313
$$ 262786673 239145408 216898774 196413253 178445434 162058122 146493210 133305897
40001A33305897r370912p465852q495604q822149o127817l840294n698582r164572
$$ 133305897 123934985 116469133 107973529 99151380 93023563 89183269 83484687 74320115
39993G4320115r063730n573464l402026m254151n325190m827576l921374l041672
$$ 74320115 65256385 59682921 56280895 52026744 46701554 41873978 37952604 34910932
39985C4910932j306626j48891k458719o820224p525742k423402L580139N224383
$$ 34910932 33604306 33455415 30996696 24176472 16650730 14227328 17807467 23031850
39977B3031850L097402N37487j627057l766919m300026k022727O80403R76998
$$ 23031850 26129252 26666739 25039682 21272763 16972737 14950010 15630413 16607411
39969A6607411K11688J400488L524599K805345q09373l054670j924524n83505
$$ 16607411 16819099 18219587 21744186 24549531 23740158 20685488 18760964 18177459
39961A8177459j995149m242722l845355j192839M61574N9519l71696M74267J407255
$$ 18177459 16182310 11939588 8094233 6901394 7362968 7422487 7050791 7525058 8932313
39952H932313J230342M88814k62596j704792l705234l951289r35911K835057L264216
$$ 8932313 10162655 10651469 10388873 8684081 4978847 1027558 91647 2926704 6190920
39943F190920N1544k791850k138222O83798K135229N54999k589886m159439j949869
$$ 6190920 6242464 3450614 1312392 1996190 4131419 4686418 2096532 -2062907 -4012776
39934d012776K596723M756360J925151k019311j265348L306585M858220Q74913
$$ -4012776 -1416053 3340307 5265458 3246147 1980799 5287384 10145604 11020517
39926A1020517k991291k048484L32772o37611k686320j012749K605524K719984
$$ 11020517 8029226 5980742 6313514 5675903 2989583 1976834 4582358 7302342
39918G302342j20589n66235J658650J404819j920055k571369J126325K853558
$$ 7302342 7181753 6615518 8274168 9678987 7758932 5187563 6313888 9167446
39910I167446j211960n320583l153858J962095K525060j472420l498114j138780
$$ 9167446 7955486 2634903 -518955 1443140 3968200 2495780 -1002334 -2141114
39902b141114J114286j80958k405714j374799K909096O702137O649632K574883
$$ -2141114 -1026828 -1207786 -3613500 -4988299 -2079203 4622934 11272566 13847449
39894A3847449k443325m541347k772030j01267K58352j376644k374905j656144
$$ 13847449 11404124 6862777 4090747 3989480 4247832 2871188 496283 -1159861
39886a159861m55529P6390J00228J47566M81402J226847K004680J835794M59402
$$ -1159861 -1615390 -1539000 -1438772 -1291206 -809804 417043 2421723 4257517 4716919
39877D716919q05741o11708N07061Q01542m86282k344723l042813j598164J130523
$$ 4716919 3911178 3299470 3806531 4608073 4121791 1777068 -1265745 -2863909 -1733386
39868a733386K690713J462904j061932j873139m05498R83207P96195K98242P72261
$$ -1733386 957327 2420231 1358299 -514840 -920338 62869 859064 1157306 1929567
39859A929567J279790N52637q91583j906009k153316j246748J460561M975086
$$ 1929567 3209357 3761994 2870411 964402 -1188914 -2435662 -975101 3999985
39851C999985O715781N754541L814019K057106k47869k670517k868670r12983
$$ 3999985 10715766 16470307 20284326 22341432 22093563 19423046 16554376 15641393
39843A5641393m92168l013640m489163j957596R87217j15059k908543k152173
$$ 15641393 15149225 12135585 7646422 5688826 6676043 6560984 3652441 1500268
39835A500268J194432J557866j662886l016920Q2068L733982M233512K718477
$$ 1500268 2694700 4252566 2589680 -427240 -345172 3388810 7622322 10340799
39827A0340799J224900p63534l311446l960238j551051J189261J359175n89496
$$ 10340799 11565699 10802165 7490719 3530481 1979430 3168691 4527866 3938370
39819C938370k761207m112121l267625J134297O640867P454598J876986m139104
$$ 3938370 1177163 -2934958 -6202583 -5068286 1572581 9027179 10904165 6765061
39811F765061m508553j047644J80705k032750l632351k604382j298760j251372
$$ 6765061 2256508 1208864 1389569 -643181 -4275532 -6879914 -8178674 -9430046
39803i430046n95596J897768M087985L845593K284803J411368Q11427q33744k533615
$$ -9430046 -10025642 -8127874 -4039889 -194296 2090507 3501875 4313302 3479558 945943
39794I45943k088770J98644J559339P18954m59015r5759Q98033N76260q67829
$$ 945943 -1142827 -944183 615156 1334110 875095 779336 1677369 2253629 1385800
39785A385800j527612p07528M57582J113293J558803J807289J043445r10219k974678
$$ 1385800 -141812 -849340 -391758 721535 2280338 4087627 5131072 4220853 1246175
39776A246175m045701l515761p59363L656149O243180L416651k793946n471629
$$ 1246175 -2799526 -6315287 -7074650 -3418501 2824679 6241330 3447384 -2024245
39768b024245j541568L696942L941712L89567j505799q45806j085571k612715
$$ -2024245 -3565813 131129 4072841 4462408 2956609 2110803 1025232 -1587483
39760a587483k077914P30877J772601r1334r13716J013379J580924j752146m363361
$$ -1587483 -3665397 -2934520 -1161919 -1253253 -2166969 -1153590 427334 -1324812 -5688173
39751e688173j302097M295776N464065J667063j144507K33659K665640K655227
$$ -5688173 -6990270 -2694494 2769571 4436634 3292127 3525786 6191426 8846653
39743H846653Q56317p98392k333049l942879l971267j163184K701222M446555
$$ 8846653 9702970 8904578 6571529 2628650 -1342617 -2505801 195421 4641976
39735D641976K966715j29986k497693k761098j123357P78740J201866J47829o71548
$$ 4641976 7608691 7478705 4981012 2219914 1096557 1875297 3077163 3224992 2553444
39726B553444j72968O28065K12200j161192j853765j151033K9528P60816J183336
$$ 2553444 2380476 3008541 3220741 2059549 205784 -945249 -915721 -154905 1028431
39717A028431J407430N41662j848817l917089k995155P69942L892071L611363
$$ 1028431 2435861 2977523 1128706 -2788383 -5783538 -5013596 -1121525 2489838
39709B489838J159341k94381J98588R37676N53050n06238j284145j416788q66458
$$ 2489838 3649179 3354798 3553386 4491062 5044112 4537874 3253729 1836941 970483
39700I70483M2702L91550k04973n33765O36489K330132K537718J213874q854p24880
$$ 970483 1013185 1404735 1199762 665997 1302486 3632618 6170336 7384210 7375356 6650476
39690F650476j827117k843147k201599m30775J74096k88481Q09593L358551L304024
$$ 6650476 4823359 1980212 -221387 -652162 -478066 -766547 43046 3401597 6705621
39681F705621q07257m134464k188949K113017K798719k9482r88118J441563K534330
$$ 6705621 5898364 1763900 -425049 1687968 4486687 4457205 3469087 4910650 7444980
39672G444980o79961m311886l421715P69669L093300J707534n42307j203559j088079
$$ 7444980 6765019 2453133 -968582 -198913 2894387 4601921 4059614 2856055 1767976
39663A767976j557632j904620j097714k39381j010627k445008j755497J317999
$$ 1767976 210344 -1694276 -2791990 -3031371 -4041998 -6487006 -8242503 -6924504
39655f924504L405048K031128q04693j634001n05323j87187j273789j403558M90027
$$ -6924504 -3519456 -1488328 -2293021 -3927022 -4432345 -4619532 -5893321 -7296879 -6806852
39646f806852K394210K591143J922506J421992M06454j410836k321724j075464
$$ -6806852 -4412642 -1821499 101007 1522999 1929453 518617 -1803107 -2878571
39638b878571J009088K105152K153649J563648o0278k056970k059647M84847K525175
$$ -2878571 -1869483 235669 2389318 3952966 3892688 1835718 -223929 260918 2786093
39629B786093J690569p2787q6684M28898r48683k801738k059153K81695N20697
$$ 2786093 4476662 4403875 4317191 4746089 3797406 995668 -1063485 -781790 -261093
39620b61093j388175j877296j08184Q75771N0202K72673K549094L315296J87160
$$ -261093 -1649268 -3526564 -3634748 -2758977 -2708775 -2436102 112992 3428288 3615448
39611C615448l566454l614928p09377J099222K97175j191618j537036o50112P73901
$$ 3615448 48994 -3565934 -4275311 -3176089 -2878914 -4070532 -5607568 -6257680 -5483779
39602e483779J636300P64420j253100j701794P67100L434720K683259q70567k948246
$$ -5483779 -3847479 -3083059 -4336159 -6037953 -5270853 -1836133 847126 -23441 -2971687
39593b971687j199546K157761L745320L024060J827744J275369O51289q72851
$$ -2971687 -4171233 -2013472 1731848 4755908 6583652 7859021 8510310 7637459
39585G637459k586968k964528j701107k03134K60804J20957M62914J096631Q97771
$$ 7637459 5050491 2085963 384856 181722 442526 563483 1026397 2123028 3020799
39576C020799k11237j020866q64264l82289k28729k79817m78153j210799k337754
$$ 3020799 2809562 1788696 924432 542143 313414 33597 -444556 -1655355 -3993109
39567c993109k929899k463044j297071L26109K527001M557845M677524K178899
$$ -3993109 -6923008 -9386052 -10683123 -10357014 -7830013 -3272168 1405356 3584255
39559C584255j321630l391027k981787q17215J473758K200796P17379j591352
$$ 3584255 2262625 -1128402 -4110189 -4927404 -3453646 -1252850 -535471 -2126823
39551b126823k310631p09618J275421J383328l95861k235312k724811j869668
$$ -2126823 -4437454 -5147072 -3871651 -2488323 -2884184 -5119496 -7844307 -9713975
39543i713975k99192J553908L297656M128226L177851P11751j414332j499749
$$ -9713975 -10013167 -8459259 -5161603 -1033377 2144474 2856225 1441893 -57856
39535e7856k73989j33976j713479k855284j836034L25025K098716L692413N000072
$$ -57856 -331845 -465821 -2179300 -5034584 -6870618 -6545593 -4446877 -754464 4245608
39526D245608L855502m49513m092324l314771m94974p40471l425520l027672J334435
$$ 4245608 8101110 7651597 3559273 244502 -250472 -990943 -4416463 -7444135 -6109700
39517f109700L741226R13522k424988j285070J823952J704351j015709j707139
$$ -6109700 -2368474 -1454952 -3879940 -5165010 -3341058 -1636707 -2652416 -4359555
39509d359555M47279J978272J298318L92764O06169R16294O37866M70499N20021
$$ -4359555 -3912276 -1934004 -635686 -242922 363247 1279541 1917407 2387906 2907927
39500B907927j3594r88609j384113j086694o94098j04835P46352O77815r72479
$$ 2907927 2894333 1905724 521611 -565083 -1259181 -1364016 -617664 60151 -912328
39491i12328k368106j446096P44481J558536P26386J14443L71661O43155Q18782
$$ -912328 -3280434 -4726530 -3982049 -2423513 -1697127 -1582684 -1211023 -567868 250914
39482B50914J118373L14576k320688m080207j683776L121942M850174J648315
$$ 250914 1369287 1683863 -636825 -4717032 -6400808 -3278866 1571308 3219623
39474C219623k382976l078193q45176J664456L016905K590364q1613l536912m447219
$$ 3219623 836647 -2241546 -3086722 -1422266 1594639 4185003 4103390 566478 -3880741
39465c880741j499160K529270M061149K513371k02543k163174k433245j302220
$$ -3880741 -5379901 -2850631 1210518 3723889 3521346 1358172 -1075073 -2377293
39457b377293l16859n46297p67557M95103J585782j97096l110998k160610K847473
$$ -2377293 -2694152 -3240449 -4008006 -3512903 -1927121 -2124217 -5235215 -7395825 -4548352
39448d548352N443469J704307l271696k638714J948908L081368j142654m712555
$$ -4548352 895117 2599424 -672272 -3310986 -1362078 1719290 576636 -4135919
39440d135919k934562J330615K682073N39258j314065l68461K095609L340299
$$ -4135919 -7070481 -5739866 -3057793 -2518535 -3832600 -4201061 -2105452 1234847
39432A234847K141773m23532k092233j385594Q95366K267228J162323j145474
$$ 1234847 3376620 2953088 860855 -524739 370627 2637855 3800178 2654704
39424B654704j786766K72574K632645K217672n40083j896628J7385K099152N05375
$$ 2654704 867938 1140512 3773157 5990829 5450746 3554118 3571503 5670655 6176030
39415F176030l387553m506258j370238J817721J496269l03646L34034L157730
$$ 6176030 2788477 -1717781 -3088019 -1270298 225971 -77675 256359 3414089
39407C414089M450104K465172p04302k357149k095906j357739j361438j762965
$$ 3414089 7864193 10329365 9625063 7267914 5172008 3814269 2452831 689866
39399F89866j103747R54330K284947Q97970j417107r35678K064954K964239K2353
$$ 689866 -413881 540449 2825396 3723366 2306259 1370581 3435535 6399774 6422127
39390F422127k247677j01468K965190J465710l224390m954675k305708J381q30725
$$ 6422127 4174450 4072982 7038172 8503882 5279492 324817 -1980891 -1979510 -2810235
39381b810235k030620q95244J099219J850991J967572K243532J550557l27230
$$ -2810235 -4840855 -5736099 -4636880 -2785889 -818317 1425215 2975772 2648542
39373B648542j140789l4843K17836k248958m501866k860648J327446L557499K414077
$$ 2648542 1507753 1472910 1690746 -558212 -5060078 -7920726 -6593280 -3035781 -621704
39364f21704N04309n8000J42163J2249l11313k43084L80993J149104Q44905j482125
$$ -621704 -117395 -175395 -33232 -20983 -332296 -575380 -194387 954717 1799622 317497
39354C17497l958668k442708L853193R140771P083711p62447o413540n399718
$$ 317497 -3641171 -6083879 -2230686 6910085 13993796 13231349 6817809 1418091
39346A418091j346506J92489j422817l167038l206234j800749N17268K888455
$$ 1418091 71585 264074 -1158743 -4325781 -7532015 -9332764 -8815496 -5927041
39338e927041L514259J634146o02426m64614J581664K466117P47202j643916k145114
$$ -5927041 -2412782 -778636 -1381062 -1845676 -264012 2202105 2949307 1305391 -839723
39329h39723n24994J368531J771967M96033j081950j313365J0075J382202J402429
$$ -839723 -1364717 3814 1775781 2271814 1189864 -123501 -113426 1268776 2671205
39320B671205L45800o45989j077058q36302N04646K535455L110637Q78600j828296
$$ 2671205 3017005 2371016 1293958 457656 962302 3497757 6608394 7486994 5658698
39311E658698j489897J068060J023816l230290o639407m039420K339562N617201
$$ 5658698 4168801 5236861 6260677 3030387 -3609020 -7648440 -5308878 308323
39303C08323L290539m46690j429753o68695j305276l382685m079274j895325J417974
$$ 308323 3598862 3152172 1722419 1053724 -251552 -3634237 -7713511 -9608836 -8190862
39294h190862K943302J643302o55470j203933M61568J832762R00718o94158o2909
$$ -8190862 -5247560 -3604258 -4259728 -5463661 -5002093 -3169331 -2268613 -2962771 -3025680
39285c025680K054906J908235j398863m048482k955582O8882J717118J812645
$$ -3025680 -970774 937461 -461402 -4509884 -7465466 -7396584 -5679466 -3866821
39277c866821J745629R56910j338372k846912r03777K437838K484144r04617k635377
$$ -3866821 -2121192 -1164282 -2502654 -5349566 -6253343 -3815505 -1331361 -2235978 -4871355
39268d871355R0081L716585L822086J235714j17612Q48159J705774P24195j016876
$$ -4871355 -4781274 -1064689 2757397 3993111 3875499 4723658 6429432 7153627 6136751
39259F136751j762328j443298j282411j830960k072127p91447J336116K149888
$$ 6136751 4374423 2931125 1648714 -182246 -2254373 -3045820 -1709704 440184
39251D40184J127287N13756J752619K639973Q62217j282422N7557L203924K317089
$$ 440184 1567471 2081227 3833846 6473819 7336036 6053614 6111171 9315095 11632184
39242A1632184l155993o126130j875091M600491N548338Q91622l271415l757736
$$ 11632184 8476191 2350061 474970 5075461 10623799 11515421 8244006 4486270
39234D486270k437427r96033P87595J937142O13299k032835k697526j068822r1675
$$ 4486270 2048843 1052810 1840405 3777547 4390846 2358011 -339515 -1408337 -1500012
39225a500012p87241j102982m61961p74700j770089k79101L698881N070098J059736
$$ -1500012 -2287253 -3390235 -3852196 -4626896 -6396985 -6676086 -2977205 2092893 3152629
39216C152629l587405k946234J637872L990204K018012n10306l71069J234318
$$ 3152629 -434776 -3381010 -1743138 2247066 4265078 3754772 3383703 4618021
39208D618021J625542K18294j683108k547804j591111L79274J144732m61830k714260
$$ 4618021 6243563 6461857 4778749 2230945 639834 1019108 2163840 1702010 -1012250
39199a012250l127256j659086K6193J470153L121694L907400K201676p66488j639890
$$ -1012250 -4139506 -5798592 -5772399 -4302246 -1180552 2726848 4928524 4162036 2522146
39190B522146K32625J631385K87277j947228k470247j898324k193934k736966
$$ 2522146 2754771 4386156 4673433 2726205 255958 -1642366 -3836300 -6573266
39182f573266j345825J552282K853180J213342r56129r18135Q40930J854792J221823
$$ -6573266 -7919091 -6366809 -3513629 -2300287 -3256416 -4174551 -3333621 -1478829 -257006
39173b57006K87403K76986P86266Q31769L24915j8144K66033P59215M15221j361042
$$ -257006 30397 307383 1093649 1925418 2250333 2232189 2498222 3257437 3672658 2311616
39163B311616l438102l342933j94886L020390K123822k687278o116093m151887
$$ 2311616 -1126486 -4469419 -4664305 -1643915 479907 -2207371 -8323464 -12475351
39155a2475351P49350L127972J619224l52075j17547J344667K118746J804384
$$ -12475351 -11726001 -8598029 -6978805 -7330880 -7448427 -6103760 -3985014 -2180630
39147b180630P33155m70868j36712K638317N037284L035045k261836m947617k625864
$$ -2180630 -1447475 -1918343 -2055055 583262 5620546 8655591 6393755 1446138 -1179726
39138a179726J37579p17932k557165j301330J428404J640972J44142M88584K062879
$$ -1179726 -1042147 -1760079 -4317244 -5618574 -4190170 -2549198 -2405056 -1916472 146407
39129A46407J472732o93213r71512m9054j751807m992151m133905J247338M363060
$$ 146407 1619139 925926 -45586 -94640 -1846447 -6838598 -10972503 -9725165 -5362105
39120e362105J656153j722322o88180J970343J561884k71907O25353K940663K271743
$$ -5362105 -3705952 -5428274 -6116454 -4146111 -2584227 -2856134 -2230781 709882 2981625
39111B981625r68807k294686n43150J116186J030292P82755J010537J13638k181645
$$ 2981625 2012818 -281868 -825018 291168 1321460 2104215 3114752 3228390 1046745
39102A046745l664019k818761m30330K146325L773637K990390l71163l299267
$$ 1046745 -2617274 -5436035 -5866365 -3720040 53597 3043987 2672824 -626443
39094f26443k412424J330144L595214K329921m18873k300138l158725l334421
$$ -626443 -3038867 -1708723 1886491 4216412 3797539 1497401 -1661324 -4995745
39086d995745k431719o78773P71030J606270K545591L470950L303920J945786
$$ -4995745 -7427464 -8106237 -7335207 -5728937 -3183346 287604 3591524 5537310
39078E537310N13799m08469j083723j484738j549237j919431k605183k019001
$$ 5537310 6051109 5642640 4558917 3074179 1524942 -394489 -2999672 -5018673
39070e018673M16265K135777P83015j774026k212244j071561j146499j820451
$$ -5018673 -4602408 -2466631 -1683616 -3457642 -5669886 -6741447 -7887946 -9708397
39062i708397o1278L395198M371821K180755O91241J462750J478143o01978j724662
$$ -9708397 -9769675 -6374477 -2002656 178099 869340 2332090 3810233 3208255 1483593
39053A483593n01448k83789k782077l998756q73070K752769J940773j328593j512601
$$ 1483593 982145 698356 -2083721 -6082477 -6955547 -4202778 -2262005 -3590598 -5103199
39044e103199J749031L814971K441289j09562j581991j879339j080295Q40923
$$ -5103199 -3354168 460803 2902092 2792530 1210539 -668800 -1749095 -908172
39036i08172K453664K136152N66629n37895j151971j865882j628237L60477J993314
$$ -908172 1545492 3681644 4248273 3710378 2558407 692525 -935712 -575235 1418079
39027A418079R16528j401928j771789l13204K83858m38060n53907J66503r297
$$ 1418079 2334607 932679 -839110 -1152314 -868456 -1306516 -1860423 -1693920 -1703217
39018a703217j061735r63307O06414J580916Q66385m67459j446229j982113j579815
$$ -1703217 -2764952 -3728259 -3121845 -1540929 -674544 -1142003 -2588232 -4570345 -6150160
39009f150160R7340J666147J555785N11962J24905L3473n80037l57214J769314
$$ -6150160 -6052820 -4386673 -2830888 -2318926 -2194021 -2160548 -2740585 -3097799 -1328485
39000a328485L114322N94589l649721m625365j592370J885444L914791N040347
$$ -1328485 1785837 2380426 -1269295 -5894660 -7487030 -5601586 -1686795 3353552
38992C353552M181106R8679l581085j879589K650345K191320l848904o839449
$$ 3353552 7534658 7633337 4052252 2172663 4823008 7014328 3165424 -3674025
38984c674025k267153L215459K686618o87097l13118L022806M018192K002485
$$ -3674025 -5941178 -2725719 -39101 -726198 -1039316 1983490 6001682 8004167
38976H004167K66000n43583j907998k798740j453386K86040k61837j655296j170715
$$ 8004167 8270167 7726584 5818586 3019846 1566460 1852500 1590663 -64633 -1235348
38967a235348j08864r63658j946019j82928K105256J029245j515369p95507J975414
$$ -1235348 -1344212 -2307870 -4253889 -4436817 -2331561 -1302316 -2817685 -3613192 -1637778
38958a637778J407107k217973k863614R82802L800313K331557l5439m03504p55719
$$ -1637778 -230671 -2448644 -5312258 -4329456 -529143 1802414 1766975 1363471 607752
38949F07752k242959j837976J500079L359528Q90209k050649j356870O00496k32931
$$ 607752 -1635207 -3473183 -1973104 1386424 2276633 225984 -1130886 -530390 -763321
38940g63321k368889j964525J18476L02287j020971n81772J503247K149567J176018
$$ -763321 -3132210 -5096735 -4978259 -4675972 -5696943 -6278715 -4775468 -2625901 -1449883
38931a449883J379639K877154K524981l62014k382508j424001L41571M74849j98227
$$ -1449883 -70244 2806910 5331891 4969877 2587369 1163368 1504939 1979788 1781561
38922A781561r1832o231j298476k835574k285462M30850K931916L274033J730922
$$ 1781561 1689729 1683498 385022 -2450552 -4736014 -4305164 -1373248 1900785 3631707
38913C631707o0611p12748j5444R41086O51334j172741k894463k482171Q7332
$$ 3631707 3571096 2858348 2842904 3783990 4435324 3262583 368120 -2114051 -2026719
38904b026719K480623K527924P58833l83883J38797O35509o20492k629565l120502
$$ -2026719 453904 2981828 3740661 3356778 3495575 4131084 3510592 881027 -2239475
38895b239475j892654o16415L23894K162510M450469M224728J29833m673160n808798
$$ -2239475 -4132129 -4748544 -4424650 -2262140 2188329 6413057 6542890 1869730 -3939068
38886c939068k744219J195112K877817J814757m68877j749386n02155K361529
$$ -3939068 -6683287 -5488175 -2610358 -795601 -1264478 -3013864 -3516019 -1154490
38878a154490L754914J889332j312207k852558k594693k328740j895709N51166
$$ -1154490 2600424 4489756 3177549 324991 -2269702 -4598442 -6494151 -5942985
38870e942985M251008N219391J588986k912846l218051O49944L838557K972031
$$ -5942985 -1691977 3527414 5116400 2203554 -1014497 -364553 3474004 6446035
38862F446035j45730j679578o61883P39744Q16755K12782J09840L40371L02674
$$ 6446035 6300305 4620727 3958844 4698588 5515343 5728125 5837965 6178336 6481010
38853F481010L80352R09853O92959j436624l959595l919102j087402J487603J870114
$$ 6481010 6861362 7771215 8464174 7027550 3067955 -851147 -1938549 -450946 1419168
38844A419168J689086K740963L566948J860801j384762l085913k688630k598862
$$ 1419168 3108254 5849217 9416165 11276966 9892204 6806291 4117661 1518799
38836A518799l864053m213437j528630K643818M618321K864179m10677j890379
$$ 1518799 -2345254 -6558691 -8087321 -5443503 -825182 2038997 1628320 -262059
38828b62059o83051J128524J331896K16535m40136l05119n56441j050125n30K443258
$$ -262059 -945110 183414 1515310 1731845 1291709 986590 430149 -619976 -620506 1822752
38818A822752L063762K78400k417480j029336K466301K312875k600381o669779
$$ 1822752 4886514 5164914 2747434 1718098 4184399 6497274 3896893 -2772886
38810b772886n074034J40584L460482K816595O53832l28521J25391J059057K065821
$$ -2772886 -7846920 -7706336 -4245854 -1429259 -775427 -1103948 -978557 80500 2146321
38801B146321L029117L093911J156329k140612l792861j568153K091843J808130
$$ 2146321 5175438 8269349 9425678 7285066 3492205 1924052 4015895 5824025
38793E824025l468725p469719m110646L694409P078657K832215k766253k966917
$$ 5824025 2355300 -5114419 -9225065 -5530656 1548001 4380216 1613963 -1352954
38785a352954J131924L960873L463348J865749P28484n31496j812562j758255
$$ -1352954 -221030 3739843 7203191 9068940 9797424 9265928 7453366 5695111
38777E695111m77352p166j188721k259930j689220o55747j088592k272589j500511
$$ 5695111 5217759 5210593 4021872 1761942 72722 -583025 -1671617 -3944206 -5444717
38768e444717J695286L947338K213192j627691k760327m498K442999J051344k102241
$$ -5444717 -3749431 197907 2411099 783408 -1976919 -1981417 461582 1512926 -589315
38759e89315k864127j087746K07868J10777K53041Q32607M73783j38529J070266
$$ -589315 -3453442 -4541188 -4333320 -4222543 -3969502 -3136895 -2663112 -2801641 -1731375
38750a731375K954362J917341j784285l418882j094290J285914P15768k99874
$$ -1731375 1222987 3140328 1356043 -2062839 -3157129 -1871215 -1155447 -1455321
38742a455321R38702K193107O39557j704695j495544L20987Q94809L68672j9085
$$ -1455321 -516619 1676488 2316045 611350 -884194 -563207 331602 700274 681189
38733F81189j356767l774764l415919J587152N712946L419428j326931q79819
$$ 681189 -675578 -4450342 -7866261 -6279109 -566163 2853265 1526334 646515
38725F46515L259570K875286k663473m973313q17690K734203P14049j944651k04535
$$ 646515 3906085 6781371 4117898 -855415 -1673105 1061098 1775147 -169504 -374039
38716c74039K185529L25579k496747q52080K851200K531787j179569k675910j027567
$$ -374039 1811490 2137069 -359678 -1211758 1639442 4171229 2991660 315750 -711817
38707g11817k28151j163585o76747J590394K085460k88616k349185k057748q65526
$$ -711817 -939968 -2103553 -2780300 -1189906 895554 606938 -1742247 -3799995 -4665521
38698d665521J68356J921016L817553L342781M74154j234592K27000K287911J680733
$$ -4665521 -4497165 -2576149 1241404 4584185 5058339 3823747 4050747 6338658 8019391
38689H019391j136999l131833k486194k7135J878008J365520q97306k052140p17944
$$ 8019391 6882392 3750559 1264365 1237230 3115238 4480758 3583452 1531312 813368
38680H13368P93783l2470j692034r65010J726285L017146K109242J490535K014962
$$ 813368 1607151 1574681 -117353 -1082363 643922 3661068 5770310 7260845 9275807
38671I275807J417582j373193m167825m941820m091469k299135N29571L127030
$$ 9275807 10693389 9320196 5152371 210551 -3880918 -6180053 -5650482 -2523452
38663b523452L073096N37395j301615q46977O6707N3775L01084J257892R77532
$$ -2523452 549644 1087039 -214576 -1061553 -994846 -941071 -639987 617905 1595437
38654A595437j127843k472624j613184q14934j620354j532557J461681M421056
$$ 1595437 467594 -2005030 -3618214 -4433148 -6053502 -7586059 -6124378 -1703322
38646a703322L593513L99667j027642k47292m4725j055355j337156m91891L3916
$$ -1703322 1890191 2289858 1262216 1014924 970199 -85156 -1422312 -1914203 -1880287
38637a880287L61742J904478L831194L618472J192948j075955k504307m354534
$$ -1880287 -1518545 385933 4217127 7835599 9028547 7952592 5448285 1093751
38629A093751n775749l887576Q68874L711746K054490n24222L05299L123423L231946
$$ 1093751 -4681998 -8569574 -7700700 -3988954 -1934464 -2458686 -2153387 970036 4201982
38620D201982n5164k469734j089563J708008J879071p54354k603184j417813O78331
$$ 4201982 4146818 1677084 587521 2295529 4174600 3420246 817062 -600751 77580
38611G7580K33471k594871m041545j807933J782894K836996P10851j723994j772422
$$ 77580 311051 -2283820 -6325365 -8133298 -6350404 -3513408 -2802557 -4526551 -6298973
38602f298973N51242L021425L069704P9134l028133j953318L481728P668393N646965
$$ -6298973 -5747731 -2726306 343398 422532 -2605601 -4558919 -1077191 6591202 12238167
38593A2238167j81820l141561j251228R61731j57069k586359k889278j478525
$$ 12238167 12056347 8914786 7663558 8625289 8468220 5881861 2992583 1514058
38585A514058q61969j257771j049944j17852J49240n24969r85730o32176P2348
$$ 1514058 652089 -605682 -1655626 -1773478 -1624238 -2149207 -3134937 -3767113 -3694765
38576c694765P73148J379454J374038M02912p10491q79636m37675n52541j116557
$$ -3694765 -2921617 -1542163 -168125 234787 -475704 -1355340 -1793015 -2345556 -3462113
38567c462113p06476J120768K850580K929162J642261L15895n61752j355835j823000
$$ -3462113 -4168589 -3047821 -197241 2731921 4374182 4690077 4128325 2772490 949490
38558I49490j027456Q89361K091653J249332m50590q53173J42100Q15722N76285
$$ 949490 -77966 811395 2903048 4152380 3701790 2848617 2990717 3806439 4382724
38549D382724M38252L96803q83549k792945k311316J160526L523842J529534k047145
$$ 4382724 4820976 5217779 4334230 1541285 -770031 390495 3914337 5443871 3396726
38540C396726k570600o17230j75707j389304p96413J558807J496450j725619l384353
$$ 3396726 826126 208896 33189 -1356115 -2152528 -593721 902729 -822890 -4207243
38531d207243j183773P51560p09108j921459R24539M195025K275878k438740k318598
$$ -4207243 -5391016 -4639456 -5348564 -7270023 -6345484 -2150459 125419 -2313321 -4631919
38522d631919L634695P769232M707448j749298m984139l988242k165356j171748
$$ -4631919 -997224 6772008 11479456 9730158 4746019 757777 -1407579 -2579327
38514b579327J30422K040383K826971J415479p48134j301361K25682J787316J218893
$$ -2579327 -2448905 -408522 2418449 3833928 3085794 1784433 2010115 3797431 5016324
38505E016324r64390k044443p36459R44791O29842q10497n57220J844102L625372
$$ 5016324 4051934 2007491 1271032 2215823 2845665 2035168 1477948 3322050 6947422
38496F947422K426049r60349l879276m531799l037308q69106L70492K17502n32007
$$ 6947422 9373471 8413122 4533846 2047 -3035261 -3904367 -3533875 -3316373 -3848380
38487c848380j129768j537834j419016J5281K059132K199940l65942k569407j348128
$$ -3848380 -4978148 -6515982 -7934998 -7919717 -5860585 -3660645 -4026587 -6595994 -7944122
38478g944122J691956K604285J150511Q16682K850913M188554K381499p47665
$$ -7944122 -6252166 -3647881 -2497370 -1680688 1170225 5358779 7740278 6992613
38470F992613k070453j269076k69505m25144j708995l192940l283533j009958
$$ 6992613 4922160 3653084 3383579 2958435 1249440 -1943500 -5227033 -6236991
38462f236991K097017L037590R88528j722596k783432k124347n80524J295886
$$ -6236991 -4139974 -1102384 -113856 -1836452 -4619884 -6744231 -7324755 -6028869
38454f028869K359005J325236q54557j495658m5901J157379R56031J017665J995444
$$ -6028869 -3669864 -2344628 -3199185 -4694843 -4740744 -3583365 -2627334 -1609669 385775
38445C85775J676895p58170k271900q17950Q03673k79576j657070J73566K923336
$$ 385775 2062670 1304500 -967400 -1785350 -981677 -1261253 -2918323 -2744757 178579
38436A78579J642048k646228l776368j22533K705001N27619l408797l866976q20155
$$ 178579 1820627 -825601 -4601969 -4724502 -2019501 -1491882 -4900679 -8767655 -9587810
38427i587810K025478K815492K345403J389630L12532N5713R91167J664413N99478
$$ -9587810 -7562332 -4746840 -2401437 -1011807 -699275 -643562 347605 2012018 2611496
38418B611496j469019k617104j985786R1705K742935M137012K345998j607632
$$ 2611496 1142477 -1474627 -3460413 -3368708 -625773 3511239 5857237 4249605
38410D249605l500950j013915K617994K790667p8009j701283o46209N4890j561929
$$ 4249605 748655 -265260 2352734 5143401 5065392 3364109 2717900 2772790 1210861
38401A210861l150931k136891J8473K87093j059461j021355J335992L416042K806195
$$ 1210861 -1940070 -4076961 -4058488 -3771395 -4830856 -5852211 -4516219 -1100177 1706018
38392A706018L15521j660437k211873j939469r81787J003442K988987K819790
$$ 1706018 2021539 361102 -1850771 -3790240 -4772027 -3768585 -779598 2040192
38384B040192L04062j568239j75389K999857M202311K374439p4824j282106j822960
$$ 2040192 2344254 776015 600626 3600483 7802794 10177233 10102409 8820303 6997343
38375F997343k069832r95510P58198J3738l859814n988743k226616L746915M628425
$$ 6997343 4927511 3932001 4690199 4703937 844123 -5144620 -7371236 -3624321 1004104
38366A004104l9689l262585j116640J988844J029755j948084j968769Q78848K404414
$$ 1004104 964415 -2298170 -3414810 -1425966 -396211 -2344295 -4313064 -3434216 -1029802
38357a029802J020553j075471k034068j569680O78332L845301M185624m96232
$$ -1029802 -9249 -1084720 -3118788 -4688468 -4010136 -164835 4020789 3524557
38349C524557n591808m369995K029654N341301K142605j428190J11727L053359
$$ 3524557 -2067251 -6437246 -4407592 933709 3076314 1648124 1759851 4813210
38341D813210J332923l122096l659707K73394K734663J002751j058115k82416
$$ 4813210 6146133 3024037 -635670 -362276 2372387 3375138 2317023 2034607
38333B034607J097375K70732j358137j134653M46419J174850N34822p45086k375950
$$ 2034607 3131982 3402714 2044577 909924 1356343 2531193 3066015 2320929 -55021
38324e5021l482675k109966J664869M103212K242169j590653k930711j657776
$$ -55021 -3537696 -5647662 -3982793 120419 2362588 771935 -2158776 -3816552
38316c816552j488307l283902l225407R02968N345312N138129R83333j903163
$$ -3816552 -5304859 -8588761 -11814168 -10911200 -5565888 -427759 555574 -1347589
38308a347589q61147J520654J928593N63208m02404l75577l98222q48223j068280
$$ -1347589 -2208736 -688082 1240511 1803719 1401315 1025738 627516 -220707 -1288987
38299a288987q09830l65448M54532J869204K877752K233336O19827q9133J26738
$$ -1288987 -2098817 -2464265 -2009733 -140529 2737223 4970559 5590386 5501253 5627991
38290E627991n94913k479423l168159j477904M69962O23063L2706L14694N39682
$$ 5627991 5033078 2553655 -614504 -2092408 -1622446 -999383 -966677 -651983 -112301
38281a12301m73324j022189P23072K642085J575612q84892l48188K959221L954281
$$ -112301 -585625 -1607814 -884742 1757343 3332955 2448063 2099875 5059096 9013377
38272I013377O95403k559323k219210n28172r84711k606937k350234l43861R14645
$$ 9013377 9708780 7149457 4930247 4402075 3417364 810427 -1539807 -1883668 -969023
38263i69023O38894j12383q06268j273688p08263Q57484J775737J518610J930724
$$ -969023 -330129 -442512 -1248780 -2522468 -3230731 -2373247 -597510 921100 2851824
38254B851824L506778L285711m33784m116231l634040m89256R19014J00521k87084
$$ 2851824 6358602 9644313 9210529 5094298 1460258 971002 1890016 1990537 1703453
38245A703453j52857j326399k306639J52502M246710M286771l02752l406594j617717
$$ 1703453 1550596 224197 -2082442 -1929940 2316770 6603541 6300789 2894195 1276478
38236A276478Q76503j64730k296942j412461J168692J599749J39604j70309Q40437
$$ 1276478 2152981 1988251 -308691 -1721152 -552460 1047289 1186893 1016584 1857021
38227A857021R64229J90788K65702P74624j8710j175049j93835K159269K333784
$$ 1857021 2821250 3012038 3277740 4052364 4033654 2858605 2664770 4824039 7157823
38218G157823l89456k637250k044044j39475Q49911Q88064N51975n43040k170606
$$ 7157823 6768367 4131117 2087073 1947598 2797509 3685573 4237548 3694508 1523902
38209A523902k739471j708545p41784j010082j315399m17664P49905R84440J078429
$$ 1523902 -1215569 -2924114 -3665898 -4675980 -5991379 -6409043 -5659138 -4674698 -3596269
38200c596269K032562K604011J241195o10467j27470K214629K665225l42931l485008
$$ -3596269 -1563707 1040304 2281499 1671032 1543562 3758191 6423416 6080485 2595477
38191B595477k969351K72756K079048P75532j097914r48417L05280K16466j065810
$$ 2595477 -373874 -101118 1977930 2753462 1655548 707131 1012411 1228877 163067
38182A63067q40215J930944M449747L445456l43934k901646k086919j14178K0640
$$ 163067 -677148 1253796 5703543 9148999 8805065 5903419 3816500 3702322 3722962
38173C722962j181669j006682Q71232J764160K06308j902712k646828l020278
$$ 3722962 2541293 1534611 2405843 4170003 4376311 2473599 -173229 -3193507
38165c193507m222294m211311m97900M597187N653493J679126k013556j093144
$$ -3193507 -7415801 -11627112 -12125012 -7527825 -1874332 -195206 -2208762 -3301906
38157c301906K174665L081252J144879p36676j479175k157779k449075r09600
$$ -3301906 -1127241 1954011 3098890 2362214 883039 -1274740 -3723815 -4633415
38149d633415J470599J909834L75700j23165J484097K487866P18400k321948l999831
$$ -4633415 -3162816 -1252982 -877282 -1000447 483650 2971516 3689916 1367968 -2631863
38140b631863l566148j489541J423532L089475J466697j721134j996180J285098
$$ -2631863 -6198011 -7687552 -6264020 -3174545 -1707848 -3428982 -5425162 -4140064
38132d140064L233185R90260j309969O45914L575930J674249l097022l117790
$$ -4140064 -906879 83381 -1226588 -580674 2995256 4669505 1572483 -1545307
38124a545307K755462O632954L202859k701465l964628j380481p45628l023736
$$ -1545307 1210155 7843109 11045968 8344503 4379875 2999394 2253766 -769970
38116g69970l393126N20282M637622M009380q68403n154473n371941k452976J99429
$$ -769970 -4163096 -3642814 994808 5004188 4135785 -1018688 -6390629 -8843605 -8644176
38107h644176N14644n06815n05303J214000K966721L020058J664537L85091j35657
$$ -8644176 -8129532 -8636347 -9141650 -7927650 -4960929 -1940871 -276334 108757 -26900
38098b6900k56470k69410j51327j30826n08834r74839q67900j04682O99982R10617
$$ -26900 -283370 -552780 -704107 -834933 -1343767 -2318606 -3186506 -3291188 -2591206 -1680589
38088a680589K32655j239082k716307k848565j021066J576648K945986K370404
$$ -1680589 -1447934 -2687016 -5403323 -8251888 -9272954 -7696306 -4750320 -2379916
38080b379916R09317j25804m56104m75923l11743K91874J320899K014045J306541
$$ -2379916 -1470599 -1596403 -2052507 -2528430 -2840173 -2548299 -1227400 786645 2093186
38071B093186q54549k712939k125181O96039K794695J852945q12982k064397j168361
$$ 2093186 1238637 -1474302 -3599483 -2903444 -108749 1744196 931214 -1133183 -2301544
38062b301544k58110o19282q92591J29958J138112M26224j266784k058629j831752
$$ -2301544 -2559654 -3178936 -4071527 -3941569 -2803457 -2377233 -3644017 -5702646 -7534398
38053g534398j597512r33928J236289L710728L814916J442453n72896p52321n99660
$$ -7534398 -9131910 -10065838 -8829549 -5118821 -1303905 138548 -434348 -1186669 -1786329
38044a786329q76880K11416K885253L326683r50334n770411m988051N98930L927995
$$ -1786329 -2663209 -2451793 433460 3760143 2809809 -2960602 -7948653 -7349723 -3421728
38035c421728J430770k676944l192887o11326J417527J693610J309921M26806
$$ -3421728 -1990958 -4667902 -7860789 -8472115 -7054588 -5360978 -4051057 -3624251
38027c624251j268264k322584j089530J133218J551779K70910M00290L300414
$$ -3624251 -4892515 -7215099 -8304629 -7171411 -5619632 -5348722 -4948432 -1648018
38019a648018O112668N169880N14537m045192m900191k167982O48567O01123j311482
$$ -1648018 4464650 9634530 10149067 6103875 1203684 -964298 -315731 285392 -1026090
38010a026090j661056M88254K127246Q29813j482113j610665k04791n31325k810930
$$ -1026090 -2687146 -2198892 -71646 758167 -723946 -2334611 -2539402 -3070727 -5881657
38001e881657l530019j044913J622291J324473o53350j003723N68598J577642
$$ -5881657 -9411676 -10456589 -8834298 -7509825 -8163175 -9166898 -8598300 -7020658
37993g020658J060771O57596J291452J527704L10958q35811j48688J239719P85839
$$ -7020658 -5959887 -5302291 -4010839 -2483135 -2172177 -3007988 -3156676 -1916957 -1131118
37984a131118j342984k162193l88125J380077M84304j762357k078718P4801K365187
$$ -1131118 -2474102 -4636295 -5024420 -3644343 -3160039 -4922396 -7001114 -6926313 -4561126
37975d561126L346802L444805K542224l0716k663855k218064J036765K640561
$$ -4561126 -1214324 2230481 4772705 4741989 2078134 -139930 896835 3537396
37967C537396J50946l034863k777047k53437N68670o19998o05925J748660L884447
$$ 3537396 3688342 653479 -2123568 -2377005 -1808335 -2428333 -3034258 -1285598 2598849
37958B598849L431166O94680k636556m693984l802271l61080K170756J004482
$$ 2598849 6030015 6724695 4088139 -605845 -4408116 -4769196 -2598440 -1593958
37950a593958j875367k414652n37370L07298o95554n15042J998173L592328J693558
$$ -1593958 -3469325 -5883977 -6421347 -6114049 -6809603 -7324645 -5326472 -1734144 -40586
37941d0586j603246k878725j879836m27667Q03316K124788L115929K993848J670963
$$ -40586 -1643832 -4522557 -6402393 -6830060 -6026744 -3901956 -786027 2207821 3878784
37932C878784m80852k634152l086707r35097J683361J721820j45694l41548J626501
$$ 3878784 3397932 763780 -2322927 -3258024 -1574663 147157 1463 -340085 1286416
37923A286416K085674m48156k250375l71209K328865J616984j767992l913765
$$ 1286416 3372090 2923934 673559 302350 2631215 4248199 2480207 -1433558
37915a433558l402475j566146P37287K912358L046060K96453k532182k285302
$$ -1433558 -4836033 -6402179 -5664892 -2752534 293526 589979 -1942203 -4227505
37907d227505l4040R32057J75314m12588p57647k172336l642828k647762N47621
$$ -4227505 -4261545 -3329488 -3154174 -3566762 -4324409 -6496745 -10139573 -12787335 -12239714
37898a2239714L057456L670895L599176L243722J762719k35430j065535j063740
$$ -12239714 -9182258 -5511363 -1912187 1331535 3094254 2858824 1793289 729549
37890G29549j896592k805011j269337K185345L631451J199451k364209l752532
$$ 729549 -1167043 -3972054 -5241391 -3056046 575405 1774856 -589353 -4341885
37882d341885k893536j571835p07546j10593P90948K351985L433250J686080k635826
$$ -4341885 -7235421 -8807256 -9514802 -9625395 -8834447 -6482462 -3049212 -1363132 -3998958
37873c998958m892420j759566K928905L004688m97376r20185K835038M093546
$$ -3998958 -8891378 -10650944 -7722039 -4717351 -5214727 -6134912 -3299874 793672
37865G93672m87346m929176l227671J609980L257828J837632J770782L411797
$$ 793672 306326 -4622850 -7850521 -6240541 -2982713 -1145081 625701 4037498
37857D037498L395227J324350q3921n15239k009234l833857k888628M64167K022507
$$ 4037498 7432725 8757075 8673154 8157915 6148681 2314824 -573804 -109637 1912870
37848A912870J59257j806932j011563J007861J446724K35718q38472p43556M01591
$$ 1912870 2072127 265195 -746368 261493 1708217 1943935 1105463 361907 763498
37839G63498J717146J655430l60520k144358j065649J534444J349809k473514
$$ 763498 2480644 4136074 3775554 1631196 565547 2099991 3449800 976286
37831I76286n245572l088339J439618K919774M30444j869638q69805J757942K484437
$$ 976286 -4269286 -7357625 -5918007 -2998233 -2567789 -4437427 -5307232 -3549290 -1064853
37822a064853N29202j587401j278855J183640K987087J846798j414982l741429
$$ -1064853 -535651 -2123052 -3401907 -2218267 768820 2615618 1200636 -2540793
37814b540793l281769j243081N3127J49901N34961K030583L296905K570881L05867
$$ -2540793 -5822562 -7065643 -7012516 -6862615 -6327654 -4297071 -1000166 1570715 1876582
37805A876582r85877J83105K214619K368923L72914j195430l80177J512280J563508
$$ 1876582 890705 1073810 3288429 5657352 6030266 4834836 4454659 5966939 7530447
37796G530447j149866m407261n062270k096279K169848L921810J644672k007582
$$ 7530447 6380581 1973320 -3088950 -5185229 -3015381 906429 2551101 543519
37788E43519l151076j208910J100447K014898K371520K586181J282077j445461
$$ 543519 -2607557 -3816467 -2716020 -701122 1670398 4256579 5538656 4093195
37780D093195k657531j054556J84163j567457l340373j078330K926130K677878
$$ 4093195 1435664 381108 565271 -1002186 -4342559 -5420889 -2494759 183119
37772A83119k167464n474388l717216j44974J700643K916599M848661M987449
$$ 183119 -1984345 -7458733 -11175949 -11320923 -9620280 -6703681 -1855020 3132429
37764C132429J417037k524450k608400l8926R62117k54174r78193l19706K40227
$$ 3132429 4549466 2025016 -583384 -622310 339807 85633 -892560 -1212266 -972039
37755i72039L73208P14351P4588k692313m717976k060612L232703M401903l07417
$$ -972039 -598831 115520 190108 -2502205 -7220181 -9280793 -6048090 -1646187 -1953604
37746a953604m413647k309425K965417M781294K258627J9776N54819J536175N63295
$$ -1953604 -6367251 -8676676 -5711259 -929965 1328662 1348438 1903257 3439432 4002727
37737D002727j272143j544196J62232K098700K346951O01747j254864p15681K232131
$$ 4002727 2730584 1186388 1348620 3447320 5794271 6396018 5141154 4425473 6657604
37728F657604M263438K407363k044746m966474m239153j381536J210924K452635
$$ 6657604 10921042 13328405 11283659 6317185 2078032 696496 1907420 4360055
37720D360055J989046j37932k455510k701789o43368J260579J088404o6681q4362
$$ 4360055 6349101 6211169 3755659 1053870 410502 1671081 2759485 2692804 2608442
37711B608442J017113J507628P56684n4013J15379P84857P45479m37937j825009
$$ 2608442 3625555 5133183 5889867 5835854 5951233 6736090 7481569 7043632 5218623
37702E218623j856652j08249J689448J347522p93550j981136q97802L34257m92633
$$ 5218623 3361971 3253722 4943170 6290692 5497142 3516006 2618204 2952461 2459828
37693B459828k012187j427050P95771J497333q1187j187242l89904j11240k247228
$$ 2459828 447641 -979409 -183638 1313695 1232508 45266 -344638 -455878 -2703106
37684b703106m122255k067796K541078M561187K277110k29456Q56833L500540
$$ -2703106 -6825361 -8893157 -6352079 -1790892 486218 256762 1113595 4614135
37676D614135K742420k144559o248574n184341o19409J925162Q4759k465980r61928
$$ 4614135 7356555 5211996 -1036578 -6220919 -6840328 -4915166 -4830407 -7296387 -8258315
37667h258315L953471O664052L618710k092882m567595k174484J251033J933177
$$ -8258315 -4304844 2359208 5977918 3885036 -682559 -2857043 -1606010 327167
37659C27167N31747J12510J524582K577191J297619j568142l544795k919109O4356
$$ 327167 858914 971424 2496006 5073197 6370816 4802674 1257879 -1661230 -1596874
37650a596874L601468N321756L624981q61572n168320o273569l907121n28786
$$ -1596874 2004594 7326350 10951331 10089759 4921439 -1352130 -5259251 -5788037
37642e788037J579552K203076J857262K79382k141230k828076K83204M735293
$$ -5788037 -4208485 -2005409 -148147 131235 -2009995 -4838071 -4554867 180426
37634A80426N419299J376192k381463j699210J076152J251296r81193j702236
$$ 180426 5599725 6975917 4594454 2895244 3971396 5222692 4241499 2539263
37626B539263k74863j60415k481517l786280j946988J87382k04195j068918P19575
$$ 2539263 2264400 2103985 -377532 -4163812 -6110800 -5923418 -6127613 -7196531 -6476956
37617f476956L666277M072040K253296J721327K986634K866015J80696k280731
$$ -6476956 -2810679 1261361 3514657 5235984 8222618 11088633 11269329 8988598
37609H988598k553036k250569k849263k827670r01742Q73485J85979j414911n84557
$$ 8988598 6435562 4184993 1335730 -1491940 -2393682 -1520197 -1334218 -2749129 -3333686
37600c333686K725984M996854L544138q22361n114185o521914m161748j40075
$$ -3333686 -607702 4389152 7933290 7110929 1996744 -4525170 -8686918 -8826993
37592h826993J784356J63566k245586j955425J012071L972618N141195M158293
$$ -8826993 -7042637 -6879071 -9124657 -11080082 -10068011 -6095393 -954198 3204095
37584C204095P93290l734208n504139j982294L138518L592580o42067k953184
$$ 3204095 3997385 263177 -5240962 -7223256 -4084738 -492158 -1134225 -4087409
37576d087409J01961L607250J887064l038272m965199k573000j79L13123M05377
$$ -4087409 -3985448 -378198 1508866 -1529406 -6494605 -9067605 -9067784 -8754661 -8349284
37567h349284K176774M134837M061912K153747J47895q45052o60388L47559J290294
$$ -8349284 -6172510 -2037673 2024239 4177986 4325881 3480829 2820441 3168000 4458294
37558D458294J317505N93749n9998l59495n01667l92394p5370l33484j535389
$$ 4458294 5775799 6369548 6309550 5950055 5448388 5055994 4980624 4647140 3111751
37549C111751k579648k449365j901323j856936j310080P44365K435054J279991
$$ 3111751 532103 -1917262 -3818585 -5675521 -6985601 -6241236 -3806182 -2526191
37541b526191j261888j248868J546940K871071M35778k785244l488401k491980
$$ -2526191 -3788079 -5036947 -3490007 -618936 -183158 -2968402 -6456803 -8948783
37533h948783j692364j24349L245277N439424K771509k831534n315116k583262
$$ -8948783 -10641147 -10765496 -7520219 -2080795 690714 -2140820 -7455936 -10039198
37525a0039198Q80624P30769j335285q07041K701582M925165L027253n87143j682756
$$ -10039198 -9158574 -8427805 -9763090 -10570131 -7868549 -2943384 83869 -503274 -2186030
37516b186030L36012K265489J768439L4178o26529J21263J029851J155257N1170
$$ -2186030 -1850018 415471 2183910 2218088 1591559 1712822 2742673 3897930 3949100
37507C949100k335064m420432l462016O02475L642695K386718q26404j645054
$$ 3949100 1614036 -2806396 -6268412 -5665937 -2023242 363476 -462928 -2107982
37499b107982j30350O91629R00479K682786M282369J805006k595769k031145L611263
$$ -2107982 -2238332 -1546703 -646224 2036562 6318931 8123937 5528168 3497023 7108286
37490G108286N562716m66784o722656n119146N40392J673142j495355k395473
$$ 7108286 12671002 12204218 5481562 362416 902808 2575950 1080595 -1314878
37482a314878j55876M78732q78438m9582K553947J936794j787842k700168N32853
$$ -1314878 -1470754 -992022 -1870460 -1920042 633905 2570699 782857 -1917311 -1384458
37473a384458K292654J96185j018372J071846J806844j485512l679620p24619
$$ -1384458 908196 1104381 86009 1157855 2964699 1479187 -2200433 -2925052
37465b925052K814675J611932j259151m39433J586656j084679o513380o792434
$$ -2925052 -110377 1501555 242404 -197029 1389627 304948 -6208432 -13000866
37457a3000866r3088O832961Q259911N137223Q23629k838956m300612k430760
$$ -13000866 -13093954 -6260993 1998918 7136141 7959770 5120814 820202 -1610558
37449a610558P87467J806431N07415k04321J20946r91074l424276l573142m80405
$$ -1610558 -823091 983340 1490755 1286434 1407380 416306 -3007970 -6581112 -7061517
37440g061517J925097R98051n63508K78008J704413N66506j761981j334856J915662
$$ -7061517 -5136420 -4138369 -4701877 -4423869 -2719456 -2152950 -3914931 -5249787 -3334125
37431c334125L709735J437508k386309l421608m42711L651908M785635J553015
$$ -3334125 375610 1813118 -573191 -3994799 -4437510 -785602 4000033 5553048
37423E553048l099080m361020p23658L780068L899491l98393l631104j652943
$$ 5553048 2453968 -1907052 -2630710 1149358 5048849 4650456 1019352 -633591
$$ [...]
##END NTUPLES=NMR SPECTRUM
##END=
