##TITLE=31Pdec_LR-673-R2-HCR4
 D2O, 24 sc
 23.12.2019
##JCAMPDX= 6.0         $$ Bruker NMR JCAMP-DX V2.0
##DATA TYPE= NMR SPECTRUM
##DATA CLASS= NTUPLES
##ORIGIN= UXNMR, Bruker Analytische Messtechnik GmbH
##OWNER= root
$$ XWIN-NMR		Version 3.5
$$ Mon Dec 23 14:48:54 2019 Russian Standard Time (UT+4h)  she@DPX200
##.OBSERVE FREQUENCY= 81.013821
##.OBSERVE NUCLEUS= ^31P
##.ACQUISITION MODE= SIMULTANEOUS
##.ACQUISITION SCHEME= undefined
##.AVERAGES= 24
##.DIGITISER RES= 17
##SPECTROMETER/DATA SYSTEM= spect
##.PULSE SEQUENCE= zgpg30
##.SOLVENT NAME= CDCl3
##.SHIFT REFERENCE= (INTERNAL, CDCl3, 0, 182.463)
##AUDIT TRAIL= $$ (NUMBER, WHEN, WHO, WHERE, WHAT)
$$ ##TITLE= Audit trail, XWIN-NMR		Version 3.5
$$ ##JCAMPDX= 5.01
$$ ##ORIGIN= Bruker BioSpin GmbH
$$ ##OWNER= she
$$ F:/spectra/data/she/nmr/P31/1/pdata/1/auditp.txt
$$ ##AUDIT TRAIL=  $$ (NUMBER, WHEN, WHO, WHERE, WHAT)
(   1,<2019-12-23 14:47:36.21 +0400>,<she>,<DPX200>,
      <created by zg, POWCHK disabled, PULCHK disabled
       configuration hash MD5:
       00 E9 B6 7A A2 85 ED C7 34 08 36 98 17 FE 4E 26
       data hash MD5: 32K
       3C 85 D6 80 7C 27 B3 2D DC 6D 83 31 D6 78 AE E1>)
(   2,<2019-12-23 14:47:53.20 +0400>,<she>,<DPX200>,
      <Start of raw data processing
       efp BC_mod = 2 LB = 1 FT_mod = 6 PKNL = 1 PHC0 = -1696.07 PHC1 = 99.4012 SI = 64K 
       data hash MD5: 64K
       8C 08 2F 88 AC 6F 1D D8 76 EA 55 FA E8 AA 80 AA>)
(   3,<2019-12-23 14:48:16.15 +0400>,<she>,<DPX200>,
      <pk PHC0 = -15.80234 PHC1 = 48.20001 
       data hash MD5: 64K
       38 5D A1 B5 8F 0E D3 69 93 36 FD 39 C5 8B 58 D3>)
(   4,<2019-12-23 14:48:20.92 +0400>,<she>,<DPX200>,
      <abs ABSG = 5 
       data hash MD5: 64K
       D5 27 1F 51 1A CE 17 F3 05 7A 78 42 F6 D6 31 6A>)
$$ ##END=
$$ 
$$ hash MD5
$$ 55 FC 8F BC 88 A9 63 2D B5 4D 52 D2 C6 39 A1 DB
##$RELAX= 
##$RELAX= 
##$RELAX= 
##$RELAX= 
##$RELAX= 
##$RELAX= 
##$RELAX= 
##$RELAX= 
$$ Bruker specific parameters
$$ --------------------------
##$DU= <F:/spectra>
##$EXPNO= 1
##$NAME= <P31>
##$PROCNO= 1
##$TYPE= <nmr>
##$USER= <she>
##$AMP= (0..31)
100 100 100 100 100 100 100 100 100 100 100 100 100 100 100 100 100 100 
100 100 100 100 100 100 100 100 100 100 100 100 100 100 
##$AQSEQ= 0
##$AQ_mod= 1
##$AUNM= <au_zg>
##$AUTOPOS= <>
##$BF1= 81.014009
##$BF2= 200.13
##$BF3= 200.13
##$BF4= 200.13
##$BF5= 200.13
##$BF6= 200.13
##$BF7= 200.13
##$BF8= 200.13
##$BYTORDA= 1
##$CFDGTYP= 0
##$CFRGTYP= 5
##$CHEMSTR= <none>
##$CNST= (0..31)
1 1 145 1 1 1 1 1 1 1 1 1 1 1 1 1 1 1 1 1 1 1 1 1 1 1 1 1 1 1 1 1 
##$CPDPRG= <waltz16>
##$CPDPRG1= <>
##$CPDPRG2= <waltz16>
##$CPDPRG3= <>
##$CPDPRG4= <mlev>
##$CPDPRG5= <mlev>
##$CPDPRG6= <mlev>
##$CPDPRG7= <mlev>
##$CPDPRG8= <mlev>
##$CPDPRGB= <>
##$CPDPRGT= <>
##$D= (0..31)
0 1 0 0 0 0 0 0 0 0 0 0.03 2e-05 3e-06 0 0 0 0 0 0 0 0 0 0 0 0 0 0 0 0 
0 0 
##$DATE= 1577098055
##$DBL= (0..7)
120 120 120 11 120 120 24 19 
##$DBP= (0..7)
150 150 150 150 150 150 150 150 
##$DBP07= 0
##$DBPNAM0= <>
##$DBPNAM1= <>
$$ [...]
##$SUBNAM3= <"">
##$SUBNAM4= <"">
##$SUBNAM5= <"">
##$SUBNAM6= <"">
##$SUBNAM7= <"">
##$SUBNAM8= <"">
##$SUBNAM9= <"">
##$SW= 369.568048894756
##$SWIBOX= (0..15)
0 1 3 0 0 0 0 0 0 0 0 0 0 0 0 0 
##$SW_h= 29940.119760479
##$TD= 32768
##$TD0= 1
##$TE= 0
##$TE2= 300
##$TE3= 300
##$TEG= 300
##$TL= (0..7)
0 120 53 12 22 120 120 120 
##$TP= (0..7)
150 150 150 150 150 150 150 150 
##$TP07= 0
##$TPNAME0= <>
##$TPNAME1= <>
##$TPNAME2= <>
##$TPNAME3= <>
##$TPNAME4= <>
##$TPNAME5= <>
##$TPNAME6= <>
##$TPNAME7= <>
##$TPOAL= (0..7)
0.5 0.5 0.5 0.5 0.5 0.5 0.5 0.5 
##$TPOFFS= (0..7)
0 0 0 0 0 0 0 0 
##$TUNHIN= 0
##$TUNHOUT= 0
##$TUNXOUT= 0
##$USERA1= <user>
##$USERA2= <user>
##$USERA3= <user>
##$USERA4= <user>
##$USERA5= <user>
##$V9= 5
##$VALIST= <valist>
##$VCLIST= <CCCCCCCCCCCCCCC>
##$VD= 0
##$VDLIST= <DDDDDDDDDDDDDDD>
##$VPLIST= <PPPPPPPPPPPPPPP>
##$VTLIST= <TTTTTTTTTTTTTTT>
##$WBST= 1024
##$WBSW= 4
##$XGAIN= (0..3)
0 0 0 0 
##$XL= 0
##$YL= 0
##$YMAX_a= 12788
##$YMIN_a= -13322
##$ZGOPTNS= <>
##$ZL1= 120
##$ZL2= 120
##$ZL3= 120
##$ZL4= 120
##$ABSF1= 182.463
##$ABSF2= -187.1042
##$ABSG= 5
##$ABSL= 3
##$ALPHA= 0
##$AQORDER= 0
##$ASSFAC= 0
##$ASSFACI= 0
##$ASSFACX= 0
##$ASSWID= 0
##$AUNMP= <proc_1d>
##$AZFE= 0.1
##$AZFW= 0.5
##$BCFW= 0
##$BC_mod= 2
##$BYTORDP= 0
##$COROFFS= 0
##$CY= -3
##$DATMOD= 1
##$DC= 0
##$DFILT= <>
##$DTYPP= 0
##$F1P= 0
##$F2P= 0
##$FCOR= 1
##$FTSIZE= 65536
##$FT_mod= 6
##$GAMMA= 0
##$GB= 0
##$INTBC= 1
##$INTSCL= 5.30512e-09
##$ISEN= 30
##$LB= 1
##$LEV0= 0
##$LPBIN= 0
##$MAXI= 10000
##$MC2= 0
##$MEAN= 0
##$ME_mod= 0
##$MI= 50
##$NCOEF= 0
##$NC_proc= -5
##$NLEV= 6
##$NOISF1= 182.463
##$NOISF2= 159.3651
##$NSP= 0
##$NTH_PI= 0
##$NZP= 0
##$OFFSET= 182.463
##$PC= 4
##$PHC0= -1711.872
##$PHC1= 147.6012
##$PH_mod= 1
##$PKNL= yes
##$PPARMOD= 0
##$PSCAL= 0
##$PSIGN= 0
##$REVERSE= no
##$SF= 81.0140089999434
##$SI= 65536
##$SIGF1= 159.3651
##$SIGF2= -187.1042
##$SINO= 113.3802
##$SIOLD= 16384
##$SREGLST= <1H.CDCl3>
##$SSB= 0
##$STSI= 65536
##$STSR= 0
##$SW_p= 29940.119760479
##$SYMM= 0
##$S_DEV= 0
##$TDeff= 32768
##$TDoff= 0
##$TI= <>
##$TILT= no
##$TM1= 0
##$TM2= 0
##$TOPLEV= 0
##$USERP1= <user>
##$USERP2= <user>
##$USERP3= <user>
##$USERP4= <user>
##$USERP5= <user>
##$WDW= 1
##$XDIM= 65536
##$YMAX_p= 416920381
##$YMIN_p= -13159859
$$ End of Bruker specific parameters
$$ ---------------------------------
##NTUPLES= NMR SPECTRUM
##VAR_NAME=  FREQUENCY,     SPECTRUM/REAL,   SPECTRUM/IMAG
##SYMBOL=    X,             R,               I
##VAR_TYPE=  INDEPENDENT,   DEPENDENT,       DEPENDENT
##VAR_FORM=  AFFN,          ASDF,            ASDF
##VAR_DIM=   65536,         65536,           65536
##UNITS=     HZ,            ARBITRARY UNITS, ARBITRARY UNITS
##FACTOR=    0.456856943014862, 1,           1
##FIRST=     14782.0589164792, 0,            0
##LAST=      -15158.0608439998, 0,           0
##MIN=       -15158.0608439998, -13159859,   0
##MAX=       14782.0589164792, 416920381,    0
$$ Real data points
##PAGE= N=1
##DATA TABLE= (X++(R..R)), XYDATA
$$ [...]
45218 -1663959 -774639 -497346 -390908 234674 1239166 1714230 1245578 557415 481324
45209 481324 777770 658059 159714 141242 931191 1828064 2138099 1957470 1617418 1071584
45199 1071584 315258 -177372 -49758 270178 87718 -593397 -1134580 -1129067 -730242 -229691
45189 -229691 229940 557324 726849 886131 1120555 1161369 703807 6091 -254464 147265
45179 147265 610540 427509 -359767 -1071511 -1229195 -1003541 -791173 -568586 107845 1431257
45169 1431257 2851562 3455583 2860069 1598533 585548 305910 548718 773909 633082
45160 633082 223232 -74212 -33230 145248 102233 -170107 -289848 -3464 477946 789161
45150 789161 879512 997766 1309170 1680159 1804697 1473404 788180 158000 -16413 288907
45140 288907 730910 948730 773752 174989 -717896 -1510573 -1786878 -1593194 -1411232 -1499769
45130 -1499769 -1550299 -1207888 -651143 -334748 -325968 -240503 200708 828161 1281402 1443523
45120 1443523 1540360 1823066 2168256 2103303 1376251 399934 -128936 456 425034 810774
45110 810774 1105764 1209050 959580 587437 562733 752174 408971 -579402 -1155244 -492351
45100 -492351 646491 833858 -97358 -1000585 -1123271 -873126 -800824 -773021 -504777 -174624
45090 -174624 -52714 -18115 143284 328503 343037 226250 59234 -275926 -862546 -1477605
45080 -1477605 -1775295 -1591102 -961000 -71744 694149 936015 647899 280212 254217 552994
45070 552994 856550 921889 783489 702677 885168 1140332 1009035 440572 35590 224166
45060 224166 557478 434837 201825 608461 1301746 1012860 -488077 -1768795 -1666040
45051 -1666040 -837207 -543732 -734495 -446428 425507 997702 879698 629844 617488 457736
45041 457736 -89739 -507663 -296012 234292 429883 131159 -392834 -969065 -1500866 -1690757
45031 -1690757 -1294053 -546538 84344 501150 913645 1247452 1166208 792333 791981 1355784
45021 1355784 1634365 855264 -330751 -499096 575194 1548736 1390587 652412 259927
45012 259927 -13744 -840916 -1773843 -1692656 -579650 441586 834082 1117745 1434494
45003 1434494 1049910 -139577 -871736 -178652 1170609 1817553 1619405 1341566 1226222
44994 1226222 945168 525938 267922 -1923 -658553 -1465875 -1851489 -1761366 -1474246 -899768
44984 -899768 58300 762792 483104 -400058 -821875 -535520 -191826 -56947 227113 613187
44974 613187 569324 196362 276502 915247 1227229 751594 132380 -57110 -140299 -447988
44964 -447988 -595198 -308208 -77766 -248585 -270030 314977 831372 357886 -808674 -1456847
44954 -1456847 -958500 252385 1455952 2250083 2546282 2507355 2411474 2300805 1997244
44945 1997244 1590062 1383030 1156595 237958 -1251874 -2020655 -1162329 562172 1732748
44936 1732748 1941646 1665222 1101822 155108 -819321 -1273748 -1303120 -1412380 -1682036 -1901779
44926 -1901779 -2173590 -2554783 -2510520 -1681548 -805398 -776842 -1126575 -691906 404351 859927
44916 859927 310704 -127816 239374 633960 228653 -555306 -863109 -561706 60691 863528
44906 863528 1481623 1238114 137806 -785386 -773662 -284791 -14191 184075 612433 797464
44896 797464 272547 -330920 -120078 497740 238150 -1172451 -2540943 -2718882 -1783841
44887 -1783841 -627160 -19034 -150050 -539448 -366212 629125 1644518 1722398 1014213
44878 1014213 524816 694064 952294 746036 293280 75311 129808 157613 -16006 -303961
44868 -303961 -440915 -141992 549569 1089555 948821 286719 -249394 -351109 -259377 -194623
44858 -194623 -76373 146793 376870 656390 1112187 1547904 1611661 1457354 1639232 2161178
44848 2161178 2280403 1597537 708076 259044 -82650 -1006737 -2237162 -2641979 -1672479
44839 -1672479 -62939 1033596 1133171 520698 -263421 -765155 -779594 -523052 -521738 -1074494
44829 -1074494 -1880874 -2380739 -2379417 -2110499 -1726778 -1057470 -24042 964547 1351530 1109773
44819 1109773 784783 810815 1032681 1014433 608900 61018 -310630 -385221 -290991 -284084
44809 -284084 -476039 -642138 -457302 66547 611057 1012173 1340213 1504721 1297877 979643
44799 979643 1172452 1821316 1973167 1196984 511330 979155 1948913 1912326 842565 270030
44789 270030 888359 1501182 932670 -207477 -547017 99415 763614 799947 440118 131972
44779 131972 46831 137951 215818 99655 -48922 125039 483168 422048 -85506 -188472
44769 -188472 569119 1403490 1444723 1051789 1087817 1486516 1587473 1437295 1602683 1978064
44759 1978064 1962388 1663658 1733138 2068110 1917828 1322513 1155316 1549213 1617942 1103973
44749 1103973 955162 1680527 2408528 2341116 1968070 1930989 1775257 934621 41333 302
44739 302 408966 166495 -779164 -1502207 -1598577 -1426319 -1054129 -185591 855708 1167850
44729 1167850 471985 -572725 -1314413 -1569621 -1216781 -306848 391587 25837 -956482
44720 -956482 -1107797 -13642 995857 673945 -552975 -1489468 -1829358 -2066084 -2350216
44711 -2350216 -2370951 -2088845 -1772011 -1423280 -852306 -265636 -154725 -514952 -688796 -187102
44701 -187102 648043 1016053 564348 -241170 -673152 -585491 -527615 -946153 -1536879 -1678318
44691 -1678318 -1268768 -668380 15457 941578 1843855 2056174 1430056 571324 -85044
44682 -85044 -742684 -1456062 -1661036 -1080279 -426474 -458002 -844499 -784567 -358926 -355042
44672 -355042 -925741 -1327555 -1022348 -263267 518083 1200922 1669236 1653400 1177021 705508
44662 705508 562337 525245 236510 -241966 -487915 -176180 634810 1554930 2151460 2249802
44652 2249802 1917820 1204236 188311 -669729 -755726 -193920 31348 -628563 -1373260
44643 -1373260 -1146317 -217147 230826 -155062 -579645 -503583 -333763 -505116 -789454 -850824
44633 -850824 -726926 -446304 110657 670688 632353 9290 -442439 -410812 -539982 -1280115
44623 -1280115 -2047081 -2175756 -1982316 -2116766 -2447105 -2379579 -1822305 -1079737 -236310 584386
44613 584386 794409 62223 -851017 -866571 -2128 817549 1150834 1326952 1457089 1142147
44603 1142147 286733 -628249 -1260413 -1690504 -1883268 -1595016 -979170 -578682 -523107 -404489
44593 -404489 -125356 -131810 -539539 -789474 -583575 -474831 -999148 -1773096 -2029796 -1650046
44583 -1650046 -1122604 -797691 -696031 -827569 -1215347 -1707906 -2081997 -2188147 -1814454
44574 -1814454 -758113 646851 1455790 1067268 40912 -515814 -250811 187089 117272
44565 117272 -421658 -926594 -1058677 -899934 -792480 -970713 -1223770 -1001966 -58343 1104613
44555 1104613 1688368 1468425 957109 691756 631286 373876 -220870 -829603 -1066157 -927256
44545 -927256 -715648 -570830 -307925 147982 415826 83133 -642117 -1119513 -1100604 -900704
44535 -900704 -689390 -193957 604301 1034428 520798 -526278 -1148135 -982535 -475070
44526 -475070 -94266 116771 225441 185606 67043 107419 357255 546252 433371 67237
44516 67237 -373970 -749837 -874806 -534568 239161 1065846 1527087 1490462 1088202 547573
44506 547573 122906 2791 111201 100388 -283979 -858677 -1178452 -1084499 -927438 -1103033
44496 -1103033 -1439825 -1299087 -395948 707939 1197087 955345 586694 541185 646504
44487 646504 573855 293527 -151735 -871604 -1767746 -2316293 -2144458 -1560061 -1084963 -732036
44477 -732036 -242378 210451 192024 -215617 -478784 -498805 -771469 -1474311 -2007604 -1780332
44467 -1780332 -996400 -315750 -105585 -344382 -877552 -1354326 -1232726 -360997 596060
44458 596060 801077 292305 -36573 440671 1357828 1898248 1757654 1326760 1078672 1051458
44448 1051458 957877 616398 144183 -227544 -411816 -512144 -684795 -992505 -1330034 -1455896
44438 -1455896 -1180729 -592858 -31038 222135 141808 -160953 -583364 -962792 -1084320 -940255
44428 -940255 -784943 -717604 -454035 161658 663383 476657 -181699 -487467 -141538 261388
44418 261388 196814 -7125 279858 1083471 1937300 2621105 3248019 3696281 3497545 2492760
44408 2492760 1284665 727182 991924 1354447 1028693 98032 -630661 -713688 -638871 -1047464
44398 -1047464 -1744308 -2002764 -1678239 -1364255 -1397894 -1389987 -999433 -559539 -504909 -638469
44388 -638469 -463895 64404 589372 912943 1082085 1117585 1056199 1058555 1084058 708065
44378 708065 -263147 -1228849 -1429524 -1015929 -836653 -1158337 -1288478 -679661 213387 582856
44368 582856 341542 51247 -9400 -173876 -698756 -1136589 -755029 430241 1383505 1132648
44358 1132648 10147 -652889 -182139 621773 674062 74153 -296977 -289304 -630544 -1514550
44348 -1514550 -2035903 -1508636 -595806 -415523 -973143 -1270841 -805798 -175618 -80145 -378778
44338 -378778 -475430 -212823 24105 -122106 -669765 -1424457 -2069921 -2226800 -1838331 -1501421
44328 -1501421 -1908531 -2774359 -2868727 -1569783 79467 558136 -174544 -790296 -605685
44319 -605685 -411483 -937691 -1561722 -1358517 -647731 -424635 -694891 -543544 248015 807887
44309 807887 601834 253136 515381 1227339 1819067 2229867 2694771 3007429 2634042 1477103
44299 1477103 124443 -670120 -611316 -75033 234738 -2892 -382285 -368663 -86482 -60998
44289 -60998 -303513 -325033 -83886 -115695 -506153 -624780 -345363 -627699 -2083730 -3667265
44279 -3667265 -3824559 -2586481 -1480398 -1486274 -2082555 -2397337 -2319816 -2089332 -1574306 -598950
44269 -598950 399912 660678 16357 -841861 -1111313 -710815 -239062 -162215 -270861 -117487
44259 -117487 213145 181696 -390872 -1071952 -1467180 -1596749 -1485711 -1032603 -566044 -771837
44249 -771837 -1572624 -1875471 -1151792 -463587 -908790 -1760159 -1487936 -182785 607689
44240 607689 363661 239909 918841 1461864 1047430 441241 684284 1398309 1585289 1341321
44230 1341321 1527214 2178864 2436197 1918710 1204347 930162 1125959 1424320 1397569 813590
44220 813590 14963 -228752 269519 660287 227395 -458755 -372436 395830 897821 897913
44210 897913 1058631 1594924 1901527 1724653 1629364 1929678 2100005 1697604 1026588 425854
44200 425854 -265642 -1007856 -1183225 -604177 -100823 -275490 -398012 428218 1570829
44191 1570829 1593242 433039 -467148 -315784 29412 -312833 -787140 -451357 300481
44182 300481 208788 -892876 -1664400 -1026083 452762 1384094 1263215 756163 533149
44173 533149 494441 276248 -55283 -233667 -376787 -787848 -1257245 -1147019 -320243 536441
44163 536441 823542 791561 923721 963458 285420 -905070 -1601314 -1439612 -1314580 -2015837
44153 -2015837 -2875210 -2591572 -1114443 216323 467683 168142 222518 568562 574109 223523
44143 223523 57797 171002 152614 42627 461676 1516612 2356701 2290463 1733859 1511651
44133 1511651 1738526 1996949 2146561 2223302 1915434 1001677 86623 -30934 353131 172592
44123 172592 -730980 -1308821 -954171 -374618 -318645 -479447 -402456 -498360 -1135270 -1537663
44113 -1537663 -869366 110149 -88057 -1336919 -1904948 -1004965 97085 63100 -688579
44104 -688579 -983273 -733992 -720458 -1129456 -1411493 -1346079 -1291225 -1403796 -1390471 -1088043
44094 -1088043 -658222 -161262 463598 924156 701279 -154988 -882110 -915890 -527397 -315968
44084 -315968 -473283 -821318 -1186424 -1394427 -1246379 -906129 -996654 -1790245 -2516394 -2118187
44074 -2118187 -698308 434088 357123 -402217 -739907 -370720 193273 648241 1109863
44065 1109863 1436570 1188241 474440 93017 381557 563016 -122967 -1118433 -1229488
44056 -1229488 -412237 68399 -589542 -1653877 -1966195 -1431056 -816378 -550164 -402576
44047 -402576 -139029 161424 405945 589747 592739 327137 98572 354592 1003511 1444632
44037 1444632 1405578 1277598 1394765 1459818 1086677 547753 438794 749234 829552 352702
44027 352702 -184316 -179878 177743 120150 -663915 -1535958 -1593703 -704030 321372 573191
44017 573191 -70638 -964722 -1456335 -1423754 -1083801 -562695 114449 752863 1027745 853988
44007 853988 491140 176426 -155713 -645885 -1182535 -1522929 -1627714 -1620293 -1476031 -1057638
43997 -1057638 -483440 -131315 -147588 -256564 -258043 -408509 -980388 -1672876 -1893730 -1536870
43987 -1536870 -1037579 -670229 -302057 13011 -255869 -1376592 -2630499 -2858534 -1721529
43978 -1721529 -49950 1095672 1381983 1132309 675224 120101 -343588 -372562 79630
43969 79630 498690 379537 44 158536 983860 1515785 921762 -248498 -700000 -139763
43959 -139763 389472 32991 -803387 -1269952 -1271674 -1268113 -1365181 -1282688 -959487 -562730 -55126
43948 -55126 664704 1301626 1420259 1116385 882091 809401 485680 -252206 -990853 -1307887
43938 -1307887 -1227228 -983317 -730268 -573741 -488672 -161267 608552 1295002 1042909 -114077
43928 -114077 -1033942 -816441 139362 818204 830283 478084 37348 -370858 -446521 40386
43918 40386 672448 648681 -226016 -1214136 -1456863 -842583 11211 379279 -42087 -945288
43908 -945288 -1584109 -1329387 -273931 755183 951293 351421 -172679 163110 1176733
43899 1176733 1911194 1721257 930788 264016 -77623 -419240 -919885 -1388643 -1733817
43890 -1733817 -2053583 -2230052 -1998355 -1566982 -1574522 -2132418 -2445060 -1785858 -445617 665256
43880 665256 988099 564242 -238001 -841448 -757682 -232426 -146207 -765720 -1116659 -295672
43870 -295672 1060619 1509718 740326 -173978 -381514 -166072 -142419 -403166 -728552 -955368
43860 -955368 -886912 -436599 -38745 -267824 -857795 -835135 48364 762578 384517 -600977
43850 -600977 -1032411 -647001 -205776 -266137 -522501 -415897 89906 533897 568580 396035
43840 396035 517371 996838 1208424 674749 -37256 90047 1016661 1547529 1056380 445139
43830 445139 716337 1321854 938253 -502704 -1705848 -1932876 -1898881 -2354807 -2736664
43821 -2736664 -2005766 -294332 1170379 1644609 1570195 1574567 1501145 881082 -121752 -868371
43811 -868371 -1150298 -1298665 -1410983 -1151594 -504412 -39407 -35729 36335 600060 1112202
43801 1112202 872127 235297 86852 383142 280736 -347129 -659868 -278035 174810
43792 174810 318236 661083 1399396 1652278 791239 -317616 -440139 244372 539245
43783 539245 6184 -704878 -1071026 -1208703 -1204962 -868233 -277616 142856 230985 202812
43773 202812 146457 -30212 -174172 -33185 158519 -121931 -815796 -1206009 -853312 -101692
43763 -101692 481409 721789 796825 977165 1444325 1980016 1907138 840917 -538159 -1024620
43753 -1024620 -260394 922563 1551500 1402195 846357 382990 399556 884310 1293561
43744 1293561 1134112 631519 353677 362229 386644 610282 1381250 2234539 2267470 1607616
43734 1607616 1396739 2014039 2440280 1875678 898334 354747 121332 -218904 -400163
43725 -400163 -136292 18914 -486423 -1121889 -1084649 -648283 -603320 -811206 -515309 199672
43715 199672 491625 183171 -92485 -141309 -387013 -688774 -241503 966127 1723226 1187773
43705 1187773 9183 -687760 -621970 -95013 755048 1680483 1970356 1259808 315735
43696 315735 203612 888104 1379141 1125209 570319 350042 556368 895721 1091687 999935
43686 999935 676959 425671 487605 667693 574817 249846 183166 593033 1034102 952936
43676 952936 407539 -20809 78525 568395 1038274 1227325 1104902 719323 187208 -187190
43666 -187190 -56079 502752 823213 294125 -825771 -1582221 -1433454 -825275 -424738
43657 -424738 -165313 482794 1527255 2330366 2449664 2029825 1277037 179648 -968158
43648 -968158 -1396701 -758488 233119 672796 645527 843827 1257436 1155533 411595 -116543
43638 -116543 111804 484400 284298 -114868 123523 914285 1333353 913590 111831 -475749
43628 -475749 -704335 -658172 -438284 -285201 -443118 -800886 -1011482 -926716 -571571 77312
43618 77312 737469 527553 -1118839 -3291883 -4274684 -3522657 -2118830 -1111417 -436923
43609 -436923 129174 98637 -837530 -1886544 -2063265 -1479069 -898916 -518450 -27802 555919
43599 555919 1011699 1501295 2120072 2183775 984305 -876218 -1902752 -1491557 -446552
43590 -446552 304964 654977 881390 1094020 1308567 1431665 1105886 217822 -502847 -225007
43580 -225007 645807 839391 60919 -606662 -462214 -221040 -660430 -1239029 -989998 -111826
43570 -111826 332838 -29845 -520350 -494912 -110460 41307 -349856 -982509 -1186692 -708657
43560 -708657 -303888 -1020592 -2662686 -3648082 -2901238 -1249656 -245640 -171085 -127526
43551 -127526 283407 494486 176539 -155723 -50312 204354 240259 274172 558100 654272
43541 654272 -59897 -1328910 -2073114 -1600193 -358625 676490 1058313 1060878 1049493 1077741
43531 1077741 1128285 1317133 1593130 1555073 973346 304912 204177 574234 618892 -80629
43521 -80629 -1018604 -1449249 -1193072 -586861 -50107 85732 -279798 -789194 -887372 -519006
43511 -519006 -210283 -293530 -495343 -484266 -299717 13137 580648 1149194 1029494 131405
43501 131405 -577248 -318036 355474 430463 -67028 -357032 -287901 -397714 -797579 -1054411
43491 -1054411 -1166084 -1623991 -2371812 -2658324 -2172618 -1476553 -1037191 -651254 -167580
43482 -167580 18218 -342323 -808702 -875349 -624609 -388445 -285857 -426698 -974031 -1602984
43472 -1602984 -1518621 -517882 532046 829745 716862 994387 1666529 2125888 2231684
43463 2231684 2375884 2639312 2667288 2373203 2086253 1944481 1731840 1398397 1200025 1194629
43453 1194629 1063031 573022 -135953 -784095 -1114846 -877846 -129734 470018 264012
43444 264012 -416343 -542399 113580 526237 -74970 -984077 -1071995 -501690 -355184 -775966
43434 -775966 -670188 511303 1781283 2004512 1440478 1089442 1086932 725282 -187779 -978488
43424 -978488 -1140290 -878371 -513542 -141260 -48612 -606645 -1411517 -1393607 -299406 731217
43414 731217 702535 95320 -132377 -80584 -341698 -544823 111886 1153146 1199630 155806
43404 155806 -497724 -12091 515759 91060 -480382 30047 1239158 1828924 1577416
43395 1577416 1325924 1305083 918058 135275 -260978 -88675 -238887 -1242611 -2307539
43386 -2307539 -2414557 -1695295 -1062588 -934140 -965594 -793068 -465960 -194376 -42623 113062
43376 113062 478943 1107120 1692717 1814899 1463107 1051494 820351 590784 271182 142547
43366 142547 314847 363233 13153 -197526 360543 1212599 1126099 -222959 -1674184 -2020709
43356 -2020709 -1420158 -875477 -777475 -641889 -115445 456837 604340 383105 220370 391109
43346 391109 828915 1238972 1259621 737600 21470 -202161 420315 1482394 2206482 2195588
43336 2195588 1701883 1237666 1040828 917230 596107 241929 438194 1438721 2589181
43327 2589181 2899055 2167318 1087251 223555 -499819 -1129826 -1267213 -811176 -458051
43318 -458051 -760229 -1209943 -1076926 -722574 -1070415 -1994685 -2369014 -1782316 -1103661 -1054467
43308 -1054467 -1247811 -1115691 -853331 -786589 -575037 161319 963130 1100631 714612 650033
43298 650033 1271823 2006179 2009169 959073 -630393 -1620637 -1124147 460260 1643582
43289 1643582 1463980 513615 -39707 97797 478820 923261 1476796 1678489 917525
43280 917525 -431537 -1124848 -540088 602376 1222091 1021545 445892 20195 -9387
43271 -9387 256971 452031 333804 141591 269120 628599 732225 373690 -211517 -832919
43261 -832919 -1465885 -1846293 -1540838 -651778 26091 -129663 -825145 -1198047 -729946 276914
43251 276914 945893 561852 -692467 -1785134 -1881145 -1212237 -596601 -355864 -229941
43242 -229941 -128545 -231658 -392054 -211508 197947 275281 -28005 -125769 150401 215672
43232 215672 -183187 -376619 191847 1060186 1513675 1632139 1861031 2060478 1779244 1122175
43222 1122175 554842 71753 -674050 -1523919 -1825779 -1321588 -437016 352565 928021
43213 928021 1254989 1201808 763343 131827 -529606 -1139091 -1569354 -1748896 -1805188 -1810872
43203 -1810872 -1524202 -749366 183844 753467 981742 1335467 1879684 2067015 1531360
43194 1531360 626592 -87825 -540361 -997869 -1440842 -1455401 -766314 322030 1112185
43185 1112185 1136272 596973 179057 405697 1194258 2006259 2317029 1951613 1167639 493280
43175 493280 292055 381016 269659 -144473 -408088 -193219 208385 364350 332862 379423
43165 379423 334045 -168151 -856799 -877617 84881 1185228 1303557 373786 -526382 -430528
43155 -430528 431730 990852 676882 83611 121322 794800 1261479 1015323 467597 231611
43145 231611 368689 613346 852922 1012538 907756 649577 778881 1482416 2060421 1778824
43135 1778824 916284 275352 -49389 -575181 -1283465 -1582783 -1525121 -2001962 -3248146
43126 -3248146 -4033485 -3137052 -1138191 94126 -434682 -1876905 -2782318 -2698410 -2235394
43117 -2235394 -1934568 -1610548 -879325 87551 728132 882371 960873 1230005 1371605 1000405
43107 1000405 230237 -594495 -1351236 -1933128 -2005919 -1517189 -1083686 -1189605 -1287998 -530380
43097 -530380 755326 1278162 585138 -288199 -291001 359356 843290 951933 973166 862647
43087 862647 272124 -736187 -1542956 -1572732 -818494 167106 720145 683980 596802 993990
43077 993990 1602575 1697043 1199472 751890 615112 325556 -248654 -408835 221213 838295
43067 838295 565520 -207205 -521756 -422386 -749622 -1581300 -2022881 -1658236 -1161422 -1100822
43057 -1100822 -1019596 -299333 668222 887546 102436 -872079 -1173128 -812756 -412170 -273079
43047 -273079 -42950 613073 1273074 1085045 -113346 -1393087 -1719761 -1078824 -311268
43038 -311268 -53890 -223654 -412749 -377891 -157308 -32380 -338587 -1004904 -1370448 -869047
43028 -869047 124729 604836 197648 -343536 -150590 656099 1270004 1339596 1270484 1373166
43018 1373166 1250759 402825 -848722 -1569855 -1378610 -899630 -831800 -1036831 -981539 -667445
43008 -667445 -462846 -270222 297403 926115 711627 -470280 -1552456 -1680708 -1269251
42999 -1269251 -1095309 -1061745 -606153 212298 852872 1135390 1173687 817475 -38372 -873780
42989 -873780 -1088456 -887792 -811458 -659077 137154 1223023 1484323 571009 -711776
42980 -711776 -1639192 -2220030 -2479882 -2154868 -1413628 -876172 -529236 353068 1725829
42971 1725829 2318146 1426799 185342 60164 840854 1219852 808712 362767 259118
42962 259118 -25088 -809081 -1577561 -1753869 -1411206 -932250 -495222 -159527 -37000 -107371
42952 -107371 -127767 90375 483783 875686 1128995 1139047 852584 327562 -307395 -890172
42942 -890172 -1187178 -1039449 -670569 -579156 -940786 -1415603 -1749898 -2144665 -2668346 -2769853
42932 -2769853 -1974739 -758191 -35634 58523 165746 524844 590599 25019 -634591 -693458
42922 -693458 -202680 267730 414650 345510 168556 -123800 -415928 -466879 -228282 31642
42912 31642 20510 -248370 -495904 -507926 -333922 -140302 5104 82389 -21053 -362224
42902 -362224 -709282 -754901 -561665 -452365 -435978 -183411 333911 723444 892069 1236898
42892 1236898 1714427 1437242 -61333 -1700875 -1941422 -743326 503743 891895 825838
42883 825838 872443 859165 546980 312346 493895 623097 -467 -1224223 -2086830 -1881722
42873 -1881722 -846259 178685 612441 686555 1104600 2029927 2635940 2071528 710287
42864 710287 -154123 146380 1023905 1594707 1588016 1158057 529468 118601 320854 836200
42854 836200 868046 326522 72701 525099 880792 400898 -340337 -389897 69269 201646
42844 201646 46265 377180 1231974 1747486 1529967 1172565 1225134 1531282 1805243 2036619
42834 2036619 2041759 1403949 258658 -523045 -387379 171557 344337 33147 -264520 -249962
42824 -249962 -82959 -33269 -166778 -289571 -124379 292790 456004 -29481 -767140 -945695
42814 -945695 -414594 159579 309955 348695 708704 1271188 1666391 1767956 1565941 987854
42804 987854 181813 -408590 -551025 -440752 -209695 276773 868122 977570 421434 -122274
42794 -122274 13120 640056 1246335 1816287 2470043 2778520 2249548 1206342 414663
42785 414663 51648 -228917 -441994 -289205 131252 464085 821944 1479815 1951659 1466276
42775 1466276 478973 485220 1843056 2933036 2330268 885319 492563 1340240 1737689
42766 1737689 664907 -804398 -1159584 -567938 -395853 -1044495 -1361097 -419738 1016251
42757 1016251 1497414 840621 174689 182849 331276 100770 -60356 297816 565845 -861
42747 -861 -828010 -656850 569626 1604529 1696965 1372067 1217697 1005545 471854 25280
42737 25280 74753 347984 417980 329836 277611 243260 302206 619094 834193 292527 -734722
42726 -734722 -1074195 -464511 -188544 -1016415 -1727914 -1000909 257357 172639 -1141421
42717 -1141421 -1792392 -1079070 -322569 -498448 -871705 -613283 -169597 -118291 19556 746775
42707 746775 1383696 1049283 146809 -255491 -70532 -152236 -841239 -1510010 -1539177 -993681
42697 -993681 -268694 341225 604763 325579 -474930 -1519132 -2440234 -2928463 -2859743 -2379659
42687 -2379659 -1718847 -952768 -219885 -49042 -885517 -2218537 -2848946 -2291573 -1312533
42678 -1312533 -788344 -685926 -549633 -305191 -59090 271709 571150 393702 -186825
42669 -186825 -311135 337246 696696 -167904 -1384127 -1377545 -263460 307377 -349129 -1048355
42659 -1048355 -654670 382842 1002577 1022082 933036 931637 893449 864589 946006 948538 617670
42648 617670 17381 -587690 -1024777 -1225558 -1210489 -1167541 -1261120 -1342504 -1193851 -972113
42638 -972113 -912023 -723982 -28302 634029 172788 -1413639 -2719996 -2733378 -2089971 -1914408
42628 -1914408 -2200623 -2158414 -1567018 -894728 -457053 -273466 -457454 -965871 -1222638 -789470
42618 -789470 -213525 -390961 -1202039 -1610957 -1117377 -298496 178765 287868 181850 -235515
42608 -235515 -893384 -1286011 -1070400 -574667 -353779 -511507 -755321 -887658 -951195 -1009509
42598 -1009509 -991524 -730581 -144570 539740 868695 706062 546988 901287 1463524 1434889
42588 1434889 735092 302336 900206 2099963 2842459 2671891 1986357 1315782 851531
42579 851531 619833 633174 731211 598451 160718 -200860 -55218 504187 899064 739070
42569 739070 270388 -5284 -1557 -43849 -250952 -319462 -49615 299376 430985 458009
42559 458009 611725 802092 838155 806260 797816 541897 -147962 -787758 -727466 -107403
42549 -107403 392910 680315 1261578 2010747 1885531 378025 -1481984 -2228402 -1599444
42540 -1599444 -473277 454772 1250777 2158109 3060613 3620903 3632001 3186674 2634538
42531 2634538 2279027 2048377 1691594 1340235 1462003 2087223 2556978 2340320 1660712
42522 1660712 986504 390120 -181500 -531789 -640768 -949582 -1585957 -1818084 -1065357
42513 -1065357 -1911 283699 -113592 -228057 79854 -9406 -632880 -772260 141558
42504 141558 1278940 1690982 1581202 1556999 1443751 771141 -112122 -362176 192684 994752
42494 994752 1655255 2169413 2378759 1982109 1149131 529960 500708 771485 808794 354548
42484 354548 -470832 -1314393 -1842592 -1998212 -1904900 -1480437 -515515 699778 1361360 1151913
42474 1151913 734912 736528 796707 350623 -189144 -27211 571844 579151 -138688 -628943
42464 -628943 -449998 -274962 -550568 -698197 -231470 338963 430183 328085 404263 222950
42454 222950 -594751 -1296867 -926859 107572 563489 250618 229743 1114304 2252047
42445 2252047 2794031 2667240 2254686 1935392 2160469 3118676 4010657 3549976 1692203
42436 1692203 70002 66481 1117442 1651469 1154403 431909 166463 163351 24714 -210795
42426 -210795 -297673 -157752 119312 314621 122547 -481003 -972274 -831389 -349709 -392459
42416 -392459 -1280534 -2394898 -3034078 -3173279 -3127702 -2929511 -2443087 -1804529 -1313633 -1013961
42406 -1013961 -739974 -530791 -668696 -1232666 -1813311 -1809902 -1025695 39624 577197 278807
42396 278807 -310021 -451117 -126716 81901 -9206 102556 677486 1152555 1013088 720364
42386 720364 1003345 1545099 1314702 174473 -834827 -1062750 -1139749 -1767017 -2469005
42377 -2469005 -2375558 -1660870 -1239329 -1337001 -1359557 -1096324 -1040926 -1339371 -1366282 -766221
42367 -766221 -139193 -126664 -410492 -266404 293688 597896 312018 -231937 -595789 -630099
42357 -630099 -394923 -124342 -183422 -650845 -1055259 -946880 -580853 -529666 -758984 -724869
42347 -724869 -364214 -263673 -670969 -1030234 -839669 -383233 -174687 -157507 36156 383157
42337 383157 541110 386355 30368 -476972 -1017361 -1218584 -914093 -586370 -754397 -1051864
42327 -1051864 -640823 398457 879987 73295 -1191121 -1541199 -774073 95668 283839
42318 283839 18962 -180139 -324528 -678471 -1105184 -1208646 -970447 -761381 -712500 -515935
42308 -515935 16349 586353 835742 809518 696578 414523 -133147 -625191 -678546 -521813
42298 -521813 -717099 -1200513 -1265697 -694136 -223758 -478645 -1003782 -941067 -263084 317027
42288 317027 424173 323441 207833 -144357 -838786 -1478485 -1559537 -1017102 -253058 235268
42278 235268 274796 220256 602377 1370349 1759874 1299715 648684 813164 1685675 2106458
42268 2106458 1424483 239768 -602737 -985902 -1106622 -825837 -58152 699274 923051
42259 923051 836640 956039 1083861 505096 -808247 -1888474 -1905412 -1122474 -435420 -303884
42249 -303884 -465944 -499629 -285886 105154 687642 1477220 2180198 2251055 1494503 486818
42239 486818 49622 252876 302263 -390073 -1368498 -1726744 -1325840 -966175 -1345132 -2232495
42229 -2232495 -2816530 -2601090 -1778921 -887790 -320024 -134944 -145235 -72467 283201 840491
42219 840491 1193643 996934 503839 443099 1069400 1589645 1022595 -462403 -1637031
42210 -1637031 -1702998 -1086420 -569081 -312355 -159931 -263717 -730093 -1067758 -752388 -119574
42200 -119574 60089 -204325 -113108 656452 1416843 1448165 914496 506052 628220 1207187
42190 1207187 1874255 2090483 1513337 516759 -64165 16681 89104 -357465 -815140 -566190
42180 -566190 93904 252801 -203900 -499757 -377559 -633280 -1748074 -2767766 -2375503
42171 -2375503 -701921 805805 1211060 894159 424929 -358068 -1553604 -2320296 -1825491
42162 -1825491 -721991 -552980 -1612904 -2444573 -1821417 -281553 907050 1446401 1773321
42153 1773321 1769291 915439 -408143 -949722 -195690 904781 1204686 691511 162647
42144 162647 120481 430392 683186 510482 -149214 -807522 -793201 -130071 355180 109772
42134 109772 -423346 -571984 -421947 -416739 -365828 311939 1438186 1995191 1414366 340745
42124 340745 -182570 156833 920209 1608134 1942519 1700602 779237 -496706 -1436729
42115 -1436729 -1538565 -899329 2036 828586 1541346 2081720 2186641 1738122 1128629
42106 1128629 929441 1191440 1403843 1191865 675131 38570 -744296 -1469984 -1527614 -715505
42096 -715505 154780 161374 -451611 -665579 -242095 14819 -327185 -618353 -282186 160266
42086 160266 -72639 -768832 -1125473 -1025554 -1059781 -1456399 -1817546 -1896261 -1870497 -1787087
42076 -1787087 -1470261 -1104430 -1162786 -1546451 -1542203 -931599 -371554 -275067 -152989 329287
42066 329287 506681 -155782 -798824 -222525 1213033 2040357 1876607 1777066 2280882 2561335
42056 2561335 2033240 1456793 1584788 1806762 1191959 57475 -629058 -794703 -1040500
42047 -1040500 -1316558 -1037598 -301832 183491 318467 617614 995866 732175 -158518
42038 -158518 -670942 -322147 102643 -187509 -888910 -1325077 -1451152 -1514371 -1429240 -1155509
42028 -1155509 -1087390 -1407289 -1601169 -1263530 -841960 -889332 -1098421 -859809 -337045 -142144
42018 -142144 -274999 -259739 -109249 -254492 -598277 -508981 179271 905280 1221667 1245901
42008 1245901 1174901 974335 703996 620983 799945 1048457 1219761 1203435 725524 -274999
41998 -274999 -1168082 -1216171 -633417 -341477 -619899 -800566 -465207 -74498 -45089 -21989
41988 -21989 402677 940199 1173513 1272993 1482409 1427518 735129 -21614 124319 1138286
41978 1138286 1930680 1762938 1041146 556637 520740 622211 597388 397906 54141 -295955
41968 -295955 -355186 70066 733453 1068269 759150 112733 -308609 -427972 -764239 -1596539
41958 -1596539 -2297772 -2003218 -902008 -247161 -826045 -1945834 -2358024 -1763951 -852393
41949 -852393 -167883 326694 625204 399331 -368565 -1027849 -962851 -359137 110806 177979
41939 177979 178406 440626 829052 965565 670901 94594 -435097 -619574 -408643 -120585
41929 -120585 -209739 -768828 -1354600 -1459132 -1064783 -550091 -163321 93639 90195 -479797
41919 -479797 -1571100 -2579297 -2973785 -2872209 -2658136 -2326347 -1694723 -1050087 -924788
41910 -924788 -1205654 -1120083 -335088 499670 661444 322602 127070 163344 -13981 -460448
41900 -460448 -594121 -45252 729553 1015113 743511 439188 348867 75503 -713103 -1522676
41890 -1522676 -1423872 -235407 1054662 1276194 299154 -934725 -1462586 -1175564 -734380
41881 -734380 -797292 -1315523 -1578098 -1094376 -334495 -156375 -480699 -262760 848223 1641064
41871 1641064 952571 -469529 -831377 270008 1495559 1832666 1733679 1891246 2105588
41862 2105588 1990434 1833234 2034730 2434206 2819966 3377183 3997505 3938473 2954389 2030430
41852 2030430 2075951 2513033 2168656 1053722 157694 -156079 -377192 -642741 -486753
41843 -486753 127078 561672 521385 470310 798815 1273831 1527977 1494945 1215714 768894
41833 768894 474893 626600 988747 1090503 939249 855711 778532 496076 401967 1053292
41823 1053292 1981996 2005463 920512 -129693 -283043 43670 168812 129441 83896 -308200
41813 -308200 -1158398 -1766102 -1550708 -975993 -827332 -1116173 -1398958 -1625284 -1887814 -1804243
41803 -1804243 -993419 131405 784210 770446 419920 -68322 -535164 -551013 -42189 130870
41793 130870 -790460 -2045370 -2053637 -583091 833736 928565 200011 -96531 301567 603167
41783 603167 234557 -500580 -974417 -1016242 -1016295 -1346049 -1748085 -1480250 -259286 1118085
41773 1118085 1489544 652819 -400443 -632197 23546 890263 1415484 1556086 1523825
41764 1523825 1437346 1232229 808309 215700 -359750 -788393 -1017585 -872165 -140792 937672
41754 937672 1607871 1400800 767763 465382 501224 257012 -409864 -851872 -589380 -11850
41744 -11850 215200 46187 -43455 148447 232345 -274536 -1290668 -2068499 -1817538 -535555
41734 -535555 869335 1465748 1191374 612790 13316 -736609 -1418286 -1296539 -121397
41725 -121397 1187523 1443001 609397 -182019 -18151 817274 1333963 969367 69751
41716 69751 -544569 -314470 628835 1586079 1873251 1413367 756855 457657 486141 372358
41706 372358 -131007 -744199 -1061317 -1016861 -794032 -479192 -77291 243402 232528 -117240
41696 -117240 -558260 -875781 -974701 -789986 -435652 -344128 -818213 -1456385 -1509148 -867168
41686 -867168 -187296 59602 89207 182787 216409 128971 225607 580760 720337 383502
41676 383502 36932 117579 388933 666662 1464746 3020344 4283121 4013026 2557010
41667 2557010 1388906 1063452 810362 128957 -461368 -492432 -252242 -67903 134734
41658 134734 195066 -378779 -1403126 -1836756 -1179348 -241514 92667 111030 564312 1343353
41648 1343353 1674976 1266090 553164 38127 -88749 141355 523186 784605 863988 848167
41638 848167 612858 22323 -485762 -260424 433001 512665 -328660 -1055973 -852999 -310306
41628 -310306 -316542 -645660 -576799 -193421 -53674 -148380 -190677 -402397 -959402 -1161511
41618 -1161511 -315634 951501 1474407 1322111 1492415 2042318 1957015 950216 846
41609 846 -205862 -135278 -318271 -554292 -665201 -984860 -1534506 -1637973 -959266 -128614
41599 -128614 231477 368746 748806 1252681 1578039 1775191 1857779 1563797 1040984 1022743
41589 1022743 1666338 1953655 1056884 -329395 -924244 -627517 -385053 -651075 -1017184
41580 -1017184 -1210192 -1420385 -1567184 -1189372 -349874 117368 -318730 -1099136 -1302504
41571 -1302504 -819598 -357646 -416383 -685070 -581580 -126607 66885 -287811 -672613 -596333
41561 -596333 -552499 -1382438 -2721406 -3051541 -1721121 -33389 413025 -231334 -651718
41552 -651718 -500137 -684992 -1564477 -2144454 -1602371 -664835 -646554 -1588950 -2178564 -1437599
41542 -1437599 157550 1391004 1665688 1335568 964057 734350 648779 833666 1246966
41533 1246966 1344961 608592 -600975 -1275438 -990592 -360053 -49593 23651 104380 -115980
41523 -115980 -927464 -1807929 -2065796 -1993713 -2428590 -3228087 -3207194 -1848262 -183524 505898
41513 505898 205202 -163052 -70346 234387 365836 210523 -212044 -793880 -1214353 -1131343
41503 -1131343 -568599 105051 585375 821786 842751 680937 539068 746719 1334597 1812452
41493 1812452 1665092 1057329 725176 1023052 1397175 1143222 454987 190180 626711
41484 626711 1082856 993817 750567 999383 1577007 1761648 1309924 601101 -103231 -867735
41474 -867735 -1549162 -1719031 -1313180 -851148 -771125 -922918 -920907 -669628 -347550 -146980
41464 -146980 -195774 -505897 -888367 -1133792 -1310304 -1615779 -1943670 -1964555 -1682532 -1487508
41454 -1487508 -1527744 -1461975 -1053983 -613126 -517852 -585224 -296137 440237 1036626 807897
41444 807897 -256153 -1329219 -1468451 -574768 542354 1175938 1447925 1727692 1811588
41435 1811588 1348798 748797 763876 1250404 1300901 699912 251678 406388 597227 388217
41425 388217 240586 482367 518830 -36933 -328405 524411 1808744 2071367 1229777 583815
41415 583815 849428 1397925 1549854 1494714 1595199 1683957 1472864 1015035 446444 -177993
41405 -177993 -591552 -452083 35350 245257 87411 176987 767608 1210009 936891 397880
41395 397880 409338 947208 1213604 772958 113222 27506 709235 1518568 1572527 612582
41385 612582 -717819 -1568282 -1752991 -1691146 -1626270 -1360631 -790188 -218077 48345 47491
41375 47491 -59164 -221270 -330136 -124207 512567 1325762 1865793 1775126 1010946 41176
41365 41176 -367444 23693 488650 252070 -378817 -528605 -226793 -363313 -1099094 -1475921
41355 -1475921 -1029499 -662287 -1170877 -1872544 -1680871 -840100 -485431 -890077 -1233116
41346 -1233116 -955839 -406979 -148363 -364991 -940170 -1479917 -1365206 -422689 588506
41337 588506 825404 530245 589557 1057225 1034957 128334 -851647 -947683 -153221 845449
41327 845449 1462675 1467747 935480 232352 -278968 -633560 -1017231 -1201662 -805050 -100533
41317 -100533 166506 -99608 -187811 189740 345448 -216390 -840345 -626396 262804 971388
41307 971388 1228564 1415301 1550933 1112501 2250 -1027903 -1267602 -921924 -733542
41298 -733542 -1001174 -1353448 -1403413 -1235539 -1100832 -919280 -441755 162081 326922 -113163
41288 -113163 -552303 -387769 148387 383901 174095 -76468 -166967 -211706 -81081 519109
41278 519109 1330639 1650774 1350228 1069422 1157483 1171203 786111 438491 556926 853092
41268 853092 952249 1053881 1294689 1123916 168906 -808823 -789096 27283 590106 601792
41258 601792 713607 1219862 1634025 1686256 1730125 1864116 1557849 595837 -342089 -545021
41248 -545021 -167118 178804 238292 106591 -147879 -401070 -368881 -5702 291279 259740
41238 259740 266238 815992 1782170 2501607 2494007 1809994 871538 255955 392172 1089077
41228 1089077 1520214 1047321 -33319 -869614 -1043419 -846188 -712119 -811070 -1161481
41219 -1161481 -1674510 -1990939 -1709606 -982408 -509700 -649464 -843710 -354370 611168
41210 611168 1054409 527778 -220594 -263448 267309 478856 16560 -601280 -956129 -1290856
41200 -1290856 -1763914 -1807425 -883696 492409 1238022 1100482 854813 1050528 1277984
41191 1277984 964324 296569 -116630 -124478 -67625 -117251 -61335 255870 655098 876786
41181 876786 865767 685306 337144 -144373 -502714 -424154 -4838 167640 -304889 -968622
41171 -968622 -971474 -256432 231302 -136397 -663172 -269225 880278 1502702 934609 -84360
41161 -84360 -614906 -760871 -1183708 -1868258 -2063295 -1380772 -427652 -139326 -676820 -1223094
41151 -1223094 -979323 -217482 32683 -576124 -1152494 -895668 -394116 -726390 -1620102
41142 -1620102 -1685622 -540518 532448 464866 -208758 -520295 -573752 -916331 -1236402 -875988
41132 -875988 -158815 -10612 -465959 -659911 -251783 178004 209918 78441 -85570 -557878
41122 -557878 -1240120 -1414624 -741856 140005 473948 319683 193756 252871 334568 453790
41112 453790 719755 924079 678434 -36778 -749995 -968745 -652696 -215198 -74361 -181491
41102 -181491 -108895 280201 494949 88982 -544045 -598178 -46413 226798 -331904 -1147731
41092 -1147731 -1308861 -703903 57907 546086 851289 1165593 1466727 1693158 1977752
41083 1977752 2541646 3334445 3826684 3362753 1924357 376585 -400889 -542376 -914584
41074 -914584 -1821651 -2550219 -2379630 -1504064 -621359 -60331 256982 340231 136305 -150431
41064 -150431 -201075 -11624 145834 145746 96806 26183 -246333 -842316 -1563161 -1948758 -1619001
41053 -1619001 -671374 256681 523782 152785 -235999 -200038 116672 451068 890681 1560200
41043 1560200 2141916 2153690 1621959 1104443 1004343 1112363 907553 184692 -677555 -1051933
41033 -1051933 -672418 121673 790818 1105329 1098308 748095 111358 -362326 -207934 318145
41023 318145 442935 -53835 -564170 -626902 -500308 -450752 -227770 220366 247888 -494868
41013 -494868 -1157053 -714955 471380 1108002 756013 182938 43862 263739 756839
41004 756839 1615782 2307490 1823666 219043 -958617 -542440 689823 1156980 559645
40995 559645 -148634 -436543 -677135 -1003808 -836355 66377 943986 1005367 499348 204838
40985 204838 240776 76003 -437400 -773049 -595446 -287704 -280985 -333047 37882 682278
40975 682278 939271 543762 -112489 -646936 -1078656 -1418350 -1411305 -999112 -593816 -503734
40965 -503734 -449341 -88791 291577 147502 -449890 -865042 -758587 -388166 -57265 237042
40955 237042 523653 655190 519931 149556 -428329 -1128762 -1614007 -1554020 -1101940 -692423
40945 -692423 -358683 220334 902898 978428 245124 -367454 161099 1568028 2561767 2369069
40935 2369069 1516090 1001515 1117675 1326344 1092732 561628 347471 760179 1385019
40926 1385019 1516926 956264 257277 181496 961371 2051532 2537652 1902167 523386
40917 523386 -673060 -1167347 -1283088 -1540495 -1885919 -1908087 -1543300 -1067027 -560289 35078
40907 35078 427701 231128 -236587 -132573 698878 1367806 1149027 452436 140231 398624
40897 398624 816705 1170886 1535235 1844190 1864505 1493451 775662 -140620 -805758 -667286
40887 -667286 88492 352445 -610731 -2030547 -2537454 -1956758 -1342970 -1311720 -1309859 -765382
40877 -765382 -54802 185175 44823 18937 136157 66498 -129504 -1077 556219 1088037
40867 1088037 1204779 995811 659841 117921 -670267 -1248703 -1008839 -63525 616314
40858 616314 231016 -861276 -1511362 -1093812 -147645 341901 -9246 -806011 -1460512
40849 -1460512 -1664004 -1403078 -842684 -284564 -55042 -251390 -576935 -543501 9957 606349
40839 606349 564986 -129453 -650343 -283253 685198 1414882 1623077 1694735 1802154 1627130
40829 1627130 1074580 555481 270409 -150705 -915220 -1573772 -1727312 -1671429 -1772662 -1699412
40819 -1699412 -944897 248266 1168410 1560927 1612505 1288863 450624 -520530 -990838
40810 -990838 -958310 -973538 -1174353 -1111338 -627795 -224270 -342137 -850271 -1431056 -1939412
40800 -1939412 -2177537 -1849330 -1041852 -351234 -232591 -485479 -566309 -185165 479789 905802
40790 905802 567000 -524266 -1634716 -2018949 -1761004 -1521135 -1559521 -1541582 -1256987 -903328
40780 -903328 -580205 -115612 445784 744433 690771 652287 880411 1201910 1393491 1399997
40770 1399997 1136727 610077 242457 441372 833578 666184 -5656 -405542 -371858 -524927
40760 -524927 -861683 -454899 857143 1740252 1242954 313875 313890 939636 957869 301212
40750 301212 -77272 -61939 -526377 -1628360 -2363978 -2091400 -1344446 -787825 -350519 216981
40740 216981 762593 1097391 1246532 1050336 224843 -887149 -1352521 -811533 36031
40731 36031 470522 630789 935720 1278199 1363805 1346877 1504303 1621238 1312130 734893
40721 734893 400903 364906 142814 -511232 -1182274 -1325447 -947923 -520930 -304684 -33477
40711 -33477 583743 1247615 1338641 844209 542825 962706 1583267 1570099 980644 600095
40701 600095 765053 1076877 1244437 1427093 1600430 1367035 748774 498784 1125021 2069089
40691 2069089 2367566 1822837 1056061 615475 486105 427527 441273 770953 1484270 2142809
40681 2142809 2141953 1550681 1242848 1739662 2304304 1952097 1091679 1082574 2133095 2893568
40671 2893568 2534938 1927876 1956295 1887406 681758 -960696 -1419470 -625907 -153935
40662 -153935 -829325 -1697995 -1697534 -1065980 -509973 -43517 576891 1054984 1037205 875815
40652 875815 1109672 1513479 1409320 729876 71768 -227702 -398058 -588360 -565356 -267498
40642 -267498 -105721 -349331 -608309 -374729 164939 371495 128453 10916 336052 590968
40632 590968 206876 -486136 -640752 -50919 668422 1012922 1035144 746467 -168469 -1593651
40622 -1593651 -2532857 -2071046 -496802 1077874 1957240 2171638 1845383 1028390 135674
40613 135674 -189593 135557 504787 461888 200496 48490 -76662 -434614 -1034715 -1665208
40603 -1665208 -2065308 -1952049 -1240845 -371650 -9928 -259604 -586005 -640925 -600340 -473015
40593 -473015 178628 1303959 1857435 1066225 -251338 -610082 120253 681849 448619
40584 448619 324650 1172230 2335055 2538554 1653515 682550 314681 374295 599356 1051764
40574 1051764 1547507 1477671 678090 -62076 59356 730415 954675 453792 -48285 -34678
40564 -34678 10968 -549483 -1367758 -1485696 -707482 78680 85853 -428879 -708779 -521877
40554 -521877 -187718 94062 357761 437981 53697 -579093 -800791 -431474 -133842 -461959
40544 -461959 -964660 -771391 173772 1045382 1217191 845016 360177 -28026 -161684 170089
40534 170089 827867 1228023 1033000 629981 547420 678935 543661 132855 -20709 386586
40524 386586 1023180 1377902 1307954 1031495 800715 676286 515888 203408 -45383 187425
40514 187425 885361 1378134 1155223 658863 711528 1284643 1518561 1011036 346068 93201
40504 93201 5327 -324117 -627237 -444071 -33817 -66478 -571719 -903800 -781689 -726308
40494 -726308 -1231892 -1947533 -2018328 -1070815 366331 1381230 1523657 1147772 939035
40485 939035 1148837 1419080 1354635 1023718 756625 663529 549950 171398 -560090 -1431121
40475 -1431121 -1877503 -1398461 -261198 525561 283053 -551044 -1059310 -974170 -713615
40466 -713615 -563047 -438435 -362829 -539807 -892537 -1081626 -1078428 -1193521 -1410073 -1259775
40456 -1259775 -628935 -171969 -500774 -1285759 -1605300 -1068775 -262424 -87085 -818045
40447 -818045 -1820271 -2180482 -1694117 -1124916 -1260871 -1841248 -1845895 -855604 397900 1030564
40437 1030564 1044171 992046 1012563 738860 30137 -710194 -1012026 -814223 -385299 -11560
40427 -11560 130737 -25767 -399279 -760796 -919272 -959008 -1184904 -1690358 -2058661 -1774287
40417 -1774287 -979015 -457356 -655630 -1086974 -1077546 -735369 -606093 -632479 -234579 575857
40407 575857 969071 451807 -406872 -776385 -579297 -315673 -291570 -414447 -438331 -96746
40397 -96746 696277 1526981 1743413 1291858 840877 771323 598773 -120869 -849804 -711115
40387 -711115 271921 1269801 1747354 1787053 1487910 802108 -2936 -398652 -282700 -125358
40377 -125358 -295212 -647156 -876231 -894254 -752108 -512304 -260369 42457 688133 1841089
40367 1841089 3035136 3450558 2773980 1489594 317357 -328844 -395041 -130105 -5676
40358 -5676 -311776 -801023 -1062384 -1149554 -1363186 -1503212 -1012583 15391 660477 324155
40348 324155 -510964 -1049475 -1189371 -1264610 -1213887 -674618 224981 781710 571616 50037
40338 50037 107307 1099533 2368167 2761919 1778535 200014 -632678 -238618 599346 974619
40328 974619 1007653 1489029 2623117 3633909 3665391 2716227 1539279 831839 690770
40319 690770 768791 795348 863329 1207144 1780926 2188583 2082155 1551373 1053744 993208
40309 993208 1392363 1920779 2187496 2010151 1441508 634231 -186682 -649733 -400430 483024
40299 483024 1398646 1758013 1530741 1109995 802286 660068 630613 568355 238366 -367144
40289 -367144 -839004 -821490 -530142 -393098 -339218 32 450567 350736 -388992 -918092
40279 -918092 -479115 643353 1527347 1594395 925993 14253 -487883 -158076 686051 1181914
40269 1181914 949161 584531 790445 1385912 1629272 1217243 484314 -141936 -402200
40260 -402200 -162976 354146 501347 -43567 -591141 -178958 1015144 1726005 1249061
40251 1249061 345329 133874 681750 1253850 1528166 1809343 2145983 2027272 1236947
40242 1236947 433121 384965 939866 1295154 1169722 1098325 1478392 1945424 2015598 1819313
40232 1819313 1714610 1602556 1253903 1023855 1513902 2644736 3795141 4809113 6055444
40223 6055444 7421773 8154319 7985645 7553854 7255278 6520714 4882794 3056237 2150712
40214 2150712 2274809 2672245 2851086 2831472 2630649 2311814 2293974 2805160 3211639 2714660
40204 2714660 1602374 962183 1165386 1489523 1332389 954522 796797 841713 978531
40195 978531 1321913 1775100 1850068 1357953 838732 898905 1479289 2142795 2753757 3471398
40185 3471398 4289100 4943400 5184649 4926771 4249333 3398672 2653195 2097937 1684695
40176 1684695 1515898 1782192 2346455 2714765 2606531 2333987 2444535 3125527 4051337
40167 4051337 4682439 4686423 4223720 3827939 3867951 4191182 4429544 4454662 4285916 3838908
40157 3838908 3194756 2847614 3092705 3376734 3023972 2546748 3294117 5536427 7797971
40148 7797971 8647684 8452159 8627158 9630108 10579141 10779070 10810896 11772264 13850756
40139 13850756 16084414 17516684 18295315 19439736 21672522 24821699 28397218 32324050
40131 32324050 36882577 42323774 48875382 56833275 66467875 78364899 94078524 115684013
40123 115684013 144445016 181146803 227874360 286127253 349565281 400106134 416920381
40116 416920381 392739125 340077410 280176663 227463511 185156060 151513949 125282670
40109 125282670 105461271 90128172 77618247 67511264 59630747 53178368 47358648
40102 47358648 41915191 36772254 31997182 28141600 25629922 23794037 21524354 18829660
40094 18829660 16644854 15169915 13702903 12179088 11417030 11475937 11156262 9728444 7989887
40085 7989887 6989006 6762099 6933962 7472273 8087091 7874951 6460469 4754276 3774029
40076 3774029 3370956 2848895 2149769 1626852 1266024 965654 1049713 1650405 2037684 1454171
40066 1454171 323207 -200158 288587 1111850 1527707 1457683 1257095 1231534 1351083 1214141
40056 1214141 505705 -382575 -646728 -176860 245421 144942 -5338 217979 406288
40047 406288 195954 59870 346376 371436 -388341 -916474 92182 1984175 2700472
40038 2700472 1581003 160640 -105820 436587 732234 655553 743278 1041086 1070990 635027
40028 635027 63356 -210094 -22713 435857 817564 1050142 1473213 2247939 2883025 2881154
40018 2881154 2629503 2947042 3904523 4898980 5748599 6675147 7194541 6314623 4259655
40009 4259655 2762479 2871022 3481456 3005286 1665223 985885 1530458 2377679 2687869
40000 2687869 2648254 2709510 2786236 2550860 1942975 1099309 169263 -600344 -898494 -629602
39990 -629602 -797 672099 1099855 1112170 884515 931979 1553611 2377026 2753016 2494745
39980 2494745 1954801 1568885 1682193 2590312 4222620 5884296 6870844 7358928 8169131
39971 8169131 9569824 10814830 11002589 9947924 8083356 6007867 4367531 3677986
39963 3677986 3842220 4115063 3882136 3266553 2730701 2400065 2144631 2046019 2278277 2619079
39953 2619079 2577385 2083079 1653579 1709087 2006518 1964977 1389173 663502 284618 358473
39943 358473 582698 647905 576512 593900 676694 421843 -425503 -1400349 -1609307 -733736
39933 -733736 510617 1167595 1140702 1175479 1780706 2562180 2812787 2452159 2020756 1853920
39923 1853920 1674140 1129773 434817 178332 557872 1053886 978092 253564 -479674 -558509
39913 -558509 -6150 529397 473170 -188246 -1058872 -1684606 -1669425 -828017 422430 1100450
39903 1100450 632890 -283643 -392329 464310 1051288 416370 -791267 -1259064 -769350
39894 -769350 -219320 -125802 -43180 400136 741753 419243 -299259 -666657 -448195 -85154
39884 -85154 -10699 -185015 -263673 14131 539499 807289 376290 -486135 -923362 -520329
39874 -520329 124635 242872 -65644 -229931 -327283 -921920 -1795091 -1845284 -674569 579906
39864 579906 704008 85723 68033 977114 1779437 1685402 1143469 940486 1088236 1119424
39854 1119424 977659 1020580 1361893 1691403 1685365 1302746 757271 385473 384610 527660
39844 527660 396712 75317 214869 1082435 1982034 2153161 1860243 1876047 2160522 1967574
39834 1967574 1217920 732038 834782 743184 -96726 -952479 -889328 -238165 -27335 -391308
39824 -391308 -578895 -333565 -197457 -408438 -505787 -253788 -33397 30488 449578 1365325
39814 1365325 1947086 1490707 533314 115800 352505 515566 255221 -87049 -266358
39805 -266358 -419986 -498229 -151475 569823 967821 467094 -709031 -1825831 -2302731
39796 -2302731 -1989296 -1135600 -244450 329549 723660 1239647 1719862 1715526 1312032 1200104
39786 1200104 1710226 2324503 2440834 2085737 1521600 746594 -88401 -339326 299633
39777 299633 1002338 706431 -350532 -844852 -148131 906654 1221606 679604 -98414
39768 -98414 -620339 -757054 -586276 -415392 -629013 -1175475 -1496600 -1250661 -787716 -608992
39758 -608992 -681875 -639777 -363898 21686 475041 929618 1066010 653574 9719 -327954
39748 -327954 -337607 -482837 -928436 -1218482 -879731 -29639 793631 1201443 1199837 998521
39738 998521 715494 253010 -542358 -1562811 -2362884 -2527453 -2080970 -1417668 -871009
39729 -871009 -474424 -107210 257723 466502 306105 -231506 -789625 -883985 -370905 426737
39719 426737 1071200 1311268 1055927 376976 -361499 -721726 -712083 -760101 -1015331 -1118469
39709 -1118469 -905719 -802997 -1080910 -1227935 -667271 308542 986533 1256068 1428622
39700 1428622 1363906 705014 -166477 -412493 -16925 187811 -89173 -184671 246233 550813
39690 550813 183551 -376585 -443772 -167096 -117498 -401931 -774062 -1099244 -1169993 -623608
39680 -623608 387455 1030380 910187 725158 1093542 1402380 775489 -347302 -714141
39671 -714141 -62531 681309 885787 821403 742896 384016 -393589 -1240122 -1825957 -2073847
39661 -2073847 -1813255 -898282 258328 970187 1152438 1216700 1147283 575518 -196583 -300994
39651 -300994 327020 731959 459170 218770 491015 560223 -235975 -1201702 -1221279 -361976
39641 -361976 440692 812380 1084084 1351624 1325666 931954 296009 -626714 -1679050 -2119957
39631 -2119957 -1497102 -598520 -525741 -1009458 -776597 409455 1288715 972338 141013
39622 141013 -162873 8233 -15762 -270198 -179294 511322 1446214 2095353 2062894 1231220
39612 1231220 -15320 -961581 -1275108 -1266865 -1199533 -802339 108207 986844 1134530 620318
39602 620318 39543 -405429 -934142 -1445556 -1462602 -882212 -186113 217510 348123 236279
39592 236279 -286990 -1119682 -1662362 -1424410 -613882 121087 322798 -69619 -848102 -1602662
39582 -1602662 -1863043 -1453106 -652866 83596 445211 312116 -194377 -616851 -490088
39573 -490088 43487 314424 47332 -243088 -130346 -50772 -589915 -1353204 -1346399 -402041
39563 -402041 555611 783067 546481 445301 563197 677213 795154 1018535 1198692 1126284
39553 1126284 823127 380832 -155038 -468345 -16575 1117812 1827345 1116921 -518894
39544 -518894 -1529752 -1144016 -186258 65581 -660785 -1547069 -1701223 -977388 61220
39535 61220 777536 1014368 996847 771320 83680 -1009277 -1823157 -1797091 -1302351 -1165680
39525 -1165680 -1535647 -1786615 -1471299 -784500 -116300 226009 -151585 -1429282 -2918966
39516 -2918966 -3445018 -2736819 -1833764 -1711291 -2069725 -1950749 -1054766 89867 886110
39507 886110 1073975 690238 126141 -22937 386844 780206 637328 214942 52039 126136
39497 126136 80369 -15815 181149 545825 598791 328056 223915 428894 479946 73940
39487 73940 -432752 -533939 -215575 123952 148325 -141781 -418820 -306004 162725 461634
39477 461634 203389 -335038 -669318 -841454 -1160567 -1416062 -1098566 -433576 -398922 -1411040
39467 -1411040 -2627951 -2967533 -2351400 -1524638 -1009738 -684296 -202295 511849 1115813
39458 1115813 1083789 296521 -548795 -486291 593170 1730549 2030052 1636577 1308451
39449 1308451 1364778 1431849 1033731 119472 -873520 -1301593 -857687 17632 523049 421977
39439 421977 225747 294157 264023 -248759 -871344 -1000696 -798760 -955892 -1534389 -1743299
39429 -1743299 -1049846 2980 415322 -93717 -831182 -995286 -592489 -376692 -881652
39420 -881652 -1702448 -1992477 -1582471 -1156955 -1198147 -1267791 -714567 304428 1025936 1076789
39410 1076789 748319 405202 145585 22229 97992 193986 -26436 -620814 -1296080 -1784312
39400 -1784312 -2004374 -1914911 -1587934 -1385170 -1596505 -1859476 -1432062 -194108 1072412
39391 1072412 1596513 1387161 884739 341782 -77811 -38271 549089 1065494 747308 -287683
39381 -287683 -1071211 -932849 -189343 464838 824634 1104119 1310584 1189385 776120 550444
39371 550444 828300 1279796 1331585 898466 417269 223632 228374 247967 315464 497207
39361 497207 654594 593174 280097 -225045 -819536 -1164625 -782156 271549 1067459 671094
39351 671094 -665931 -1668184 -1500140 -646541 -154017 -399237 -929822 -1235846 -1235826 -1055899
39341 -1055899 -740166 -351758 -147690 -411775 -1104556 -1811335 -2105368 -1902965 -1400987
39332 -1400987 -755693 14718 825803 1427308 1595638 1307636 690782 -33392 -526483
39323 -526483 -499671 -24579 517453 865244 996156 796997 105391 -714188 -828271 -43016
39313 -43016 669182 402469 -379883 -609730 -306282 -397910 -960553 -940154 33687 816455
39303 816455 462126 -262952 -64815 937298 1587598 1514735 1326473 1173566 432499 -963118
39293 -963118 -2038428 -2126258 -1768522 -1636706 -1369548 -374702 767848 822346 -264502
39284 -264502 -1099557 -726344 90470 56903 -786805 -1225384 -661749 125713 163494 -527840
39274 -527840 -1315336 -1936945 -2519933 -2973050 -3020622 -2731362 -2442041 -2199957 -1829118 -1513007
39264 -1513007 -1652521 -2026519 -1784280 -601502 722991 1226209 869601 267960 -193608
39255 -193608 -467452 -487590 -316911 -367314 -859599 -1275877 -981807 -236002 109007 -144862
39245 -144862 -319687 28918 500574 593255 420888 319080 248829 50242 -68020 210284
39235 210284 712748 846391 245306 -859130 -1834651 -2059816 -1309709 -3772 961234
39226 961234 855784 -274588 -1611018 -2170565 -1558234 -319686 484767 272676 -481550
39217 -481550 -822155 -373325 443739 1122124 1526740 1620706 1289073 680553 284739 355665
39207 355665 594116 670970 686427 782047 710695 268517 -169972 -115386 231599 229673 -215704
39196 -215704 -488068 -136854 580016 1148875 1380304 1399810 1403616 1545810 1779575 1761037
39186 1761037 1245605 606978 527431 1054641 1430547 1081956 336993 -161236 -336910 -527703
39176 -527703 -756541 -725096 -461968 -452177 -976113 -1637891 -1736552 -990193 176123 993751
39166 993751 1016780 502634 96492 129250 383243 569992 706139 806656 570569 -181476
39156 -181476 -954298 -985280 -189695 748671 1236178 1244518 891505 148480 -757813 -1181326
39146 -1181326 -781186 -124693 -84490 -751045 -1353684 -1233498 -552092 7872 -36 -393856
39136 -393856 -586666 -163618 720199 1553529 2033879 2217404 2147097 1751460 1258810 1203165
39126 1203165 1634141 1773701 1005753 -156307 -739321 -625104 -383493 -38572 911033
39117 911033 2172395 2567264 1738418 854214 856449 986029 113362 -1241095 -1601902 -889727
39107 -889727 -546558 -1178348 -1538359 -476404 1272754 2164057 1899249 1373868 1059986
39098 1059986 586394 -135582 -437579 96602 864069 974295 335139 -449382 -988186
39089 -988186 -1380009 -1628817 -1326729 -225937 1129854 1750882 1226917 154604 -547431
39080 -547431 -510105 36782 765931 1415613 1620135 1123332 286819 -68577 391050 1039385
39070 1039385 1076495 540385 152618 300034 609135 575163 248031 100838 384608 786810
39060 786810 728768 -11590 -968860 -1389348 -1070393 -677373 -1007600 -1988062 -2665793 -2256091
39050 -2256091 -990390 186789 595827 335535 -77918 -344573 -539837 -758915 -863695
39041 -863695 -749038 -704019 -1167257 -2062018 -2710256 -2620485 -2096289 -1786188 -1871775 -2069769
39031 -2069769 -2227149 -2390012 -2329025 -1597448 -271702 831442 1006111 452667 -44536
39022 -44536 -8352 399903 723997 636131 179097 -217852 -142502 238067 310035 -80138
39012 -80138 -238944 439362 1460188 1711856 840589 -395920 -1113012 -1108532 -674256 -180159
39002 -180159 -17747 -441269 -1181870 -1593911 -1433732 -1148107 -1158591 -1247477 -983545 -432923
38992 -432923 -60079 -129516 -532115 -1011027 -1260938 -1018550 -377226 182064 362834 398664
38982 398664 511777 403729 -192685 -782168 -639826 70142 472435 269084 39266 113524
38972 113524 22829 -539725 -1016107 -860641 -477495 -514291 -676031 -138308 1043937 1845979
38962 1845979 1679926 1112212 905695 972904 701757 -67908 -829888 -1024951 -595014 -6700
38952 -6700 150180 -289840 -860210 -971780 -627441 -343601 -371675 -486798 -712462 -1607583
38942 -1607583 -3265790 -4508573 -3970104 -1954568 -361643 -489718 -1612311 -2156793 -1649575
38933 -1649575 -819498 -240718 198537 556759 517860 118507 54111 724415 1450719 1250619
38923 1250619 156902 -802428 -869625 -320229 68603 -80555 -488788 -628731 -303044
38914 -303044 102524 43212 -409653 -505121 185062 1018883 1042171 288087 -311656 -264610
38904 -264610 -70623 -283319 -664596 -615479 -1223 785733 1266427 1143737 444067 -421317
38894 -421317 -1035803 -1494595 -2131797 -2701523 -2461583 -1291163 -74786 382941 234514
38885 234514 15397 -158496 -343707 -368758 -271810 -548222 -1326271 -1877269 -1635990 -1102114
38875 -1102114 -936049 -797397 -69400 812286 897472 205979 -476802 -946198 -1480548 -1703245
38865 -1703245 -970382 214615 656234 352543 375730 786401 469707 -562018 -683577
38856 -683577 656682 1673451 988298 -48997 501983 2034624 2398636 1222306 165786
38847 165786 193817 553942 526627 441784 595735 594867 263082 69556 201692 171181 -254284
38836 -254284 -586538 -458576 -152146 61012 375361 901206 1311954 1364717 1204565 934932
38826 934932 493005 122880 269685 753543 754770 -57839 -1038727 -1523210 -1601548 -1563460
38816 -1563460 -1259546 -546602 162725 348667 34512 -399245 -667228 -523442 250972
38807 250972 1357241 1905689 1341712 163667 -684518 -847380 -630580 -385591 -243325
38798 -243325 -189692 -18838 543693 1340771 1706059 1255167 471928 133918 433651 1040011
38788 1040011 1701360 2305125 2589918 2335357 1734839 1147435 587521 -137602 -915865
38779 -915865 -1406760 -1560123 -1613539 -1585029 -1220455 -549167 -104581 -352720 -1074471 -1525545
38769 -1525545 -1222050 -502009 -225899 -844107 -1842260 -2283217 -1814071 -861978 63776
38760 63776 778814 1087625 668351 -343536 -1128173 -1029433 -372485 -25609 -362767 -1027216
38750 -1027216 -1495877 -1490450 -1038948 -537685 -568582 -1215036 -1677957 -1019741 708717 2403034
38740 2403034 2963624 2227676 984338 299070 658890 1521293 1839120 1207168 250623
38731 250623 -279942 -370330 -373745 -267819 161354 735504 1102517 1312996 1593732 1770779
38721 1770779 1547751 1154146 1018557 953397 443092 -323190 -556825 -92510 331744 231571
38711 231571 16125 139407 345466 220725 -87045 -197621 -100550 21045 183212 391423
38701 391423 386357 39986 -253517 15345 847910 1805352 2500736 2802044 2795038 2753775
38691 2753775 2880704 2922538 2411082 1449830 771594 747956 900615 786523 734089 1076430
38681 1076430 1249581 572685 -402191 -356496 987107 2474748 3093554 3013570 2728872
38672 2728872 2086422 864847 -312638 -522121 207252 901859 879988 400328 37040
38663 37040 -51472 -53603 -114600 -244603 -349440 -193117 396933 1115813 1271866 558315
38653 558315 -491630 -1100647 -1087491 -797251 -435063 44622 494593 609998 516154 795212
38643 795212 1692610 2727386 3339708 3483746 3269990 2533173 1297084 275050 186040
38634 186040 704940 791921 97516 -608614 -552884 115747 796306 1294004 1773247 2202594
38624 2202594 2323976 2040561 1478573 757724 11349 -457625 -421429 -178581 -398551 -1285712
38614 -1285712 -2123815 -2000143 -950647 -11631 10335 -552221 -868327 -790002 -783842 -868343
38604 -868343 -473261 456907 1072074 821347 340613 484864 1061005 1287507 1027715 702494
38594 702494 366519 -179015 -655483 -715653 -836953 -1640087 -2463955 -1993416 -411558 561587
38584 561587 184658 -264824 307109 1045994 714530 -214371 -468332 -132008 -342491 -1274142
38574 -1274142 -1902679 -1634281 -879278 -42833 842977 1413449 1069877 31881 -696608
38565 -696608 -680163 -479253 -483273 -264753 482656 1207119 1261462 774707 225016 -326659
38555 -326659 -1005171 -1516999 -1385820 -659588 52762 243059 -11224 -194059 91519 659401
38545 659401 921772 694147 596487 1265963 2357062 2886228 2518242 1882349 1540302 1303581
38535 1303581 803900 143492 -354221 -565788 -423548 203604 1133480 1747139 1601622
38526 1601622 910204 184260 -292642 -442985 -241988 154516 483610 793223 1371922
38517 1371922 2040544 2056604 1127417 23164 -351752 -130623 -175040 -872312 -1792782 -2342991
38507 -2342991 -2236203 -1485424 -453606 222360 274513 255637 822926 1690873 1923316 1253396
38497 1253396 425694 70642 -79239 -484873 -878809 -615733 330637 1277581 1684586
38488 1684586 1634967 1410978 1018865 402405 -121669 -35121 727850 1559411 1751107 1129278
38478 1129278 6276 -1240537 -2218897 -2347185 -1218722 663027 1971110 1787133 562527
38469 562527 -470959 -681329 -460002 -392841 -527297 -631306 -760849 -1144143 -1598957 -1513432
38459 -1513432 -648886 276352 225709 -875542 -1909138 -1896526 -1212908 -954678 -1290348
38450 -1290348 -1199377 -50306 1291289 1519476 638763 -65959 259305 1028813 1130492
38441 1130492 346210 -549871 -874416 -742439 -645873 -735640 -824310 -872893 -1012416 -1077948
38431 -1077948 -643099 240712 830044 647060 232674 361452 869920 1039426 890179
38422 890179 1108261 1717831 1955055 1709211 1882379 2722058 2956766 1559316 -543295
38413 -543295 -1687618 -1722348 -1734741 -1997009 -1703944 -724246 -112478 -469295 -1007373 -838865
38403 -838865 -225099 113260 124465 114211 -73923 -721997 -1408456 -1312142 -308890 806899
38393 806899 1269529 1142745 1070040 1421690 1817337 1551143 513973 -511582 -730934
38384 -730934 -319670 -105165 -409683 -786583 -873649 -808268 -654122 -155937 610432 1034535
38374 1034535 864260 675573 922365 1120306 649952 -136476 -419623 -185752 -123705 -398810
38364 -398810 -414507 128398 721831 834905 582964 319525 70117 -263434 -480719 -245467
38354 -245467 462328 1289067 1837005 1952600 1765622 1480969 1087521 376567 -622680 -1415332
38344 -1415332 -1534778 -1137485 -760125 -564862 -224911 445459 1161892 1544739 1456804 897262
38334 897262 -38327 -947975 -1264242 -849872 -196538 145152 86688 -159966 -426394 -584525
38324 -584525 -540518 -468146 -716820 -1224608 -1398952 -949830 -461311 -609135 -1112431 -1151880
38314 -1151880 -700304 -616214 -1241269 -1697652 -1072735 269208 1213802 1404782 1491957 1946061
38304 1946061 2372591 2235776 1677162 1202000 935693 675934 477249 664966 1269780
38295 1269780 1885502 2200177 2327613 2456789 2463572 2101100 1409035 726074 367342 391927
38285 391927 596868 694519 628845 693447 1075459 1317190 720875 -542604 -1323972 -943965
38275 -943965 -199698 -213206 -719114 -524489 468512 957724 311897 -280704 392510 1543649
38265 1543649 1391387 -239038 -1656970 -1679517 -1005153 -790289 -948688 -696517 -83188
38256 -83188 67473 -443345 -787707 -318179 456120 479103 -558637 -1854850 -2348310 -1769381
38246 -1769381 -846109 -512619 -939890 -1447988 -1397745 -918952 -542280 -382596 -156334 73276
38236 73276 -228815 -1219024 -2177704 -2273455 -1558697 -791611 -430987 -247740 102117 552042
38226 552042 797133 706978 430235 260872 458065 1012766 1547189 1639890 1290965 865329
38216 865329 573198 304659 49485 117391 717648 1601729 2385765 2983048 3414253 3418982
38206 3418982 2670295 1301163 -134854 -1185640 -1683352 -1535325 -791927 74059 452541
38197 452541 314965 232842 507184 728109 476715 12383 -173911 -129888 -209782 -299664
38187 -299664 73597 879189 1461024 1430471 1137653 1033064 1091636 1209117 1644005 2502779
38177 2502779 3139669 2774633 1618087 699556 504420 458535 25419 -351360 50436
38168 50436 1025358 1620279 1363054 663955 6559 -584727 -1081691 -1119906 -600248 -177375
38158 -177375 -542256 -1408145 -1809003 -1390732 -827362 -807719 -1154111 -1289712 -1145094 -1057281
38148 -1057281 -961604 -329913 925076 1985631 1968893 1009813 92950 -134150 60189
38139 60189 202093 409156 1033836 1781322 1847284 1068479 360639 604901 1467650 1840337
38129 1840337 1246335 231155 -579261 -1128069 -1459412 -1282962 -499116 288169 400363
38120 400363 28093 -36110 470003 1004000 1127176 1083052 1224519 1379419 1187644 718401
38110 718401 302761 -14377 -365208 -533267 -108563 749520 1241061 899824 234668 10715
38100 10715 196780 158297 -236053 -358388 159368 757467 737013 278509 64280 136478
38090 136478 -110811 -783252 -1135998 -698571 -56203 33830 -239501 -207014 77133 -49075
38080 -49075 -644974 -924829 -356347 717548 1732238 2450859 2586799 1676780 -84441
38071 -84441 -1471120 -1422471 -338611 414490 85786 -903522 -1748382 -1988941 -1560966 -741774
38061 -741774 -114227 -131672 -648657 -1180434 -1520856 -1736546 -1751283 -1490315 -1333991 -1783737
38051 -1783737 -2609039 -2903971 -2136072 -679860 746070 1662810 1837249 1364234 903748
38042 903748 1173498 1933662 2101198 1205941 109546 -163008 263537 508212 179703
38033 179703 -361878 -677719 -631417 -283098 168214 481087 660850 886043 994055 551238
38023 551238 -292854 -679975 -244066 240884 42475 -406889 -413218 -373900 -1092249 -2181153
38013 -2181153 -2443851 -1702863 -968238 -736964 -407550 365278 991071 1088295 1169579 1557423
38003 1557423 1624718 873266 -85522 -465399 -509315 -856596 -1278680 -1050424 -269181 168278
37993 168278 -156357 -719759 -910308 -710893 -448331 -359629 -501460 -726966 -697048 -177293
37983 -177293 682050 1534086 2174663 2529308 2545135 2345645 2249806 2369728 2436262 2257697
37973 2257697 2007536 1770116 1235619 278019 -581479 -833012 -748102 -884445 -1125043 -914096
37963 -914096 -274136 146046 25609 -253810 -215451 253128 1009716 1696710 1747438 942772
37953 942772 -85495 -509120 -395459 -468978 -839776 -803580 -29412 906370 1454425 1769555
37943 1769555 2089912 2208727 2039796 1988977 2186059 2017304 1116232 216561 179087 645759
37933 645759 640943 213079 348527 1238739 1794741 1281930 443903 317940 682822 585118
37923 585118 -23946 -220605 330408 719010 75414 -1186203 -1961286 -1845409 -1333914
37914 -1333914 -922074 -676666 -606938 -765873 -867055 -421631 493103 1117168 949015 335988
37904 335988 -181344 -606534 -1136193 -1539078 -1447695 -950692 -375019 191699 617019 386203
37894 386203 -668553 -1589222 -1181922 345850 1525088 1478217 757322 177318 -229034
37885 -229034 -679039 -911945 -612376 -4682 516014 904235 1193482 1204259 975873 984813
37875 984813 1429248 1786550 1629970 1374360 1535478 1712769 1156418 79645 -493277
37866 -493277 -145030 486990 757036 741379 717504 605447 303791 97052 312251 835490
37856 835490 1277267 1434803 1376171 1239077 1129507 1078308 967076 652427 277819 266720
37846 266720 818797 1550398 1854875 1564425 1045448 643253 283790 -227376 -714172 -763703
37836 -763703 -351502 18926 -21003 -212252 -136962 96001 78094 -167654 -238518 -81429
37826 -81429 -39422 -77795 347638 1341815 2108476 1914100 1073632 504093 672321 1448572
37816 1448572 2587139 3720350 4151621 3391871 1917773 845744 763588 1250040 1539162
37807 1539162 1288708 696848 215615 196999 588176 991041 1160606 1263182 1461757 1560084
37797 1560084 1373565 1120609 1034080 914370 553535 255447 337396 449544 115709 -338943
37787 -338943 -276943 26678 -298397 -1132026 -1225363 -6858 1480829 1991332 1557203 925737
37777 925737 315169 -430702 -1046163 -1159742 -1090554 -1427057 -1965302 -1934766 -1269864 -795783
37767 -795783 -956409 -1139684 -674451 114437 423790 188930 136328 682511 1376499 1637637
37757 1637637 1582073 1685819 1861674 1462075 328261 -680273 -624893 304779 1005023
37748 1005023 800057 86919 -407770 -506154 -460412 -359847 -80910 331917 643665 810340
37738 810340 1070087 1520120 1818972 1556454 875151 438714 624424 971849 756912 -336
37728 -336 -561263 -549611 -444494 -698792 -916878 -480984 364751 757087 402370 -171802
37718 -171802 -562706 -1000424 -1714278 -2363516 -2423561 -1804421 -869859 -104517 152974 -25188
37708 -25188 -88020 436324 1264376 1657811 1454223 1278494 1555739 1846135 1477941 434525
37698 434525 -708922 -1401336 -1392761 -741076 119667 547637 220845 -611098 -1464354 -1959846
37688 -1959846 -1834730 -1070240 -145789 281168 131888 -81172 -128316 -390568 -1065832 -1638557
37678 -1638557 -1542839 -884346 -136328 398902 469903 -184477 -1249636 -1727549 -1044976 152282
37668 152282 916206 1248938 1722933 2278695 2311529 1770018 1259708 1038336 719344 101732
37658 101732 -433256 -592018 -641459 -910155 -1250450 -1311209 -1085659 -925178 -1089483 -1391546
37648 -1391546 -1326229 -687230 -41184 -207218 -1099758 -1589833 -907548 306966 908187
37639 908187 753657 593963 800106 1042825 1061549 879925 314541 -826308 -1973970
37630 -1973970 -2136225 -1254459 -423839 -438394 -859285 -936681 -776090 -1033774 -1894705 -2846654
37620 -2846654 -3207463 -2609486 -1308451 -209303 -115325 -695227 -717182 358862 1577712
37611 1577712 1729763 871528 18364 -261341 -242043 -265641 -297425 -247151 -143832 74711
37601 74711 465560 719146 385119 -405643 -919463 -766231 -440385 -532851 -747934 -304580
37591 -304580 754773 1350140 764050 -304187 -663135 -251569 -47728 -456611 -753121
37582 -753121 -420002 -61840 -284638 -462643 352032 1765476 2450743 2048363 1461533
37573 1461533 1189247 644006 -427715 -1040744 -333925 992465 1578334 1240206 929014
37564 929014 1106572 1152331 485986 -505059 -991648 -711689 -140405 132133 -30615 -292024
37554 -292024 -266517 73393 442520 644633 763259 918310 1023174 887047 446126 -129584
37544 -129584 -435075 -43171 973554 1800333 1609005 598330 -165325 -90695 279419
37535 279419 220936 -116325 -99691 350254 746611 893487 1129410 1618618 1854326 1149143
37525 1149143 -480504 -2080553 -2529795 -1650676 -456977 -55313 -380130 -411747 356321
37516 356321 1227645 1300079 613870 -101693 -416495 -454260 -446858 -535472 -859357 -1391866
37506 -1391866 -1757539 -1573421 -931724 -284778 56695 88332 -67188 -242094 -246922 -33941
37496 -33941 258809 513361 652806 430155 -329575 -1098062 -885354 421227 1533485
37487 1533485 1251861 36502 -714001 -623199 -581411 -1094924 -1485323 -1082042 -298356 98906
37477 98906 157641 437842 902352 922455 372638 -12857 337701 984221 1127885 814734
37467 814734 858585 1560281 2170910 1962471 1281019 961940 1067964 934296 311213 -317017
37457 -317017 -579532 -629394 -580959 -298686 26267 -143434 -799533 -1208994 -1005982 -711753
37447 -711753 -728200 -646348 -175102 59183 -535977 -1420400 -1646923 -1172268 -629821 -321087
37437 -321087 -267400 -693210 -1509464 -1862298 -1236797 -488204 -640345 -1198543 -1001069 -284355
37427 -284355 -290063 -1016586 -1118868 -189567 597930 541641 435166 863604 1032856 266411
37417 266411 -611205 -501818 298782 713104 431628 -80673 -484715 -620048 -237126 543215
37407 543215 1038879 936820 804141 1057566 1195235 799047 450918 684716 823781 57666
37397 57666 -936098 -805570 359160 1095182 725889 183113 457219 1310629 1929204 2021778
37387 2021778 1796481 1390902 772540 -33431 -835490 -1299944 -1165381 -615672 -234427
37378 -234427 -343470 -668012 -905695 -1161040 -1416236 -1157004 -184022 718825 752903 351356
37368 351356 548841 1385603 1922009 1715507 1303614 1218113 1432891 1821771 2260074 2221888
37358 2221888 1235143 -120858 -640522 -141347 288335 10955 -224274 366834 1230087
37349 1230087 1249822 317218 -640283 -863053 -396144 236258 532766 371987 146365 309032
37339 309032 677285 624811 98735 -175023 189178 547955 132815 -885526 -1752486 -2091720
37329 -2091720 -1981062 -1495042 -776363 -259160 -230442 -352729 -93310 568357 1262463 1787380
37319 1787380 2112325 2095055 1660431 1039829 448332 -176331 -742228 -775308 -176827 267454
37309 267454 -113485 -737401 -517977 456743 962036 346562 -734379 -1434569 -1661716
37300 -1661716 -1621379 -1251732 -564355 80958 472442 807105 1134551 1119428 716753 450478
37290 450478 544490 405718 -407881 -1271158 -1316007 -750832 -482399 -660483 -541239 195503
37280 195503 888533 877397 315645 -286052 -697122 -803761 -388933 459280 1137209 1185517
37270 1185517 842067 523178 116609 -653055 -1418604 -1431878 -638907 134452 246386 -25141
37260 -25141 -64793 219936 508999 705153 947559 1107515 796247 -10530 -771903 -1058633
37250 -1058633 -1142988 -1559278 -2216020 -2388041 -1700442 -749438 -439360 -891234 -1383711 -1361746
37240 -1361746 -1114775 -1259497 -1819277 -2161522 -1831071 -1157090 -855533 -1123839 -1363713
37231 -1363713 -949277 -150989 29194 -921601 -2286925 -2955954 -2789512 -2622499 -2932860
37222 -2932860 -3167495 -2662490 -1642710 -815636 -401192 -157466 -71292 -331256 -718917
37213 -718917 -720573 -320860 -87842 -318048 -624345 -567237 -221664 100992 255080 157644
37203 157644 -271765 -785334 -843311 -323093 172435 94175 -286363 -309215 139260 593848
37193 593848 746796 722115 638892 353692 -224433 -846649 -1145671 -1067692 -959675 -1147710
37183 -1147710 -1425394 -1165436 -172372 766573 638939 -513999 -1602213 -1840004 -1483603
37174 -1483603 -1036672 -467372 307005 823229 665793 215710 90851 187916 29775 -232895
37164 -232895 -34293 521222 674986 167995 -425062 -641260 -648233 -644359 -517998 -399567
37154 -399567 -801698 -1759552 -2460953 -2263436 -1581339 -1214019 -1225693 -1113382 -760330 -512260
37144 -512260 -433545 -192222 245891 442503 241262 163426 642827 1231158 1114758 306317
37134 306317 -272813 -50139 400571 219515 -487679 -875288 -663096 -486363 -827006 -1291903
37124 -1291903 -1304427 -952350 -676113 -531978 -288234 14289 81722 -205384 -702930 -1120245
37114 -1120245 -1019105 -138922 968979 1222893 422880 -261301 100776 787637 591216
37105 591216 -204204 -300596 442454 756232 300 -886872 -876585 -177523 429512 663367
37095 663367 619050 323489 -95617 -379360 -571484 -889965 -1065844 -608095 184859 472201
37085 472201 298487 610952 1523828 1875438 1119352 351099 592585 1248988 1290586 874137
37075 874137 626846 306302 -504811 -1164921 -819811 110542 604792 646951 843674 1014521
37065 1014521 647376 290760 838795 1670667 1237822 -467471 -1740918 -1710091 -1377221
37056 -1377221 -1627536 -1798614 -1072134 -1099 356882 -48034 -494686 -573329 -295401
37047 -295401 301695 1002107 1332895 1161824 939708 961839 892766 384036 -373526 -1060247
37037 -1060247 -1633468 -1996886 -1863537 -1306716 -864855 -766838 -662517 -410229 -395819 -708634
37027 -708634 -831291 -645589 -868453 -1796381 -2448542 -1854156 -535937 267304 357212 521116
37017 521116 1046031 1355654 1072048 524965 125784 -49772 12188 342244 725066 836753
37007 836753 624619 161232 -652992 -1711124 -2318550 -1937124 -1149767 -1052889 -1708415 -2065803
36997 -2065803 -1544777 -816208 -712659 -1183547 -1771128 -2361340 -2839956 -2639031 -1464066
36988 -1464066 -153015 52638 -907322 -1760710 -1484117 -446197 301652 378310 248176
36979 248176 301855 322933 -43966 -693346 -1175537 -1218887 -893575 -371454 192556 548108
36969 548108 429979 -83432 -482055 -319299 266778 725406 777558 705839 850757 1030450
36959 1030450 783386 180801 -27023 618564 1486700 1578156 932872 607133 1084846 1501272
36949 1501272 956471 -106193 -642553 -610507 -787369 -1234508 -1160280 -446866 -98194 -649714
36939 -649714 -1162278 -581701 650277 1220662 672266 -368480 -1323535 -2079500 -2412100
36930 -2412100 -1940741 -823198 212584 753918 1059449 1328736 1201666 375325 -699465
36921 -699465 -1227579 -987955 -399865 242117 1074809 2026487 2363059 1442395 -196706
36912 -196706 -1154350 -806454 -69534 -133826 -968566 -1715058 -2084676 -2417643 -2578452 -1969473
36902 -1969473 -835528 -409332 -1217347 -2191635 -2176110 -1511144 -1249337 -1416918 -1092308
36893 -1092308 45378 1188360 1440951 760176 -146159 -440868 180236 1083699 1224629
36884 1224629 417426 -369269 -412143 -275744 -746922 -1399816 -1275890 -552454 -322224 -888585
36874 -888585 -1501274 -1783917 -2172746 -2727961 -2737344 -1952447 -1151036 -908484 -752541 -183534
36864 -183534 319940 105620 -487764 -614044 -175440 163684 4671 -361112 -452250 -96204
36854 -96204 464661 716024 353594 -180396 -14296 1034310 2068511 2162770 1387938 441320
36844 441320 -277988 -765712 -1013376 -1057515 -1105203 -1095983 -481098 956027 2340908 2479186
36834 2479186 1302629 -82065 -755653 -776267 -567396 -190909 456589 1167683 1557084
36825 1557084 1536385 1392368 1393798 1440045 1169542 444344 -377407 -861495 -1133707 -1701332
36815 -1701332 -2530339 -2806798 -1991455 -683770 109290 256175 383925 659546 533724
36806 533724 -144357 -572962 -72582 822544 1025785 429744 54730 534980 1074533 414946
36796 414946 -1392800 -2777526 -2370398 -531430 1152074 1598814 1039013 291591 -138584
36787 -138584 -153720 132109 323519 -108227 -1182457 -2150802 -2241756 -1478127 -461668 397974
36777 397974 1066244 1539437 1786904 1918571 1992012 1772580 1115490 443907 314433 568847
36767 568847 500204 -116013 -787056 -1218960 -1759009 -2566059 -2975372 -2289925 -842518 333502
36757 333502 715819 649199 609345 658149 666382 611412 512396 381038 330989 471122 650346
36746 650346 607410 415742 436850 757170 1060908 1189696 1357478 1537222 1148853 -108541
36736 -108541 -1462406 -1780915 -973991 -43197 248074 69623 -207266 -637421 -1176075
36727 -1176075 -1205831 -296573 899409 1224025 410578 -660926 -1098465 -871885 -475864
36718 -475864 -202989 -2448 202295 317619 189918 -132062 -274413 159277 1081148 1940798
36708 1940798 2383715 2556802 2525188 1859976 356376 -1174656 -1581311 -792612 95180
36699 95180 199230 -291252 -710319 -727340 -360789 257835 856193 1168192 1300311 1575298
36689 1575298 1930303 1937102 1494104 961726 534103 104452 -142839 220040 968829 1196988
36679 1196988 601881 21759 167578 595084 604704 431148 695426 1248416 1479793 1373295
36669 1373295 1347975 1343227 939512 180045 -535793 -1152811 -1748494 -1904675 -1228419 -289546
36659 -289546 -5138 -201710 80642 837083 923817 -48396 -889650 -540862 411290 737822
36649 737822 300881 -114528 -153800 -130631 -166773 46730 622486 1226115 1522983 1469231
36639 1469231 1158569 734904 446456 455476 565459 412508 -7068 -214578 208505 1017360
36629 1017360 1384747 726177 -555121 -1381965 -1200337 -560523 -208150 4797 662027
36620 662027 1486438 1446360 329560 -700070 -604812 208895 721768 831779 1185832 1824730
36610 1824730 1978146 1275527 355846 -22281 80070 81329 -266332 -706128 -961177 -1036946
36600 -1036946 -1075667 -1157924 -1289407 -1432808 -1495722 -1387545 -1149211 -926588 -709923 -217026
36590 -217026 719150 1661013 1812662 948415 -184074 -672560 -428039 -34997 142180
36581 142180 204861 185839 -130534 -731494 -1200558 -1212576 -850249 -313085 295091 776991
36571 776991 910300 902524 1288391 2072954 2447162 1781479 539532 -266774 -268175 88135
36561 88135 353679 552121 886241 1409586 2032717 2549088 2644669 2170477 1451468 1088412
36551 1088412 1354799 1887199 2013919 1396315 429410 -18947 525623 1519622 1926566
36542 1926566 1417258 648666 199733 -226261 -1093880 -1985025 -1976354 -971879 13530 71016
36532 71016 -560718 -905904 -422975 462177 877436 422395 -431316 -883841 -738323 -564058
36522 -564058 -800347 -1034276 -570726 486374 1266742 1246682 786221 402572 48448 -509222
36512 -509222 -990844 -839957 -48185 761314 1127980 1179665 1108704 710119 -135013 -857149
36502 -857149 -724621 68217 510385 171599 -153103 381093 1410103 1912454 1633238
36493 1633238 1213590 1118945 1238994 1475922 1882108 2147818 1829397 1291825 1512416 2558901
36483 2558901 3166060 2430985 1122105 514700 597786 416705 -227580 -512174 32977
36474 32977 824851 1084805 731104 221920 164 241663 761612 1070947 842926 348143
36464 348143 135143 332585 593224 647717 538217 353280 124355 6602 227566 776607
36454 776607 1319629 1427505 868123 -98227 -669974 -206544 803416 1027070 -65969
36445 -65969 -1416131 -1770657 -1262580 -856987 -795214 -586280 -191850 -111890 -375369 -455366
36435 -455366 -203560 40169 240619 616673 842410 387069 -293817 -125999 772361 918833
36425 918833 -382677 -1912581 -2275965 -1717663 -1317064 -1247153 -868062 -712 851310
36416 851310 1241329 1037285 287764 -562031 -735989 -36501 703039 664889 125024 -107404
36406 -107404 129742 381694 356162 8418 -732659 -1646104 -2044257 -1604130 -945746 -708035
36396 -708035 -594374 -139392 202824 -197264 -821226 -657411 150785 610392 606303 888646
36386 888646 1380525 1079101 -71160 -756979 -315928 239074 -43443 -622835 -703033 -653487
36376 -653487 -1010567 -1127139 -264773 706158 283291 -1329018 -2372347 -1959004 -928586
36367 -928586 -182227 400722 972327 996726 313654 -93877 628192 1784338 1926996 748429
36357 748429 -640471 -1146465 -694726 117391 689017 675180 128486 -456607 -576227 -251840
36347 -251840 124539 360307 470589 243517 -606770 -1783030 -2493250 -2402219 -1967431 -1594382
36337 -1594382 -1055417 -152326 623500 715305 387620 300288 459938 341521 -72880 -181993
36327 -181993 237198 675846 750701 735160 925872 1098944 1001977 849827 855984 735965
36317 735965 232283 -232404 -60615 560542 822743 357505 -411914 -972715 -1238974 -1266575
36307 -1266575 -953874 -295511 360746 579721 252484 -375440 -974690 -1345884 -1465242
36298 -1465242 -1402309 -1175105 -711847 -5763 756809 1297499 1408801 993383 135241 -754274
36288 -754274 -1116030 -837868 -492002 -647755 -1067619 -1003234 -304113 222941 -200672 -1278481
36278 -1278481 -1927362 -1538844 -627476 -107714 -167120 -163430 393706 1159344 1500011 1405453
36268 1405453 1377356 1524311 1349416 570702 -365971 -866333 -875139 -701048 -544053 -529640
36258 -529640 -835395 -1363389 -1579858 -1112294 -273600 396360 835309 1267013 1598833 1560752
36248 1560752 1256714 1026000 891276 681456 558881 818524 1240649 1288558 972617 888258
36238 888258 1286893 1686160 1564280 938474 107072 -684587 -1144438 -986177 -345143 190553
36228 190553 156705 -410460 -1176451 -1752650 -1790226 -1265558 -642038 -303572 47737 843451
36218 843451 1673853 1718655 1152190 1086988 1825124 2210049 1302731 -200250 -981134 -802423
36208 -802423 -347275 45224 512309 883463 736562 157160 -331732 -561785 -782141 -989025
36198 -989025 -859343 -388621 -13772 -14252 -237092 -429048 -427668 -90124 489322 754271
36188 754271 232157 -657364 -877903 6121 1326523 2144289 2157830 1636322 899293 179100
36178 179100 -256825 -204009 224599 564511 338647 -427677 -1054419 -864097 -92744 249968
36168 249968 -328738 -1135834 -1364225 -1330057 -1888904 -2938243 -3466594 -3101716 -2639139 -2730908
36158 -2730908 -2904267 -2417003 -1452201 -811447 -790609 -970479 -928983 -635726 -238011 83710
36148 83710 69809 -403059 -1002220 -1157885 -715317 -139109 56030 -112664 -265880 -285673
36138 -285673 -465444 -947690 -1303085 -1011882 -276346 81981 -331600 -937782 -960723 -432421
36128 -432421 -41576 -196604 -667073 -1060943 -1247476 -1288510 -1245411 -1095683 -723859 -130897
36118 -130897 260569 -112391 -1096906 -1718862 -1407897 -856943 -1003689 -1612561 -1764153 -1416539
36108 -1416539 -1357411 -1699448 -1672831 -1115624 -909998 -1430217 -1700397 -851205 488056 1077256
36098 1077256 650197 -147138 -753572 -865302 -247060 790445 1264650 703275 -52938
36089 -52938 -29545 494890 692165 602339 671550 456661 -733274 -2172829 -2287648 -978291
36079 -978291 112569 -52235 -700851 -840994 -669808 -717460 -818070 -779300 -1033227 -1709483
36069 -1709483 -1964448 -1195384 -149750 144072 -155671 -303947 -333742 -660939 -897062
36060 -897062 -368954 498479 637666 42815 -270731 995 102495 -195762 -37490 942961
36050 942961 1658583 987202 -659410 -1946835 -2178390 -1562247 -512491 529222 965899
36041 965899 514024 -350015 -931539 -1077194 -947791 -425700 580316 1485246 1454515 511932
36031 511932 -379573 -444298 163246 810633 1128728 1152121 1070213 1036739 1080929 1159167 1364134
36020 1364134 1897819 2614472 2851134 2137153 914743 65906 -188622 -373981 -768822
36011 -768822 -975004 -666535 -192593 -99105 -451773 -928502 -1208813 -979243 31886 1588281
36001 1588281 2794709 2872127 1959594 829572 16760 -406598 -448016 -144556 166301
35992 166301 81361 -251475 -202569 470706 1192579 1243113 601840 -109499 -323627 46379
35982 46379 694527 1189187 1266341 1088071 1139718 1660381 2237191 2202812 1431393 507754
35972 507754 60300 140793 349847 365077 188971 29475 116681 524452 982675 970328
35962 970328 243073 -765649 -1322290 -1194109 -849315 -839435 -1234023 -1709374 -1900882 -1568535
35952 -1568535 -740961 118874 401522 50651 -301798 -157876 202656 236702 -39018 -212520
35942 -212520 -195546 -201116 -168973 139513 510707 409507 -170204 -613186 -597387 -489111
35932 -489111 -598084 -643357 -305485 193232 434866 338566 59596 -227785 -202272 441886
35922 441886 1402894 1885626 1653497 1371952 1506625 1591351 1171475 721847 795967 918000
35912 918000 355297 -490481 -630538 -141382 -33222 -543878 -822188 -445329 -27270 -8789
35902 -8789 -17316 103977 -235795 -1209477 -1872206 -1456578 -573887 -247705 -404301 -259828
35892 -259828 299124 721699 873292 1124636 1458730 1380194 785424 199244 18729 101076
35882 101076 207218 325883 425307 347268 119975 33806 274597 738733 1251832 1700098
35872 1700098 1927918 1788615 1347485 830218 380906 45380 -112755 -118298 -185283 -435057
35862 -435057 -634385 -516545 -240934 -198919 -471070 -831923 -1194248 -1661277 -2193506 -2590531
35852 -2590531 -2752195 -2633380 -2096673 -1242897 -705057 -1002665 -1645381 -1545511 -429746
35843 -429746 789600 1220957 934104 452407 -16078 -422869 -562995 -468088 -635342 -1259654
35833 -1259654 -1651978 -1136435 -232637 -115069 -970890 -1737727 -1610385 -1010330 -722905
35824 -722905 -783193 -763202 -638011 -685056 -810038 -667888 -348365 -266909 -354854 -56631
35814 -56631 681218 1123427 845777 473434 688745 1015962 480999 -736314 -1323792 -671683
35804 -671683 250671 313697 -251605 -456034 -141894 -69966 -550937 -861224 -305030 694552
35794 694552 1015943 189784 -1022633 -1501364 -1049002 -519466 -575528 -708736 -7103 1310929
35784 1310929 1954476 1325515 341321 -33656 -239629 -1195726 -2503824 -2765074 -1578804
35775 -1578804 -122035 442905 215648 -74748 -126045 -56375 27840 3374 -284754 -666896
35765 -666896 -692973 -311869 -64533 -312176 -718342 -815872 -667052 -617355 -753996 -921517
35755 -921517 -959595 -710554 -168222 222667 -70378 -793504 -1012528 -412895 185954 69830
35745 69830 -339694 -346031 -185443 -489286 -1027759 -1001019 -357432 149836 164898 84675 149291
35734 149291 12496 -573409 -1297892 -1722756 -1683027 -1216132 -625970 -563770 -1336440 -2100023
35724 -2100023 -1568841 238314 1758318 1775999 832146 223376 236918 105103 -630651
35715 -630651 -1460970 -1627801 -1035359 -311902 -108992 -372809 -398518 196834 753707 357181
35705 357181 -713869 -1119606 -302799 650259 592489 14960 248122 1419918 2288936
35696 2288936 2033067 1170888 489664 -32547 -767092 -1570619 -1978720 -1883330 -1492593 -889746
35686 -889746 -159662 227661 -226894 -1242575 -1824437 -1390841 -491116 -90379 -383347
35677 -383347 -716265 -581020 -201672 -11199 -6337 21987 -64724 -550459 -1191453 -1302936
35667 -1302936 -677400 33910 142399 -206129 -328348 59865 607088 922486 980941 868897
35657 868897 492703 -223164 -1011774 -1399280 -1212546 -819680 -741039 -1041612 -1265111 -1042058
35647 -1042058 -569641 -278038 -193970 898 350614 536710 485362 539350 774655 659130
35637 659130 -170000 -1187649 -1574919 -1254775 -777243 -411771 -18567 312978 278497 82946
35627 82946 376861 1215070 1787138 1568601 1088136 1034446 1196916 993508 599751 676476
35617 676476 1155607 1219903 602664 69562 263863 754919 736237 171202 -344383 -532678
35607 -532678 -589512 -521058 -19777 851112 1421428 1213486 642809 536339 1099650 1702088
35597 1702088 1662013 979929 246736 340 234659 452994 185131 -494477 -998632 -833556
35587 -833556 -80244 816517 1553994 2020794 1998231 1252679 13767 -1024443 -1399035
35578 -1399035 -1302535 -1101849 -749082 -44787 712609 840216 112218 -860781 -1272497 -966607
35568 -966607 -496236 -419914 -657204 -595354 139933 1117078 1531118 1214710 835480 863516
35558 863516 792950 -55633 -1232284 -1454391 -318915 1016516 1261650 569205 153611
35549 153611 664238 1538535 1909340 1635761 1279291 1342188 1715232 1823691 1275215 343288
35539 343288 -291584 -278036 127994 548504 913027 1216705 1208984 718834 99581 -74365
35529 -74365 291817 745268 863979 588557 48999 -566126 -968257 -960294 -730406 -661365
35519 -661365 -823062 -953654 -930422 -877257 -770272 -381050 242516 658161 604244 316963
35509 316963 44569 -348209 -952459 -1359210 -1102961 -375327 139949 68732 -344417 -620232
35499 -620232 -422755 298153 1161964 1475659 934299 143395 -27901 402022 577547 115287
35489 115287 -265023 209535 1187103 1627368 1166205 466697 259484 561625 957336 1216163
35479 1216163 1392398 1576854 1781025 1910242 1707786 940704 -157004 -858612 -695315
35470 -695315 -101207 92440 -223808 -306509 312034 1089796 1280931 1071039 1260354 1950861
35460 1950861 2298869 1773560 997307 866242 1286880 1387064 768290 -57018 -433542
35451 -433542 -201404 494668 1459540 2281341 2422218 1870013 1350065 1447646 1771343 1500355
35441 1500355 634330 94988 468417 1198212 1378077 972374 752536 1137766 1614996
35432 1614996 1478686 795376 306463 485250 1009029 1228277 912913 359717 -79754
35423 -79754 -310303 -357431 -213169 51000 224515 192853 83599 -4961 -237049 -709037
35413 -709037 -1034479 -695914 163547 739472 512309 -185555 -736200 -966126 -1040699 -1044867
35403 -1044867 -1047307 -1195725 -1310296 -828897 224883 682736 -433886 -2275384 -2974362
35394 -2974362 -2100340 -1092217 -991525 -1096333 -529791 182185 224607 132321 888021 2043995
35384 2043995 2256741 1349731 360229 -268643 -957057 -1444811 -722926 1047476 2168955
35375 2168955 1717387 819941 748312 1070035 819895 320823 430787 839368 636664 48764
35365 48764 90161 734641 883155 159321 -572616 -658294 -471711 -492120 -541821 -319345
35355 -319345 53892 330670 407368 177020 -291260 -430198 252744 1280465 1680367 1377754
35345 1377754 1227645 1565104 1726095 1291231 810956 820685 992662 808088 340697 -156667
35335 -156667 -762251 -1447689 -1779275 -1611248 -1474182 -1720321 -1881384 -1463518 -791211 -415213
35325 -415213 -242704 23427 89491 -454711 -1212092 -1362181 -791706 -117444 278476 538480
35315 538480 735730 687225 440069 388634 731385 1144369 1129073 545300 -191797 -411755
35305 -411755 128086 851201 996157 635228 506097 769396 749221 229359 59219 782090
35295 782090 1520343 1216517 349468 233289 944837 1208979 374650 -633027 -651777 279880
35285 279880 1235699 1562953 1313837 852925 384219 -173452 -911856 -1609601 -1949018 -2066031
35275 -2066031 -2375250 -2688681 -2218383 -867516 256550 269355 -294789 -527785 -631621
35266 -631621 -1280388 -2116272 -2161163 -1379410 -588019 -83532 373639 466281 -345907 -1467302
35256 -1467302 -1633651 -861003 -461076 -883088 -1066008 -374130 344719 320672 103336 386210
35246 386210 770101 639547 300521 308824 462945 326785 57358 -62333 -264516 -783182
35236 -783182 -1340610 -1734375 -2224338 -2791348 -2848572 -2296958 -1948998 -2194620 -2211086 -1340485
35226 -1340485 -290323 15685 -130844 -32094 31205 -542490 -1336385 -1516808 -1212096 -1036997
35216 -1036997 -780971 82574 1016651 997733 251225 12731 629432 1213745 1192119 920458
35206 920458 654519 135947 -564752 -876303 -657548 -364707 -127517 378200 964097 847907
35196 847907 -143391 -1164363 -1474770 -1214829 -801260 -310366 246907 716397 1134380
35187 1134380 1674189 2092954 1844065 885423 -192082 -885810 -1055059 -597115 369831
35178 369831 1085318 825367 32798 -160693 412723 806596 572572 357507 557634 546297
35168 546297 -175300 -1065944 -1477288 -1658977 -2092298 -2504177 -2315898 -1614922 -1025874 -914868
35158 -914868 -1137592 -1243672 -705378 541577 1581493 1239383 -335132 -1519888 -1116077
35149 -1116077 263844 1192720 1159957 716890 439370 393455 317407 -117964 -950874 -1613655
35139 -1613655 -1445679 -687907 -303336 -576006 -713440 -225380 237934 63591 -188726
35130 -188726 288229 1135911 1302529 557087 -310793 -583969 -253638 235202 376712 -3941
35120 -3941 -412270 -169830 473046 396413 -772198 -1918456 -1981871 -1402806 -1170928 -1241873
35110 -1241873 -1015520 -738570 -1101103 -1765752 -1636054 -564310 372362 404806 -118537
35101 -118537 -588289 -885889 -1069588 -1073918 -941923 -779931 -426838 249616 790180 586609
35091 586609 -120824 -434136 -52103 398251 401789 189578 103009 -3191 -350108 -685479
35081 -685479 -531974 198608 1025280 1272660 695560 -166814 -479114 -90383 335989 335814
35071 335814 192562 140508 -192573 -901515 -1166909 -446026 383112 201010 -598094 -830645
35061 -830645 -550892 -826499 -1671620 -1852553 -935647 12009 156254 -70794 -145686 -317063
35051 -317063 -700800 -777260 -480730 -604885 -1372245 -1765997 -1158214 -467587 -633940 -962028
35041 -962028 -266144 1087717 1662855 1052109 193768 -224883 -464504 -778758 -811167 -246689
35031 -246689 619311 1255459 1446542 1328166 1117021 837156 225900 -898909 -2118186
35022 -2118186 -2662815 -2339659 -1707122 -1145074 -432014 415252 709687 147237 -431655
35013 -431655 -153249 583348 781008 345126 -24213 -50837 7268 192966 743026 1264273
35003 1264273 1058346 293830 -125541 38562 61122 -426431 -762433 -312101 557913 1043414
$$ [...]
##END NTUPLES=NMR SPECTRUM
##END=
