##TITLE=31Pdec_LR-673-R2-HCR3
 D2O, 24 sc
 18.12.2019
##JCAMPDX= 6.0         $$ Bruker NMR JCAMP-DX V2.0
##DATA TYPE= NMR SPECTRUM
##DATA CLASS= NTUPLES
##ORIGIN= UXNMR, Bruker Analytische Messtechnik GmbH
##OWNER= root
$$ XWIN-NMR		Version 3.5
$$ Wed Dec 18 13:50:11 2019 Russian Standard Time (UT+4h)  she@DPX200
##.OBSERVE FREQUENCY= 81.013821
##.OBSERVE NUCLEUS= ^31P
##.ACQUISITION MODE= SIMULTANEOUS
##.ACQUISITION SCHEME= undefined
##.AVERAGES= 24
##.DIGITISER RES= 17
##SPECTROMETER/DATA SYSTEM= spect
##.PULSE SEQUENCE= zgpg30
##.SOLVENT NAME= CDCl3
##.SHIFT REFERENCE= (INTERNAL, CDCl3, 0, 182.463)
##AUDIT TRAIL= $$ (NUMBER, WHEN, WHO, WHERE, WHAT)
$$ ##TITLE= Audit trail, XWIN-NMR		Version 3.5
$$ ##JCAMPDX= 5.01
$$ ##ORIGIN= Bruker BioSpin GmbH
$$ ##OWNER= she
$$ F:/spectra/data/she/nmr/P31/1/pdata/1/auditp.txt
$$ ##AUDIT TRAIL=  $$ (NUMBER, WHEN, WHO, WHERE, WHAT)
(   1,<2019-12-18 13:49:19.10 +0400>,<she>,<DPX200>,
      <created by zg, POWCHK disabled, PULCHK disabled
       configuration hash MD5:
       00 E9 B6 7A A2 85 ED C7 34 08 36 98 17 FE 4E 26
       data hash MD5: 32K
       DC 9D A4 67 F3 61 9D BB 77 F9 CD BA 7B FE 54 2A>)
(   2,<2019-12-18 13:49:21.34 +0400>,<she>,<DPX200>,
      <Start of raw data processing
       efp BC_mod = 2 LB = 1 FT_mod = 6 PKNL = 1 PHC0 = -1309.69 PHC1 = 58.40095 SI = 64K 
       data hash MD5: 64K
       F6 7B 6E 4B A7 7B 55 1E 86 6D 45 56 A8 20 46 87>)
(   3,<2019-12-18 13:49:31.75 +0400>,<she>,<DPX200>,
      <pk PHC0 = -8.444189 PHC1 = 0 
       data hash MD5: 64K
       72 EB 80 85 09 72 95 0A F5 A1 7C 38 0C 9F BE B3>)
(   4,<2019-12-18 13:49:36.17 +0400>,<she>,<DPX200>,
      <abs ABSG = 5 
       data hash MD5: 64K
       A8 AA 3F C9 FA 8D 81 32 13 FD 34 21 B1 32 E1 D7>)
$$ ##END=
$$ 
$$ hash MD5
$$ F3 25 C2 34 BA EA A5 53 92 89 2B 42 59 33 A4 88
##$RELAX= 
##$RELAX= 
##$RELAX= 
##$RELAX= 
##$RELAX= 
##$RELAX= 
##$RELAX= 
##$RELAX= 
$$ Bruker specific parameters
$$ --------------------------
##$DU= <F:/spectra>
##$EXPNO= 1
##$NAME= <P31>
##$PROCNO= 1
##$TYPE= <nmr>
##$USER= <she>
##$AMP= (0..31)
100 100 100 100 100 100 100 100 100 100 100 100 100 100 100 100 100 100 
100 100 100 100 100 100 100 100 100 100 100 100 100 100 
##$AQSEQ= 0
##$AQ_mod= 1
##$AUNM= <au_zg>
##$AUTOPOS= <>
##$BF1= 81.014009
##$BF2= 200.13
##$BF3= 200.13
##$BF4= 200.13
##$BF5= 200.13
##$BF6= 200.13
##$BF7= 200.13
##$BF8= 200.13
##$BYTORDA= 1
##$CFDGTYP= 0
##$CFRGTYP= 5
##$CHEMSTR= <none>
##$CNST= (0..31)
1 1 145 1 1 1 1 1 1 1 1 1 1 1 1 1 1 1 1 1 1 1 1 1 1 1 1 1 1 1 1 1 
##$CPDPRG= <waltz16>
##$CPDPRG1= <>
##$CPDPRG2= <waltz16>
##$CPDPRG3= <>
##$CPDPRG4= <mlev>
##$CPDPRG5= <mlev>
##$CPDPRG6= <mlev>
##$CPDPRG7= <mlev>
##$CPDPRG8= <mlev>
##$CPDPRGB= <>
##$CPDPRGT= <>
##$D= (0..31)
0 1 0 0 0 0 0 0 0 0 0 0.03 2e-05 3e-06 0 0 0 0 0 0 0 0 0 0 0 0 0 0 0 0 
0 0 
##$DATE= 1576662558
##$DBL= (0..7)
120 120 120 11 120 120 24 19 
##$DBP= (0..7)
150 150 150 150 150 150 150 150 
##$DBP07= 0
##$DBPNAM0= <>
##$DBPNAM1= <>
##$DBPNAM2= <>
$$ [...]
##$SUBNAM3= <"">
##$SUBNAM4= <"">
##$SUBNAM5= <"">
##$SUBNAM6= <"">
##$SUBNAM7= <"">
##$SUBNAM8= <"">
##$SUBNAM9= <"">
##$SW= 369.568048894756
##$SWIBOX= (0..15)
0 1 3 0 0 0 0 0 0 0 0 0 0 0 0 0 
##$SW_h= 29940.119760479
##$TD= 32768
##$TD0= 1
##$TE= 0
##$TE2= 300
##$TE3= 300
##$TEG= 300
##$TL= (0..7)
0 120 53 12 22 120 120 120 
##$TP= (0..7)
150 150 150 150 150 150 150 150 
##$TP07= 0
##$TPNAME0= <>
##$TPNAME1= <>
##$TPNAME2= <>
##$TPNAME3= <>
##$TPNAME4= <>
##$TPNAME5= <>
##$TPNAME6= <>
##$TPNAME7= <>
##$TPOAL= (0..7)
0.5 0.5 0.5 0.5 0.5 0.5 0.5 0.5 
##$TPOFFS= (0..7)
0 0 0 0 0 0 0 0 
##$TUNHIN= 0
##$TUNHOUT= 0
##$TUNXOUT= 0
##$USERA1= <user>
##$USERA2= <user>
##$USERA3= <user>
##$USERA4= <user>
##$USERA5= <user>
##$V9= 5
##$VALIST= <valist>
##$VCLIST= <CCCCCCCCCCCCCCC>
##$VD= 0
##$VDLIST= <DDDDDDDDDDDDDDD>
##$VPLIST= <PPPPPPPPPPPPPPP>
##$VTLIST= <TTTTTTTTTTTTTTT>
##$WBST= 1024
##$WBSW= 4
##$XGAIN= (0..3)
0 0 0 0 
##$XL= 0
##$YL= 0
##$YMAX_a= 29131
##$YMIN_a= -29061
##$ZGOPTNS= <>
##$ZL1= 120
##$ZL2= 120
##$ZL3= 120
##$ZL4= 120
##$ABSF1= 182.463
##$ABSF2= -187.1042
##$ABSG= 5
##$ABSL= 3
##$ALPHA= 0
##$AQORDER= 0
##$ASSFAC= 0
##$ASSFACI= 0
##$ASSFACX= 0
##$ASSWID= 0
##$AUNMP= <proc_1d>
##$AZFE= 0.1
##$AZFW= 0.5
##$BCFW= 0
##$BC_mod= 2
##$BYTORDP= 0
##$COROFFS= 0
##$CY= -3
##$DATMOD= 1
##$DC= 0
##$DFILT= <>
##$DTYPP= 0
##$F1P= 0
##$F2P= 0
##$FCOR= 1
##$FTSIZE= 65536
##$FT_mod= 6
##$GAMMA= 0
##$GB= 0
##$INTBC= 1
##$INTSCL= 5.30512e-09
##$ISEN= 30
##$LB= 1
##$LEV0= 0
##$LPBIN= 0
##$MAXI= 10000
##$MC2= 0
##$MEAN= 0
##$ME_mod= 0
##$MI= 50
##$NCOEF= 0
##$NC_proc= -4
##$NLEV= 6
##$NOISF1= 182.463
##$NOISF2= 159.3651
##$NSP= 0
##$NTH_PI= 0
##$NZP= 0
##$OFFSET= 182.463
##$PC= 4
##$PHC0= -1318.134
##$PHC1= 58.40095
##$PH_mod= 1
##$PKNL= yes
##$PPARMOD= 0
##$PSCAL= 0
##$PSIGN= 0
##$REVERSE= no
##$SF= 81.0140089999434
##$SI= 65536
##$SIGF1= 159.3651
##$SIGF2= -187.1042
##$SINO= 113.3802
##$SIOLD= 16384
##$SREGLST= <1H.CDCl3>
##$SSB= 0
##$STSI= 65536
##$STSR= 0
##$SW_p= 29940.119760479
##$SYMM= 0
##$S_DEV= 0
##$TDeff= 32768
##$TDoff= 0
##$TI= <>
##$TILT= no
##$TM1= 0
##$TM2= 0
##$TOPLEV= 0
##$USERP1= <user>
##$USERP2= <user>
##$USERP3= <user>
##$USERP4= <user>
##$USERP5= <user>
##$WDW= 1
##$XDIM= 65536
##$YMAX_p= 492199785
##$YMIN_p= -3210744
$$ End of Bruker specific parameters
$$ ---------------------------------
##NTUPLES= NMR SPECTRUM
##VAR_NAME=  FREQUENCY,     SPECTRUM/REAL,   SPECTRUM/IMAG
##SYMBOL=    X,             R,               I
##VAR_TYPE=  INDEPENDENT,   DEPENDENT,       DEPENDENT
##VAR_FORM=  AFFN,          ASDF,            ASDF
##VAR_DIM=   65536,         65536,           65536
##UNITS=     HZ,            ARBITRARY UNITS, ARBITRARY UNITS
##FACTOR=    0.456856943014862, 1,           1
##FIRST=     14782.0589164792, 0,            0
##LAST=      -15158.0608439998, 0,           0
##MIN=       -15158.0608439998, -3210744,    0
##MAX=       14782.0589164792, 492199785,    0
$$ Real data points
##PAGE= N=1
##DATA TABLE= (X++(R..R)), XYDATA
$$ [...]
43485b28453j67856k45372l36203j50645K10195K71031p2809l06479o1909K93346
43475g95154K26270j19965j41638L04029O69962M52243j98810p01423o47249j09030
43465a060765M69654O22993K54305k52541m19850j93424O1402Q8334M8317J79525
43455b02050L58390K70177n5379k16335m5510Q6634j43983l92836q6223N96576
43445A69461P85656J56984m87668l28215K67014L11708k96305o57430k65519K97458
43435d6856L47639P7896N4982K47724J80932j95959m12754k23132N6036N6329
43425A42837j47673k23838n2998J59317J73795O285j05775j0199J58509J67801
43415B68061J4004r6998o6366J093J8482L936q1498l17095n69877n37977j69068
$$ y = [-228453, -396309, -641681, -977884, -1128529, -918334, -647303, -720112, -1026591, -1088500, -795154, -568884, -688849, -830487, -526458, 143504, 595747, 396937, -304486, -951735, -1060765, -591111, 31882, 286187, 33646, -386204, -579628, -518226, -429892, -381575, -202050, 156340, 426517, 371138, 154803, 109293, 195927, 51944, -340892, -427115, 169461, 955117, 1112101, 624433, 296218, 563232, 874940, 578635, -78795, -344314, -46856, 300783, 378679, 433661, 681385, 862317, 666358, 253604, 30472, 86508, 142837, -4836, -228674, -281672, -122355, 51440, 57725, -48050, -58249, 100260, 268061, 282065, 185067, 118701, 119794, 138276, 142212, 60714, -256381, -826258, -1364235, -1533303]
43404a533303K22398L80591L79421L40370K07601P658n043K42017L76817Q9771
43394G08298l20452l13872J02335L61178J05716l69238n27686k28682J51903J63931
43384a66569k01242m89293l49087Q233J56607J23659K70444N42951M54036l0790
43374C18949k59264R6389M35169J59117l61294m08484l1778K02546J97935K50436
43364E99721K61783r2138n51132n17424p5761J06823p5199l4619L63154M67913
43354D53121k8008m95714l50555J01140K84544K01391J47094J17167L104n6188
43344C77096L1838O6008k8938K1071K80838L32536j4058k68980l0403L04015J84983
43333A256006j90099k87935j57794k18490m16710l43408j8125J50166Q4827P2200
$$ y = [-1533303, -1310905, -930314, -550893, -210523, -2922, 4736, -307, 241710, 618527, 708298, 387846, 73974, 176309, 537487, 643203, 273965, -253721, -482403, -330500, -166569, -367811, -857104, -1206191, -1197958, -1041351, -917692, -647248, -104297, 349739, 318949, 59685, 156074, 591243, 750360, 389066, -19418, -51196, 151350, 349285, 599721, 861504, 769366, 218234, -299190, -374951, -268128, -343327, -377946, -14792, 453121, 425113, -70601, -421156, -320016, -35472, 165919, 313013, 430180, 433284, 377096, 408934, 474942, 446004, 467075, 747913, 1080449, 1066391, 797411, 767008, 1071023, 1256006, 1065907, 777972, 620178, 401688, -15022, -358430, -376555, -226389, -141562, -69362]
43323f9362J57006J42517J15078L10371N00779K09177m32412p27974m27088k5040
43313b46948R4087J33602K67400K29523r9795k92498l8823K59071R7970k81022
43303A22567k54389J77834L64913j5116m87903m66667j7483L23260K75189N4982
43293G7187n6504r4598k30601m06315l95932j83638r047K0167R4709L46378N70391
43282b67803N05605J93332j47944m02652m95942k96879J21606L57884J68653j24976
43272c89116j01303J09866J02425p5983l6187K18666K90457J01733k1337k6984
43262A72237k17153n09485l51796L21662P46039L96864j89097k23991J78053K99933
43252F23266m7465l62813k87930r035J68465J77330Q3083k7197k7681J07651J78983
$$ y = [-69362, 87644, 230161, 345239, 655610, 1156389, 1365566, 933154, 205180, -221908, -246948, -152861, -19259, 248141, 477664, 377869, 85371, 46548, 305619, 403589, 122567, -131822, 46012, 410925, 395809, -92094, -558761, -576244, -252984, 22205, 77187, 20683, -73915, -304516, -710831, -1106763, -1290401, -1299448, -1279281, -1184572, -838194, -267803, 237802, 431134, 283190, -119462, -615404, -912283, -790677, -432793, -264140, -389116, -490419, -380553, -278128, -354111, -390298, -171632, 118825, 220558, 199221, 172237, -44916, -554401, -906197, -584535, 161504, 558368, 369271, 145280, 323333, 623266, 575801, 212988, -74942, -83977, 84488, 261818, 344901, 317704, 290023, 397674, 576657]
43241E76657Q189k66712l80570l11172k06678q4280R5854J82527J0541k39220
43231f14864k06717J24262L77603K84700j8779k16137j27249J81130M24097L05237
43221E13283j14998l72506j58448K12512K05648j68919l75855j24853K62468L40901
43211B19233Q5612j79771j79721R6696M24089N22920L18748J5292j70260k38212
43201I14626k53814j55256O8047K05001J15337n656K0342j8564l12808n07342
43191F9913j92409K55999P7970o30444q98378k96061M35501N31863K18390N5069
43181c72587l0484l39264n64634k14421M11749N15834j174l98556k01104K41540
43171i53101M41451M04560L49880L10790K82760L45073L72906K7009o64807j084600
$$ y = [576657, 584846, 318134, -62436, -373608, -580286, -664566, -568712, -386185, -375644, -614864, -821581, -697319, -319716, -35016, -53795, -269932, -397181, -216051, 208046, 513283, 398285, 25779, -132669, 79843, 285491, 116572, -259283, -384136, -121668, 219233, 304845, 125074, -54647, 42049, 466138, 989058, 1307806, 1323098, 1152838, 914626, 660812, 505556, 573603, 778604, 893941, 888285, 908627, 890063, 577255, 69913, -122496, 133503, 211473, -418971, -1317349, -1613410, -1177909, -646046, -427656, -372587, -403071, -742335, -1306969, -1521390, -1109641, -593807, -594981, -993537, -1194641, -953101, -511650, -107090, 242790, 553580, 836340, 1181413, 1554319, 1581328, 916521, -168079]
43161a68079p69385j03876J67207n1063j58778J98687O20796N47160J3220m56327
43151a60438n14693k72759K869J84389K41483J52706r169n9230Q0862K44274K35676
43140A25970R0018l6544j23687k25424k45723n9309J70695J22374j78464l11186
43130f71280n8492K56380K38937l1793j84591q7430O8825Q9989m3933k14564k14075
43119h52027Q3029M44048M15360m6240l68087j08796L76199M50208J34206k2013
43109E05887J24831J42592j65189m00235k27653J18893K58878J74640K4512j73696
43099C83460l62857k88896J14579M39454K82019j55713l10320j9844K94059K15459
43089E91400j50372l29795l8134M71163O37991K31220l30316m78311k30363r7087
$$ y = [-168079, -937464, -1041340, -874133, -925196, -1083974, -885287, -264491, 282669, 295889, -160438, -675131, -947890, -945021, -760632, -519149, -366443, -375612, -434842, -353980, -109706, 125970, 215988, 179444, 55757, -169667, -415390, -474699, -304004, -181630, -360094, -671280, -729772, -473392, -234455, -266248, -450839, -538269, -469444, -379455, -423388, -637952, -852027, -768998, -324950, 90410, 44170, -323917, -432713, -56514, 393694, 527900, 505887, 630718, 773310, 608121, 207886, -19767, 99126, 358004, 532644, 557156, 383460, 20603, -268293, -153714, 285740, 567759, 412046, 101726, 81882, 375941, 591400, 441028, 111233, 73099, 544262, 1182253, 1413473, 1083157, 604846, 374483, 277396]
43079B77396k72363l70888j12438K13847K59512J55297J50376J04226j67781l56435
43069a19251o1086M47559M96145O749l77317k42289P9480J24339n9010j49530
43059A45789o9428L5540Q7411R4141M3005l5796l5925O4814J48454J44839J13038
43048G35882P1057n8981k56577l56160k82497j39796j909J56586K48751P9391
43038A95747k95060m88312k79034M0315N2692k12393l52517j42975K16238L78924
43028h86375K24234m5861j16346R7270L25928K78497M1929p0290k5727q5078k63586
43017e25405k09084J91529N04800L60921P194j29296j04428k12022l36050j18807
43007e70648L32097M85851J74976j70900j86129j1866P7537Q2842J00617O8556
$$ y = [277396, 5033, -365855, -478293, -264446, -4934, 150363, 300739, 404965, 237184, -119251, -180337, 267222, 763367, 770116, 392799, 150510, 229990, 354329, 295319, 145789, 76361, 111901, 199312, 293453, 336458, 300662, 264737, 329551, 478005, 622844, 735882, 806939, 747958, 491381, 135221, -147276, -287072, -288981, -132395, 116356, 195747, -99313, -587625, -866659, -826344, -773652, -986045, -1338562, -1481537, -1265299, -886375, -662141, -708002, -824348, -727078, -401150, -122653, -80724, -151014, -176741, -261819, -525405, -734489, -542960, -38160, 322761, 329955, 200659, 96231, -115791, -451841, -570648, -238551, 247300, 422276, 251376, 65247, 53381, 130918, 213760, 314377, 382933]
42997C82933o4080j51608o4752Q2779J03965J61q3911n2121P7506J76866N8313
42986D66051k97376n65553l92500P7855L06026Q2563j91561j21744J34294K09852
42976b92093J16436J28397K71318K98114R8164j77292l62610m10889l26740j70470
42966h27665o3731j6946J26973L85871M61762J53346k29938k29057J09021L37146
42956B06782K85119J73471P7326j91387n64802o22312k47580R8152O4380p3886
42946g94737L6760K04053J12182j2043J98644M34723P7418o47812p32121J42790
42936i80143R54922O76543l14130q18386m59457J3671l4322l35615l43639l4624
42926a675180K62990M25694N21481M94302K63083R814R22J57822J34128j51689
$$ y = [382933, 318853, 167245, 102493, 185272, 289237, 289398, 205487, 153366, 230872, 407738, 466051, 168675, -396878, -789378, -711523, -405497, -322934, -514495, -636239, -501945, -292093, -175657, -47260, 224058, 522172, 620336, 443044, 80434, -330455, -657195, -827665, -891396, -908342, -781369, -395498, 66264, 219610, -10328, -239385, -130364, 206782, 491901, 665372, 742698, 551311, -13491, -635803, -883383, -785231, -720851, -794737, -757977, -553924, -441742, -453785, -255141, 179582, 257000, -390812, -1122933, -980143, -25221, 651322, 337192, -481194, -940651, -926980, -961302, -1296917, -1640556, -1675180, -1412190, -986496, -465015, 29287, 292370, 302184, 303106, 460928, 595056, 443367]
42916D43367l59825k06943J35369K71884O5574k58437m01594k60276L7012K49325
42906b84544K02190o9422l48676m31169k77523R858K78193L75682K27275n5357
42896c73493k11986q1857K10993L83814K76888l1956l28944m13343k19056J09415
42886f79525L11255K82624K02632K64179L48204J68807k58389n37307l91855m0730
42876c30105J15149L4180J2325J74672K81495J32064q0133k6295K56760L71193
42866I41305R1465l10037m05494j68303J1663j14544k88933j11794L35128N15016
42856D95472J60245l08177l33419o831Q5982k29863m36687j36299K97234K81785
42846a30558o4633j37373J52136K29407j72648n23064l13929J38262K08801p5640
$$ y = [443367, 83542, -123401, 11968, 283852, 349426, 90989, -310605, -570881, -533869, -284544, -82354, -151776, -500452, -931621, -1209144, -1199286, -921093, -545411, -318136, -373493, -585479, -667336, -456343, -72529, 204359, 172403, -156541, -569884, -788940, -679525, -368270, -85646, 116986, 381165, 729369, 898176, 639787, 102480, -289375, -330105, -214956, -180776, -168451, 6221, 287716, 419780, 339647, 313352, 570112, 941305, 1032770, 722733, 317239, 148936, 160599, 46055, -242878, -354672, -19544, 495472, 655717, 347540, 14121, 7290, 93272, -136591, -573278, -709577, -412343, -130558, -195191, -332564, -180428, 48979, -123669, -646733, -960662, -822400, -613599, -689239]
42836f89239j82406J9844J37692J0134m7248J09656J52190r6574k46215N4454
42826g77712M88114N19539K08864O2301K16452L13660J91563J59575M04453N55787
42816B342596J78856n27718q75816n00867K02926N17613J61391m49178o69959
42807C79844l08936K19735M11431K11360n5051j57992j59007j76093k02124k15234
42797e2067k57725k97607j85409J15059L87611M06870K27655Q6024Q3881J23276
42787F37568J09270N9767J2698m0677r6798j09356n7883Q244J6233p1372k30903
42776B36791l65303l46380j43526R7893J82007P3593p5993j11374j5549J21564
42766c46277J88248J00014j24064k94068j81174J88870M73271L79213L4087j72311
$$ y = [-689239, -871645, -851801, -714109, -703975, -751223, -641567, -489377, -585951, -832166, -777712, -289598, 229941, 438805, 501106, 717558, 1031218, 1222781, 1382356, 1786809, 2342596, 2521452, 1993734, 1117918, 617051, 819977, 1337590, 1498981, 1049803, 379844, 70908, 290643, 702074, 913434, 858383, 700391, 541384, 365291, 163167, -52067, -309792, -607399, -792808, -677749, -290138, 116732, 344387, 430411, 514292, 637568, 746838, 806605, 819303, 778626, 681828, 572472, 514589, 522833, 539066, 467694, 236791, -128512, -474892, -618418, -520525, -338518, -264925, -340918, -452292, -467841, -346277, -158029, -58015, -182079, -476147, -657321, -468451, 4820, 384033, 418120, 245809]
42756B45809r2289L4604q649q7873K1516K04456J20333k62738n30599l47565Q4708
42745f18287K93015J48283j8231Q8796L39339L92741J58740j20676k10706j44902
42735C08112j02453j48473k03035k00668j43429j8096J70785K59979L8820l72156
42725d10614m87461o4242M35356L75312j33930l34520O8984M43512J87400l34961
42715b55164l56030J20167L84375J66347j3740K10239M24002J32934m03567n36734
42705a27171j43707L11862M80634M18618K31238j09153n05636o74714n07749k35452
42695h61230q3285O847J43457J98227P746k66098k76327Q063K14551Q3100j56472
42684i81421j19192J71045L25478J66448m3932m1098O8554P5094N2475J68338
$$ y = [245809, 153520, 188124, 179475, 91602, 113118, 317574, 437907, 175169, -355430, -702995, -618287, -325272, -176989, -195220, -106424, 232915, 625656, 784396, 663720, 453014, 308112, 205659, 57186, -145849, -346517, -489946, -508042, -337257, -77278, -38458, -410614, -898075, -962317, -526961, -151649, -285579, -620099, -551115, -107603, 79797, -255164, -611194, -491027, -106652, 59695, 45955, 256194, 680196, 813130, 409563, -127171, -270878, 40984, 521618, 940236, 1171474, 1062321, 556685, -118029, -625778, -861230, -944515, -937668, -794211, -595984, -588238, -854336, -1130663, -1122600, -908049, -824949, -981421, -1100613, -929568, -604090, -437642, -481574, -522672, -454118, -379024, -326549, -158211]
42674a58211K86565J54337r9040j02255J05267O7589k95029m28212o713M40605
42664c5097K80434k20146k88407J42987L51744m585l54973j34740L49136M27455
42654E13808N8918k09068r3493J08957O9048j16832j64245n0905k5870k29585
42644a39267m48078l15731K39555Q27337R66310O08543J81360J08630M21880Q44941
42634C295480J075159R25879L99345k47972o63465p50696p36438p96491q07805
42625A692996o19449l55647k16512j46457K1512K11027K00419J6309q5285k8457
42615F90456n955j20531k27450k11034j48792r8069K2946K06128K45250L1382
42605C84331k33197k90840j41693M6414J67319J62647j5552k27713j54301K39467
$$ y = [-158211, 128354, 282691, 183651, 81396, 186663, 254252, -40777, -468989, -475702, -35097, 245337, 25191, -263216, -120229, 231515, 226930, -128043, -262783, 86353, 513808, 572726, 363658, 270165, 379122, 448170, 331338, 167093, 116188, 90318, -139267, -587345, -903076, -663521, 163816, 1130126, 1738669, 1920029, 2028659, 2450539, 3295480, 4370639, 5296518, 5695863, 5447891, 4784426, 4033730, 3297292, 2500801, 1692996, 1073547, 717900, 501388, 354931, 376443, 587470, 787889, 804198, 718913, 690456, 684501, 563970, 336520, 125486, -23306, -121375, -98429, 107699, 352949, 384331, 151134, -139706, -281399, -234985, -67666, 94981, 79429, -148284, -302585, -63118]
42595f3118M51260M0711o35190p51454j13113N42828N21681L1925k38484q9416
42585c02370P7796k1237j79665j20005O3384Q9795o4658j34762N8657L59892M48702
42574B75529J95793j97310m05127k95452k0331J85349K32814J87513J22652M5874
42564C27304m1355q1231Q753K38176M74058N07106K65831m1031j15902M9261J24242
42553A715212j25202m88679n72638l25418q0682q6633k16440k15858n8517O4065
42543c90790J0696j45481j84242M0911L85706M69866J02100l84982m57048o6218
42533f19482K60899J46375j20811m0885L49055N40183K85844q9116j71224L0316
42523E71154J87644R0949j66423l58731l69706k68302j81899j23507r251J39598
$$ y = [-63118, 388142, 428853, -206337, -957791, -1070904, -528076, -6395, 25530, -212954, -302370, -224574, -245811, -425476, -545481, -482097, -392302, -456960, -591722, -533065, -173173, 275529, 471322, 274012, -131115, -426567, -446898, -261549, -28735, 158778, 281430, 327304, 285949, 204718, 213471, 451647, 925705, 1432811, 1698642, 1657611, 1541709, 1590970, 1715212, 1590010, 1101331, 528693, 203275, 122593, 35960, -180480, -396338, -454855, -390790, -380094, -525575, -709817, -668906, -283200, 186666, 288766, -96216, -553264, -619482, -358583, -212208, -333019, -373904, -24849, 515334, 801178, 712062, 540838, 571154, 758798, 849747, 683324, 324593, -45113, -313415, -495314, -618821, -628072, -488474]
42513d88474J46354o3663k77378k32232L7054K64933L03149K10217N1863j51596
42503a99773k85182j90492Q7209K96396K80671J24742k3522j04151j02573m0294
42493a56969k0281r6046j19529M6857K13452Q6227k04970k22479N4860J13343
42483c05535k67196n62972k67741L14212N32427L34816J82927K29613K04669N1095
42473D46315L5225J47717N283m43881o61594k87281K74620M25681K03720J01021
42463B46826K55343K96089k5890m56659n96288l77502m7824J72834K68821L10858
42453D6608K85328J08726j98052m33148l97842j31820J29570K21955J77298J03717
42443h7660P0341J05200J61270Q9572j75593m02682k73035J32270L29646P6921
$$ y = [-488474, -342120, -405783, -683161, -915393, -878339, -613406, -310257, -100040, -48177, -199773, -484955, -675447, -588238, -291842, -11171, 113571, 90049, -14102, -116675, -156969, -177250, -273296, -392825, -345968, -132516, -46289, -251259, -473738, -418878, -305535, -572731, -1135703, -1403444, -1089232, -556805, -221989, -39062, 190551, 395220, 446315, 481540, 629257, 634540, 190659, -470935, -758216, -483596, -57915, 145805, 246826, 502169, 798258, 772368, 315709, -280579, -658081, -705905, -533071, -264250, 46608, 331936, 440662, 242610, -190538, -588380, -720200, -590630, -368675, -191377, -87660, -17319, 87881, 249151, 338723, 163130, -239552, -512587, -380317, -50671, 26250]
42433B6250k33815q3312M51056P92245O18416K05907k4799l2045p4422k77258
42423A368223m79196m91952l49238k03517o1252J93654M69783L95895j81780p73463
42413a12843o93664L4674O13322M68342n4755k75631j17130k1735j42426j63809
42403d65655O0165K02240j3545l58549m32885k07197L7923J61674K80196M77558
42393b58075O23292N27915J76027k29747m23452k97516j2313J46248O0514j00251
42383B12642j00691N1427Q9056j88788o09339p29068l14458L28120O37230M22237
42373b01632M0890j05964m1581j5287n7090k1100O0495K8013l6304J16844L93456
42362A60740L33692j95650o46236m54048J73629N08360K31116k42538l59437l8847
$$ y = [26250, -207565, -290877, 160179, 952424, 1570840, 1776747, 1751948, 1719903, 1645481, 1368223, 889027, 397075, 47837, -155680, -216932, -23278, 446505, 842400, 660620, -112843, -806507, -771833, -158511, 309831, 255076, -20555, -137685, -159420, -301846, -465655, -405490, -203250, -216795, -575344, -1008229, -1215426, -1177503, -1015829, -735633, -258075, 365217, 893132, 1069159, 839412, 415960, 118444, 106131, 252379, 312893, 212642, 111951, 163378, 252434, 63646, -545693, -1274761, -1589219, -1261099, -623869, -201632, -160742, -266706, -308287, -323574, -380664, -401764, -341269, -313256, -349560, -232716, 160740, 494432, 298782, -347454, -801502, -627873, -119513, 111603, -130935, -490372, -529219]
42352e29219L80893N57415L90385J7660l07256m02862k91159j16930K9295J21302
42342a50476R7563p0134k21054j38095J04596J54954j15552l34590r2882M41863
42332c23807O75080L42031j77470l86608k47150n4970L6363J00364J63532J41734
42322B69099M0137l4422p3745j37655j16450J61299N03779M11472k14455p49636
42312E9423n75701J04133N66846N10919K51821Q1973m8531j76738j58509j3572
42302F02064p141j86321k28793J4493K12004P7900j56304j52701l0443r7255k69253
42291b21750k28924l9J14290P7773J27963K66697K19898n2096k53225k47000k24038
42280d20451k56475j25014K13395M01386K05054q3913r5944M9500j860k16521
$$ y = [-529219, -148326, 409089, 799474, 817134, 509878, 107016, -184143, -301073, -271778, -150476, -52913, -123047, -344101, -482196, -377600, -222646, -338198, -672788, -765670, -323807, 351273, 693304, 515834, 129226, -117924, -172894, -136531, -36167, 127365, 269099, 309236, 274814, 201069, 63414, -53036, 108263, 612042, 1023514, 809059, 59423, -516278, -412145, 154701, 665620, 917441, 999414, 950883, 774145, 615636, 602064, 594923, 408602, 179809, 194302, 406306, 484206, 327902, 175201, 144758, 47503, -221750, -450674, -450713, -336423, -258650, -130687, 136010, 355908, 303812, 50587, -196413, -420451, -676926, -801940, -588545, -187159, 17895, -66018, -161962, -112462, -114322, -330843]
42270c30843k19948R4018L75861L02890j5197k15985j16687J25849K28643J09016
42260C37617k5354L4298J67614O8620k61088m35148k43751o595q6655k89202j52550
42249h92194K75865M36106R2055k88556k15662J28956K24250N525r3704J49059
42239a78300L98605K64332j32539l31995j51699J10544R7572j66292l43473k04396
42229f37641J18283K92333J54415j11056j80763K3843K37531K01756J8277j7996
42219I8982J08484R6036j66007l49120j65366J51355J73199o8917j56877M7281
42209b30950K42717K50723K77754M32660M08662k5773n32570n92798k03002J95070
42199B22493L49597L65364K98328K3192m06514o36953m45569n8542J47015Q9898
$$ y = [-330843, -550791, -456773, -80912, 221978, 206781, -9204, -125891, -42, 228601, 337617, 312263, 346561, 514175, 582795, 321707, -113441, -357192, -363787, -450442, -739644, -892194, -616329, -180223, -88168, -376724, -592386, -463430, -239180, -233655, -327359, -178300, 220305, 484637, 352098, 20103, -131596, -21052, 76520, -89772, -433245, -637641, -519358, -227025, -72610, -183666, -364429, -340586, -103055, 98701, 116978, 98982, 207466, 303502, 137495, -211625, -376991, -225636, -52437, -121354, -278231, -230950, 11767, 262490, 540244, 972904, 1381566, 1355793, 823223, 230425, 27423, 222493, 572090, 937454, 1235782, 1258974, 852460, 215507, -230062, -288604, -141589, -51691]
42189e1691l6184r0120q5307k8073J28965L22072L26623J6433l76643m39246q2334
42178c95505K84331K45885o7123j75061N6307K57606J59297k2176j1919M8989
42168C80631j12552l86253m29613j91114Q2482K51236L30302K44171m9680k61045
42158a41435o0959L20620K89082k33941o23906m19292J06230M68628N86527N45051
42148H36605K22542l71819p46999m80458Q2827K43117m3675j45671K31905N93757
42138D22131M20796p8796l14777j15000J73139K31799R3882n5745j28563j22876
42128E25990n6227n583q7387k77165l37256q6007K92963M08044J64583j07571
42118D34384j37698o4476q2074k0281L15995N86823K65999m65220p97859m25177
$$ y = [-51691, -87875, -177995, -263302, -291375, -162410, 159662, 486285, 502718, 126075, -313171, -395505, -111174, 134711, 67588, -107473, -51166, 206440, 365737, 343561, 331642, 380631, 268079, -118174, -547787, -738901, -656419, -405183, -74881, 169290, 119610, -141435, -202394, 118226, 407308, 173367, -450539, -869831, -763601, -294973, 291554, 836605, 1059147, 687328, -59671, -540129, -457302, -214185, -257860, -403531, -171626, 422131, 842927, 764131, 449354, 334354, 507493, 739292, 833174, 777429, 648866, 525990, 469763, 464180, 376793, 99628, -237628, -323635, -30672, 377372, 541955, 434384, 296686, 232210, 150136, 129855, 445850, 1032673, 1298672, 833452, 35593, -389584]
42108c89584L8756P2693K6599L68525P40417N14234r3155l16939p5571r301k89775
42097E86899l25345J16753L88118K1593m34867k70976K66243M16981Q6078j76685
42087F74792j62195k04125m18082m51935j46166J48877J58116J02276K35570L54166
42077B91294J32424l02822n04900k97935O2907K61442K15337M7272m0095R0966
42067d4110L16288K80938j55087n93045n21989m1637K19050m968k23139N0211
42057g17488N31827O13922L16545K06233M19388M29173j9224l71625j09636L41509
42047A640624J76668n49758r29454m60607L15163O33043M56223K76466L10200
42038A868568K99743m047m77880p59280o03639j26004K64460K56331j8665j71705
$$ y = [-389584, -350828, -278135, -251536, 116989, 857406, 1371640, 1278485, 961546, 885975, 876674, 586899, 261554, 378307, 766425, 788018, 353151, 82175, 348418, 765399, 851477, 674792, 512597, 308472, -109610, -561545, -707711, -558834, -400718, -298442, -62872, 291294, 423718, 120896, -384004, -681939, -619032, -357590, -142253, -94981, -135076, -44110, 272178, 553116, 398029, -195016, -717005, -758642, -539592, -544560, -767699, -717488, -185661, 428261, 744806, 951039, 1370427, 1799600, 1780376, 1408751, 1299115, 1640624, 1817292, 1267534, 338080, -122527, 192636, 825679, 1281902, 1558368, 1868568, 2168311, 2164264, 1686384, 927104, 323465, 197461, 461921, 718252, 699587, 527882]
42028E27882p7858L2050K9144Q3464K37731J63374l16919p51877n67253Q1377
42018e58885M43635J76024k41089k21842J76076M63395M12047K31118J59595J63752
42008A203826Q1392r4673j86376p7248P7732l395l30115n21782k58693K32953
41998A23621L96659N8975l41191l42922l4483J52484J7558k85670n51243o40734
41988a446946l86523K44585Q40214P95327R7679m65878k32355M33368O00793M4768
41978E25032m75148l09026K37865M64832K48957r756j30472k66121l77746k00330
41968b91913J73585K31265j93289n47762l06972K49257M17085K4019m21003m62364
41958a128092j94590K5648O7084Q6089K42165M66909N11779K32716j83024l71542
$$ y = [527882, 450024, 482074, 511218, 594682, 832413, 995787, 678868, -73009, -640262, -558885, -115250, 60774, -180315, -402157, -226081, 237314, 649361, 880479, 1040074, 1203826, 1285218, 1190545, 1004169, 926921, 1004653, 1001258, 671143, 149361, -109332, 123621, 520280, 579255, 238064, -104858, -139341, 13143, 30701, -254969, -806212, -1446946, -1833469, -1588884, -748670, 46657, 144336, -321542, -553897, -120529, 480264, 525032, 49884, -259142, -21277, 443555, 692512, 682756, 552284, 286163, -91583, -291913, -118328, 112937, -80352, -628114, -935086, -685829, -268744, -244725, -665728, -1128092, -1322682, -1297034, -1229950, -1143861, -901696, -434787, 76992, 309708, 126684, -244858]
41948b44858k04034P9358J92667J11392n570l3939N2669J68329J14771j84917
41938D5868m23388k09528K79869L77090j28659n78436l43397K77342N31156K43659
41928G1576j52808l39548k89236L3173N22207O79034J82971m28231l73413J83689
41918H9414L68647k2075k90970q8496R7128k2780j4732K95970K94516l15407p55786
41907c64571l48494L06979K72530k29123l06700O6426J65483q1570k12N06635
41897a2617O75194J62102l70119l22368l749K9383j72779k18843j3982K53456
41887E678L90146K15479k94100p03157m58109K62446N96037J72964l47904l00025
41877d60545L5726L4001k28372k02533J70738M09587K68315j3482j82542k07519
$$ y = [-244858, -448892, -369534, -176867, -65475, -71045, -104984, -52315, 116014, 230785, 45868, -377520, -587048, -307179, 69911, -58748, -637184, -980581, -703239, -172083, 71576, -81232, -420780, -710016, -676843, -154636, 524398, 707369, 279138, -94275, 89414, 458061, 435986, 145016, 56520, 153648, 130868, 116136, 412106, 706622, 391215, -364571, -713065, -406086, -133556, -362679, -669379, -602953, -437470, -519040, -519252, -12617, 662577, 824679, 454560, 132192, 128443, 157826, -14953, -233796, -247778, 5678, 395824, 611303, 317203, -385954, -844063, -581617, 14420, 187384, -160520, -460545, -424819, -390818, -619190, -821723, -650985, -241398, 26917, 13435, -169107, -376626]
41867c76626q4766J57521K93597J34535j05450n3565K49520M03867K52177L5540
41857I06350o2133j29184k20333k05010l9983J10301J47308J71930K35160K02532
41847A116938n793k46197l46155l05352k15043j29649q1402p2002j5573J41947
41837a58281K42333Q4440j95504k02689J37387L67667R0434m46546o40011k97415
41827a018185J80393L73196L16800K88443L20909J70971k37795n70192m50736
41818f26196J4753L26182K22802k7170r4286o1611j50849k04857J12775O51389
41808A62932P92877K81611l71238n59577l35290j75483k43419k78156j25222K0699
41798h30266l0718j59167j21607J07599L06960K62886L644k03788j23797J44855
$$ y = [-376626, -461392, -303871, -10274, 124261, 18811, -34754, 214766, 618633, 870810, 906350, 844217, 715033, 494700, 289690, 249707, 360008, 507316, 679246, 914406, 1116938, 1111145, 864948, 518793, 213441, -1602, -131251, -212653, -284655, -300228, -158281, 84052, 168492, -27012, -229701, -92314, 275353, 365787, -80759, -720770, -1018185, -837792, -464596, -147796, 140647, 461556, 632527, 394732, -175460, -626196, -611443, -285261, -62459, -89629, -183915, -245526, -396375, -601232, -488457, 162932, 955809, 1237420, 866182, 306605, -28685, -204168, -447587, -725743, -850965, -830266, -860984, -1020151, -1141758, -1034159, -727199, -464313, -460669, -664457, -788254, -643399]
41788f43399K41184K1585j81789j1411L18829K44888k89080o17637k51090L70116
41778g97804M51526k2173k83862O0800M59736K84024k10449k95823J18065L86657
41768A50697J22786k81259k94806M2066L16482L10454Q6534k14415l70807j43316
41758b75584L28940M57973n3358o26280m82729K17069N26775M6155n37599m82144
41748h80782P472K27763J5360j80143m9050K54899M89303N94486N52621L23697
41738A355626J9774j20711n5453m2078k85092o07814o26140k17374K92591M52062
41728A65391J66628k00229k45954K0428K55086K51412J38643Q5910M3944q5490
41718E95769k13771j90067m4858P0618J02028Q4730K161j70524l33107l38574
$$ y = [-643399, -402215, -380630, -562419, -573830, -255001, -10113, -299193, -916830, -1167920, -797804, -346278, -368451, -652313, -591513, -131777, 152247, -58202, -354025, -235960, 150697, 273483, -7776, -302582, -260516, 55966, 366420, 452954, 238539, -132268, -275584, 53356, 511329, 457971, -168309, -651038, -433969, 92806, 138961, -398638, -880782, -873310, -645547, -630187, -810330, -859380, -604481, -115178, 479308, 1031929, 1355626, 1375400, 1254689, 1199236, 1157158, 872066, 264252, -361888, -579262, -286671, 165391, 332019, 131790, -114164, -93736, 161350, 412762, 551405, 637315, 681259, 595769, 381998, 191931, 147073, 217691, 319719, 404449, 406610, 236086, -97021, -435595]
41708d35595j84777m517J02504J27252R8458O8424Q2668Q8189j7981j75942j70356
41697d21673L5839J88067J31123P0789J94414K78355L1384l57105m35943j59625
41687d44375R3987J21520O4594k450j72553l37812k15257J31093K74245R9709
41677c87299l018J41646J29562k85809n96615k41509M41537O03298P2322m62107
41667e87992m54046j27607K8307o6553j44829l8821J53333K15879K9915k61409
41657a253823l16065J6991M16627M29665P5960j59705J5048L27214L42748K3969
41647h1371k84330l11993j68347j92955n00035o81320j63275R61971J709678J224385
41637A512408o7713q49714n26318J18480J25219l47699m43680O3877N28115M22228
$$ y = [-435595, -620372, -624889, -522385, -395133, -296675, -228251, -145583, -57394, -75375, -251317, -421673, -385834, -197767, -66644, 4145, 198559, 476914, 508298, 151193, -284750, -444375, -350388, -228868, -164274, -166724, -339277, -677089, -892346, -761253, -487008, -387299, -390317, -248671, -119109, -404918, -1001533, -1243042, -801505, -198207, -125885, -587992, -1042038, -1169645, -1141338, -1207891, -1352720, -1391541, -1238208, -1022329, -992414, -1253823, -1569888, -1552897, -1136270, -706605, -630645, -790350, -775302, -448088, -105340, -81371, -365701, -677694, -846041, -1038996, -1539031, -2220351, -2383626, -1421655, 288023, 1512408, 1444695, 594981, 68663, 187143, 312362, -35337, -479017, -415140, 112975, 535203]
41627E35203l0794l25560k99046j02738R5197J65449K7296k01271k50669m6737
41617d33670J73976K22322K04986K46263K05357o8026l80532m08913j66458M7334
41607c57361J01179J24533J74815J52139Q0428J27294K50424J75922j11570k15370
41597E02433Q0375L89553K51579j66639l20552q9594J33653J07129J1921k593
41587H97265q0079k80675l40114p3995K67137L29856J34504m6332j10924j57412
41577E39231k16797k24386j87427j59845j11170o902O3091K1468l3090j711m250
41566c21788j66443k90662o6072M03160O13206K96772k19323m25787k06867J34039
41556b49765K83528K04689P5161M7415Q2606K3014j62972k90053j93716L0435
$$ y = [535203, 504409, 178849, -120197, -222935, -127738, 37711, 65007, -136264, -386933, -433670, -259694, -37372, 167614, 413877, 619234, 551208, 170676, -238237, -404695, -357361, -256182, -131649, 43166, 195305, 275733, 403027, 653451, 829373, 717803, 502433, 582808, 972361, 1223940, 1057301, 736749, 647155, 780808, 887937, 899858, 897265, 817186, 536511, 196397, 122402, 389539, 719395, 853899, 807567, 696643, 539231, 322434, 98048, -89379, -249224, -360394, -367296, -304205, -282737, -315827, -317538, -321788, -488231, -778893, -844965, -441805, 171401, 468173, 248850, -176937, -383804, -249765, 33763, 238452, 313613, 361028, 443634, 466648, 303676, 13623, -180093, -149658]
41546a49658J60144J42543Q9519M5748k7056o3521P0074L19401M33308K83126
41536A303628K5812j17459j02840k5945K7888L1353P05l1744p7547j82615l00508
41525E50728k95614j81762j71560k95828k16848K43433O25594L88194j94353l23735
41515A28249J12122L38416p1888m93158k44771L26278M19148R683k43216r8870
41505A81993L0007q5135j53399j5195K1084k19170l65576p9868L36612L49519
41495H72k0410k50507o9283K41326L25426J95938O8930J1255l9479n3771M1886
41484D52183J38450K5101k47460l41123j20165Q0298n5476k72222q9580L91519
41474c8475N39762J40913k36497j01937K06300R0401l18979l29377K55675Q04319
$$ y = [-149658, 10486, 153029, 242548, 288296, 261240, 197719, 267793, 587194, 1020502, 1303628, 1329440, 1211981, 1109141, 1083196, 1111084, 1142437, 1143142, 1111398, 1033851, 851236, 550728, 255114, 73352, -98208, -394036, -610884, -367451, 258143, 646337, 451984, 128249, 240371, 578787, 506899, 13741, -231030, 95248, 514396, 524079, 280863, 181993, 212000, 126865, -26534, -41729, -20645, -239815, -605391, -685259, -348647, 872, -19538, -270045, -339328, -98002, 227424, 423362, 492292, 503547, 464068, 410297, 452183, 590633, 615734, 368274, 27151, -93014, -12716, -68192, -340414, -429994, -38475, 501287, 642200, 405703, 303766, 510066, 600467, 281488, -47889, 207786, 1012105]
41464A012105O86116K4682n51388o35813l46425o0165O358j6501J23639L82013
41454F24621L89566j1625m21995l78261m4312J597l57003n65482j97846M27301
41444e33439O77846L83376r4375l82811l96157j95798J41944M47396M57145P0555
41434E75682m32031n85823k32369K77901M83173L28443J20776M8012J6288l7233
41424E62819j5070N6250l1739k70383l40569j43037k1190j52633j70724J68015
41414c58261M04575Q5236l48560j67323M06516M81590m7194l12141R6928M82067
41404G23433K07167l22557l94119l7291K46196K88988K21014M4794k09919k61996
41394E05710n676J80847J9557j56219J5972K36977N1439k99651k33263J95146
$$ y = [1012105, 1698221, 1722903, 1171515, 535702, 189277, 129112, 135470, 118969, 242608, 624621, 1014187, 1002562, 580567, 202306, 157994, 159591, -197412, -762894, -960740, -533439, 144407, 527783, 433408, 50597, -345560, -541358, -399414, 47982, 505127, 575682, 143651, -442172, -674541, -396640, 86533, 414976, 535752, 583764, 600052, 562819, 547749, 603999, 572260, 301877, -38692, -181729, -202919, -355552, -526276, -358261, 46314, 131550, -217010, -384333, 22183, 503773, 456579, 144438, 241366, 723433, 930600, 608043, 213924, 176633, 422829, 711817, 932831, 977625, 767706, 505710, 500034, 680881, 700438, 544219, 560191, 797168, 848607, 548956, 315693, 510839]
41384E10839L92972J99657L4269Q3743M4888k15005l74260k37730p6334j39464
41374B23575k46995j26891J51547L17336K60139Q8936k2133K3702J23758K9838
41364H22812k94816m83654k22712K01552J99647k86489o59022m61732O7489L93711
41354g23214L38391J48723J03773K18632K75843J04378j58343k01435j2003K9819
41344A24564k71469n40696l57850R3744L28122K71421J85077R5082j15146k14666
41334d01817R0029M69273L17808k13110l40579R0188L42166L2861k52837l0489
41324A03493K55709Q4032k02338m3073L30865L34283L9831n3264N5039k5063k51967
41313F27547k31470k111J3853j96021k10384L8569J50686J2471n088K39305L69127
$$ y = [510839, 903811, 1103468, 1137737, 1221480, 1266368, 1051363, 677103, 439373, 363039, 223575, -23420, -150311, 1236, 318572, 578711, 667647, 645514, 669216, 792974, 822812, 527996, 44342, -178370, 23182, 222829, -63660, -722682, -1184414, -1116925, -723214, -384823, -236100, -132327, 86305, 362148, 466526, 308183, 106748, 94745, 124564, -146905, -687601, -1045451, -951707, -623585, -352164, -167087, -72005, -187151, -401817, -311788, 157485, 475293, 262183, -78396, 11792, 353958, 386819, 133982, 103493, 359202, 443234, 240896, 197823, 528688, 862971, 902802, 849538, 904577, 879514, 627547, 396077, 393966, 407819, 211798, 1414, 39983, 190669, 203140, 198052, 437357, 806484]
41302H06484J47324j19918j04145P4228J54164J14712R174k02498m17832l55507
41292A06186r287K10255O3929j17413N7521M15186M62484O9951m23065o58089
41282A77658n27301j13804L54396N67264M03470R6259o0019q2311j69065k94190
41272C52357k06123J59438M97794M52613J0315m65161n58398k08158J79816J43194
41262C57687k49425m14130j2364N26666N40590K9522l90297l79183k29225k08022
41252d28181p5976L75131P20280M11098k94917n54025j31925K45743r716m73436
41242b15924l95877J52258M51667K45499j1000j7220n0387l02580m15036q0201
41232f38801L56346L83899R1313o5864k0548n9277j75877o8308K16638K37091
$$ y = [806484, 953808, 833890, 729745, 803973, 958137, 1072849, 1082023, 879525, 461693, 106186, 96899, 307154, 371083, 253670, 311191, 726377, 1188861, 1258812, 835747, 177658, -349643, -463447, -109051, 458213, 861683, 957942, 897923, 815612, 646547, 352357, 146234, 305672, 803466, 1256079, 1266394, 801233, 242835, 34677, 214493, 357687, 108262, -305868, -318232, 208434, 749024, 778546, 388249, 9066, -220159, -428181, -504157, -129026, 591254, 1002352, 707435, 153410, 21485, 267228, 257512, -215924, -611801, -459543, -7876, 237623, 226623, 209403, 159016, -143564, -558600, -638801, -282455, 101444, 192757, 126893, 106345, 47068, -128809, -197117, 19521, 256612]
41222B56612j02484l06475l0677L98630N22799M01228L35566K77797j0697m07275
41212A335024n32390l44174j76791j76164j31133N3391J45369L1195j5777K00309
41202C88859L75653J26658l62774n40680k66769M0743Q1677O1676K27367M10914
41192E43324L51086J72848J50194J78786n7279m54915n17415j03145K92042K06998
41182G62524j85427m07065l09226q5958J08852K29215J92536K001j04619M6056
41172B48889K16728O3184k86056l53733k8492K62542K11821O5798J67314L75904
41162I43899K81192j49927m74755l48043L4976J84889q3814m36837m43830j13118
41152f05368J61322J63920J03221J76234J95195m8249k89948j15718L24472M38935
$$ y = [256612, 154128, -152347, -183024, 215606, 738405, 1139633, 1475199, 1752996, 1742299, 1335024, 802634, 458460, 281669, 105505, -25628, 27763, 173132, 204327, 188550, 388859, 764512, 891170, 528396, -12284, -279053, -238310, -156633, -94957, 132410, 543324, 894410, 1067258, 1217452, 1396238, 1338959, 884044, 366629, 263484, 555526, 762524, 577097, 170032, -139194, -225152, -116300, 112915, 305451, 307452, 202833, 248889, 465617, 528801, 242745, -110988, -139480, 123062, 334883, 400681, 567995, 943899, 1225091, 1075164, 600409, 252366, 287342, 472231, 388417, -48420, -492250, -605368, -444046, -280126, -176905, -671, 194524, 146275, -143673, -259391, 65081, 504016]
41142E04016P7547k27355q7835J60987L3668l45924m79933k45317K9147J15123
41132d65876J11187J39158J56673J27360J33933K44633M00491M61815L03033o6230
41122A546177l97888l69559R492L17988K26357r5785k96119l53209m47011m92056
41112c51613k41160J92622L81131K15974O4452J51808K12238n800k66333k14644
41102A38675O4462K38507K72476L53981L90371P4545m97364p52494m06414P8438
41092d4817J33667r3250j3147M19345N43820j4698o69979o03941R2175N27925
41082B77100K28945k94015l69592p4939O9008k2187L9213L63238N48855L31033
41072A096659K0193M1251L36464N12764L79975O0342k87028n54096n90666l34693
$$ y = [504016, 581563, 354208, 266373, 427360, 461028, 115104, -364829, -610146, -580999, -465876, -354689, -215531, -58858, 68502, 202435, 447068, 847559, 1309374, 1612407, 1546177, 1148289, 778730, 788222, 1106210, 1332567, 1236782, 940663, 587454, 140443, -351613, -592773, -400151, -19020, 196954, 261406, 413214, 625452, 619652, 353319, 138675, 203137, 441644, 714120, 1068101, 1458472, 1533017, 1035653, 283159, -123255, -44817, 88850, -4400, -17547, 401798, 945618, 930920, 260941, -343000, -250825, 277100, 506045, 212030, -157562, -232501, -163493, -185680, -146467, 216771, 765626, 1096659, 1116852, 1158103, 1494567, 2007331, 2387306, 2447648, 2160620, 1606524, 1015858, 681165]
41062F81165k0200K7073j72038k70579r1221J64602K73702K68312K15794J3726
41052A090336l49310n58198l20820J64950M17588K97195J07778P4189N2540j36973
41042H39275l73521m03645j71761J47997L19735J89169j63931l82084j81067K09315
41032B9482K78513J111o5909L12566N49452J07096n61480o18987j31773O0665
41022c9264k79147m29901M1212N26842L74566n9301l8796L42315L65938j23195
41012F81269n14136m04303r3708K3462j1459j0436N360j2280M0970J82081K21476
41001A08296R4882J5791P4248O313l29503n42308k01534M28232O23287J68736
40991D46440l51913l62349j5341J34303p8918k92003j84396J13678K53198J13495
$$ y = [681165, 660965, 688038, 516000, 245421, 154200, 318802, 592504, 860816, 1076610, 1090336, 741026, 182828, -137992, 26958, 444546, 741741, 849519, 923708, 976248, 839275, 465754, 62109, -109652, 38345, 358080, 547249, 383318, 1234, -179833, 29482, 307995, 309106, 243197, 555763, 1105215, 1212311, 650831, 31844, -99929, -39264, -318411, -748312, -707100, -180258, 194308, 135007, 96211, 438526, 804464, 681269, 167133, -237170, -330878, -307416, -318875, -329311, -323951, -336231, -295261, -113180, 108296, 203178, 218969, 293217, 299530, -29973, -572281, -773815, -345583, 277704, 446440, 94527, -267822, -283163, -148860, -227778, -519781, -704177, -590499, -337301, -223806]
40981b23806j11310j88269q3415O7061J28651P5823j8081n0127K4422J26312J03326
40970a49413q0846k27210r0080K73734M78777K56037j76661l70346k16355k3656
40960c26019j0944k1621J08195J99941N4402r5937J16757N23260N31619J0573
40950A090226m20626k46157K04373K54461j55985m61434k95431J21811M06101
40941D97339M23267K26677p5277k82624k02251J02056L42104L35032J26016j90187
40931A302152n17553o43939l90528O9940L33227K62254Q6506k2059j21332j85701
40921A72967l4721K66849L39940M4748k66808k96182k13049k25799j36564K51121
40911i7498N97846M12509j88222n76883m16347J4110K56718J31469j94125l45160
$$ y = [-223806, -335116, -523385, -606800, -539739, -411088, -335265, -353346, -403473, -379051, -252739, -149413, -230259, -457469, -547549, -273815, 204962, 460999, 284338, -86008, -302363, -326019, -336963, -358584, -250389, -50448, 3954, -91983, 24774, 548034, 1079653, 1090226, 669600, 423443, 627816, 882277, 726292, 264858, -30573, 91238, 497339, 920606, 1147283, 1072006, 789382, 587131, 689187, 1031291, 1366323, 1492339, 1302152, 784599, 140660, -249868, -179928, 153299, 415553, 502059, 480000, 358668, 172967, 138246, 405095, 745035, 789783, 522975, 226793, 13744, -212055, -348619, -97498, 500348, 912857, 724635, 147752, -268595, -254485, 2233, 133702, -60423, -405583]
40901d05583n7989M24076M86819m5779n29010l32397K33964L86984N5323r6847
40891A19561K02275M21657J35053l12403l90841j44652L5660M4630M9022P2120
40881B32082n245j24040p2813J48405K37768l1772m57305n66888j81622K93005
40871e28425L24725l5859k18472J8853K37115P8192r9640J39377M32781J16624
40861D65271n95711p65689j05710N97376O43646K71577K6418m9010j44145j53464
40851A90559N7487K47159J49757n6799o2462N6815M1644n9796j2022J59311K09317
40840I20970O7608q9447q3249J13262L37887K93214j09689m37203j77487M21272
40830A257138N16943j06571o31897m18392M1694j9645m17105m29921l9084J42609
$$ y = [-405583, -463572, -39496, 447323, 401544, -127466, -459863, -225899, 161085, 216408, 119561, 321836, 743493, 878546, 566143, 175302, 30650, 66310, 110940, 159962, 232082, 226837, 102797, 29984, 178389, 416157, 384385, -72920, -639808, -821430, -528425, -203700, -239559, -458031, -439178, -202063, -123871, -223511, -84134, 348647, 465271, -130440, -896129, -1001839, -404463, 239183, 510760, 537178, 488168, 344023, 190559, 248046, 495205, 644962, 588163, 525701, 582516, 624160, 564364, 552342, 711653, 920970, 988578, 899131, 815882, 929144, 1267031, 1560245, 1450556, 1013353, 835866, 1257138, 1774081, 1667510, 1035613, 617221, 658915, 639270, 222165, -207756, -246840, -104231]
40820a04231k0363l6520K59759M20950J89999r6967j17071q838n034q5838j81910
40809B13936l07612l35552l7280M86026P69619N44315L9301l72641n38493m67018
40799e399k25455J4065R2526P8631J29488J85977J10251L6327J84649L91674K87834
40788A280568p1392k51836j48528j16124k96844l64234j22901J37170J25609l2796
40778A38692r4413l2048J08995L12387M03120J68030k13563l20478j74923k14172
40768H1627m36329k73244L83730P75664L85188k28860l24396q5823r7197k39957
40758e9597j2312M01212L49376j24390k71073J66604N81185M73710O0929k87318
40748A278326n31104o23231l26705K82491O49472M40577n682k37383k82116l50884
$$ y = [-104231, -124594, -161114, 98645, 519595, 709594, 612627, 495556, 486718, 481684, 395846, 213936, -93676, -429228, -466508, 19518, 789137, 1333452, 1372753, 1000112, 461619, -5399, -230854, -216789, -124263, -45632, 83856, 269833, 380084, 416411, 601060, 992734, 1280568, 1209176, 957340, 808812, 692688, 395844, 31610, -91291, 45879, 171488, 138692, 44279, 12231, 121226, 433613, 836733, 1004763, 791200, 470722, 295799, 81627, -354702, -627946, -244216, 531448, 916636, 687776, 363380, 277557, 180360, -59597, -71909, 329303, 678679, 554289, 283216, 449820, 1031005, 1504715, 1565644, 1278326, 747222, 123991, -202714, 79777, 729249, 1169826, 1164144, 926761, 644645, 293761]
40738B93761l59682j55041R4844J43074O7634P4904J22990Q6078O3390J54968
40728E86920J61688p1463k33369K4778L97213K64510k94997m92179Q594N39644
40718H91339L97741j54405l51152m0558K33423J12292j70559k79465k00233o4267
40708C74156P4260J40457K4589j81880k00021L6049K37195J71416k2311r9110
40698E54800m6132L2293J24481J92983R5390j31366j72476Q1288K37107k0543
40688I47825l29733j53818L07144L44845j53369n04145k62158J85495L17593J91917
40678H91596J00768J9044j57776k25470l906K45656K07875N1750R4107J76845
40668A400489n1050m03405l51814Q5327L03529O1340j64708l552K25811J29412
$$ y = [293761, -65921, -220962, -126118, 16956, 84590, 159494, 282484, 368562, 431952, 586920, 748608, 677145, 443776, 468554, 865767, 1130277, 835280, 343101, 351695, 891339, 1289080, 1134675, 783523, 742965, 976388, 1088680, 918121, 638656, 438423, 374156, 448416, 588873, 613462, 431582, 231561, 267610, 504805, 676221, 653910, 554800, 508668, 540961, 665442, 858425, 953815, 822449, 649973, 731261, 968368, 947825, 618092, 464274, 771418, 1116263, 962894, 458749, 196591, 382086, 699679, 891596, 992364, 1011408, 853632, 628162, 624256, 869912, 1077787, 1129537, 1223644, 1400489, 1349439, 946034, 594220, 679547, 983076, 1044416, 879708, 876156, 1101967, 1231379]
40658A231379o4586N8675L13535J74152l14911n12982j44423K70828K01755j19615
40648A093807j10032K52246M27560J76436q3000M8264L22094K34738j89162m27631
40638A745320k33668L2775l1118k98928l47052p3659J89674J46730j05142k41664
40628G83268j06656J48365K80961K33702J47865J31323J17661J9668p4898m857
40618A676402J99915L18873K37252J05520J37558L47154N63467O56445O68185
40609D910771P02111P12691M92433m1464o19219q72496q01566p18573o90165m27446
40599B647077R0632L43791P991m32608l45296Q7086J98873p7009j97687L847J17151
40588B443848j69J8346K47524K14339k38032n51010l14457J12711K58127J92809
$$ y = [1231379, 1166793, 1225468, 1539003, 1713155, 1398244, 885262, 740839, 1011667, 1213422, 1093807, 983775, 1236021, 1663581, 1840017, 1757017, 1805281, 2127375, 2362113, 2172951, 1745320, 1511652, 1544427, 1513309, 1214381, 867329, 793670, 983344, 1130074, 1024932, 783268, 676612, 824977, 1105938, 1339640, 1487505, 1618828, 1736489, 1756157, 1681259, 1676402, 1876317, 2195190, 2432442, 2537962, 2675520, 3022674, 3586141, 4242586, 4910771, 5612882, 6325573, 6818006, 6776542, 6157323, 5284827, 4483261, 3764688, 3074523, 2647077, 2737709, 3081500, 3089491, 2656883, 2311587, 2398673, 2597546, 2520537, 2322850, 2326697, 2443848, 2443679, 2462025, 2709549, 2923888, 2685856, 2134846, 1820389, 1933100, 2191227, 2384036]
40578B384036J05982j33541m95196n06020k4268L22240R9328j55018J56207O10993
40568B364743M86950M2579O7623N00917N64971J15834j88432n6820P5174m2942
40558C930597q7438J40802L80747M41797M16428K74863r8550m21921k63302J87449
40548D901472L19592J13392J60675N86843Q03641N37199K65696L34787M12375
40539H435672J85432q3247o1636J75831M73988Q29397J069363R04642N15552M63903
40529A2908897Q35386J120751J098152J116139J362838J641752K000604K699605
40521B4784124L421385L526138L290509L771923N163461O509027P437328Q873165
40513F6777060J1540254J5124101J9473106K5226070L2815645M2445028N4811969
$$ y = [2384036, 2490018, 2356477, 1861281, 1355261, 1330993, 1653233, 1752561, 1597543, 1753750, 2364743, 2851693, 2894272, 2961895, 3462812, 4027783, 4143617, 3955185, 3898365, 3973539, 3930597, 3843159, 3983961, 4364708, 4806505, 5222933, 5497796, 5399246, 4977325, 4714023, 4901472, 5221064, 5334456, 5495131, 6081974, 6885615, 7422814, 7688510, 8023297, 8435672, 8621104, 8537857, 8476221, 8652052, 9126040, 9955437, 11024800, 11929442, 12444994, 12908897, 13744283, 14865034, 15963186, 17079325, 18442163, 20083915, 22084519, 24784124, 28205509, 31731647, 35022156, 38794079, 43957540, 50466567, 57903895, 66777060, 78317314, 93441415, 112914521, 138140591, 170956236, 213401264, 268213233]
40506B68213233O8310764P4259752N9890362K1525674k6617711o1980055p2902728
40499C30699291o5557195n2785349m1361577l1503398k3101399j7342811j4025662
40492H5021900j1447966q958815p245917o380514n604548m829622m561459m492137
40484C1500922l776769k618250k087507k363081k501123k019276j458880j235572
40476A3440464j074161p99909o90565p96392p62048n35199m97932p33953q65556
40467F684749p35690n87635n00404l08657j13318j89384l77747k77188k2247r6002
40457C476477l90905l33286K4755K2194l61653l52007K10934M29052j43034o30244
40447A952283k57454L31685J68413m08804l83807J92291L52541r4886k83166K04501
$$ y = [268213233, 336523997, 410783749, 470674111, 492199785, 465582074, 403602019, 330699291, 265142096, 212356747, 170995170, 139491772, 116390373, 99047562, 85021900, 73573934, 64615119, 57369202, 50988688, 45384140, 40554518, 35993059, 31500922, 27724153, 25105903, 23018396, 20655315, 18154192, 16134916, 14676036, 13440464, 12366303, 11566394, 10875829, 10079437, 9317389, 8782190, 8284258, 7550305, 6684749, 5949059, 5361424, 4861020, 4552363, 4439045, 4249661, 3871914, 3594726, 3572479, 3476477, 3085572, 2752286, 2777041, 2799235, 2437582, 2085575, 2296509, 2725561, 2582527, 1952283, 1694829, 2026514, 2194927, 1786123, 1402316, 1594607, 1947148, 1852262, 1569096, 1773597]
40437A773597O82496N72133L05256M69749P69120N06713l02847r41614r40963
40428B893640n30005j78213p0464q3209m1741Q2740J53353L4963k11688l80335
40418A669041l67510k46312q9997R8456K45919K10461J2489j27943q3541L7438
40408A358501J25699K18635L03321K50170J21963K47542P11389J042030P64445
40399E143695N3883n38064q07457r07977q32625m58441l1177K8633j53356l3390
40389A463724L74733L80750k33202p01234m23256N8482n8223n20494m60067J78676
40379E9889N88810L82648K4652q3141j10188k01723j39996J07161J66089q1121
40369G13080k10003K4752K51846J54304K9481K25703N09484M92438K76350J85427
$$ y = [1773597, 2456093, 3028226, 3333482, 3803231, 4572351, 5079064, 4776217, 3834603, 2893640, 2363635, 2185422, 2114958, 2031749, 1990008, 2072748, 2226101, 2261064, 2049376, 1669041, 1301531, 1055219, 965222, 1063678, 1309597, 1520058, 1532547, 1404604, 1321063, 1358501, 1484200, 1702835, 2006156, 2256326, 2378289, 2625831, 3337220, 4379250, 5143695, 5197578, 4659514, 3852057, 2944080, 2111455, 1653014, 1621837, 1650470, 1497114, 1463724, 1838457, 2219207, 1986005, 1284771, 861515, 919997, 861774, 341280, -118787, 59889, 648699, 1031347, 1055999, 972858, 862670, 660947, 520951, 628112, 794201, 713080, 503077, 527829, 779675, 933979, 963460, 1189163, 1698647, 2191085, 2467435, 2652862]
40359B652862K42685L84082P58682J268802J269088M15694n64260p41949l35734
40350E349952l04737p76778r11589l97661k1039l65896q60407o98259k8157M18347
40340A403776L87361J46376j56422n07047o32458k67538K43452K21326l89248
40331D49578q34690n05497K93244P53009N15243j8350k36777Q200L19814K74974
40321A018748p8098l29356k56897o6014k3794q5385n5577O2736J22383J16848
40311D25594J43722J41225m8982l35346l78823n7355K94714K81026o6183l68769
40301C0823l85343k13784l7031J15898K69011L25738J73565q9000k09109r4633
40291a13865P0627Q4560l9434j83835l17175m15375l30074K2654L97560M15905
$$ y = [2652862, 2895547, 3279629, 4038311, 5307113, 6576201, 6991895, 6427635, 5685686, 5349952, 5045215, 4268437, 3356848, 2959187, 2938148, 2572252, 1711845, 1013586, 985429, 1403776, 1791137, 1937513, 1781091, 1274044, 641586, 374048, 617500, 838826, 449578, -385112, -890609, -597365, 155644, 670887, 652537, 415760, 423960, 743774, 1018748, 940650, 611294, 354397, 288383, 264589, 179204, 123627, 186363, 308746, 425594, 569316, 710541, 661559, 326213, -52610, -109965, 184749, 465775, 399592, 30823, -354520, -568304, -605335, -489437, -220426, 105312, 278877, 189877, -19232, -113865, -43238, 41322, 1888, -181947, -499122, -914497, -1244571, -1221917, -824357, -408452]
40281d08452O0297k68706k61158k9202J69617K87491L82484L77540J81396p4749
40271D16558j77602j37568j16118j15332j6105J04310K4797j86159j38470K95011
40261d6678O78100N91887K65156K16560M14772L20773j92771n41356l22082J8614
40251A402975r3455l75827j36261M76975N34119k16476q02579m17583L49863L97163
40241A118914k59343o15140k48363J74371P7964j86762o6211K82464L14475n6667
40231E35702m22638m73058k41064Q8042L07421K65017N3944k3444J22879J98683
40221D11484q956k58513k36386n5560j4596p8726j6368J06271K5968j91861j86460
40210e03703J18813L81161L53832J80302P8985M6380r278q3900j28986j16258
$$ y = [-408452, -348155, -616861, -878019, -907221, -737604, -450113, -67629, 309911, 491307, 416558, 238956, 101388, -14730, -130062, -146167, -41857, -17060, -203219, -341689, -46678, 631422, 1223309, 1488465, 1705025, 2119797, 2440570, 2247799, 1706443, 1384361, 1402975, 1309520, 933693, 797432, 1274407, 1808526, 1592050, 789471, 371888, 721751, 1118914, 859571, 244431, -3932, 170439, 248403, 61641, -4570, 277894, 592369, 535702, 113064, -359994, -601058, -513016, -205595, 59422, 113366, 89922, 212801, 411484, 402528, 144015, -92371, -147931, -162527, -241253, -257621, -151350, -125382, -317243, -503703, -384890, -3729, 350103, 530405, 609390, 655770, 646492, 562592, 433606, 317348]
40200C17348l4232K2544j39987m77593n45149o5279M81033L73115k70251n68085
40190i06536j58160K83827J25186k71294j94308L15073O35036N17169K36532k1309
40180E61216k98554m64740k72002J47998L42970J73640l9469o8133n4083j40045
40170a11202k23032k03477j31266L159K70599M95989L38731j68314n35979m51346
40160g16138j29339J33889L33514M51517K56279k27601m85935k14979J29937L0042
40150d38814k08435M2614N81648N80954n5316m28397j7613M91920K67156m22053
40140C93664o86429l42640l556j8746q2563M0035Q6789j24854k29209J47612O98044
40129a21853P64922K54503k28829k10258Q2967J65927R51q0187k493o1088l44983
$$ y = [317348, 283116, 305660, 165673, -311920, -857069, -922348, -441315, -68200, -338451, -906536, -1064696, -780869, -655683, -926977, -1121285, -806212, -171176, 345993, 582525, 561216, 262662, -202078, -474080, -326082, 16888, 190528, 151059, 82926, 28843, -111202, -334234, -537711, -668977, -665818, -395219, 100770, 439501, 271187, -264792, -716138, -845477, -711588, -378074, 73443, 329722, 102121, -383814, -598793, -468856, -438814, -647249, -604635, -22987, 557967, 502651, 74254, 56641, 548561, 815717, 393664, -292765, -635405, -638961, -657707, -740270, -700235, -613446, -738300, -967509, -819897, -121853, 643069, 897572, 668743, 458485, 541452, 707379, 708330, 628143, 625650, 564562, 219579]
40118B19579m64835j22635L46958L85937l040l08377k74181j35160n2896J39865
40108b68785M22327L49520k54192p76892n31492K54968P21288N17555J09331k9957
40098E13671N2512J58209K69724K98828K911n34648p50854l04140L72655N98605
40088F77473K91751q8106k50858l05861l67284l48467j93453r877R1945Q6020
40078d16717m2102k46065l22723j08343K25428L16276Q6991j51809j29114P1082
40068g17096K01139J68455O1899l704J7164P1062M2436q6826j45543O223K06331
40057a78460J64813r1738k22308q2909O1687o691p8956J34884M70218M60256j0082
40046F20714m98201n25243j08150L28540M46662K83971J00596N2597O8974J5566
$$ y = [219579, -245256, -367891, -20933, 365004, 361964, 53587, -220594, -355754, -408650, -268785, 153542, 503062, 248870, -528022, -1059514, -804546, -83258, 434297, 543628, 513671, 566183, 724392, 994116, 1292944, 1295855, 761207, 10353, -293787, 78868, 677473, 969224, 881118, 630260, 324399, -42885, -391352, -584805, -594682, -502737, -416717, -458819, -704884, -1027607, -1135950, -910522, -594246, -507255, -659064, -788178, -717096, -515957, -347502, -285603, -289307, -272143, -201081, -158645, -245471, -391014, -384791, -178460, -13647, -105385, -327693, -410602, -348915, -355606, -434562, -299678, 170540, 630796, 620714, 122513, -402730, -510880, -182340, 264322, 548293, 648889, 701486, 770460, 786026]
40036G86026j06730j82916j53283p3691j6759P737L5319J11280K42922L21352
40026I71257J73174j83133m33478l27986o3306k1812j70648r8911K81250N04153
40016F30560K41405j72917k53142q3962r8895l41623m29074j82891J50204L21967
40006b18368L29234J97088r3018l62416k90544J29849M90122M77310K24949Q079
39996H92285j30722k57438l07821k18185j08406r6426p6520Q9461K80624K49047
39986C15899k7895l23459m37060l37720j05844J09880J51233K8950k4405J56571
39976d93850L93715L60952K1951l12435l70884k04162m0617J3207M3860J46312
39966d41951K51538K08143L9634j1168J78159L53177K10633r6646j34574J20113
$$ y = [786026, 679296, 496380, 343097, 269406, 252647, 260384, 295703, 406983, 649905, 971257, 1144431, 961298, 527820, 199834, 136528, 114716, -55932, -154843, 126407, 630560, 871965, 699048, 445906, 361944, 263049, -78574, -507648, -690539, -540335, -218368, 110866, 307954, 214936, -147480, -438024, -308175, 181947, 659257, 884206, 892285, 761563, 504125, 196304, -21881, -130287, -226713, -303233, -213772, 66852, 315899, 288004, -35455, -472515, -810235, -916079, -806199, -654966, -626016, -650421, -493850, -100135, 260817, 282768, -29667, -400551, -604713, -645330, -632123, -588263, -441951, -190413, 17730, 57364, 46196, 224355, 577532, 788165, 691519, 556945, 677058]
39956F77058J96598j10786l64041j76733J30141K9880l50977m22600l6264L44753
39946h2971L58866J46308j1690l5444M4814J67420J64853p4224l44425l30907
39936B600n5194K08812L76623N02802M06293j01811o55685o43083j45299J10149
39926F207j18035k49741M6301K57856j1630k55565P6582N55131M21918j70439
39916E58585m24380j31488J84552J95376M9586j73332n14239o74409k73982L88514
39906h15217N69271J52581k22429j99465j09529j71361q5734K63016M42849K12240
39896C6222m0842k4684n4594l37856l96052J48710P46491O29478k1642l83509
39886C01722k14131k843k5754k6150J27452J69883m130q9696Q7794K34888M9174
$$ y = [677058, 873656, 762870, 398829, 222096, 352237, 382117, 31140, -391460, -427724, -82971, 275895, 422203, 410513, 375069, 419883, 587303, 752156, 677932, 333507, 2600, -52594, 156218, 532841, 1035643, 1441936, 1340125, 684440, 41357, -103942, 6207, -111828, -361569, -315268, -57412, -69042, -324607, -248025, 307106, 729024, 558585, 134205, 2717, 187269, 382645, 432231, 258899, -255340, -929749, -1203731, -815217, -245946, -93365, -315794, -515259, -624788, -796149, -881883, -618867, -176018, 36222, -4620, -29304, -83898, -421754, -817806, -669096, 77395, 706873, 685231, 301722, 87591, 84748, 58994, 32844, 160296, 330179, 326049, 236353, 324147, 559035, 608209]
39875F08209l19850n09546m03606j55867O4663J88156K13918J68605N1461j48428
39865b42285l04352j62169L05120O90908N85366J27166j76131j11593Q4511J81045
39855I77586J76924O7127k07847m96245m96471j99049P8158J88581K95556L91893
39845G76213J62463m07696p55308m82335j0018J0658l16827l14605K09916O79416
39835d48123O00250J84518q4258j01678q0226j14253j11383k1810J02169K02067
39825A27273K15110Q4768q7822m5922K70741N04782K77242k56317n40575l27730
39815B21550M5536J70789N9589m4483p0077p4565q600J49325J59780j94759o34031
39804b19946o00705l9013M38728L47224n5135k09477k8212J26371N0728j05184
$$ y = [608209, 288359, -221187, -624793, -780660, -715997, -527841, -313923, -145318, -93857, -242285, -546637, -708806, -403686, 287222, 872588, 999754, 823623, 712030, 796541, 977586, 1154510, 1221637, 1013790, 517545, 21074, -177975, -99817, 88764, 384320, 776213, 938676, 530980, -224328, -706663, -716681, -706023, -1022850, -1337455, -1127539, -448123, 152127, 336645, 252387, 150709, 70483, -43770, -155153, -176963, -74794, 127273, 342383, 427151, 339329, 293407, 564148, 1068930, 1346172, 1089855, 549280, 221550, 267086, 437875, 497464, 452981, 382904, 308339, 299739, 449064, 608844, 414085, -219946, -820651, -859664, -420936, -73712, -128847, -338324, -366536, -240165, -189437, -294621]
39794b94621j93123k45257k54497r0984K44390N07136M85581K53372M8464L889
39784D64350O5064Q3523n0785k83809l86065j75552K23392M56918L13537p6538
39774F34035m25899n51092m28553j46029J17656J83350N0093q1978m5366J02251
39764e91532J94278J93652K05230K76764L03977J68624j02519l69159n20706n21043
39754g62434l47825r728L45975M84829L56722K02325K30893K99820J46540j37224
39744H09893j87261N4791K06374K2933k30452k08720P734J11042K2127j42866
39734D65595l34322m78926l45726J30904N70528N69438K47559q448j47200l21495
39724C47907l52664M3562N56105N02565j32023n46894k50274K78218L69723N4848
$$ y = [-294621, -487744, -733001, -987498, -1078482, -834092, -326956, 158625, 411997, 460461, 464350, 529414, 612937, 562152, 278343, -107722, -283274, -59882, 397036, 710573, 634035, 208136, -342956, -771509, -917538, -799882, -616532, -566439, -648417, -693783, -591532, -397254, -203602, 1628, 278392, 582369, 750993, 648474, 279315, -241391, -762434, -1110259, -1119987, -774012, -289183, 67539, 269864, 500757, 800577, 947117, 809893, 622632, 677423, 883797, 906730, 676278, 467558, 475292, 586334, 608461, 465595, 131273, -347653, -693379, -562475, 8053, 577491, 825050, 816602, 669402, 347907, -4757, 38805, 594910, 1097475, 965452, 418558, 168284, 446502, 816225, 871073]
39714H71073k29313l36644l51028k16413P7507K28406J5233k71221k38760j4964
39704d66124J2745j11703p931L43100N20841L12060j1648j43049r6733k4461J6326
39693C43423J0322n2005q4945J0935J44185J12965r4275k76828k97424j83901
39683c67548J1480K27110L00861J24120j20463j43698J5883K4443k32567m50057
39673f10436l19640Q5871M55497N79123M49839J97512L115o2981j52503m23698
39663B01699p11203o50550j91805K63797L60023J95941R5354J68764K86007L26302
39653C44329K54388M9941k41374m29855l24027L1807L50660L54400K9391l26193
39643I3467l37124N0700M17897K96662k14437m87017j37870M61573O72195M00340
$$ y = [871073, 641760, 305116, -45912, -262325, -184818, 43588, 58821, -212400, -451160, -466124, -453379, -565082, -573013, -229913, 290928, 602988, 591340, 448291, 351558, 327097, 343423, 353745, 301740, 216795, 227730, 371915, 484880, 390605, 113777, -183647, -367548, -356068, -128958, 171903, 296023, 175560, 31862, 47745, 72188, -160379, -610436, -930076, -844205, -388708, 190415, 640254, 837766, 840881, 777900, 625397, 201699, -509504, -1160054, -1351859, -1088062, -728039, -532098, -436744, -267980, 18027, 344329, 598717, 648658, 407284, -22571, -346598, -314791, 35869, 390269, 419660, 93467, -243657, -192957, 224940, 521602, 307165, -179852, -317722, 143851, 816046, 1216386]
39633A216386J09822J02383J59837j2098l09282m15272k65953q2853l2401p3210
39623C97359j08588r6437j9097P4989J7218k76585n43268l90559J34524M86931
39613c23513L10322q7370j90424M0992K61954L04157K50141R7415j92352l76501
39603I4821j57839K56394L26585j0334k31307p4223P1797j07281k91505j03836
39593b26728K25309K63578Q2657L9954J33915R8386o8519j66394k04103k77324
39583i9269k29959O2257K71040M2106l26267k57419J62340L00544O250k12731
39573b81108j20348r7175l26304l71880L6427M24455K81761j24989j88514J17741
39563f49934K98250J36106o1892P884K40931L04876M5070l16383l63060L5250
$$ y = [1216386, 1326208, 1428591, 1588428, 1576330, 1267048, 851776, 585823, 502970, 470569, 397359, 288771, 192334, 173237, 248226, 265444, -11141, -554409, -944968, -810444, -323513, -13191, -100561, -290985, -249993, 11961, 316118, 566259, 663674, 471322, 94821, -63018, 193376, 519961, 509627, 278320, 204097, 275894, 168613, -122892, -226728, -1419, 262159, 344816, 384770, 518685, 617071, 548552, 382158, 178055, -99269, -329228, -266971, 4069, 46175, -280092, -537511, -375171, -74627, -68377, -281108, -401456, -498631, -824935, -1196815, -1160388, -735933, -454172, -579161, -767675, -649934, -351684, -215578, -277470, -269586, -28655, 276221, 321291, 4908, -358152, -322902]
39553c22902M61370M09905j1821k05458L5151K15985p3763n17747n64398k16792
39543g90470Q5326J40436J17521J42247J47258J04204Q7377Q8481l45j86090l08458
39532c72513k08724Q3259L20779K44709p7109k13525R9902N02330M38296k0321
39522G97083k70470j20744l8504k72730l81456k1722L78082K80747q2824j19393
39512A48069J69745K82311O4348j56470j88526j69498j85879j75613j61542j71667
39502e44722m7777K43813L12939j11418n41979l01567L85533O31067K26480p4950
39492A77419J85428M60504J64084l53989l91299L0951L02781J51371j42390k93564
39482B91296k73674j06993J43627K21237q2069n06215n25469m8776M17075M38484
$$ y = [-322902, 138468, 548373, 536552, 331094, 366245, 582230, 508467, -9280, -573678, -790470, -705144, -564708, -447187, -304940, -157682, -53478, 33899, 122380, 122035, -64055, -372513, -581237, -497978, -177199, 67510, -9599, -223124, -123222, 379108, 817404, 797083, 526613, 405869, 367365, 94635, -286821, -308543, 69539, 350286, 267462, 148069, 317814, 600125, 664473, 508003, 319477, 149979, -35900, -211513, -373055, -544722, -592499, -348686, -35747, -147165, -689144, -990711, -605178, 25889, 252369, 177419, 362847, 823351, 987435, 633446, 242147, 273098, 575879, 727250, 584860, 291296, 17622, -89371, 54256, 275493, 193424, -312791, -838260, -887036, -469961, -31477]
39472c1477J91819J14375K47078K41822m6098l14452k72461p1540m0057j56518
39462a37509j14317J31694K55516Q5933j24290j50044j56821k99179k86906J76334
39452f19589P21249O52940m0078n69314l89763J23258L01071Q0861r5001j7701
39442A47933Q0322j3838j98318k87196k70882k19397j00012J37817L70569L80638
39432B7636J55766n3590o9993l1523j31739k57969j65593N6593N7964j92548k86257
39421h91253Q903L82788M64700L23527K00536P9178j20474k17921n6963J32901
39411C05922R0322L721J68047L82729K40247j43755k85473j35699j12176l39853
39401A74032m77621l58796j98627o8763K18223N51889M87355O717k85041l8415
$$ y = [-31477, 160342, 274717, 521795, 763617, 717519, 403067, 130606, 59066, 19009, -137509, -251826, -120132, 135384, 221317, 97027, -53017, -209838, -509017, -795923, -619589, 101660, 754600, 714522, 145208, -244555, -121297, 179774, 260635, 165634, 147933, 228255, 214417, 16099, -271097, -541979, -761376, -861388, -723571, -353002, 27636, 183402, 129812, 59819, 28296, -103443, -361412, -527005, -470412, -412448, -604996, -891253, -882350, -499562, -34862, 288665, 489201, 568379, 447905, 229984, 173021, 305922, 396244, 399965, 568012, 950741, 1190988, 1047233, 761760, 626061, 513885, 174032, -303589, -662385, -861012, -929775, -711552, -159663, 327692, 334409, 49368, 10953]
39391A0953L17132K86058L0415l5514P4323J02769N5664O3774K4054j87075l79054
39380C63499l26613j67451j41611j48568M0828L12960L56626J57542k0912o0489
39370C65811o5227r8756j37884k03439k73776j79442J44194M21731L53989O8651
39360C95852o0668K3747K2989j90919l37673j44041K21639L15521l0313m63898
39350b47764n11159j78803L1470j80983m49146k66393K18577M03536J54306m3395
39340a069754P8580K00415J01712Q8281L37586L94097j15684o93376n61708J75973
39330a063878O19259K65544m25637p09499l66743K48397O47488N92428K39028
39321D6387l5709k3238J45718K42800J82043k3605k88649l68454p4223L26021
$$ y = [10953, 328085, 614143, 644558, 609044, 683367, 786136, 841800, 905574, 929628, 742553, 363499, 36886, -130565, -272176, -420744, -379916, -66956, 289670, 447212, 426300, 365811, 300584, 201828, 63944, -139495, -413271, -592713, -448519, -26788, 327201, 395852, 335184, 358931, 381920, 191001, -146672, -290713, -69074, 246447, 216134, -247764, -758923, -937726, -906256, -1087239, -1536385, -1802778, -1584201, -1180665, -1026359, -1069754, -991174, -790759, -689047, -600766, -263180, 130917, 15233, -678143, -1239851, -1063878, -444619, -179075, -604712, -1314211, -1680954, -1432557, -785069, -192641, 46387, 10678, -12560, 133158, 375958, 558001, 534396, 245747, -122707, -196930, 129091]
39311A29091L22347q2870l22680j68941q8167l43797m09384J40561P44471O20071
39301E40702q898k84121l3458J36716o8316k95058k90413k06502q4818K42763
39291c51403O06544N24504k2428m21897k73756Q0480J09398k15586m98981m15397
39281h78522J5953M53884N12390J85113j17418j33535q5940j82571j82469J00062
39271c13053K98982J07869m7708K90938O45880K65273n35478p52669k62909J10898
39261a91977O2453J22368M01121K83048k98112n10456l5365L34446R0777j34590
39251A23713J75448M16949L592m78438k85375J51574L5750l31259j10052N19162
39241B21064N99401k6272n31698m54711k06543j68557j69442k3259J23063J50371
$$ y = [129091, 451438, 368568, 45888, -123053, -211220, -555017, -964401, -823840, -79369, 540702, 531804, 247683, 214225, 350941, 282625, -12433, -302846, -509348, -594166, -351403, 255141, 779645, 757217, 335320, 61564, 142044, 251442, 35856, -463125, -878522, -862569, -408685, 103705, 288818, 171400, 37865, -48075, -230646, -413115, -313053, -14071, 93798, 46090, 337028, 982908, 1248181, 712703, -39966, -302875, -191977, -129524, -7156, 393965, 677013, 378901, -131555, -166920, 167526, 258303, 123713, 299161, 716110, 719702, 241264, -44111, 107463, 143213, -188046, -298098, 221064, 820465, 794193, 262495, -192216, -398759, -567316, -736758, -760017, -636954, -486583]
39231d86583J39657J03597o791n3410R4703K16066L6937k64727l24645j77620
39221g22816p3160O5294M01015O15392K75646l34063m66347O79M03188K90349
39211D55177m3862j59151m8635N2906J1708j83347m03894l64138M5152M65233
39201a72851M83909K22412P5268K6161k25836n68027n40790j20491J76884P9985
39191e63376r2411j1964K00418K52353O1264k27263l28437L280N70760P12542
39181E77166J27584n29772m65478Q5265K39111j50545l53053j35M23370M73962
39171D27475L04428J12178j80881m49134l27208P0267J40615k11062l47342L901
39161d56763K57828J3548k44620m7038K35900J28504q5932K7390J87131o3321
$$ y = [-486583, -346926, -243329, -250120, -303530, -208827, 7239, 44176, -220551, -545196, -722816, -795976, -730682, -329667, 285725, 561371, 227308, -239039, -238360, 164828, 455177, 411315, 252164, 203529, 256435, 268143, 84796, -319098, -683236, -638084, -172851, 311058, 533470, 608738, 634899, 409063, -158964, -699754, -820245, -643361, -563376, -655787, -667751, -467333, -214980, -153716, -380979, -709416, -706136, -135376, 577166, 704750, 174978, -290500, -205235, 33876, -116669, -469722, -469857, -46487, 427475, 731903, 844081, 663200, 214066, -113142, -42875, 97740, -113322, -460664, -456763, -198935, -185387, -430007, -477045, -241145, -112641, -198573, -171183, 15948, -47373]
39151d7373m35796l52499L9244J33424r8063j29332J92958M75778M89588M19629
39141F87558L93885K81210M295l15335n09079m19445J3903M88823M77232o1858
39131A041189m87554l64103q0258j10461j91397J00623M39308K52705k06835k10350
39121A82867K29143M13773J49163n8053q664q1579l55599l59375L8576K94618
39111D44870O6216k84773l82589l58407l53517j69368K05959L49716R8032r9612
39101d83473N3265J70409r1071l53845j63178J92307J72889q9552p7744J71246
39091d98747J58890j55422k47807J04299M57895L68208l2485l02944k35141J2001
39081c71253J25842o0485l38387k73960K16928O02329L55579k87628n86980k54914
$$ y = [-47373, -483169, -835668, -796424, -663000, -761063, -890395, -697437, -221659, 267929, 687558, 1081443, 1362653, 1366948, 1051613, 542534, 123089, 136992, 625815, 1103047, 1041189, 553635, 189532, 109274, -1187, -192584, -91961, 347347, 600052, 393217, 182867, 412010, 825783, 974946, 916893, 908229, 826650, 471051, 111676, 150252, 444870, 511086, 226313, -156276, -514683, -868200, -1037568, -831609, -481893, -383861, -483473, -430208, -259799, -350870, -704715, -867893, -675586, -502697, -592249, -669993, -498747, -339857, -495279, -743086, -638787, -180892, 187316, 154831, -148113, -383254, -371253, -245411, -305896, -644283, -918243, -701315, -98986, 256593, -31035, -618015, -872929]
39071h72929K67773N01478M37325K51342l1954l45984m20194j37086J87755J99317
39061C6843K963m6898P9194R3626o6063j02734J28763L28790J92393j21423k44471
39050B80983j36811l6122J372R7831J33788j62537n92136n13959J77110O35545
39040a14936J71086o57236p79693j79403J73590q9615k28693K36583O42172L06109
39030e20036k50144q5381O44110R02799L11223m27419o27398l56244L1409L82375
39020E294N63756L91692j2815k65240k82089l35046m32673k32400K34371L92796
39010B7646K1872k93793o8012K98951K14416j14308q4665K50236L12283Q956j68055
38999D05527m6518l5829l45827n86788l88587Q8401M94795O97151O20292J43254
$$ y = [-872929, -605156, -103678, 333647, 584989, 553035, 207051, -213143, -350229, -162474, 36843, 39806, -7092, 72102, 165728, 99665, -3069, 125694, 454484, 646877, 525454, 280983, 144172, 108050, 109422, 207253, 341041, 178504, -413632, -927591, -750481, -114936, 56150, -601086, -1380779, -1560182, -1386592, -1476207, -1704900, -1468317, -826145, -520036, -770180, -855561, -211451, 691348, 1002571, 575152, -52246, -408490, -377081, 5294, 569050, 960742, 947927, 682687, 400598, 65552, -367121, -599521, -365150, 27646, 49518, -244275, -312287, -13336, 201080, 86772, 2107, 252343, 564626, 573582, 405527, 359009, 323180, -22647, -609435, -998022, -909621, -414826, 282325, 902617, 1045871]
38989A045871n42826q61373m96644J48600M51369K96693K5735j10740j18855m4259
38979b06429Q1728J50071Q4383p764J0713O8471k1236k86358n46459n75835k59899
38968a508614K66759N95411L99497q5407k37379J32520M84576L35018l7548p9491
38958B65342J55484J54057j82027l88182j81624J50433K25236L7396j75112k37708
38948a76705j11240R7385J54292l5848k07334o0642K39349K50784p9695l43203
38938b72857k90399j08953j1036K8413J5790j43359l24594k12297J77045M20047
38928g22200L16751J48819J04326m4155l82287m97101j13039L56146L86039J07547
38918c39154j9010L4895j331p0674Q5178L32480K90173o436j55358n7855J6763
$$ y = [1045871, 503045, -358328, -854972, -706372, -255003, 41690, 67425, -43315, -162170, -206429, -124701, 25370, 109753, 101989, 112702, 181173, 159937, -126421, -672880, -1248715, -1508614, -1241855, -646444, -246947, -332354, -569733, -437213, 47363, 382381, 344833, 265342, 420826, 574883, 392856, 4674, -176950, -26517, 198719, 236115, 61003, -176705, -287945, -190560, -36268, -72116, -279450, -340092, -100743, 150041, 70346, -272857, -563256, -672209, -683245, -654832, -639042, -782401, -1106995, -1319292, -1142247, -722200, -405449, -256630, -152304, -196459, -578746, -1075847, -1188886, -832740, -446701, -339154, -358164, -323269, -324600, -395274, -310096, 22384, 312557, 306121, 150763, 92908, 109671]
38907A09671J4550J65199M19002L91510O605l18977l02129j41867p3120k9469
38897B40975M5031j3733k37718l53048k19184q8551j67577k65181j62369L285
38887a218070L9708O8424K30173L14863J06716j36764k9235K71793K57243j08662
38877b03811k97590n2167K08161P7198j77677n9635L27381M08293M2163k24820
38867D7496K2547M38566M45540Q0792j50010j03266j21659l10332k99344L7715
38857H8045K10258j08804m20642j27998M26610M04605j95036m75670j0511N31526
38847C22383M40502m3831k63845j25983P177K2297N6946L3980k07608m20000j62219
38836c40201M57402P65053L96737k11963m22668j83167L8746o0581k79387k53969
$$ y = [109671, 124221, 289420, 708422, 1099932, 1106537, 787560, 485431, 343564, 270444, 240975, 286006, 272273, 34555, -318493, -537677, -626228, -793805, -1058986, -1221355, -1218070, -1178362, -1109938, -879765, -564902, -458186, -594950, -624185, -352392, -95149, -203811, -501401, -553568, -345407, -268209, -445886, -505521, -178140, 230153, 272316, 47496, 70043, 508609, 954149, 1034941, 884931, 781665, 660006, 349674, 50330, 88045, 298303, 189499, -231143, -359141, 67469, 472074, 277038, -198632, -209143, 322383, 762885, 719054, 455209, 329226, 336403, 358700, 415646, 449626, 242018, -177982, -340201, 117201, 882254, 1278991, 1067028, 644360, 461193, 499939, 439358, 159971, -93998]
38826i3998M2999K67963J50821j45937k32603j5394J79855P0779j96963k90704
38816b63182j61193m1687m7388k8694J39294L27328L29478J61883M6397J01212
38806E63448J61152q71l14852m44434k58583q9373k88594o37191n46343J02459
38796a753182O81521N95864O2596k09245K3019K70330N1695m15422m95361N992
38786a182193N36892M73102p9323m19273j66717K89622M02050J76427l1552j36255
38776a37220k85580l92278k37183L0743N9656m6221J48359N52547N21974q0021
38766A34776n18696k88751J08538M8163j83159K9574M84637M68902l7038l33498
38756h6552j34736Q5828j5278j49804k1200J51336N9312j64021j63401J35421
$$ y = [-93998, -50999, 216964, 367785, 221848, -10755, -26149, 153706, 224485, 27522, -263182, -424375, -466062, -513450, -542144, -402850, -75522, 253956, 415839, 462236, 563448, 724600, 723729, 408877, -35557, -294140, -383513, -672107, -1309298, -1855641, -1753182, -1071661, -475797, -413201, -622446, -599427, -329097, -277402, -692824, -1188185, -1182193, -645301, -172199, -251522, -670795, -837512, -547890, -145840, 30587, -965, -137220, -422800, -815078, -1052261, -1021518, -961862, -1008083, -859724, -307177, 214797, 134776, -383920, -672671, -564133, -515970, -699129, -669555, -184918, 283984, 246946, -86552, -221288, -135460, -150738, -300542, -321742, -170406, -111094, -275115, -438516, -303095]
38746c03095M70469N41717K67347j22836k61101o8014R8723n8252l06492k41884
38736A6582O5044K11394J14160L1426K2110q1430k01574q4489J44991Q3854k35905
38725H6163l43087j35209m1473k11520k30241Q3169K83008R5711m4754K34869
38715b23364N28699L11523j50506k19989J05902K79214Q8570j66513k78304l33537
38705e8305l51371k17841J1910J46396J75151K18242K45222J89488K08916M27770
38695I95578N46412J82266m56439p28585m15915L5311J91711J15100N5722O7569
38685E88730R8260J37852J12815r5959l86618m45564j71181J40469J81287K222
38675A62313j44895j58287j21336j08207r7152k9181J10751K39205K21689M6053
$$ y = [-303095, 167374, 709091, 976438, 853602, 592501, 524487, 623210, 564958, 258466, 16582, 81626, 293020, 407180, 438606, 460716, 379286, 177712, 93223, 238214, 322068, 86163, -256924, -392133, -433606, -645126, -875367, -792198, -509190, -413479, -458233, -223364, 305335, 616858, 466352, 246363, 352265, 631479, 720049, 553536, 275232, -58305, -409676, -627517, -615607, -469211, -294060, -75818, 169404, 358892, 567808, 995578, 1541990, 1724256, 1267817, 539232, 123317, 158628, 350339, 465439, 521161, 588730, 686990, 824842, 937657, 841698, 455080, 9516, -161665, -21196, 160091, 162313, 17418, -140869, -262205, -370412, -467564, -496745, -385994, -146789, 74900, 120953]
38665A20953j12868j10643k8192p993j5426L5469M6112j04349k59278j69733P4810
38654e31138J51539K2436l5399N3867L5706j80585l15344j89453j6363P138L5275
38643i62321K12842L24762J62117n4245k9212O4656j18065m08931k84392K83642
38633h09147O77704M89013N0555j36469j02947j78444l57610l49516j22400N2969
38623g86292R3966K11872M38951M62295J38278j80361j37695P5918M3588j94227
38613A66293k18363O9074K83004J56113j15282k59307k84333k67593j42798P2927
38603e40265J60071N5054J5513J51827J37292k39613n56868k91390L41330O31731
38593a35318L69196L5152n977M4924p6432k28697j51453R8755K43982J35961j34229
$$ y = [120953, 8085, -102558, -130750, -138743, -154169, -118700, -72588, -176937, -436215, -605948, -531138, -379599, -357163, -392562, -338695, -302989, -483574, -798918, -988371, -1004734, -997596, -962321, -749479, -424717, -262600, -316845, -346057, -281401, -399466, -808397, -1092789, -809147, -131443, 357570, 408125, 271656, 168709, -9735, -367345, -716861, -839261, -786292, -692326, -480454, -41503, 420792, 559070, 378709, 241014, 316932, 360520, 166293, -52070, 17004, 300008, 456121, 340839, 81532, -202801, -470394, -613192, -540265, -380194, -325140, -309627, -157800, -20508, -260121, -816989, -1108379, -767049, -135318, 233878, 269030, 263053, 307977, 231545, 2848, -148605, -49850, 194132, 330093, 195864]
38582A95864l47428l32605j56386p8276j61877j13908K15476M35935J83817j60997
38572c20385J5893M78163L90738k94544o34312j66844L40187J47586k95733j93384
38562e32635K83823M05929J20743m4609R63p1396j70027J01507N46878N18919
38552A160095K2682k06985J15384M26391L36688K08580L43772L91270O6115k39326
38542B624666j53914m0484l40012o91545m65800J43521L50878l7087m12978l46390
38532F30855q9634J5944L8337J23297J38109n0815k63856k58309q4451M2759P0029
38521C12265R6437J54514J93078K12790K53205K66777J41038j29119l74389m08402
38511G18194k35108n5222l9963j33361j45371k1102R1836O3677n4017j38294j46843
$$ y = [195864, -151564, -484169, -640555, -718831, -880708, -994616, -779140, -343205, -159388, -320385, -304492, 173671, 564409, 269865, -364447, -531291, -191104, -43518, -339251, -532635, -248812, 157117, 277860, 233251, 234214, 162818, -7209, 94298, 641176, 1160095, 1182777, 975792, 1091176, 1517567, 1854255, 2062835, 2406607, 2797877, 2863992, 2624666, 2470752, 2430268, 2090256, 1398711, 932911, 1076432, 1427310, 1390223, 977245, 630855, 541221, 557165, 595502, 718799, 856908, 806093, 542237, 283928, 199477, 242236, 312265, 408702, 563216, 756294, 969084, 1222289, 1489066, 1630104, 1500985, 1126596, 718194, 483086, 427864, 387901, 254540, 109169, 88067, 179903, 243580, 189563, 51269, -95574]
38500i5574r3904l465L8228o2487j98910r8372K71681N20106K97442j88782m07037
38489b1074j85144J23572J47637r7130l46908m03201k39560L1981K40667L09851
38479d39309L18509L17990K05740m1696j75817j3560J73027N043l42870l22595
38469c15538J15477L77112J23039k28908k05568J5456K8311r0355k3876J26508
38459g8342J7732k50878k25280J36938L29745L9887m06377m94571j10139M39555
38449f01730P38178N44401K5196k76088O391N36955O39081J82209k87647l46791
38439A160155j65949n6147k9490m9793k51786n71037n74115q0608L94170L01190
38429G6590j14779j92332J32662K98059N1170k06124j21405J10657J85558J69834
$$ y = [-95574, -189478, -192943, -154715, -217202, -416112, -514484, -242803, 277303, 574745, 385963, -21074, -206218, -82646, 64991, -32139, -379047, -782248, -1021808, -989827, -749160, -439309, -120800, 197190, 402930, 361234, 185417, 171857, 344884, 349927, 7057, -315538, -200061, 177051, 300090, 71182, -134386, -118930, -90619, -180974, -204850, -78342, -60610, -311488, -536768, -399830, -70085, -30198, -436575, -931146, -1041285, -601730, 136448, 680849, 706045, 429957, 436348, 973303, 1612384, 1794593, 1506946, 1160155, 994206, 938059, 908569, 858776, 606990, 35953, -538162, -618770, -224600, 76590, -38189, -230521, -97859, 200200, 251370, 45246, -76159, 34498, 220056, 389890]
38419C89890K36004K59490L6810l01561m32302k88684r7869l6236p8875j45316
38409d58649j82373j23698M3806J82926J49913K4746Q817Q8421L1931k00743k91994
38398g26897j515M13521M86553J73482j03325n8773J16855J35445K6869l6301
38388D25914p4841j67456j74417L6571K07872l7758n58843p69017m28195O8710
38378a471460L28174M26948N10430L91665m7981m19360k81758J70836L60938J39664
38368A08096j15201j37899m2018M6236J65433K60344J58635p6592j31504Q2811
38358C18341K60166J59891m8021p6509O8909J53619K9171k43552m59922l98033
38348b35940k7495L70033M44832J58879k25017m76643n16398l04352P7512L02548
$$ y = [389890, 625894, 885384, 922194, 620633, 188331, -100353, -198222, -234458, -313333, -458649, -641022, -764720, -720914, -537988, -388075, -363329, -354512, -266091, -234160, -434903, -726897, -728412, -314891, 171662, 345144, 241819, 183046, 299901, 435346, 462215, 425914, 351073, 183617, 9200, 45771, 253643, 215885, -342958, -1111975, -1540170, -1471460, -1143286, -716338, -205908, 185757, 137776, -281584, -563342, -392506, -31568, 108096, -7105, -145004, -187022, -140786, 24647, 284991, 443626, 367034, 235530, 318341, 578507, 738398, 690377, 613868, 682777, 836396, 865567, 622015, 162093, -235940, -263435, 106598, 551430, 710309, 485292, 8649, -507749, -812101, -734589, -432041]
38338d32041J33428j49493o9541K97487L80749q481l88150l62641j31901J4863
38328g15721J82313M74603N85887K42961k86330n60329n45337m34941k13722J44724
38318a125892L40269J21403k08371j58690K23694M59154L21965j3131l48660n34551
38308i22810l34117K73755P89923P07793K22263q5969j30756k77894n20181m12661
38298f90654R4715M43559K80779r3320k93714l23695k63522k6890K96277L42891
38288b33574K7465k33214j27250J26236K16880J76440R2349j49959m90439n12190
38278a107256o0614L53586K43037j06969r4840K62856M15170J43519j98557k74554
38268d24622j31166M0756J33088P9779r9314j95204j5459L03400M23864K43723
$$ y = [-432041, -298613, -448106, -517647, -220160, 160589, 152108, -236042, -598683, -730584, -715721, -533408, -58805, 527082, 770043, 483713, -76616, -621953, -1056894, -1270616, -1125892, -785623, -664220, -872591, -1031281, -807587, -348433, -26468, -39599, -388259, -922810, -1256927, -983172, -193249, 514544, 736807, 650838, 520082, 242188, -277993, -690654, -595939, -152380, 128399, 35079, -258635, -582330, -845852, -872742, -576465, -233574, -206109, -439323, -566573, -440337, -223457, -47017, 45332, -104627, -595066, -1107256, -1167870, -814284, -571247, -678216, -773056, -510200, -95030, 48489, -150068, -424622, -555788, -515032, -381944, -302165, -401479, -596683, -612142, -308742, 115122, 358845]
38258C58845L473k9160J72470L95381L46811p3878n61027o44997k73132R6326
38248b08888J35845N8766J44349K28780N8155j78814j56682m461o3050k37879
38238b23879j63136J04494J57542l2115o4087J64181K79492J00744q3048p5484
38228A64704p3210j83914j64906P4784J90606m1154k99272k16394N4676J53015
38218c41065P6469L6621N609j66491l51652k66496Q9075M35470N73910M77655
38208E69105J46935l30115o61309n89074k14468J25620K34951J39998n9949k09062
38198h47368j21767J55622K73744N0294j70152K6370M67475O17218L55693O7025
38188H74154k7487j14543k83240k87971l1213J61937M6090j34697p5693O7806
$$ y = [358845, 362318, 333158, 505628, 901009, 1247820, 1173942, 612915, -32082, -305214, -208888, -73043, -14277, 130072, 358852, 417007, 238193, 81511, 77050, 14000, -223879, -387015, -282521, -124979, -157094, -221181, -57000, 222492, 323236, 240188, 164704, 91494, -92420, -257326, -182542, 8064, -33090, -332362, -548756, -494080, -341065, -264596, -227975, -222366, -388857, -740509, -1007005, -917930, -482460, 91450, 569105, 716040, 385925, -275384, -864458, -1078926, -953306, -718355, -578357, -638306, -847368, -969135, -813513, -539769, -489475, -659627, -633257, -165782, 451436, 807129, 874154, 846667, 732124, 448884, 160913, 129700, 291637, 337727, 203030, 127337, 195143]
38178A95143p884j68186n1667K42299K04767k73004o22083l64707J99300M14032
38168b31990J59882o8231Q3450L88613M57432K57079j399k41553m74922n33045
38158b04684k39138J67404J91561k08936m63781j75816K81811L07164o5245k95161
38148g04821j72800l415K3750J06995L34324M09392J46209j44687q8543K08639
38138A15043L58697K21744m2642k51976k62383J8557L88341L78073j12532m80769
38128C30153j98116L16497K23347m48908p73261k84164L66668M24763O2923p3333
38118e3431J36822L02888K29898P1469o2164j89225k46607j64770n3833j8935
38108d7888M3100J75328J50579j06434k04259J20554M17688J67674k66721j39926
$$ y = [195143, 187259, 19073, -32594, 209705, 414472, 141468, -480615, -845322, -646022, -231990, -72108, -140339, -56889, 331724, 789156, 1046235, 1044836, 803283, 328361, -204684, -443822, -276418, -84857, -293793, -757574, -933390, -651579, -344415, -409660, -704821, -877621, -881036, -857286, -750291, -415967, -6575, 139634, -5053, -93596, 115043, 473740, 695484, 652842, 400866, 138483, 157040, 545381, 923454, 810922, 330153, 132037, 448534, 671881, 222973, -550288, -834452, -467784, -43021, 19902, -53431, 83391, 386279, 616177, 687646, 625482, 436257, 189650, 24880, -28953, -47888, -4788, 170540, 321119, 214685, 10426, 130980, 548668, 716342, 449621, 309695]
38098C09695L77559L57166l62075q21581m32554J55485J93748n1703k2646Q0426
38088b16480j56813l81052k8500N42421N08631n2403k93564k1164O7998l11714
38078c42640n20576j06949M53642N80581M09518K98201J53017j96188m64064l26910
38068f2368Q589J59972J42916J22550k1055l39515m00104J22979P06735N57969
38058I98668j82481n67339k16227J89002J7433l82360l20177J45524L40266J1628
38048C3937l22089j40730L54461N23951J24801m00668m95318j49100J65719J31249
38038a73787p2223j07395M8662J41793L8580j05518p6832J17018K40306Q8761
38028A39365k36429l65742p9824L46815M07180o365m38235m18368J7925M58096
$$ y = [309695, 687254, 1044420, 682345, -139236, -571790, -416305, -222557, -274260, -296906, -216480, -373293, -754345, -782845, -240424, 268207, 215804, -77760, -98924, -30926, -342640, -863216, -970165, -516523, 64058, 473576, 771777, 924794, 728606, 264542, -62368, -53779, 106193, 249109, 371659, 350604, 11089, -389015, -266036, 440699, 998668, 816187, 248848, 32621, 221623, 239056, -143304, -463481, -317957, 22309, 33937, -288152, -428882, -74421, 449530, 574331, 173663, -321655, -470755, -305036, -173787, -246010, -353405, -304743, -162950, -124370, -229888, -306720, -189702, 50604, 139365, -97064, -462806, -542630, -195815, 211365, 205000, -233235, -651603, -633678, -175582]
38018a75582N70019L18452q2834l02256j50719J68282K49261J2470k00710j56735
38008B49648l4391l5549n5057M456m5008k94895m16742j30852K92331M35646L56186
37997C25773L21248K23271j44406m72288l02468J15897R9344l49664m84628l641
37987f71562M81674M23504O4875j56426k64721l79244k94718N9778K51820j3120
37977d98140l08258j20967K89625K95931r7138l04133p8052K41611L64304L56161
37967A40944K61034n6874n25641p30210m00222J94403N20234L47401m7036j89779
37957d85746Q3676M31334M10912P0503j07958Q7744K99308J83994p6313j63468
37947G33986j67732l27551n13138m49749k38771j50964q0563K39547O04017N31301
$$ y = [-175582, 394437, 712889, 630055, 327799, 177080, 345362, 594623, 607093, 406383, 249648, 215257, 179708, 124651, 129107, 84099, -210796, -627538, -758390, -466059, -30413, 325773, 647021, 870292, 725886, 253598, -48870, 67027, 166371, -183293, -667921, -671562, -189888, 233616, 298491, 142065, -122656, -501900, -796618, -736840, -485020, -498140, -806398, -927365, -637740, -341809, -438947, -743080, -821132, -579521, -215217, 140944, 401978, 345104, -180537, -910747, -1310969, -1116566, -596332, -248931, -295967, -485746, -402070, 29264, 440176, 510679, 402721, 490465, 789773, 973767, 897454, 733986, 566254, 238703, -274435, -724184, -962955, -1113919, -1194482, -954935, -350918, 180383]
37937A80383P4383j82409j4296J48368k6320k75248k38691O083J73969J67288
37927A3510K5827j78112k33318M4719L92555K84759k61801n58211k06848K99439
37917c77481L36537M9923j0680K08356L20692K30054J92953K34468P4995l20679
37907I39138o03627n46481l01503o6668J43335K88396K23434r95o5018J63951
37897A73962L32096M3753n03921o44254p6082O46951O91018k7629o60373m41743
37887d66222L42213P53318M57457O8269J25074L01135L4642m94491o21551k26763
37877B73081J23930O1642j40363j33059m638r96j15289k04185k24666j41211J29546
37866c76208M65240N03545J21517k91469l32603j45931j37696k89309j83836K83410
$$ y = [180383, 254766, 72357, 58061, 206429, 180109, -95139, -333830, -327747, -153778, 13510, 39337, -138775, -372093, -327374, 65181, 349940, 88139, -470072, -676920, -377481, -40944, 8979, -1701, 206655, 527347, 757401, 950354, 1184822, 1259817, 939138, 335511, -210970, -512473, -579141, -435806, -147410, 76024, 75029, 10011, 173962, 506058, 549811, 45890, -598364, -674446, -27495, 663523, 635894, -24479, -466222, -124009, 629309, 1086766, 1155035, 1280109, 1581244, 1615886, 1121395, 499844, 273081, 397011, 458653, 318290, 185231, 180593, 179597, 64308, -139877, -364543, -505754, -376208, 89032, 592577, 714094, 422625, 90022, -55909, -193605, -482914, -666750, -383340]
37856c83340O38039M43440r1047l60027j05376L07058L60120j2552l88958l87636
37846A9721j15418J3724j46090k75245n6254L43804M77703K26671o4494j01517
37836C22605k8317j39856l96083m67370k03805J76828L92376L83662K31139j6986
37826B54193k85903l88263k03091J08531K55556J80144R3946J33579J71891N7345
37816C77928j22647j60633k3284J13039R4167m3386j36307p9399N0758O5307r6163
37805C9380k33038j14551J72930K92428J10663j24679j62337p9368o2559o7850
37795b28981M4041J73682R2319j54379k39495Q065L76305N35876L77108N1979
37785A036520j88811j92613n0114j6184j86527l47409k84885r5713K2513J16101
$$ y = [-383340, 254699, 698139, 607092, 247065, 141689, 448747, 808867, 796315, 407357, 19721, -95697, -81973, -228063, -503308, -559562, -215758, 261945, 488616, 424122, 322605, 294288, 154432, -241651, -709021, -912826, -735998, -343622, 40040, 271179, 254193, -31710, -419973, -623064, -514533, -258977, -78833, 15113, 148692, 320583, 377928, 255281, 94648, 71364, 184403, 278570, 235184, 98877, 19478, 70236, 135543, 39380, -193658, -308209, -135279, 157149, 267812, 143133, -19204, -98572, -161131, -228981, -184940, -11258, 81061, -73318, -312813, -304748, 71557, 607433, 984541, 1036520, 847709, 655096, 604982, 588798, 402271, 54862, -230023, -325736, -303223, -187122]
37775a87122K93070L53420M1133l96626m16151n746K24234m3856l60807k48832
37765g47283Q5324J97583J40489K17749L18435J08687k74242l47599p7275N8768
37755c19364j15334j80899J39098M72745L69117j7235k11067j20434m0463j05915
37745a29751j54581j03825r1282j73203j76163K4513K78162L41878J65720r7907
37735a16439k61125k06815M3497K77251K41324l0828j76993L6091L37983K85249
37725D29195j05101l68463k60238n8531o1850j31551k259K27537K63926R5122
37715B7787o4934j76184l21662l60030q6902K86472L22105Q1538J14597N40245
37705C63032P02359J01983p88349j103014o56457J9522M55068N73371M19889P4502
$$ y = [-187122, 105948, 459368, 500501, 103875, -312276, -318022, -93788, -137644, -498451, -747283, -661959, -464376, -323887, -106138, 212297, 320984, 46742, -300857, -378132, -319364, -434698, -615597, -476499, -3754, 365363, 348128, 137061, 16627, -23836, -129751, -284332, -388157, -479439, -652642, -828805, -804292, -526130, -184252, -18532, -116439, -377564, -584379, -540882, -263631, -22307, -53135, -230128, -194037, 143946, 429195, 324094, -44369, -304607, -363138, -424988, -556539, -558798, -331261, -67335, 27787, -37147, -213331, -534993, -895023, -981925, -695453, -373348, -291810, -177213, 363032, 1065391, 1167374, 379025, -723989, -1380446, -1360924, -905856, -332485, 87404, 161906]
37695A61906k03568j67423O7617J76670P9962m4905r8156q3031O7072L15556L32233
37684F03933p5665m81900l28758J85288L23606o9988l51058j21287K02704J74316
37674F1191J9745J03434K37288Q0101j75882j11346J91345K96538J22401l2597
37664G92218n1088p1023q1887L1713Q0018k44841p19432o96921m8964N28067M54937
37653b7203O1242P295K65226K48858j70392m02632m6839M53666M22644r6583m49894
37642B65388l08131j9080K2684r8168j26631r0455j27599j38018L4882K73600
37632c11528L85728M31601M70071K23824m70255j068179q57827n1072M00349J62766
37622f84522j04223M7637J54701j80657m43548o2825N32136N58157J21765p2789
$$ y = [161906, -41662, -209085, -141468, 35202, 115164, 70259, -27897, -110928, -43856, 271700, 603933, 528268, 46368, -282390, -97102, 226504, 156516, -194542, -315829, -113125, 61191, 80936, 184370, 421658, 501759, 325877, 214531, 405876, 702414, 824815, 792218, 741130, 670107, 588220, 619933, 699951, 455110, -264322, -961243, -1010207, -482140, -27203, 34039, 41334, 306560, 555418, 385026, -17606, -64445, 389221, 811865, 715282, 265388, -42743, -61823, -39139, -137307, -263938, -354393, -481992, -620010, -585128, -311528, 74200, 505801, 975872, 1199696, 729441, -338738, -1196565, -1247637, -847288, -684522, -788745, -741108, -586407, -767064, -1210612, -1273437, -741301, -183144, -61379, -134168]
37612a34168O8053N2516j39396o976M39228N31605L1170m49803l93392n2020J27383
37601G4200J34169J18087L9214o0863O3949L74903M05280m0217m82031m32771
37591A93920o8862J38732R4752j751p2822j15108l8844R7634M548l48505n09954
37580f26260j98976J85019J59603p9494k4269K99534M32033K37017j1234j68478
37570B04495k91768k73017K9273L49345K79567m1603r3420J56792J81534j93176
37560C08022m56223k51454M7278j8406k56722j96979J42755L31336J74378j19827
37550b95842l07717l04135r7566K23830M16218L09763N6350o2428r320M2491M1325
37539A2969R2045J78273J26750q2234k04092o8306J33721Q5354j90907l07089
$$ y = [-134168, -66115, -13599, -152995, -159971, 279257, 810862, 842032, 392229, -1163, -53183, 74200, 208369, 326456, 365670, 304807, 368756, 743659, 1148939, 1108722, 626691, 193920, 125058, 263790, 358542, 356791, 283969, 168861, 130017, 227651, 232199, -116306, -626260, -825236, -640217, -480614, -560108, -584377, -284843, 147190, 384207, 372973, 204495, -87273, -360290, -331017, 18328, 297895, 256292, 162872, 319664, 501198, 308022, -148201, -399655, -352377, -370783, -627505, -824484, -681729, -350393, -176015, -295842, -603559, -907694, -1005260, -781430, -365212, -55449, 901, -61527, -70847, -28356, 12969, 105014, 283287, 410037, 327803, 123711, 55405, 189126, 274480, 83573, -223516]
37529b23516k0675L69922L30912k02095o38644m16846K60223O30779L11558k49596
37519A52022l81302j8770L02613J71208k39263m49424k23845K36319N34392M30546
37509E14496K5943l25856l33716o2516J28574J5084j90880j21385J93534L13454
37499A56732M3496j95604L1047M24632L11370k90994n84908j80994K56380L2896
$$ y = [-223516, -244191, 125731, 456643, 254548, -384096, -800942, -540719, 90060, 401618, 152022, -229280, -248050, 54563, 225771, -13492, -462916, -686761, -450442, 83950, 514496, 540439, 214583, -119133, -181649, -53075, -37991, -228871, -350256, -156722, 156732, 200228, 4624, 35671, 460303, 771673, 480679, -104229, -285223, -28843, 4053]
$$ [...]
##END NTUPLES=NMR SPECTRUM
##END=
