##TITLE=31Pdec_LR-673-R2-HCR2
 D2O, 24 sc
 18.12.2019
##JCAMPDX= 6.0         $$ Bruker NMR JCAMP-DX V2.0
##DATA TYPE= NMR SPECTRUM
##DATA CLASS= NTUPLES
##ORIGIN= UXNMR, Bruker Analytische Messtechnik GmbH
##OWNER= root
$$ XWIN-NMR		Version 3.5
$$ Wed Dec 18 13:57:31 2019 Russian Standard Time (UT+4h)  she@DPX200
##.OBSERVE FREQUENCY= 81.013821
##.OBSERVE NUCLEUS= ^31P
##.ACQUISITION MODE= SIMULTANEOUS
##.ACQUISITION SCHEME= undefined
##.AVERAGES= 24
##.DIGITISER RES= 17
##SPECTROMETER/DATA SYSTEM= spect
##.PULSE SEQUENCE= zgpg30
##.SOLVENT NAME= CDCl3
##.SHIFT REFERENCE= (INTERNAL, CDCl3, 0, 182.463)
##AUDIT TRAIL= $$ (NUMBER, WHEN, WHO, WHERE, WHAT)
$$ ##TITLE= Audit trail, XWIN-NMR		Version 3.5
$$ ##JCAMPDX= 5.01
$$ ##ORIGIN= Bruker BioSpin GmbH
$$ ##OWNER= she
$$ F:/spectra/data/she/nmr/P31/1/pdata/1/auditp.txt
$$ ##AUDIT TRAIL=  $$ (NUMBER, WHEN, WHO, WHERE, WHAT)
(   1,<2019-12-18 13:56:21.04 +0400>,<she>,<DPX200>,
      <created by zg, POWCHK disabled, PULCHK disabled
       configuration hash MD5:
       00 E9 B6 7A A2 85 ED C7 34 08 36 98 17 FE 4E 26
       data hash MD5: 32K
       65 1E 15 2B B7 EB CD EB 62 32 CD A0 A4 27 5E AE>)
(   2,<2019-12-18 13:56:23.51 +0400>,<she>,<DPX200>,
      <Start of raw data processing
       efp BC_mod = 2 LB = 1 FT_mod = 6 PKNL = 1 PHC0 = -1318.134 PHC1 = 58.40095 SI = 64K 
       data hash MD5: 64K
       49 08 3D EB D5 20 D9 4D 11 C2 51 67 60 DC E5 3B>)
(   3,<2019-12-18 13:56:41.12 +0400>,<she>,<DPX200>,
      <pk PHC0 = 9.826656 PHC1 = -14.00002 
       data hash MD5: 64K
       A6 D5 94 FF 66 F5 2E 3B D9 3C 40 74 96 67 31 E0>)
(   4,<2019-12-18 13:56:44.00 +0400>,<she>,<DPX200>,
      <abs ABSG = 5 
       data hash MD5: 64K
       1B 66 1A D0 00 6E 12 09 41 A9 00 73 2A 1F 17 15>)
$$ ##END=
$$ 
$$ hash MD5
$$ F8 9E 38 DC 1C A6 A5 E2 D6 69 F8 E1 B9 89 DA 6E
##$RELAX= 
##$RELAX= 
##$RELAX= 
##$RELAX= 
##$RELAX= 
##$RELAX= 
##$RELAX= 
##$RELAX= 
$$ Bruker specific parameters
$$ --------------------------
##$DU= <F:/spectra>
##$EXPNO= 1
##$NAME= <P31>
##$PROCNO= 1
##$TYPE= <nmr>
##$USER= <she>
##$AMP= (0..31)
100 100 100 100 100 100 100 100 100 100 100 100 100 100 100 100 100 100 
100 100 100 100 100 100 100 100 100 100 100 100 100 100 
##$AQSEQ= 0
##$AQ_mod= 1
##$AUNM= <au_zg>
##$AUTOPOS= <>
##$BF1= 81.014009
##$BF2= 200.13
##$BF3= 200.13
##$BF4= 200.13
##$BF5= 200.13
##$BF6= 200.13
##$BF7= 200.13
##$BF8= 200.13
##$BYTORDA= 1
##$CFDGTYP= 0
##$CFRGTYP= 5
##$CHEMSTR= <none>
##$CNST= (0..31)
1 1 145 1 1 1 1 1 1 1 1 1 1 1 1 1 1 1 1 1 1 1 1 1 1 1 1 1 1 1 1 1 
##$CPDPRG= <waltz16>
##$CPDPRG1= <>
##$CPDPRG2= <waltz16>
##$CPDPRG3= <>
##$CPDPRG4= <mlev>
##$CPDPRG5= <mlev>
##$CPDPRG6= <mlev>
##$CPDPRG7= <mlev>
##$CPDPRG8= <mlev>
##$CPDPRGB= <>
##$CPDPRGT= <>
##$D= (0..31)
0 1 0 0 0 0 0 0 0 0 0 0.03 2e-05 3e-06 0 0 0 0 0 0 0 0 0 0 0 0 0 0 0 0 
0 0 
##$DATE= 1576662980
##$DBL= (0..7)
120 120 120 11 120 120 24 19 
##$DBP= (0..7)
150 150 150 150 150 150 150 150 
##$DBP07= 0
##$DBPNAM0= <>
##$DBPNAM1= <>
$$ [...]
##$SUBNAM3= <"">
##$SUBNAM4= <"">
##$SUBNAM5= <"">
##$SUBNAM6= <"">
##$SUBNAM7= <"">
##$SUBNAM8= <"">
##$SUBNAM9= <"">
##$SW= 369.568048894756
##$SWIBOX= (0..15)
0 1 3 0 0 0 0 0 0 0 0 0 0 0 0 0 
##$SW_h= 29940.119760479
##$TD= 32768
##$TD0= 1
##$TE= 0
##$TE2= 300
##$TE3= 300
##$TEG= 300
##$TL= (0..7)
0 120 53 12 22 120 120 120 
##$TP= (0..7)
150 150 150 150 150 150 150 150 
##$TP07= 0
##$TPNAME0= <>
##$TPNAME1= <>
##$TPNAME2= <>
##$TPNAME3= <>
##$TPNAME4= <>
##$TPNAME5= <>
##$TPNAME6= <>
##$TPNAME7= <>
##$TPOAL= (0..7)
0.5 0.5 0.5 0.5 0.5 0.5 0.5 0.5 
##$TPOFFS= (0..7)
0 0 0 0 0 0 0 0 
##$TUNHIN= 0
##$TUNHOUT= 0
##$TUNXOUT= 0
##$USERA1= <user>
##$USERA2= <user>
##$USERA3= <user>
##$USERA4= <user>
##$USERA5= <user>
##$V9= 5
##$VALIST= <valist>
##$VCLIST= <CCCCCCCCCCCCCCC>
##$VD= 0
##$VDLIST= <DDDDDDDDDDDDDDD>
##$VPLIST= <PPPPPPPPPPPPPPP>
##$VTLIST= <TTTTTTTTTTTTTTT>
##$WBST= 1024
##$WBSW= 4
##$XGAIN= (0..3)
0 0 0 0 
##$XL= 0
##$YL= 0
##$YMAX_a= 19882
##$YMIN_a= -15798
##$ZGOPTNS= <>
##$ZL1= 120
##$ZL2= 120
##$ZL3= 120
##$ZL4= 120
##$ABSF1= 182.463
##$ABSF2= -187.1042
##$ABSG= 5
##$ABSL= 3
##$ALPHA= 0
##$AQORDER= 0
##$ASSFAC= 0
##$ASSFACI= 0
##$ASSFACX= 0
##$ASSWID= 0
##$AUNMP= <proc_1d>
##$AZFE= 0.1
##$AZFW= 0.5
##$BCFW= 0
##$BC_mod= 2
##$BYTORDP= 0
##$COROFFS= 0
##$CY= -3
##$DATMOD= 1
##$DC= 0
##$DFILT= <>
##$DTYPP= 0
##$F1P= 0
##$F2P= 0
##$FCOR= 1
##$FTSIZE= 65536
##$FT_mod= 6
##$GAMMA= 0
##$GB= 0
##$INTBC= 1
##$INTSCL= 5.30512e-09
##$ISEN= 30
##$LB= 1
##$LEV0= 0
##$LPBIN= 0
##$MAXI= 10000
##$MC2= 0
##$MEAN= 0
##$ME_mod= 0
##$MI= 50
##$NCOEF= 0
##$NC_proc= -5
##$NLEV= 6
##$NOISF1= 182.463
##$NOISF2= 159.3651
##$NSP= 0
##$NTH_PI= 0
##$NZP= 0
##$OFFSET= 182.463
##$PC= 4
##$PHC0= -1308.307
##$PHC1= 44.40093
##$PH_mod= 1
##$PKNL= yes
##$PPARMOD= 0
##$PSCAL= 0
##$PSIGN= 0
##$REVERSE= no
##$SF= 81.0140089999434
##$SI= 65536
##$SIGF1= 159.3651
##$SIGF2= -187.1042
##$SINO= 113.3802
##$SIOLD= 16384
##$SREGLST= <1H.CDCl3>
##$SSB= 0
##$STSI= 65536
##$STSR= 0
##$SW_p= 29940.119760479
##$SYMM= 0
##$S_DEV= 0
##$TDeff= 32768
##$TDoff= 0
##$TI= <>
##$TILT= no
##$TM1= 0
##$TM2= 0
##$TOPLEV= 0
##$USERP1= <user>
##$USERP2= <user>
##$USERP3= <user>
##$USERP4= <user>
##$USERP5= <user>
##$WDW= 1
##$XDIM= 65536
##$YMAX_p= 312667807
##$YMIN_p= -14891952
$$ End of Bruker specific parameters
$$ ---------------------------------
##NTUPLES= NMR SPECTRUM
##VAR_NAME=  FREQUENCY,     SPECTRUM/REAL,   SPECTRUM/IMAG
##SYMBOL=    X,             R,               I
##VAR_TYPE=  INDEPENDENT,   DEPENDENT,       DEPENDENT
##VAR_FORM=  AFFN,          ASDF,            ASDF
##VAR_DIM=   65536,         65536,           65536
##UNITS=     HZ,            ARBITRARY UNITS, ARBITRARY UNITS
##FACTOR=    0.456856943014862, 1,           1
##FIRST=     14782.0589164792, 0,            0
##LAST=      -15158.0608439998, 0,           0
##MIN=       -15158.0608439998, -14891952,   0
##MAX=       14782.0589164792, 312667807,    0
$$ Real data points
##PAGE= N=1
##DATA TABLE= (X++(R..R)), XYDATA
$$ [...]
42694B126377N04542M38583n3653N28924K501702L560482K728887L205021P488374
$$ 2126377 2630919 3069502 3015849 3544773 6046475 9606957 12335844 15540865 23029239
42685B3029239J1485219Q427160j399498r713925j0351091o069254l125453k956452
$$ 23029239 34514458 42941618 41542120 31828195 21477104 15407850 12282397 9325945
42677I325945k681106j162539k71596q85929j389441o22565L93554M88588Q6583
$$ 9325945 6644839 5482300 5210704 4324775 2935334 2312769 2706323 3194911 3281494
42668C281494K667J2908l80423q03809n92838J07377N90185N56919K66369k5529
$$ 3281494 3284161 3297069 2916646 2112837 1519999 1627376 2217561 2774480 3040849 3015320
42658C015320l15147o43934r19091r33725n51659J8198K56794p5726m94260l18076
$$ 3015320 2700173 2056239 1137148 203423 -348236 -330038 -73244 -148970 -643230 -961306
42648i61306L90767Q48090N57790j17820n18987m34283j07540J59805J75424j16515
$$ -961306 -570539 277551 835341 717521 198534 -235749 -343289 -183484 -8060 -124575
42638a24575n07861n82158j46614M57152O73661L64312k5410R555M10159N85854
$$ -124575 -632436 -1214594 -1361208 -904056 -230395 133917 108507 118062 528221 1114075
42628A114075J50146n15652p06379l68153j89721n33466p96007l31093M21554
$$ 1114075 1264221 748569 42190 -325963 -515684 -1049150 -1845157 -2176250 -1754696
42619a754696N11329j2831j32721M69429Q12415K06139n10526k19455O74914Q52927
$$ -1754696 -1243367 -1256198 -1388919 -919490 -107075 99064 -411462 -630917 43997 896924
42609H96924J59888k13333K95176P41119K50041o15695q20929l66667L9010J95575
$$ 896924 1056812 843479 1138655 1879774 2129815 1514120 693191 326524 365534 561109
42599E61109L29846K50873l43816r36112o66415K43881O14356L7593n31492k69760
$$ 561109 890955 1141828 798012 -138100 -804515 -560634 53722 91315 -440177 -709937
42589g09937L87495O19710L59492o1751o21925j203622j144655r2873J121473
$$ -709937 -322442 297268 656760 595009 -26916 -1230538 -2375193 -2468066 -1346593
42580a346593J350187N94856j71850l82688k59442m7087K42710L97794J67023
$$ -1346593 3594 598450 426600 43912 -215530 -262617 -19907 377887 544910
42571E44910j36402J3359L88498K21792n35490j021921p13245m9854M07429O36120
$$ 544910 408508 421867 810365 1032157 496667 -525254 -1238499 -1288353 -880924 -244804
42561b44804O79069L40066k39406m52915j34630J01387j29672l71887k35960j26368
$$ -244804 434265 774331 534925 82010 -52620 48767 -80905 -452792 -688752 -815120
42551h15120l90301n04760L1932O45260N14147l7062o2697M14099N06168M6024
$$ -815120 -1205421 -1710181 -1678249 -1032989 -518842 -555904 -618601 -204502 301666 347690
42541C47690j47668K54169N03667R4253l23104L410O71035O86007j11878q89434
$$ 347690 200022 454191 957858 1052111 729007 732417 1403452 2089459 1977581 1088147
42531A088147r35965l82243J93757M68326N54195O66522P46887N00723j30203
$$ 1088147 152182 -230061 -36304 432022 986217 1652739 2399626 2900349 2770146
42522B770146o86873o64365k21361o2608n27778j124765j128999l93151N83326
$$ 2770146 2083273 1418908 1197547 1134939 607161 -517604 -1646603 -2039754 -1456428
42513a456428J152678R62926J87248m97701m15583L77963J029561P71416k50140
$$ -1456428 -303750 659176 846424 348723 -66860 311103 1340664 2112080 1861940
42504A861940j189658j387798q65629j18449L24438K36137j45259l07325j5383
$$ 1861940 672282 -715516 -1581145 -1699594 -1375156 -1139019 -1284278 -1591603 -1606986
42495a606986L53370K35212l61950p61109l82224N50719J217805J061481L17509
$$ -1606986 -1253616 -1018404 -1380354 -2141463 -2523687 -1972968 -755163 306318 623827
42486F23827k93289k92035J59796M87677K71702l38136p21145m03171L51734P36928
$$ 623827 330538 38503 198299 685976 957678 619542 -101603 -504774 -153040 583888
42476E83888L59354k17033k19312K38337L60170p5207m05295k57731k11565p08938
$$ 583888 943242 726209 506897 745234 1105404 1030197 624902 367171 155606 -553332
42466e53332j049943l92484P29653J000097K51005l61794j78785J65370Q9128
$$ -553332 -1603275 -1995759 -1266106 -266009 -15004 -376798 -555583 -390213 -301085
42457c01085K1238L82154O53876L17082j28823l7099K06473o5091m68698k04934
$$ -301085 -279847 102307 756183 1073265 944442 907343 1113816 1048725 580027 375093
42447C75093M02029L50152k52359k99786L28605M06785n79708j419731r72857
$$ 375093 777122 1127274 874915 575129 903734 1310519 730811 -688920 -1661777
42438a661777J83726P95243O47350K83995j36502o20623o70433q530N39643Q0939
$$ -1661777 -1478051 -682808 -35458 248537 112035 -508588 -1179021 -1187551 -647908 -566969
42428e66969q24390r17424k16555J18866k18619k87970L44728Q87206P66771M76053
$$ -566969 -1391359 -2308783 -2525338 -2406472 -2625091 -2913061 -2568333 -1681127 -914356 -438303
42418d38303M14959J32611n55128q46603k41495M46172L31581j46704r2277L67884
$$ -438303 -23344 109267 -445861 -1292464 -1533959 -1087787 -756206 -902910 -995187 -627303
42408f27303N53136M87469N34122L94301k70485p38635j38812Q87675Q96906j32333
$$ -627303 -74167 413302 947424 1341725 1071240 332605 193793 1081468 1978374 1846041
42398A846041p55646k78659M37655N86309M17176K70332o2685n10853m49721J86113
$$ 1846041 1090395 811736 1249391 1835700 2252876 2523208 2460523 1949670 1499949 1686062
42388A686062N68352K70104r4217K9859M03483P54132J207211J638336J767349
$$ 1686062 2254414 2524518 2430301 2460160 2863643 3617775 4824986 6463322 8230671
42379H230671K092602L279259M575835M974757O157725J0971864J7353996J7475596
$$ 8230671 10323273 13602532 18178367 23153124 29310849 40282713 57636709 75112305
42371G5112305O735005q583270j7116283j5150810r218535o147084n586513m063945
$$ 75112305 81847310 73264040 56147757 40996947 31778412 25631328 20044815 15980870
42363A5980870j671674r71877j980799k307859j289008n85897q99519r83083k30777
$$ 15980870 14309196 13337319 11356520 9048661 7759653 7173756 6274237 5291154 5060377
42354E060377J89863m79449j178211p67510J82646L63669l97204j140306j118415
$$ 5060377 5250240 4770791 3592580 2825070 3007716 3371385 2974181 1833875 715460
42345G15460m27135L68969P07591L70330k50002m23393Q1134O44053N56160p9428
$$ 715460 288325 657294 1364885 1735215 1485213 1061820 1142954 1787007 2343167 2263739
42335B263739n40807m59514k06534k48049m78816m66141j41976J49524K55992
$$ 2263739 1722932 1263418 1056884 808835 330019 -136122 -278098 -128574 127418
42326A27418L95253N94751M74033p2155m71196k64334J45688J73946L1512K00565
$$ 127418 522671 1117422 1591455 1519300 1048104 783770 929458 1103404 1134916 1335481
42316A335481L58665p7343o15380k52673O46587N88342o12602j270852m22724
$$ 1335481 1694146 1616803 1001423 748750 1395337 1983679 1371077 100225 -322499
42307c22499O27890M55146k74421j97733L75236K75675k22502Q5806R67793R39722
$$ -322499 305391 760537 486116 288383 663619 939294 716792 802598 1770391 2710113
42297B710113j96229r40579n18010Q6517M9531j4678M84472Q56542M10680j59344
$$ 2710113 2513884 1573305 1055295 1141812 1191343 1176665 1661137 2517679 2928359 2769015
42287B769015J35851R25243J111962O53258N68808J366071K365023K564035J566503
$$ 2769015 2904866 3830109 4942071 5595329 6164137 7530208 9895231 12459266 14025769
42278A4025769k53646j995372k760285k380874j529780q74896m47144r8627k7279
$$ 14025769 13772123 11776751 9016466 6635592 5105812 4230916 3783772 3685145 3657866
42269C657866l01080l63484K31261R04510P00886k90899j006751r07595n53774
$$ 3657866 3356786 2993302 3224563 4129073 4829959 4539060 3532309 2624714 2070940
42260B070940m94997m64069j45681J1742m87994j123928r09321J08264P86654
$$ 2070940 1575943 1111874 966193 977935 489941 -633987 -1543308 -1435044 -648390
42251f48390M93690o3812m1059K78430J52637k51262j69064L24090L39391k55256
$$ -648390 -154700 -218512 -259571 18859 171496 -79766 -248830 75260 414651 159395
42241A59395m65854J84216P59363M10749k21170j26983L51577J84944m94405o21779
$$ 159395 -306459 -122243 637120 1047869 826699 699716 1051293 1236237 741832 120053
42231A20053o5500J83005k39456n12088j31429L08705K98912K06452L27213K46422
$$ 120053 54553 237558 -1898 -513986 -645415 -336710 -37798 168654 495867 742289
42221G42289j92649l22933J68500M65957p7268p37913n24853K57444O20500M42181
$$ 742289 549640 226707 395207 861164 783896 45983 -478870 -221426 399074 841255
42211H41255K68470Q4003m81308j053295q99237k72913j28009m91888l84024M60364
$$ 841255 1109725 1193728 712420 -340875 -1240112 -1513025 -1641034 -2132922 -2516946 -2056582
42201b056582J034235O65718P3534J61223O33777O08923K3149l81757j92595K34394
$$ -2056582 -1022347 -356629 -283095 -121872 511905 1120828 1143977 762220 569625 804019
42191H04019L89868J84230j24333k98725l64832n27801p86210p41880q6564P88550
$$ 804019 1193887 1378117 1253784 955059 590227 62426 -723784 -1465664 -1552228 -763678
42181g63678J110925P10356J92065l1818l15602r96708j536257j099280J69171
$$ -763678 347247 1057603 1249668 1217850 902248 -94460 -1630717 -2729997 -2560826
42172b560826J112398R52418K07912j03685J68049K74918j46327m17614J31717
$$ -2560826 -1448428 -496010 -288098 -391783 -223734 51184 -95143 -512757 -381040
42163c81040R24658P28818n52965j532022j110584J16025Q02624O16789L01856
$$ -381040 543618 1272436 719471 -812551 -1923135 -1807110 -1004486 -387697 -85841
42154h5841L58556N35312N29316L94956J89516j32108l87808l04092j8967J03452
$$ -85841 272715 808027 1337343 1732299 1921815 1789707 1401899 1097807 1078840 1182292
42144A182292J23115L47460N59045K16298n11798p88516l87749k6299j04583p8847
$$ 1182292 1305407 1652867 2211912 2428210 1916412 1127896 740147 713848 609265 530418
42134E30418M06220P26932L60766j07400J6364K57700k02284r56366q88934m3046
$$ 530418 936638 1663570 2024336 1916936 1933300 2191000 1988716 1032350 143416 100370
42124A00370L27185l18685j014861p94162p23M39939L14070P9654M8353J71050
$$ 100370 427555 108870 -905991 -1700153 -1700876 -1260937 -946867 -867213 -818860 -647810
42114f47810L05115K61667j13827n61718m73981K66780Q99072P38128J84630J32878
$$ -647810 -342695 -81028 -194855 -756573 -1230554 -963774 -64702 673426 858056 990934
42104I90934N63357N11484m41723j387890j239401j86560N67921L54095k50808
$$ 990934 1554291 2065775 1624052 236162 -1003239 -1189799 -621878 -267783 -518591
42095e18591l30418K15146P17982O91490L32685O9133m8395k66892n96108o73269
$$ -518591 -849009 -633863 84119 775609 1108294 1177427 1129032 862140 266032 -407237
42085d07237k62768L26520N65089L89216K83584N75072R04188O71650j24658q48332
$$ -407237 -670005 -343485 221604 610820 894404 1469476 2373664 3045314 2920656 2072324
42075B072324j014017p50474l90329k1193L03819L20481l6747k66658R9811O80987
$$ 2072324 1058307 307833 -82496 -103689 200130 520611 483864 217206 317017 998004
42065I98004O53719k4807m95788k79058L3739k19679o98234o20441K137M20596
$$ 998004 1651723 1626916 1131128 852070 885809 666130 -32104 -652545 -650408 -229812
42055b29812K60157j24793l62544m33252k41446M60444J415710J748925R94766
$$ -229812 30345 -94448 -456992 -890244 -1131690 -671246 744464 2493389 3488155
42046C488155j70857p38700o00466m20588m96390m34904M986M18194L70585O556
$$ 3488155 3317298 2578598 1978132 1557544 1061154 626250 631236 1049430 1420015 1426571
42036A426571l05090n21009p08365o39886j40630L94203M46153K34016M33620
$$ 1426571 1121481 600472 -107893 -747779 -888409 -494206 -48053 185963 619583
42027F19583R88422R83499K0336j023447j161616o14219k29373q4689L71751J003539
$$ 619583 1608005 2591504 2611840 1588393 426777 -187442 -416815 -501504 -129753 873786
42017H73786R26076k5840p62455l95693M98601P35865J53323l41437j29786L99677
$$ 873786 1799862 1774022 1011567 615874 1114475 1850340 2003663 1662226 1532440 1932117
42007A932117N34007J44993k55009j43256M21165P82406L58456o11960j217570
$$ 1932117 2466124 2611117 2356108 2212852 2634017 3416423 3774879 3162919 1945349
41998A945349r22160j91870J74333N3494n4831J07238K54708J41301j4613J09589
$$ 1945349 1023189 831319 1005652 1059146 1004315 1111553 1366261 1507562 1492949 1602538
41988A602538M21055N06001J85846k02179j84031K14257L89249j02332q76495
$$ 1602538 2023593 2529594 2715440 2513261 2329230 2543487 2932736 2830404 1953909
41979A953909j142269p44512l14184k84492l31021r8504J00878j23521l97624
$$ 1953909 811640 67128 -247056 -531548 -862569 -961073 -860195 -983716 -1381340
41970a381340o1547P14401J045063N60797j48097m24041k84908r0965J6565R5477
$$ -1381340 -1442887 -728486 316577 877374 729277 305236 20328 -70637 -54072 41405
41960D1405J94885L55749N09532L22986m14584j166057r89722K03560J267506
$$ 41405 236290 592039 1101571 1424557 1009973 -156084 -1145806 -942246 325260
41951C25260J134614J14170o16801n14709r0859J8593j97057l74365l01661p871
$$ 325260 1459874 1574044 957243 442534 351675 370268 173211 -201154 -502815 -510686
41941e10686L59715N65314M26880R9405J0398L09173N55197K37101m76141q40051
$$ -510686 -150971 414343 841223 940628 951026 1260199 1815396 2052497 1576356 736305
41931G36305m58647K18247N14163L49772J18985k5130k63746n54867n63137k88915
$$ 736305 277658 495905 1010068 1359840 1478825 1453695 1189949 635082 71945 -216970
41921b16970k04835m66743n15303Q1693Q30226R33091M09867l4848p7459n4508
$$ -216970 -421805 -888548 -1403851 -1322158 -491932 441159 851026 816178 738719 684211
41911F84211k37801m59898n01878l18226J31663P26984Q85705R8393j127654j550034
$$ 684211 446410 -13488 -515366 -833592 -701929 25055 910760 1009153 -118501 -1668535
41901a668535o78673O00230J159690Q41803K48609j11784r4651J87727L61025
$$ -1668535 -2347208 -1746978 -587288 254515 503124 391340 296689 484416 845441
41892H45441P3672m29671m80285J3378L30905O0967k28465K2116L94466K58465
$$ 845441 919113 489442 9157 22535 353440 414407 185942 208058 602524 860989
41882H60989q5009L7086L77724J07285p02869j024704m29256K89820L75812J39258
$$ 860989 775980 813066 1190790 1298075 595206 -429498 -858754 -568934 -193122 -53864
41872e3864K29322N41644M97951M0911k90009j81421N4390j4683l53964n63717
$$ -53864 175458 717102 1215053 1255964 965955 784534 838924 824241 470277 -93440
41862i3440m37356j92122p8785J3654K83836M96072K30702k97677l13295L15915
$$ -93440 -530796 -722918 -801703 -788049 -504213 -8141 222561 -75116 -388411 -72496
41852g2496O19723j16340j102406j023929O3694Q15322M89015k60605o19353o30088
$$ -72496 547227 430887 -671519 -1695448 -1631754 -816432 -327417 -588022 -1207375 -1837463
41842a837463n78180k59157N05821J234494J314589P91730J20609m94034r99194
$$ -1837463 -2415643 -2674800 -2168979 -934485 380104 1171834 1292443 798409 -200785
41833b00785j093340n25458L67475R17546Q41097L63326j89652n62816n38956
$$ -200785 -1294125 -1819583 -1452108 -534562 306535 669861 480209 -82607 -621563
41824f21563j51943J97677K20474J87240M94546R24961Q51671J94632l19673n2026
$$ -621563 -773506 -575829 -355355 -168115 326431 1251392 2103063 2297695 1978022 1925996
41814A925996O97417R69615K03485j097843j800749j317351k96592J16206k89256
$$ 1925996 2623413 3593028 3796513 2698670 897921 -419430 -716022 -599816 -889072
41805h89072n73032p9823N30273L08334l95997l34671P20362J482299R10397l85154
$$ -889072 -1462104 -1541927 -1011654 -703320 -1099317 -1433988 -713626 768673 1679070 1293916
41795A293916j078949q34788l47671r9522Q0209L16859L60721J21769r0454j29094
$$ 1293916 214967 -619821 -967492 -1067014 -986805 -669946 -309225 -187456 -277910 -407004
41785d07004l04537p69237j023719n04884N50855J285813J185303M97640k35217
$$ -407004 -711541 -1480778 -2504497 -3009381 -2458526 -1172713 12590 510230 275013
41776B75013o65813o69200l21115L1711N3785p7279J65695P88383J011962K88639
$$ 275013 -390800 -1060000 -1381115 -1349404 -1295619 -1372898 -1207203 -418820 593142 881781
41766H81781p62983r97832j83781P58857R63957N29835R2090k0572P0236J48813
$$ 881781 118798 -879034 -1062815 -303958 659999 1189834 1281924 1261352 1331588 1480401
41756A480401J01378n0765j14417Q8807L64540K48128l44313q64958q01465l16340
$$ 1480401 1581779 1531014 1416597 1505404 1869944 2118072 1773759 908801 107336 -209004
41746b09004J04837L59987O28422P65983M10260k77788n78783j83808K71794M9738
$$ -209004 -104167 255820 884242 1650225 2060485 1782697 1203914 1020106 1291900 1341638
41736A341638o24983q48789k98579L23499K57508l25386o34283l07894K68083
$$ 1341638 716655 -132134 -430713 -107214 150294 -175092 -809375 -1117269 -849186
41727h49186O08695O25350L88492r9499n75698m11956N80675J475304J086120
$$ -849186 -240491 384859 773351 673852 98154 -313802 266873 1742177 2828297
41718B828297m39714j605567j417900n62769k20760l54529n0622P75588J133571
$$ 2828297 2388583 783016 -634884 -1197653 -1418413 -1772942 -1823564 -1047976 85595
41709H5595N71115j5990K32832P59750M68788m87553q65179k06191N05671L73856
$$ 85595 656710 640720 873552 1633302 2102090 1614537 749358 543167 1048838 1422694
41699A422694j77101l04987j06289j87436m00335q7227N88214O84856q383n94252
$$ 1422694 1245593 940606 834317 646881 246546 159319 747533 1432389 1424006 829754
41689H29754n50854n14847r53224j082583j09694J206434J438120N18543l28098
$$ 829754 278900 -235947 -1189171 -2271754 -2381448 -1175014 263106 781649 453551
41680D53551m75301m52561o01546m72592J01143M66813K09220j83683k38377k16008
$$ 453551 -21750 -474311 -1075857 -1548449 -1447306 -980493 -771273 -954956 -1193333 -1409341
41670a409341l55839k58191K90176O55830L15653j96428j50738J56153k5205n62554
$$ -1409341 -1765180 -2023371 -1733195 -1077365 -761712 -958140 -1108878 -952725 -977930 -1540484
41660a540484o76498k19560K46257M72425O90294Q48460N99381O5091k12928j35707
$$ -1540484 -2216982 -2436542 -2190285 -1717860 -1027566 -179106 420275 485366 272438 136731
41650A36731r6929j77169j16883j08303o41082j346691j021956O57468K263814
$$ 136731 39802 -137367 -254250 -362553 -1003635 -2350326 -3372282 -2714814 -451000
41641d51000K185820N95217q31389r01207k9872N48038K25345m60898n96573o740
$$ -451000 1734820 2330037 1498648 597441 567569 1115607 1340952 880054 283481 276741
41631B76741N79503N31181J25954J2932K06876K12140n3642k00519k03020m86354
$$ 276741 856244 1387425 1513379 1526311 1733187 1945327 1891685 1691166 1488146 1001792
41621A001792j000118r97601j32445Q53813J026237M06413k17136l15229o1135
$$ 1001792 1674 -995927 -1128372 -274559 751678 1158091 940955 625726 564591
41612E64591O1689j79211n01495l76562K43619O27757J41394p30984r06063k12517
$$ 564591 626280 447069 -54426 -430988 -187369 440388 581782 -149202 -1055265 -1267782
41602a267782M15783L79745J72062L69954P14994O98555L65094M137l50176o27253
$$ -1267782 -851999 -472254 -300192 69762 784756 1483311 1848405 1852542 1502366 875113
41592H75113n49598k36736l06624q36794r54747j33394Q22184Q86071K70738j07665
$$ 875113 325515 88779 -217845 -1054639 -2009386 -2142780 -1320596 -434525 -163787 -271452
41582b71452m4591N2595J87870O06439R17728N02500l46666p34027n37948m67376
$$ -271452 -316043 -263448 -75578 530861 1448589 1951089 1604423 870396 332448 -134928
41572a34928p55029q26166l98125N9724K08055L32857O71344R68758R87744Q31905
$$ -134928 -889957 -1716123 -2114248 -2054524 -1846469 -1513612 -842268 126490 1114234 1946139
41562A946139N40161k7920o78502q36223k78307N02279Q13914L31678p36077j600892
$$ 1946139 2486300 2458380 1779878 943655 665348 1167627 1981541 2313219 1577142 -23750
41552b3750j298884J64012J350438R65625l37782q11197j07852M28241O8011k76905
$$ -23750 -1322634 -1158622 191816 1157441 819659 8462 -99390 328851 396862 119957
41542A19957J19763M69855n2585p45861n18133K99723N67117J63177o9267J31386
$$ 119957 239720 709575 656990 -88871 -607004 -307281 259836 423013 353746 485132
41532D85132J52755l35501r20607j132436q19953M4046J169683J704761J022141
$$ 485132 637887 302386 -618221 -1750657 -2570610 -2526564 -1356881 347880 1370021
41523A370021k70005q86803m64429J33446J48159k00799l47979j94143Q210P7959
$$ 1370021 1100016 213213 -251216 -117770 30389 -170410 -518389 -712532 -704322 -626363
41513f26363m1661k67359k66054K31646Q76524R02941J01343p82174q74361j48809
$$ -626363 -668024 -935383 -1201437 -969791 -93267 809674 911017 128843 -745518 -894327
41503h94327O43717Q29506M07367j01261k49907r8657l5139k10178l63905k79714
$$ -894327 -250610 578896 986263 885002 635095 536438 501299 291121 -72784 -352498
41493c52498r7530K4381K10053N03883N60552J58700k64567j55133K75268L24878
$$ -352498 -450028 -425647 -215594 288289 848841 1007541 742974 587841 863109 1187987
41483A187987j32614n06058m29703k03620j47051r6300J90210N55237O33511K49609
$$ 1187987 1055373 549315 119612 -84008 -231059 -327359 -137149 418088 1051599 1301208
41473A301208m81668j167357j256976n68834K72860M04770j82386o11785l02652
$$ 1301208 819540 -347817 -1604793 -2173627 -1900767 -1495997 -1678383 -2290168 -2592820
41464b592820L56213P10369O49811M13929J35820j1663K86970R36473J179614
$$ -2592820 -2236607 -1526238 -876427 -462498 -326678 -338341 -51371 885102 2064716
41455B064716M85328n93024j055856p61838m36324m53217l61908J73168O53307
$$ 2064716 2550044 1957020 901164 139326 -296998 -750215 -1112123 -938955 -285648
41446b85648M61205j26703k69349K14946N76015K44753l18022l11155K06326M20869
$$ -285648 175557 48854 -220495 -5549 570466 815219 497197 186042 392368 813237
41436H13237K2446l20515j7794M89760L72956l26154p21125l07974L98955N71684
$$ 813237 835683 515168 497374 987134 1360090 1033936 312811 4837 403792 975476
41426I75476J3462p36578r84844n03113K40905N11425J45320k17291k5251L57516
$$ 975476 988938 252360 -732484 -1235597 -994692 -483267 -337947 -555238 -580489 -222973
41416b22973K24231l25606n12181p3335M28758N63829N08721L90195j4991n75792
$$ -222973 1258 -324348 -836529 -909864 -481106 82723 591444 981639 966648 390856
41406C90856o13722N5347N79434K12364n49966o62746L3929P32398P36366P6224
$$ 390856 -222866 -167519 411915 624279 74313 -588433 -554504 177894 914260 990484
41396I90484o98285r04697k53071O16998O18669k98550q08251k8218J055148R79245
$$ 990484 292199 -612498 -865569 -248571 370098 71548 -736703 -764921 290227 1269472
41386A269472j6173m92462r3469J78423r9548j55727L23483M54755k41059q13131
$$ 1269472 1253299 760837 667368 845791 746243 590516 913999 1368754 1127695 314564
41376C14564l78057M11534M36780j65973m52744k42858j22067k48281k19654M7768
$$ 314564 -63493 348041 784821 618848 166104 -76754 -198821 -447102 -666756 -618988
41366f18988K40888L33433N26734O28804K89577k50267m19950k13008n7955J4155
$$ -618988 -378100 -44667 482067 1110871 1400448 1150181 730231 517223 459268 473423
41356D73423K00386J55306n13170j105488n14334Q43468J258045K94241m61359
$$ 473423 673809 829115 315945 -789543 -1303877 -460409 797636 1091877 630518
41347F30518M90M23282m74638j549104r29112P95927J317717J89706o28925j7895
$$ 630518 631008 1054290 579652 -969452 -1898564 -1102637 215080 404786 -224139 -242034
41337b42034P47512M22029k52146k05820L5175l91103q18457j86840Q60258Q35979
$$ -242034 505478 927507 675361 469541 504716 113613 -704844 -891684 -31426 804553
41327H04553j50776o17829j44294J95415j22191l33460l5469O9668l24947l72843
$$ 804553 653777 35948 -108346 87069 -35122 -368582 -404051 -334383 -659330 -1032173
41317a032173L72700R42378M59844m02748n19040J8367L70813L48318K57293j314
$$ -1032173 -659473 282905 742749 340001 -179039 -160672 210141 558459 815752 814438
41307H14438n72847r14539n27711K3689o7742m43518j73145O10459R57370P27520
$$ 814438 241591 -672948 -1200659 -1176970 -1244712 -1688230 -1861375 -1250916 -293546 433974
41297D33974O04893O33417K23972l52374q3274Q78727J059055j969q23625k68943
$$ 433974 1038867 1672284 1896256 1543882 1460608 2339335 3398390 3396421 2572796 2303853
41287B303853O76105N43000l99710q82611o65765m33163l11260R1951N41682L82359
$$ 2303853 2979958 3522958 3123248 2240637 1574872 1141709 830449 922400 1464082 1846441
41277A846441k73890o60323n14506j94363R5219K65962n1337p96428q68563M21790
$$ 1846441 1572551 912228 397722 203359 298578 564540 513203 -283225 -1151788 -729998
41267g29998J714803J095678r16594j776423n53195Q28720O74134j37546q7467
$$ -729998 984805 2080483 1163889 -612534 -1165729 -337009 337125 199579 112112
41258A12112M44665K32419m77655n50639p7924p1679m97026m00996J73380J68999
$$ 112112 556777 789196 311541 -239098 -317022 -388701 -885727 -1286723 -1113343 -944344
41248i44344m79543n26102M66835J222017O86542l66790n64356J60919P94425
$$ -944344 -1423887 -1949989 -1483154 -261137 425405 58615 -505741 -344822 449603
41239D49603P32047K10975l20798n59824l75822k4847l9966m98919p83583m66038
$$ 449603 1181650 1392625 1071827 512003 136181 111334 71368 -427551 -1211134 -1677172
41229a677172L6509J66405Q5882K38560M98362M58863K42492K66349M00588J29220
$$ -1677172 -1640663 -1474258 -1388376 -1149816 -651454 -192591 49901 316250 716838 846058
41219H46058n04779q38861n44237k3699K53655K73148J96291N6341q4133p2051
$$ 846058 341279 -497582 -1041819 -1065518 -811863 -538715 -342424 -286083 -370216 -442267
41209d42267N4080L2004k26864m61128l89801l5820L01258K55576k88301q81546
$$ -442267 -388187 -356183 -583047 -1044175 -1433976 -1469796 -1168538 -912962 -1201263 -2082809
41199b082809p78377J11911Q41098N48449k80293m17787L61525J028938Q93653
$$ -2082809 -2861186 -2749275 -1908177 -1359728 -1640021 -2057808 -1696283 -667345 226308
41190B26308M99102N33631O92368K81941n98316j180472j050335m91762J1043
$$ 226308 725410 1259041 1951409 2233350 1635034 454562 -595773 -1087535 -1076492
41181a076492J95367R6160M119J87126M90402M99445K10048P7160K23304J90970
$$ -1076492 -881125 -784965 -780846 -593720 -103318 396127 606175 683335 906639 1097609
41171A097609k06129m43837j73655R9321j57066n86759n73024k40746k5125K43549
$$ 1097609 891480 447643 273988 373309 216243 -370516 -943540 -1184286 -1209411 -965862
41161i65862Q57016J243943N99963o71302j282906q37366j99034o813Q2204M05992
$$ -965862 -108846 1135097 1735060 1063758 -219148 -1056514 -1255548 -1262361 -1180157 -774165
41151g74165O09641L84562L6685j18314j81476j49582K28209P05543N21949l83545
$$ -774165 -164524 220038 256723 138409 -43067 -192649 35560 741103 1263052 879507
41141H79507r97868o56151r065J12265j7196K75209P38788N82583k16698q88489
$$ 879507 -118361 -774512 -783577 -671312 -688508 -413299 325489 908072 691374 -197115
41131a97115r07245l53358M54054J032306Q44605L6664l81228J48145P45711L52336
$$ -197115 -1104360 -1457718 -1003664 28642 873247 909911 528683 676828 1422539 1774875
41121A774875n62951p19600o0821K96462p103j89649j6371l10312j242260j553355
$$ 1774875 1211924 492324 431503 727965 720862 531213 514842 204530 -1037730 -2591085
41111b591085l98003J142079J455490N52593k35999j84440K39267M06435J97671
$$ -2591085 -2989088 -1847009 -391519 161074 -74925 -259365 -20098 386337 584008
41102E84008k49039o68854n99002J34137Q81714P75264j01020p41101n20398Q3651
$$ 584008 334969 -333885 -932887 -798750 82964 858228 757208 16107 -504291 -420640
41092d20640K60792j11389m95072m31768K7068M73443N29523J71814k11578j77868
$$ -420640 -159848 -271237 -766309 -1198077 -1171009 -697566 -168043 3771 -207807 -385675
41082c85675K56063N50010K35346m59278p69577k95604M21017M98380j41449o35493
$$ -385675 -129612 420398 655744 196466 -573111 -868715 -447698 50682 -90767 -726260
41072g26260l54470K43852L54149K2670m8034L08072N01515J92461k42921m18614
$$ -726260 -1080730 -836878 -482729 -460059 -508093 -200021 301494 493955 251034 -167580
41062a67580l91599j90170L36681Q71098O69681k23042o37146J21393J099017
$$ -167580 -559179 -749349 -412668 458430 1128111 905069 267923 389316 1488333
41053A488333J043801K56628n0346K37548J38833n52089q36993k24414M36597
$$ 1488333 2532134 2788762 2738416 2975964 3114797 2562708 1725715 1501301 1937898
41044A937898L79644O8405J89257M15864Q8059n23204o11651j43321J48831p2331
$$ 1937898 2317542 2385947 2575204 2991068 3079127 2555923 1944272 1800951 1949782 1877451
41034A877451m07550n13026m82518l61859J1230M67135M34822k21812p83240n52293
$$ 1877451 1469901 956875 474357 112498 123728 590863 1025685 803873 20633 -531660
41024e31660J71662N08579K02858j67972j90909j81326m52653n92010q7690O16808
$$ -531660 -359998 148581 351439 183467 -7442 -188768 -641421 -1233431 -1321121 -704313
41014g04313N09545m68222j089765m56340O99385R86844K19390n05628m34152
$$ -704313 -194768 -662990 -1752755 -2209095 -1509710 -522866 -303476 -809104 -1243256
41005a243256J1579J80773J64578L53535N84644L69545k29897n44263k00458L20600
$$ -1243256 -1231677 -1050904 -886326 -532791 51853 421398 191501 -352762 -553220 -232620
40995b32620K92373k53025m81288J36435R67296R25467j9485o82889k81625M57396
$$ -232620 59753 -193272 -674560 -538125 429171 1354638 1335153 652264 370639 828035
40985H28035M05785k94969n45487J8445O40109P26000N29769L71390R3968l58186
$$ 828035 1233820 938851 393364 411809 1051918 1777918 2307687 2679077 2773045 2414859
40975B414859o00308m22281r3584J92468M60383L92263l97499j261215r04327
$$ 2414859 1814551 1392270 1298686 1491154 1951537 2343800 1946301 685086 -219241
40966b19241N69468J310730L09151r95997r34672j60104k77901r48956n43165
$$ -219241 350227 1660957 1970108 974111 39439 -120665 -398566 -1347522 -1890687
40957a890687P86144J080236j79881j092078l29956Q80990Q94786R2520j73199
$$ -1890687 -1104543 -24307 -204188 -1296266 -1626222 -745232 149554 242074 68875
40948F8875J91427L50569K16246K84446L34251k60804j153202j257466l86669
$$ 68875 260302 610871 827117 1111563 1445814 1185010 31808 -1225658 -1612327
40939a612327M20638L63850j73089l46317R7096O89418P84474J90269n00060m15903
$$ -1612327 -1191689 -827839 -1000928 -1347245 -1250149 -560731 223743 414012 -86048 -501951
40929e01951M67172J101161O91523k33262o81991o11453o32679p30495l52126
$$ -501951 -34779 1066382 1757905 1524643 842652 231199 -401480 -1131975 -1484101
40920a484101L82933O91073M32256L29381O15146N11319m31167j371237j268410
$$ -1484101 -1101168 -410095 22161 351542 966688 1478007 1046840 -324397 -1592807
40911a592807l15125M60843O23631O19898Q13953R15557M89488l69383j077054
$$ -1592807 -1907932 -1447089 -823458 -203560 610393 1525950 2015438 1646055 569001
40902E69001j163330p20389k09630J27045M33925P14679N42047k55796r34267
$$ 569001 -594329 -1314718 -1524348 -1397303 -963378 -248699 293348 37552 -896715
40893h96715n76129N58611J196576P11705j27963l68687r0501P0728l120K1551
$$ -896715 -1472844 -914233 282343 994048 866085 497398 406897 477625 474505 496056
40883D96056J72047J49205q5185k35076j36284P6140K05479J32502j62240m91047
$$ 496056 668103 817308 732123 497047 360763 436903 642382 774884 612644 121597
40873A21597n42455k73313n575M6855O2810K27173M04341M35981L81485K07555
$$ 121597 -420858 -694171 -699746 -652891 -590081 -362908 41433 477414 858899 1066454
40863A066454k78202q36599p22449K44059J074724Q11273j13158n54102l41833
$$ 1066454 788252 -48347 -770796 -526737 547987 1359260 1246102 692000 350167
40854C50167k69672n53483m60608L20182R97651Q49130K59694J1624J40543J22002
$$ 350167 80495 -472988 -933596 -613414 384237 1233367 1493061 1504685 1645228 1767230
40844A767230j90171m03236k08424K22697L89312j16902j108897j682811j037191
$$ 1767230 1577059 1173823 965399 1188096 1577408 1460506 351609 -1331202 -2368393
40835b368393M40615J412134J149632L17530j26956j78803l69295o63860n87164
$$ -2368393 -1927778 -515644 633988 951518 824562 645759 276464 -387396 -974560
40826i74560j80401J0747j01066M9008P13128J270947R79828n0211r42125r77172
$$ -974560 -1154961 -1144214 -1245280 -1196272 -483144 787803 1767631 1717420 775295 -201877
40816b01877k66237M33868N09747J09179j18631P2590J69830l12415r95877j053174
$$ -201877 -468114 -34246 475501 584680 466049 538639 708469 396054 -599823 -1652997
40806a652997l23620M94218P62411N25028J43908j73570k93620q1146K85541L09431
$$ -1652997 -1976617 -1482399 -719988 -194960 -51052 -224622 -518242 -599388 -313847 -4416
40796d416j45070m79025j22457N28478M94523m31522j241536r17309K54531J011357
$$ -4416 -149486 -628511 -750968 -222490 272033 -159489 -1401025 -2318334 -2063803 -1052446
40786a052446O81901m4455j18502M79223Q27448M22878j65186k28060M4484j1121
$$ -1052446 -370545 -415000 -533502 -54279 773169 1196047 1030861 802801 847285 836164
40776H36164m02689m84862n6784K70697N9254k19828R2024P86600J043822N76679
$$ 836164 433475 -51387 -108171 162526 221780 1952 93976 880576 1924398 2501077
40766B501077o1209l48229m31489o37667p65398l45472M94510R25922M02690n60037
$$ 2501077 2439868 2091639 1660150 1022483 257085 -88387 406123 1332045 1734735 1174698
40756A174698r66137n83782j59338l01095o34788m21414L38433R31018R05718
$$ 1174698 208561 -375221 -534559 -835654 -1470442 -1891856 -1553423 -622405 283313
40747B83313M92635O5715k77248m92882m41969j70890L2617M7221L4434K1041
$$ 283313 775948 841663 564415 71533 -370436 -541326 -508709 -461488 -427054 -406013
40737d06013k00196n62264n90029o6519N84950Q73900P68710L87080k71773q92138
$$ -406013 -606209 -1168473 -1758502 -1825021 -1240071 -366171 402539 789619 517846 -374292
40727c74292p85440J25142Q52669O17354J2950J4245L67173J47588m32390k26021
$$ -374292 -1159732 -1034590 -181921 435433 448383 462628 829801 977389 544999 318978
40717C18978Q04130J242331L62296p37367q54377l68195k77147n10779l24314
$$ 318978 1123108 2365439 2727735 1990368 1135991 767796 490649 -20130 -344444
40708c44444K51563N00031K42780k7644r2748k25661n07075o29729m01294N3266
$$ -344444 -92881 407150 649930 622286 529538 303877 -203198 -832927 -1234221 -1180955
40698a180955N12286P16155M71827O5515J27836O29647O25701l30783j213190
$$ -1180955 -668669 47486 519313 584828 712664 1342311 1968012 1637229 424039
40689D24039r14862K5105L12616J710J92662Q60811P34152m20320j101494l38239
$$ 424039 -490823 -465718 -153102 -151392 41270 902081 1636233 1215913 114419 -223820
40679b23820Q09641R18117J77350l04667k20711l2228N9010J14060m131k41131
$$ -223820 585821 1503938 1681288 1376621 1155910 1123682 1182692 1296752 1292621 1051490
40669A051490p6384N61682P70903l5573r90653r55992k24093J14275m8421j693
$$ 1051490 975106 1536788 2307691 2272118 1281465 325473 101380 215655 167234 165541
40659A65541K43897M7931l97939k19608M56922M94606k90008o73357r6849K89234
$$ 165541 409438 457369 59430 -160178 296744 791350 501342 -172015 -268864 20370
40649B0370m35031j260278p37853P07248J336024N48028n10575o98607j26531
$$ 20370 -414661 -1674939 -2412792 -1705544 -369520 178508 -332067 -1030674 -1157205
40640a157205M76901P14847N36539M252n62843o73363k49151J87269K00845L0404
$$ -1157205 -680304 34543 571082 575334 12491 -660872 -910023 -722754 -521909 -491505
40630d91505J39964M02500K18753n10884j013389n80265L94625Q07208K52038
$$ -491505 -351541 50959 269712 -241172 -1254561 -1834826 -1440201 -632993 -380955
40621c80955m74414m66528J64845O19105M93796Q7320j51238k3297L81752O26731
$$ -380955 -855369 -1321897 -1157052 -537947 -44151 43169 -108069 -131366 250386 877117
40611H77117J54685r06523j449671o02166R35003J583795R03019J1722j43055
$$ 877117 1031802 125279 -1324392 -1926558 -991555 592240 1495259 1506981 1363926
40602A363926K3462k89900r34543j111044n03689M45606J062332Q87236K1741
$$ 1363926 1387388 1097488 162945 -948099 -1451788 -1006182 56150 943386 965127
40593I65127o85563l50660P13234J145324L72572m91175k87233M42138M15184
$$ 965127 279564 -71096 642138 1787462 2160034 1668859 1381626 1823764 2238948
40584B238948k51710k40863P24484J247635L22748j076712j274777j19802R34278
$$ 2238948 1987238 1746375 2470859 3718494 4041242 2964530 1689753 1569951 2504229
40575B504229P64373j74301o90081l95422M1793J9942j76660L3958N01227M91373
$$ 2504229 3268602 3094301 2404220 2008798 2050591 2070533 1893873 1927831 2429058 2920431
40565B920431j78421p94119p46322l12975q2231q1486L2775K62369K72383n3937
$$ 2920431 2742010 1947891 1201569 888594 806363 724877 757652 1020021 1292404 1238467
40555A238467m61748o14851l28320K45795N29098N4356p19547p51082J00639P08349
$$ 1238467 776719 161868 -166452 79343 608441 662797 -56750 -807832 -707193 1156
40545A156L39109j87819J15405O86021L29779o79031q98108J0180P68914M56881
$$ 1156 340265 152446 267851 953872 1283651 604620 -293488 -283308 485606 942487
40535I42487l11471n79510l09045N0765L18602L89598Q0120l73779l83941M4981
$$ 942487 631016 51506 -257539 -206774 111828 501426 581546 207767 -176174 -131193
40525a31193K01873j29069k05505M40558J141530J079986M09711k37582o84411
$$ -131193 70680 -58389 -263894 176664 1318194 2398180 2807891 2570309 1885898
40516A885898r82427q95285l37649J80677K23342O8944R3938Q1552j96018l16123
$$ 1885898 903471 8186 -329463 -148786 74556 143500 237438 318990 122972 -193151
40506a93151Q2214M73571K08109l72235n06139k87185l51011o00804l53815L60789
$$ -193151 -110937 362634 570743 198508 -307631 -594816 -945827 -1546631 -1900446 -1539657
40496a539657P54938N87761M82527P47417Q37236L34593l19119m79796j09894
$$ -1539657 -784719 -196958 285569 1032986 1870222 2204815 1885696 1405900 1296006
40487A296006L91217O81798N61736J3813o36057r76056r98385r36497o96628m3980
$$ 1296006 1687223 2369021 2930757 2944570 2308513 1332457 334072 -602425 -1299053 -1343033
40477a343033O90258Q25890L47596m3740k7396j859j31775R255M54918M86415
$$ -1343033 -652775 173115 520711 476971 449575 447716 315941 325196 780114 1266529
40467A266529j15833m06776K47655Q59415J66403j259056j640396n79338M31993
$$ 1266529 1150696 743920 991575 1850990 2017393 758337 -882059 -1461397 -1029404
40458a029404L26381j05978K07482Q01270N69278k37667k96699O36011J203888
$$ -1029404 -703023 -809001 -601519 199751 769029 531362 234663 870674 2074562
40449B074562M73430o35199p39765m4472J01647o23430j024684k98332O90524
$$ 2074562 2547992 1912793 1173028 1128556 1230203 606773 -417911 -716243 -25719
40440b5719P28597M8228j76157K91832M89841r7676o94376m75249J40786J35114
$$ -25719 702878 751106 574949 866781 1356622 1258946 564570 89321 230107 365221
40430C65221o00496j116878o61506M92278J494518J738714J148477P2379q74967
$$ 365221 -235275 -1352153 -2013659 -1521381 -26863 1711851 2860328 2932707 2057740
40421B057740j148670p48789k60033j97881l95057k82738K57115O61459M53966
$$ 2057740 909070 160281 -99752 -297633 -692690 -975428 -718313 -56854 397112
40412C97112o8677k48582J6159K11938N7030r6573Q0893K87355M5440m94645o83357
$$ 397112 328435 79853 96012 307950 364980 268407 349300 636655 682095 187450 -495907
40401d95907k37697M26316P62913O77899M50418K99230J46480k49151r15027j412116
$$ -495907 -733604 -307288 455625 1133524 1583942 1883172 2029652 1780501 865474 -546642
40391e46642j162480j75195P88603J022318O30585J97948l0146k11245l70717
$$ -546642 -1709122 -1884317 -1095714 -73396 557189 755137 724991 513746 143029
40382A43029l54157k44666k86401l91834k52332M8422J14567r002J62202O07243
$$ 143029 -211128 -455794 -742195 -1134029 -1386361 -1337939 -1223372 -1232374 -1070172 -462929
40372d62929N95178j55552p90181m35802M73238P58198J46800m37450k54744L17100
$$ -462929 132249 -23303 -813484 -1249286 -776048 -17850 128950 -308500 -563244 -246144
40362b46144M97156J99172l5092O2116J30590k19846p78963r39314m57898K14899
$$ -246144 251012 450184 415092 477208 607798 387952 -391011 -1330325 -1788223 -1573324
40352a573324M63989K13049p8028l9158K10536L08949J05611k11318l44388j95492
$$ -1573324 -1109335 -896286 -974314 -1013472 -802936 -493987 -388376 -599694 -944082 -1139574
40342a139574K0999J8249j78804k37259R146L18332M43641M79604N05101K26931
$$ -1139574 -1118575 -1100326 -1279130 -1516389 -1507243 -1188911 -745270 -265666 239435 466366
40332D66366n11826j117206q01042K88626J116505R89503J90730o15332r98727
$$ 466366 -45460 -1162666 -1963708 -1675082 -558577 430926 621656 6324 -992403
40323i92403p72387q7831L85606J07692l97602q6467R55758J404292O07284m48515
$$ -992403 -1764790 -1852621 -1467015 -1359323 -1756925 -1843392 -887634 516658 1123942 675427
40313F75427o89915m30259m47344n56446j95862L23712L71477K35736N47940Q97178
$$ 675427 -14488 -444747 -892091 -1448537 -1644399 -1320687 -949210 -713474 -165534 731644
40303G31644L77266p11999j100811m68582K04113K97622K37876K96260O4090m40492
$$ 731644 1108910 396911 -703900 -1172482 -968369 -670747 -432871 -136611 -72521 -513013
40293e13013m46403J59530L06237n55627j292902o60236P79548J423327Q05745
$$ -513013 -959416 -799886 -493649 -1049276 -2342178 -3002414 -2222866 -799539 6206
40284F206o4511k78619L7715L22530L37091K11654J72476K61807J72875l72689
$$ 6206 -58305 -336924 -299209 23321 360412 572066 744542 1006349 1179224 806535
40274H06535r57561p55995J80287O50799n9043r77269p63076L37175R35645N63349
$$ 806535 -151026 -907021 -726734 -75935 -134978 -1112247 -1875323 -1538148 -602503 -39154
40264c9154P8129P5664J24388j57292l55825q7164K80924K84149Q2964k48q8740
$$ -39154 38975 114639 239027 81735 -274090 -361254 -80330 203819 286783 286535 197795
40253A97795l36969m07969J903M70157L47022k27458m39492O0109O64741O12986
$$ 197795 -139174 -547143 -545240 -75083 271939 44481 -395011 -334902 329839 942825
40243I42825p9167p15040p83161m94292l96944n88166n70279k2122N86899N63814
$$ 942825 863658 148618 -634543 -1128835 -1525779 -2113945 -2684224 -2706346 -2119447 -1555633
40233a555633K0898k32601J29535N18269M27340K18404M22229P86173O85951J57491
$$ -1555633 -1534735 -1767336 -1637801 -1119532 -692192 -473788 -51559 734614 1420565 1578056
40223A578056k03573k05020j89307k51820r6067K20809J73321l02094m83084M4975
$$ 1578056 1374483 1169463 980156 728336 632269 853078 1026399 724305 241221 286196
40213B86196N84915K93234m70840n82811J87491P87478L45225o51851j053126
$$ 286196 871111 1164345 693505 110694 298185 1085663 1430888 779037 -274089
40204b74089n04557K62657M36236l316m32695l25345K69571Q55435R78463N89762
$$ -274089 -778646 -515989 -79753 -83069 -515764 -841109 -571538 283897 1262360 1852122
40194A852122j6521n11107p01419n27111j17128J64922J1280m03277n49047k35640
$$ 1852122 1835601 1324494 623075 95964 -21164 143758 155038 -248239 -797286 -1032926
40184a032926J15450J24427N2245L30357P38479O52607P7988k41464N0526L46800
$$ -1032926 -917476 -793049 -740804 -410447 328032 980639 1058627 817163 867689 1214489
40174A214489O1164m01448l42221o442j91048p42284n50972O26849J404291O03905
$$ 1214489 1275653 874205 531984 525542 334494 -407790 -958762 -331913 1072378 1676283
40164A676283r15080j360146n17021J30754j96653m46282M02886J525794J392140
$$ 1676283 761203 -598943 -1115964 -985210 -1181863 -1628145 -1225259 300535 1692675
40155A692675N4056r37447p07642j899J70863j68940m07559k80786R7393N73731
$$ 1692675 1746731 809284 101642 99743 270606 101666 -305893 -586679 -489286 84445
40145H4445Q70112O37156J0907l49257j97395j58948p24010j310772j063293j97109
$$ 84445 954557 1591713 1602620 1253363 1055968 897020 173010 -1137762 -2201055 -2398164
40135b398164L08169J66948L2362K75645M30841J15989k62283j53358L19063O03011
$$ -2398164 -2089995 -1923047 -1890685 -1615040 -1184199 -1068210 -1330493 -1483851 -1164788 -561777
40125e61777M32644p322l39029k33765K59892N22885l1150j016595j321433n50911
$$ -561777 -129133 -136455 -475484 -709249 -449357 73528 42378 -974217 -2295650 -2846561
40115b846561M13113O92087N62001O99058R03703M93106l61526o94900j64141
$$ -2846561 -2433448 -1741361 -1179360 -480302 423401 916507 554981 -139919 -304060
40106c04060M58607M21736o7482l48371k23632J01O4745J3807J4832J15236J63614
$$ -304060 154547 576283 508801 160430 -63202 -63101 1644 15451 30283 145519 309133
40095C09133O937k00449j13890K30353L45101J14061J64097P90680J046669m6165
$$ 309133 316070 115621 1731 232084 577185 691246 855343 1646023 2692692 2646527
40085B646527j634465j725739L5503J622188J291559j72024q21466k14454M78105
$$ 2646527 1012062 -713677 -678174 944014 2235573 2063549 1242083 1027629 1505734
40076A505734M47187M6281j91009j95401J617L38963L84952k14850r07513p48214
$$ 1505734 1952921 1999202 1808193 1612792 1614409 1953372 2338324 2123474 1215961 467747
40066D67747J36740N48399n0932p44554n74666J01670L43137O4195n4824K53003
$$ 467747 604487 1152886 1101954 357400 -217266 -115596 227541 291736 236912 489915
40056D89915N13068K87423k68955o70326o10814k17697O2001n8800k98565j55368
$$ 489915 1002983 1290406 1021451 351125 -259689 -477386 -415385 -474185 -772750 -928118
40046i28118K96591M05569j04733o89772p62047l98865O3278N77611J060762J069674
$$ -928118 -631527 -225958 -330691 -1020463 -1782510 -2181375 -2118097 -1540486 -479724 589950
40036E89950M27537k61119l79710k08289l67994p13614n91042K9035N16706N74465
$$ 589950 1017487 756368 376658 168369 -199625 -913239 -1504281 -1475246 -958540 -384075
40026c84075M61415L02013l228j99563J13193O07176M40450m51885j112698q98327
$$ -384075 77340 379353 376125 176562 289755 896931 1337381 885496 -227202 -1125529
40016a125529k91947l9457j75958k97651j89484J75652O99266R40274M54775l92024
$$ -1125529 -1417476 -1456933 -1632891 -1930542 -2120026 -1944374 -1245108 -304834 149941 -242083
40006b42083o64557j97723J20739j93871m11171J37854Q56059Q10884J72979k16431
$$ -242083 -906640 -1104363 -983624 -1177495 -1588666 -1450812 -594753 216131 389110 172679
39996A72679j85634j82896k87520k22019p8537j45863k30436K0255L42875K39567
$$ 172679 -12955 -195851 -483371 -705390 -783927 -929790 -1160226 -1139971 -797096 -557529
39986e57529r5485j01134J20104M5991j61372J42599P97087Q61113J17531m92519
$$ -557529 -653014 -754148 -634044 -588053 -749425 -606826 190261 1051374 1168905 676386
39976F76386k96705J62458P8089m72693q47101p49201l64728J1070J49067K7540
$$ 676386 379681 542139 620228 147535 -699566 -1448767 -1813495 -1802425 -1653358 -1625818
39966a625818k6623K97700P50817Q19210N40775L86957L39792r3930q07876r62672
$$ -1625818 -1652441 -1354741 -603924 215286 756061 1143018 1482810 1388880 581004 -381668
39956c81668k98216L05598J35651k67734l2007O65226R43493N54670P8478l0714
$$ -381668 -679884 -374286 -238635 -506369 -538376 126850 1070343 1625013 1703491 1672777
39946A672777R3107J68089J20130k9268k31133l22104j50184J69333K99584L3197
$$ 1672777 1765884 1933973 2054103 2024835 1793702 1471598 1321414 1490747 1790331 1823528
39936A823528m42203o48221k95504K77692M01090l498j99237K48519O31299J24261
$$ 1823528 1381325 733104 437600 715292 1116382 1112884 913647 1162166 1793465 1917726
39926A917726p65296q40535j23456J39974m95454r74751n04048K62474M86193
$$ 1917726 1152430 311895 188439 328413 -167041 -1141792 -1645840 -1383366 -897173
39917h97173M35151O20695O56574N5110o14632n01811J44419M53241L44539L71060
$$ -897173 -462022 158673 815247 870357 255725 -246086 -101667 351574 696113 1067173
39907A067173M88056J27644o07974q93078m11195K13396L59199J00896j64784
$$ 1067173 1555229 1682873 1074899 181821 -229374 -15978 343221 444117 279333
39898B79333k21516n2561K06767K94813J36163M2029K64698N27955M00956k1854
$$ 279333 57817 5256 212023 506836 642999 685028 949726 1477681 1878637 1856783
39888A856783k35934k7682K96305L39454N3622k13194q4948K85089K19062n27582
$$ 1856783 1620849 1593167 1889472 2228926 2282548 2069354 1984406 2269495 2488557 1960975
39878A960975j121885o98591K22350L93659k44920o02924l71108l42903n81309
$$ 1960975 839090 140499 362849 756508 511588 -91336 -462444 -805347 -1386656
39869a386656q1111J161639J656860Q91762L51792R23027J296017M32447m30658
$$ -1386656 -1467767 -306128 1350732 2242494 2594286 3517313 4813330 5245777 4815119
39860D815119o2113N02823J28500L338J356689K645165J974803O74161J199276
$$ 4815119 4753006 5255829 5384329 5387667 6744356 9389521 11364324 12038485 13237761
39851A3237761K932786L579440L408477M281221N728615O254677P301138J1081220
$$ 13237761 16170547 19749987 23158464 27439685 33168300 39422977 46724115 57805335
39843E7805335J5889966J9633126K6449352M0695302N3163139M4486707R187438
$$ 57805335 73695301 93328427 119777779 160473081 213636220 258122927 267310365
39836B67310365l1695639n1102090m4566848k9806976k1751965j8948334j4423635
$$ 267310365 235614726 184512636 139945788 110138812 88386847 69438513 55014878
39829E5014878q430821n330329n192294m784761l383138k686019k916969k777217
$$ 55014878 46584057 41253728 36061434 31276673 27893535 25207516 22290547 19513330
39821A9513330k093906j700137j566276j184582r61425j446307j949054j456606
$$ 19513330 17419424 15719287 14153011 12968429 12007004 10560697 8611643 7155037
39813G155037k97471L35081k3147q61966j434179j153794m0117Q29321L14634
$$ 7155037 6857566 7192647 7169500 6307534 4873355 3719561 3679444 4508765 4823399
39804D823399j007394j328206k56466N60722R7477m74352Q8952R93227Q27617
$$ 4823399 3816005 2487799 2231333 2792055 2889532 2415180 2504132 3497359 4324976
39795D324976j47999o67640n26089m83831o87363n65158n746M71127N54171L58117
$$ 4324976 4176977 3509337 2983248 2499417 1812054 1246896 1241150 1712277 2266448 2624565
39785B624565L4119k44600k47146q5578j65816l85983j06248O50638Q61621j464
$$ 2624565 2658684 2414084 2166938 2081360 1915544 1529561 1423313 2073951 2935572 2934108
39775B934108j015709j104046m81441o783J21108J48645r227l87281m52218Q9748
$$ 2934108 1918399 814353 332912 326129 447237 595882 586655 199374 -252844 -163096
39765a63096N41050J90414n07904o58749k96474p3574p0257R6502L87431N21866
$$ -163096 377954 568368 60464 -598285 -894759 -968333 -1038590 -942088 -554657 -32791
39755c2791O52616R26932Q13400r7903j016339q22144K18530P71819L67688j45709
$$ -32791 619825 1546757 2360157 2262254 1245915 423771 642301 1414120 1781808 1636099
39745A636099j28318J2332k12549n34953m96932j72113R8037K29069L31561M29965
$$ 1636099 1507781 1520113 1307564 772611 275679 103566 201603 430672 762233 1192198
39735A192198M56563L58084J59153R789L3922O3679j43094l32421K4406P03584
$$ 1192198 1648761 2006845 2165998 2175787 2209709 2273388 2130294 1797873 1822279 2525863
39725B525863O99802k61346j015352n76971K91223K10392o80469r97757k55475
$$ 2525863 3225665 2964319 1948967 1371996 1663219 1873611 1193142 195385 -60090
39716f0090N64924O07759J35250k59033m22784l80738j39692K7845j65663m07859
$$ -60090 504834 1112593 1247843 988810 566026 185288 45596 73441 -92222 -500081
39706e00081j96641J57201q4371o37694l28152R59475J675188O91124r91017j575834
$$ -500081 -696722 -539521 -623892 -1261586 -1589738 -630263 1044925 1736049 745032 -830802
39696h30802q07211J03359M28403N87158Q75681P37476j57549r31811m83883Q28901
$$ -830802 -1638013 -1534654 -1106251 -519093 356588 1094064 936515 4704 -479179 349722
39686C49722J423771N94414m65204l34498O10172Q47819N1759n34582k14144Q8660
$$ 349722 1773493 2367907 1902703 1568205 2178377 3026196 3077955 2543373 2329229 2417889
39676B417889m35174r55931l94231O07790N60682n34748j222330p98554m7829
$$ 2417889 1982715 1026784 632553 1240343 1801025 1266277 43947 -754607 -802436
39667h02436L07130N04247P52547N99574j15380o47237l69959K63927M11344l356
$$ -802436 -495306 8941 761488 1361062 1245682 598445 228486 492413 903757 900401
39657I00401l63013k67671O2487J43349k24978o91111o99292k37444P9004l6699
$$ 900401 537388 269717 332204 475553 250575 -440536 -1139828 -1377272 -1298268 -1334967
39647a334967l3685M70842Q24701L76388k40665o9212M33797J34977o03839l08295
$$ -1334967 -1368652 -897810 -73109 303279 62614 -6598 427199 562176 -41663 -349958
39637c49958R83347J446442L41274p64414n41643J21620q1939o79996n25993J55247
$$ -349958 633389 2079831 2421105 1656691 1115048 1236668 1154729 474733 -51260 103987
39627A03987M48301M79179P94262Q21996k32023j472587j190727M71875J509940
$$ 103987 552288 1031467 1825729 2647725 2415702 943115 -247612 224263 1734203
39618A734203Q80721k56821n30845j60852j03862m78259o52539l01517K72788
$$ 1734203 2614924 2358103 1827258 1666406 1562544 1084285 431746 130229 403017
39609D03017N88331M18154k4861k77413k09172k17078m88094m79542K05011Q27825
$$ 403017 991348 1409502 1384641 1107228 898056 680978 192884 -286658 -81647 746178
39599G46178L78958p51130j075752j01185R70477R64187J78029m02735m95537
$$ 746178 1125136 374006 -701746 -802931 167546 1131733 1309762 907027 411490
39590D11490m54071m14504k25774Q7788L64476N99689P84913O84239J78389l70544
$$ 411490 -42581 -457085 -682859 -595071 -230595 369094 1154007 1838246 2016635 1646091
39580A646091n19692l89144m86299q98057j060325n03583M32975R26789O56811
$$ 1646091 1126399 737255 250956 -647101 -1707426 -2211009 -1778034 -851245 -194434
39571a94434J41102l4235K7375q4673k39496N3908O70113Q43812L19427k42539
$$ -194434 -53332 -87567 -60192 -144865 -384361 -330453 339660 1183472 1502899 1260360
39561A260360l44570l25151m59668k82969M16031P71267O4236r02751q77277q6653
$$ 1260360 915790 590639 130971 -151998 264033 1035300 1099536 196785 -680492 -767145
39551g67145K59334K2511J39604O82326O09894k65412p08042o1925O36433L60964
$$ -767145 -507811 -485300 -345696 336630 946524 681112 -26930 -88855 547578 908542
39541I08542l54738n19329k53209k09227l06682j38194L6214k28146n91095m27631
$$ 908542 553804 34475 -218734 -427961 -734643 -872837 -836623 -1064769 -1655864 -2083495
39531b083495J10032M21886M66521N92071P35947O25574M28161M00849K63358
$$ -2083495 -1973463 -1551577 -1085056 -492985 242962 868536 1296697 1697546 1960904
39522A960904k72627p50914o12217j85784j17378k22444N0551M02640J42202l92149
$$ 1960904 1688277 937363 325146 139362 21984 -200460 -149909 252731 394933 2784
39512B784k03427O14140Q72358J93738m45061m19182l59764p72276r89756l29893
$$ 2784 -200643 413497 1285855 1479593 1034532 615350 255586 -516690 -1506446 -1836339
39502a836339O72429J070559Q09658M19182N6415l34110m66948j42281J97973
$$ -1836339 -1163910 -93351 716307 1135489 1191904 857794 390846 248565 446538
39493D46538P5824k44867k52686m0999K4186N8587L18399M83444J07644m88775
$$ 446538 522362 277495 24809 -16190 7996 66583 384982 868426 976070 487295
39483D87295n97890j95725J35148J42314j5952l59069q47989q18448K35577J408382
$$ 487295 -110595 -306320 -171172 -28858 -44810 -403879 -1251868 -2070316 -1834739 -426357
39473d26357J195725k59397j082175l17458O80938L91203n50038m83987N92734
$$ -426357 769368 509971 -572204 -889662 -208724 182479 -367559 -851546 -258812
39464b58812J080872L21842m69318j85186N37677M46680m03346q50316m16686
$$ -258812 822060 1143902 674584 489398 1027075 1473755 1070409 220093 -196593
39455a96593P1553k10408r02752j019006k87265N93967R25338P19604L53078j3888
$$ -196593 -125040 -335448 -1238200 -2257206 -2544471 -1950504 -1025166 -305562 47516 33628
39445C3628l55095m61076j50832L41134N93346N32318L77429J92438l4477R410
$$ 33628 -321467 -782543 -933375 -592241 1105 533423 910852 1103290 1068813 1078223
39435A078223O29252J355539J250675K22259p07645q43028p51728j109938j347001
$$ 1078223 1707475 3063014 4313689 4535948 3828303 2985275 2233547 1123609 -223392
39426b23392n02925R38703J359084L10012o72370j92532R52048Q47322p89957
$$ -223392 -726317 212386 1571470 1881482 1209112 1016580 1968628 2815950 2025993
39417B025993k091711j505107J77786R89675M18410j95049J59534P76210N94032
$$ 2025993 -65718 -1570825 -1393039 -403364 15046 -180003 -20469 755741 1349773
39408A349773q3441k76309m5186j75382m89872n4258Q72578Q15010m59073j171082
$$ 1349773 1266332 990023 944837 769455 279583 225325 1097903 1912913 1453840 282758
39398B82758k20351R50506N99143n72163p16522J44376N03687J48681K67321R14825
$$ 282758 62407 1012913 1612056 1039893 323371 467747 971434 1120115 1387436 2302261
39388B302261P22863m81454r86813N2371J125297P40573l43067n61276R3003N35158
$$ 2302261 3025124 2543670 1556857 1609228 2734525 3475098 3132031 2570755 2663758 3198916
39378C198916M32173K32426O4162j81791k02436K57151P67951Q79204Q82972J204906
$$ 3198916 3631089 3863515 3927677 3745886 3543450 3800601 4568552 5447756 6330728 7535634
39368G535634J692629K176787K949668M094456N404550P505348J1255956J4760872
$$ 7535634 9228263 11405050 14354718 18449174 23853724 31359072 42615028 57375900
39360E7375900J3148739M043547p838166j4577128j3439693q810981n819602n053177
$$ 57375900 70524639 74568186 66730020 52152892 38713199 29902218 24082616 19029439
39352A9029439m406778l155045k105910j491011q90772m90009p62360j339282
$$ 19029439 14622661 11467616 9361706 7870695 6979923 6489914 5727554 4388272
39344D388272j425147r89251n85681l69374j46035k2215j89541l62305j55647
$$ 4388272 2963125 1973874 1388193 1018819 872784 850569 661028 298723 143076
39335A43076K22776K80450R024j90115j31581N7503K58263M10220M38754L65281
$$ 143076 365852 646302 655326 465211 333630 391133 649396 1059616 1498370 1863651
39325A863651K42931q9371p53730j296018j040153j23962N32241M97877K86743
$$ 1863651 2106582 2017211 1263481 -32537 -1072690 -1196652 -664411 -166534 120209
39316A20209K95952K25397l2792O4111O37829Q09619P233r65632j049515m01053
$$ 120209 416161 641558 608766 672877 1310706 2120325 2127558 1161926 112411 -288642
39306b88642J55929M39495O52853M74726l89794j168510p75315N41346J387669
$$ -288642 -132713 306782 959635 1434361 1044567 -123943 -899258 -357912 1029757
39297A029757J020114K2506p46388r76549o92976p9738L98248L72014Q0742k4647
$$ 1029757 2049871 2072377 1325989 349440 -343536 -423274 -25026 346988 427730 403083
39287D03083J6685k8788M9904M63541P06492K40748m07991l27154K26377J75237
$$ 403083 419768 390980 440884 904425 1610917 1851665 1443674 1116520 1342897 1518134
39277A518134n38213q06647k19758L04171J68079M8400N09918Q42362K08322r18093
$$ 1518134 979921 173274 -46484 257687 425766 474166 984084 1826446 2034768 1116675
39267A116675j435078j120378n49161j3216N36544Q02421L68859m24365o50043
$$ 1116675 -318403 -1438781 -1987942 -2001158 -1464614 -662193 -293334 -717699 -1367742
39258a367742J8263Q52834R86654L90963k43048l51961l5803K03917J42993R4529
$$ -1367742 -1349479 -496645 490009 880972 637924 285963 250160 454077 597070 691599
39248F91599L71515O85638M63530k67991p84370o00591p4752J80235J12985J03269
$$ 691599 1063114 1748752 2212282 1944291 1159921 559330 484578 664813 777798 881067
39238H81067K62808K77502q3743n88576p61514m12164J16731L10999J15406o658
$$ 881067 1143875 1421377 1337634 749058 -12456 -424620 -307889 3110 118516 111858
39228A11858J98375K85551k55570j093413j332809o75144K37329P00756O53857
$$ 111858 310233 595784 340214 -753199 -2086008 -2761152 -2523823 -1823067 -1169210
39219a169210L83407N6118k18162k89016j96578j71324k13616k2359M67144Q34481
$$ -1169210 -785803 -729685 -947847 -1236863 -1433441 -1604765 -1818381 -1840740 -1373596 -539115
39209e39115O95362J76671l20610n50175m66180j61870Q0936P984j88563j5966
$$ -539115 156247 332918 12308 -537867 -1004047 -1165917 -1084981 -1076997 -1265560 -1281526
39199a281526N85113J021886P88208R8808m35018m71217r3436L81658N54338K11997
$$ -1281526 -696413 325473 1113681 1212489 777471 306254 212818 594476 1148814 1360811
39189A360811l42300n27839k35951j440j98904m40125j41017N52358Q38320K64924
$$ 1360811 1018511 490672 254721 253281 54377 -385748 -526765 25593 863913 1128837
39179A128837o29565q53761j19862P21488O62964j20891m53994J43323O73220
$$ 1128837 499272 -354489 -474351 247137 910101 789210 335216 478539 1151759
39170A151759J71024p15374o63270K71273P86139L64117j67198k23252k46034
$$ 1151759 1322783 607409 -55861 215412 1001551 1365668 1198470 975218 729184
39161G29184n15001m80393R8987N07512K79623P963J89979L00424j23347m75757
$$ 729184 214183 -266210 -167223 340289 619912 627875 817854 1118278 994931 519174
39151E19174j61170K51422O0129k46329O1924M66509R1463n21711j37510R68121
$$ 519174 358004 609426 669555 423226 485150 951659 1043122 521411 383901 1352022
39141A352022J176778l1463j300953j359339m76204M08379Q62870Q06889J92826
$$ 1352022 2528800 2497337 1196384 -162955 -639159 -230780 632090 1438979 1631805
39132A631805n80279p26218r6408M71720K80041l29945o25693m89522k95782j97331
$$ 1631805 1051526 325308 228900 700620 980661 650716 25023 -464499 -760281 -957612
39122i57612m0684K02588L11691J13837k43916l54312J8627N22815N08997r5230
$$ -957612 -998296 -795708 -484017 -370180 -614096 -968408 -949781 -426966 82031 -13199
39112a3199n91841m71988p1348J43981L19495O05747N06619k28411o97283o5420
$$ -13199 -605040 -1077028 -1148376 -1004395 -684900 -79153 427466 199055 -498228 -563648
39102e63648P80812L15155j078002j356801J29644J582489J416463L90712L2269
$$ -563648 217164 532319 -545683 -1902484 -1772840 -190351 1226112 1616824 1649093
39093A649093K67119J0899p56923j019051m64940J11479J24865j48056l27653
$$ 1649093 1916212 1927111 1170188 151137 -313803 -202324 -77459 -225515 -553168
39084e53168m62858n74129l53987L29601J041009J199881P06748k6709n37608
$$ -553168 -1016026 -1590155 -1944142 -1614541 -573532 626349 1333097 1306388 768780
39075G68780o69578n50797l69929k40061j94753j56410N3693M26445N27479K813
$$ 768780 99202 -451595 -821524 -1061585 -1256338 -1412748 -1359055 -932610 -405131 -402318
39065d02318o12389k89493R32900J595136P41083n66322p02737J50079M34952
$$ -402318 -1014707 -1304200 -371300 1223836 1964919 1398597 695860 845939 1280891
39056A280891l03846q88707n04893K33411N21474L65677k1724n91819q52975j81329
$$ 1280891 977045 88338 -416555 -183144 338330 704007 682283 90464 -762511 -943840
39046i43840Q45763Q14902k95477p77932J52564R88693L34926q53398r10815n6410
$$ -943840 -98077 716825 421348 -356584 -204020 784673 1119599 266201 -644614 -701024
39036g01024L55475J92432L15333O43356L02742n96150j024723p48680m53855
$$ -701024 -345549 -153117 162216 805572 1108314 512164 -512559 -1261239 -1715094
39027a715094k76672K78662R80844R48711K29339j19870K45557M95338J77496
$$ -1715094 -1991766 -1713104 -732260 216451 445790 325920 571477 1066815 1244311
39018A244311q1166J48385L35760M9022k72510j81641K4654l3831j68555j22209
$$ 1244311 1163145 1311530 1647290 1696312 1423802 1242161 1266815 1232984 1064429 942220
39008I42220m1323k5652J56632N23452O41384K70716k64971n64899n14063j34055
$$ 942220 900897 875245 1031877 1555329 2196713 2467429 2202458 1637559 1123496 989441
38998I89441L23715K49780n38455j045645k42982J093115J089354m43046j501868
$$ 989441 1313156 1562936 1024481 -21164 -264146 828969 1918323 1475277 -26591
38989b6591p91370M39645M84962l02089m86692K2128J80676j56540q9731N90312
$$ -26591 -817961 -378316 106646 -195443 -682135 -660007 -479331 -635871 -725602 -135290
38979a35290R97978O20580r787l32276m28855m29458j63932K65050L46242m6671
$$ -135290 862688 1483268 1473481 1141205 712350 282892 118960 384010 730252 683581
38969F83581l88990l53252k65047l42151j64310N30063J082739P13970k15012
$$ 683581 294591 -58661 -323708 -665859 -830169 -300106 782633 1496603 1281591
38960A281591n67050m5192L73611r0487q38652p93342j940N02470L03423J11974
$$ 1281591 714541 669349 1042960 952473 113821 -679521 -681461 -178991 124432 236406
38950B36406M42672P15505K95726l33193l41900N196k24474r72082j137089l07709
$$ 236406 679078 1394583 1690309 1357116 1015216 1020412 795938 -176144 -1313233 -1620942
38940a620942O02260Q31295Q16473J118559J229953L92634r56324j543841q76064
$$ -1620942 -1018682 -187387 629086 1747645 2977598 3370232 2413908 870067 -5997
38931e997K74564R09199P07340j9464o77106o99143l6468O11557M77897l28264
$$ -5997 268567 1177766 1885106 1865642 1188536 489393 452925 1064482 1542379 1214115
38921A214115r30988p38290M754P12999J054444R28382L11567n51228j072822
$$ 1214115 283127 -455163 -450409 262590 1317034 2245416 2556983 2005755 932933
38912I32933q23995n8936N41115O46887N21568M25069J55103n02327j138723j061040
$$ 932933 108938 50002 591117 1238004 1759572 2184641 2339744 1837417 698694 -362346
38902c62346k36995N98920Q47483N56619n356o17723q13748j83973O81383N57760
$$ -362346 -599341 -421 847062 1403681 1398325 780602 -33146 -217119 464264 1022024
38892A022024n16753q74212K85723J293356M29764j161034j076739N21244J205921
$$ 1022024 505271 -368941 -83218 1210138 1639902 478868 -597871 -76627 1129294
38883A129294K70438l54860L04928O06065n14095j314994j88204J344243R80808
$$ 1129294 1399732 1044872 1349800 1955865 1441770 126776 -61428 1282815 2263623
38874B263623n84330q88003K81508Q19238j16142j054601q97042l57506k29338
$$ 2263623 1679293 791290 1072798 1892036 1775894 721293 -175749 -533255 -762593
38865g62593j30979L22331O12030K98124k32219n21941n81273l73752K27531P64501
$$ -762593 -893572 -571241 40789 338913 106694 -415247 -996520 -1370272 -1142741 -378240
38855c78240N42260j57275l14529J99319M16807p8685n55363n16808m18713n56537
$$ -378240 164020 6745 -307784 -108465 308342 229657 -325706 -842514 -1261227 -1817764
38845a817764m63811N1431M31668M62754O69327J074848Q44622j36554o50204
$$ -1817764 -2281575 -2230144 -1798476 -1335722 -666395 408453 1253075 1116521 466317
38836D66317j9012O66656L02959m22885l16024K45714R5342n40009l63466P13331
$$ 466317 447305 1113961 1416920 994035 678011 923725 1019067 479058 115592 828923
38826H28923J264711N14295n73816q13501l35471m348m3205M4657M82300P62429
$$ 828923 2093634 2607929 2034113 1220612 885141 880793 837588 882245 1364545 2126974
38816B126974L10219o45946j159194o54300L07282P24637M40637J41082J52890
$$ 2126974 2437193 1791247 632053 -22247 285035 1009672 1450309 1591391 1744281
38807A744281O7647k67749l06663J93344N58946K25968l26994l63374O750K25023
$$ 1744281 1811928 1544179 1237516 1430860 1989806 2215774 1888780 1525406 1532156 1757179
38797A757179K17157J70831p9504o28139r34563n37717P8390J87972j7001J06463
$$ 1757179 1974336 2145167 2065663 1437524 502961 -34756 43634 231606 214605 321068
38787C21068M02059J79050m77161p11147j89920N16051Q33876O70302R5512o16831
$$ 321068 723127 902177 425016 -286131 -476051 40000 873876 1544178 1639690 1022859
38777A022859p70943R676R26879Q56831n6257p17917q66259j202270j651891j081350
$$ 1022859 251916 261592 1188471 2045302 1989045 1271128 404869 -797401 -2449292 -3530642
38767c530642O52320J832697J110460m73353q91367J51183J123618R00020r4915
$$ -3530642 -2878322 -1045625 64835 -408518 -1299885 -1148702 -25084 874936 780021
38758G80021q77897j020801o28607J5928N27460O31320M77213M00105L63591O8331
$$ 780021 -97876 -1118677 -1747284 -1731356 -1203896 -572576 -95363 304742 668333 736664
38748G36664l71268l99272J21025N02676J09224o53008p53835O3229Q39453O26466
$$ 736664 365396 -33876 87149 589825 699049 46041 -707794 -644565 194888 821354
38738H21354k63670p33637m02704M5764P0544N7962M89971R78558Q15734R6012
$$ 821354 557684 -175953 -578657 -532893 -462349 -404387 85584 1064142 1879876 1975888
38728A975888m54539n53591n21162m88039k44652J00737J11741j77835k07168
$$ 1975888 1521349 967758 446596 -41443 -286095 -185358 -73617 -251452 -458620
38719d58620J52529L35044Q2820o4469K36566L86497k11958j010768r63363n6712
$$ -458620 -306091 28953 111773 47304 283870 670367 458409 -552359 -1515722 -1572434
38709a572434O36966M51120n2982j648N53703P32570K5112r63530j164282l45474
$$ -1572434 -935468 -484348 -537330 -538978 14725 747295 772407 -191123 -1355405 -1700879
38699a700879N61974O26068P1713j74908J26233L03282j5992k59005J35038P45888
$$ -1700879 -1138905 -512837 -441124 -616032 -489799 -186517 -202509 -461514 -326476 419412
38689D19412P38912K8432o75060p69782k79615L54597O43304L89377o0830j47593
$$ 419412 1158324 1186756 511696 -258086 -537701 -183104 460200 849577 788747 641154
38679F41154J15824J05751l80587o52189k17815K60563o6928p85378p83449o4626
$$ 641154 756978 862729 482142 -170047 -387862 -127299 -194227 -979605 -1763054 -1827680
38669a827680K05473m05863q52937k62271O90239Q34827K11695k00698k9186J95805
$$ -1827680 -1622207 -2028070 -2881007 -3143278 -2453039 -1618212 -1406517 -1607215 -1636401 -1440596
38659a440596J59720K31055N95186O97138N0195q38173r43934m9480R02620R28981
$$ -1440596 -1280876 -1049821 -454635 242503 292698 -545475 -1489409 -1538889 -636269 292712
38649B92712J36749n54915o08339l25473j10668J40510N48312O39260n4732r60358
$$ 292712 429461 -125454 -733793 -1059266 -1169934 -1029424 -481112 158148 103416 -856942
38639h56942q81511L40929J362933J010098j89116p91580l35087L39648M76971
$$ -856942 -1738453 -1397524 -34591 975507 786391 -5189 -340276 -628 476343
38630D76343K66712J86000K04536K0681l41910n51085l85501O3669M49323L69593
$$ 476343 743055 929055 1133591 1154272 812362 261277 -124224 -60555 388768 758361
38620G58361k34471q43721q39563k66610K36354K96186J45904N3458m807O7381
$$ 758361 523890 -319831 -1159394 -1426004 -1189650 -893464 -747560 -694102 -698909 -631528
38610f31528N36565J127397R78410j23196j109153r60847j27376K27774p5353
$$ -631528 -94963 1032434 2010844 1887648 778495 -182352 -309728 -81954 -157307
38601a57307k88784j56856j30380k58004m9692M27293M58539l6845k42289J37808
$$ -157307 -446091 -602947 -733327 -991331 -1041023 -613730 -155191 -192036 -434325 -296517
38591b96517K98282k44296o98907k66776N23719O80147K61729M9680J94336J83128
$$ -296517 1765 -242531 -941438 -1208214 -684495 -4348 257381 307061 501397 684525
38581F84525j20193l00672j35337J87976M73570N93104L78561o7026k77887j29059
$$ 684525 564332 263660 128323 316299 789869 1382973 1761534 1694508 1416621 1287562
38571A287562j63767o43258q60477j91698P26393Q34300K10607k61029l97608
$$ 1287562 1123795 480537 -379940 -571638 154755 989055 1199662 938633 541025
38562E41025o84026r70773n44944M39093Q70743K99552m40141n30695j26613K95470
$$ 541025 -143001 -1113774 -1658718 -1219625 -348882 -49330 -489471 -1020166 -1146779 -851309
38552h51309O15548P64487N80389K67309K19305K32464k07507p54812m64588N20904
$$ -851309 -235761 528726 1109115 1376424 1595729 1828193 1620686 865874 401286 922190
38542I22190Q45655J6153p19139l43496L62559K96324q8975K32331Q65420O04481
$$ 922190 1767845 1783998 1064859 721363 1083922 1380246 1291271 1523602 2389022 2993503
38532B993503m05343p84539j91540J05554o57105j423325r23442L71274R37515
$$ 2993503 2588160 1803621 1612081 1717635 1060530 -362795 -1286237 -914963 22552
38523B2552L55294l02189j94241J87087O4657k71332j952P04401P82147j4175
$$ 22552 377846 75657 -118584 68503 133160 -138172 -140124 564277 1346424 1332249
38513A332249n62799q3714N69981K27878p35145j010406l75892J79454J79892
$$ 1332249 769450 685736 1255717 1483595 748450 -261956 -637848 -458394 -278502
38504b78502J87714N01409N92547J85235j73661l7513L31943N94152P01193M18866
$$ -278502 -90788 410621 1003168 1188403 1014742 977229 1309172 1903324 2604517 3023383
38494C023383n24963j516773j358482M0428J253440J130208J13576o78428p66465
$$ 3023383 2498420 981647 -376835 -336407 917033 2047241 2160817 1482389 715924
38485G15924k66219N03399Q80586K74141q15572j146538m98616J6290j78247k55723
$$ 715924 449705 953104 1833690 2107831 1292259 145721 -352895 -336605 -514852 -770575
38475g70575L80140R50208O67451L7458j58879q8001j45660r1295J85553J15659
$$ -770575 -390435 559773 1227224 1264682 1105803 1017802 872142 780847 966400 1082059
38465A082059m25966n65871R1890O31954M04155J18853L29718K56939o19120j213699
$$ 1082059 656093 90222 182112 814066 1218221 1337074 1666792 1923731 1304611 90912
38455I0912n43984N11397O61458J85131l0543j55968n37113m49026N57514J313980
$$ 90912 -453072 58325 719783 904914 874371 718403 181290 -267736 289778 1603758
38445A603758P92375n6967j3751K41563l72912j085992p01851N2341r3199n21513
$$ 1603758 2396133 2339166 2325415 2566978 2194066 1108074 406223 458564 365365 -156148
38435a56148p2855N18099R4153l71776N09589J599162J042691j98643Q0624J300006
$$ -156148 -229003 289096 383249 11473 521062 2120224 3162915 2964272 3044896 4344902
38425D344902J135815k52662o53925J57834M10767j36780j57851L06293K83991
$$ 4344902 5480717 5228055 4574130 4731964 5142731 5005951 4848100 5154393 5438384
38416E438384L98039J449914J816193J97644q41518J220488L589009K531885O80486
$$ 5438384 5836423 7286337 9102530 9300174 8458656 9679144 13268153 15800038 16480524
38407A6480524K848273O805010O978553N574091R350825J6446204J9898589K4809532
$$ 16480524 19328797 26133807 33112360 38686451 48037276 64483480 84382069 109191601
38399A09191601M3923356O9291697O7975207K2285946l9037348o9636539n8451923
$$ 109191601 153114957 222406654 290381861 312667807 273630459 203993920 145541997
38392A45541997l4457618k3168376k1002195j5287837p439231n180254o664834
$$ 145541997 111084379 87916003 66913808 51625971 44186740 39006486 32341652
38385C2341652n319577k047585j753478l416849k810700q47358j183914k816389
$$ 32341652 27022075 24974490 23221012 19804163 16993463 16146105 14962191 12145802
38377A2145802k212078j83948j47281j618456j397126L87376Q33775l62080r67415
$$ 12145802 9933724 9749776 9602495 7984039 6586913 6974289 7808064 7445984 6478569
38368F478569o26795q07280j236949m69105P94096O84108l19399l49411K50660
$$ 6478569 5851774 5044494 3807545 3338440 4132536 4816644 4497245 4147834 4398494
38359D398494k51290j390691j218818L4589L70433l91293o32475j29020j15583
$$ 4398494 4147204 2756513 1537695 1572284 1942717 1551424 918949 789929 674346
38350F74346n06230j07019O30657Q4778j377741j630761k87485P66244N53541
$$ 674346 168116 61097 691754 776532 -601209 -2231970 -2519455 -1753211 -1199670
38341a199670J57614L78176N93826L57096Q7832q6195l78997k91233O48779J367325
$$ -1199670 -1042056 -663880 -70054 287042 374874 288679 -90318 -381551 267228 1634553
38331A634553N19623j030966j238691j06914N04819J12696L5568N60342M43809
$$ 1634553 2154176 1123210 -115481 -222395 282424 395120 430688 991030 1434839
38322A434839l78595l39818P94564J130160k00867j491861j243921l35650j31336
$$ 1434839 1056244 716426 1510990 2641150 2440283 948422 -295499 -631149 -762485
38313g62485l54090j99743J09662K06149N03096J007135O75998p50300j675776
$$ -762485 -1116575 -1316318 -1206656 -1000507 -497411 509724 1185722 435422 -1240354
38304a240354q14890P58412J162741L25196l72038k76137R0287K45577J98381
$$ -1240354 -2055244 -1296832 -134091 191105 -180933 -457070 -366783 -121206 77175
38295G7175J358k29346j66415J91005K88587j13829m54335l14175j15688k27145
$$ 77175 78533 -150813 -317228 -126223 162364 48535 -405800 -719975 -835663 -1062808
38285a062808j79841M10399R07776O02621l6682q9881L17347L15479k16770n45446
$$ -1062808 -1242649 -832250 75526 678147 641465 551584 868931 1184410 967640 422194
38275D22194l66757j79475k75920k68068R8582L97551K16865j21768n8786K91465
$$ 422194 55437 -124038 -399958 -668026 -569444 -171893 44972 -76796 -135582 155883
38265A55883L15573o3618j68813L33138P04837J63023p53754q08210j439K89139
$$ 155883 471456 407838 239025 572163 1277000 1440023 686269 -121941 -123380 165759
38255A65759n24208j172182m62275P97323J007073J41176m59226j90210L03279
$$ 165759 -358449 -1530631 -1992906 -1195583 -188510 -47334 -506560 -696770 -393491
38246c93491M91127N14631M48647J77413o3873p3790l45993j180249j567569m79599
$$ -393491 97636 612267 1060914 1238327 1174454 1100664 754671 -425578 -1993147 -2472746
38236b472746J085685J206448Q2117j45793J102515J802284N97289j054883j292336
$$ -2472746 -1387061 -180613 -98496 -244289 858226 2660510 3257799 2202916 910580
38227I10580n48491k79930n01180l25603J31993J23798k06775k21185j02110l44801
$$ 910580 362089 82159 -419021 -744624 -612631 -488833 -695608 -916793 -1018903 -1363704
38217a363704m93689J75478J144356J232582M00120l33528n11305m96675l42422
$$ -1363704 -1857393 -1681915 -537559 695023 1095143 761615 250310 -246365 -588787
38208e88787K33948Q02848N12666m14805p20573N3203Q59593O99326o6563m69710
$$ -588787 -354839 448009 960675 545870 -174703 -121500 738093 1437419 1370856 901146
38198I01146k52814J25480K86949K11360R184k03558l49419m76146o45645p17898
$$ 901146 648332 773812 1060761 1272121 1281305 1077747 728328 252182 -393463 -1111361
38188a111361m95136q8076J49339Q0805p5800p6652J39743N43254R97049J129050
$$ -1111361 -1606497 -1694573 -1545234 -1464429 -1540229 -1616881 -1477138 -933884 63165 1192215
38178A192215N67560n17756j331600j164167j77546O91611P18519J78350n0733
$$ 1192215 1759775 1242019 -89581 -1253748 -1431294 -739683 -21164 157186 106453
38169A06453L71475Q53679P36024J13772m96967q57618r12555m79165L03781O53782
$$ 106453 477928 1331607 2067631 2181403 1684436 826818 -85737 -564902 -261121 392661
38159C92661J15956n03389j81521O32093N99286l51479q74860l80316J40142q1631
$$ 392661 508617 5228 -176293 455800 1055086 703607 -171253 -551569 -411427 -493058
38149d93058m16153j93362J09886n0339k12238P4361K40309k06741n80743j83737
$$ -493058 -909211 -1102573 -992687 -1043026 -1255264 -1180903 -940594 -1147335 -1728078 -1911815
38139a911815L54280J76847k03587J73514Q93211P95425l3817m52394j94875j00307
$$ -1911815 -1557535 -1380688 -1584275 -1410761 -517550 277875 244058 -208336 -403211 -503518
38129e03518m62264n96338k01944J35038P9655Q8121M67344P87823N82641k4426
$$ -503518 -965782 -1562120 -1764064 -1629026 -1549371 -1461250 -993906 -206083 376558 352132
38119C52132o00032p98076m66936J40309M03771R5861j93515M0093L55281J46203
$$ 352132 -247900 -1045976 -1512912 -1372603 -968832 -872971 -1066486 -1026393 -671112 -524909
38109e24909k60963k20744O5483O9687O8234M94412P03320j00254j107988q24065
$$ -524909 -785872 -1006616 -941133 -871446 -803212 -308800 394520 294266 -813722 -1637787
38099a637787M54285R74272L92667K22934J003422J197096j32427j524841j370096
$$ -1637787 -1183502 -209230 183437 406371 1409793 2606889 2474462 949621 -420475
38090d20475l53664q9628n50799n42870J21387N92978O05353N87158M88267o7474
$$ -420475 -774139 -863767 -1414566 -1957436 -1836049 -1243071 -637718 -50560 437707 370233
38080C70233o33773l37106N63248Q18786J06521m07472J38491R70849Q24960k66544
$$ 370233 -263540 -600646 -37398 781388 887909 480437 618928 1589777 2414737 2148193
38070B148193j095095q72765l2451N29824M79781J32274j41088k37911j30730
$$ 2148193 1053098 180333 147882 677706 1157487 1289761 1148673 910762 780032
38061G80032K59390P86241R42649L63928o02412j156836q99031j92021L00783
$$ 780032 1039422 1825663 2768312 3132240 2529828 1372992 473961 281940 582723
38052E82723K40750j49778k98557J06631N67823K16981q88975j470162o42004
$$ 582723 823473 673695 375138 481769 1049592 1266573 377598 -1092564 -1734568
38043a734568P09686J087741M95476J96292N50070N23336l99616j231692j033391
$$ -1734568 -1024882 62859 558335 754627 1304697 1828033 1428417 196725 -836666
38034h36666k61384K19775M52809P95524Q78059K27136o46783q42160l84490n844
$$ -836666 -1098050 -878275 -425466 370058 1248117 1475253 828470 -13690 -398180 -404024
38024d04024J00993L53504P49113P04572K7533o75106p58586k45689L45531N43302
$$ -404024 -303031 50473 799586 1504158 1531691 856585 97999 -147690 197841 741143
38014G41143K52341k06099m03645k88722j93587k64970k48306l2714N0886j89405
$$ 741143 993484 787385 383740 95018 -98569 -363539 -611845 -644559 -593673 -783078
38004g83078l81908j68315K10868L50982K81818J65427j25403n53205n33025K59861
$$ -783078 -1164986 -1333301 -1122433 -771451 -489633 -324206 -449609 -1002814 -1535839 -1275978
37994a275978J089518J002336K17399j99911P7253K94003r3405o51949p39336
$$ -1275978 -186460 815876 1033275 833364 910617 1204620 1111215 459266 -280070
37985b80070l48156R6953K59963J1676m81429o52253o6472P82733Q38698q2212
$$ -280070 -628226 -531273 -271310 -259634 -741063 -1393316 -1459788 -677055 161643 79431
37975G9431q62962n55805K88525M20436l48658r78974p22183j6250L69159M04812
$$ 79431 -783531 -1339336 -1050811 -630375 -979033 -1958007 -2680190 -2696440 -2327281 -1922469
37965a922469N15170O65679M36362r9543k81630J59603O13578M36986j60820n13527
$$ -1922469 -1407299 -741620 -305258 -404801 -686431 -526828 86750 523736 362916 -150611
37955a50611m06903j00976K22018M57387L19563k45146o26987k93827K46220J29039
$$ -150611 -557514 -658490 -436472 20915 340478 95332 -531655 -825482 -579262 -450223
37945d50223l72981j83015O99617R80507J35653o64042m46198L4039k46949p17958
$$ -450223 -823204 -1006219 -306602 673905 809558 145516 -300682 -266643 -513592 -1231550
37935a231550k53569P05300P34990k08398o93853j40724L56375m7295n96421k57369
$$ -1231550 -1485119 -779819 -44829 -253227 -947080 -1087804 -731429 -778724 -1375145 -1632514
37925a632514O62522J103107P65242J84789k51505n58392o69120m28949n038K82088
$$ -1632514 -969992 133115 898357 1083146 831641 273249 -395871 -824820 -829858 -547770
37915e47770N16215J010697J506582J172231k20617j587182j631152n13071K95402
$$ -547770 -31555 979142 2485724 3657955 3437338 1850156 219004 -294067 1335
37906A335l5223o51666m14211L96060O62649K52130O0993L54711L74626j39876
$$ 1335 -33888 -685554 -1099765 -703705 -41056 211074 272067 626778 1001404 861528
37896H61528l63418R5277L52178j96452o53099j27336N58446J54855p74949o42071
$$ 861528 498110 593387 945565 749113 96014 -31322 527124 681979 -92970 -735041
37886g35041M96969R16805k4729r10049n57372L05396N00819K04314K01465L38754
$$ -735041 -238072 678733 654004 -256045 -813417 -508021 -7202 197112 398577 737331
37876G37331m0207o89077p18101p2033L07998j07471o89087n86573J33534O51769
$$ 737331 697124 8047 -710054 -782087 -474089 -581560 -1270647 -1857220 -1723686 -1071917
37866a071917M51330j07248k76170J71943O77439N80873p7482o38832o26078k13420
$$ -1071917 -620587 -727835 -1004005 -832062 -154623 426250 348768 -290064 -916142 -1129562
37856a129562J04045P6641j21457j32936J88921N60022N31601N5493m08059m73309
$$ -1129562 -1025517 -948876 -1070333 -1203269 -1014348 -454326 77275 132768 -275291 -748600
37846g48600k49786P47K65577N39667N76188K94035O3352J21685J23375j73661
$$ -748600 -998386 -997639 -732062 -192395 383793 677828 741180 862865 986240 812579
37836H12579k71365K43822P04843K12932p99777j023126k26004M62089L74057
$$ 812579 541214 785036 1489879 1702811 903034 -120092 -346096 115993 490050
37827D90050J51425L70830N43399J60517k94575k26629j7433l24208q76915q93999
$$ 490050 641475 1012305 1555704 1716221 1421646 1195017 1177584 853376 -23539 -917538
37817i17538l23282J66947J99409k4853k55336l60114j36268M26360Q21608N68784
$$ -917538 -1240820 -1073873 -874464 -899317 -1154653 -1514767 -1651035 -1224675 -403067 165717
37807A65717J147p4465M89153R36229O11514k28815p83027n96423N5152N00171
$$ 165717 166864 92399 581552 1517781 2129295 1900480 1117453 521030 576182 1076353
37797A076353L14298k62368n70526l09176M2618j81627q79852j166614m67113
$$ 1076353 1390651 1128283 557757 248581 291199 109572 -770280 -1936894 -2404007
37788b404007O60419J148477P60830L10195L72956L93419l15395j142566q22363
$$ -2404007 -1743588 -595111 165719 475914 848870 1242289 926894 -215672 -1038035
37779a038035N10849J175399L32310p16451n24373L34913M18008j67961j83944
$$ -1038035 -527186 648213 980523 264072 -260301 74612 492620 324659 140715
37770A40715M04191M07968l16971n26538J36363M06168l51355r14842k90674N48411
$$ 140715 544906 952874 635903 109365 245728 651896 300541 -614301 -904975 -356564
37760c56564L62177k17947J34020J034460R36208l31781j258064r09187p5545
$$ -356564 5613 -212334 -78314 956146 1892354 1560573 302509 -606678 -682223
37751f82223J48421j78538l00065L7903L71066K31500k40049m37173p5846L13086
$$ -682223 -533802 -712340 -1012405 -974502 -603436 -371936 -611985 -1049158 -1125004 -811918
37741h11918Q0597m53014l46996M16326P12048K5127o19955k40704N53658O27031
$$ -811918 -731321 -1184335 -1531331 -1115005 -402957 -377830 -997785 -1238489 -684831 -57800
37731e7800J54891J65147P25842Q66605J45552p90736j171349p80036J71478J046996
$$ -57800 97091 262238 988080 1854685 2000237 1209501 38152 -741884 -570406 476590
37721D76590R28141l59682j603937j486283k59934P52110R81685Q61046N77653
$$ 476590 1404731 1045049 -558888 -2045171 -2305105 -1552995 -571310 289736 867389
37712H67389r0493p60779o24638J67663N18738N9018l31597l0622L89010K14548
$$ 867389 776896 16117 -608521 -440858 77880 136898 -194699 -225321 163689 378237
37702C78237l38336o35423m71942N38N42488P39868L21191k42359j77967M17252
$$ 378237 39901 -595522 -1067464 -1066926 -524438 215430 536621 294262 116295 533547
37692E33547O65989K74976j44263k57735m15459o31192l69986K42718K94098k52966
$$ 533547 1199536 1474512 1330249 1072514 657055 25863 -344123 -101405 192693 -60273
37682f0273j51287J015036J702164O46467r62315j128588k6656M53728k76017
$$ -60273 -211560 803476 2505640 3152107 2189792 1061204 1034548 1488276 1212259
37673A212259q04609j59482P49225P23610M1014k25609J36031L67891l6577o78109
$$ 1212259 407650 248168 997393 1721003 1762017 1536408 1672439 2040330 2003753 1325644
37663A325644q24722k87898M02797O59021N33894N02135N45000m469j342162k447434
$$ 1325644 500922 213024 615821 1274842 1808736 2310871 2855871 2851402 1509240 -938194
37653i38194k144548o47867O83263J030331Q15763P02830O95880N16678K25680
$$ -938194 -3082742 -3730609 -3047346 -2017015 -1201252 -498422 197458 714136 939816
37644I39816L0350j12003k83562k80070J01418N93112O30379K678q61522j280644
$$ 939816 970166 858163 574601 294531 395949 989061 1619440 1622118 760596 -520048
37634e20048r25007r5315N32673N04182L320l42956j07921M98957Q36063M72253
$$ -520048 -1445055 -1540370 -1007697 -503515 -500195 -843151 -951072 -452115 383948 856201
37624H56201l32359q11628m73010L16543P01712L10653l98160q14162q20246n57173
$$ 856201 523842 -287786 -760796 -444253 257459 568112 169952 -644210 -1464456 -2021629
37614b021629m95P56793J141223O84759j38308l60270J43282M88096J51892k73757
$$ -2021629 -2022124 -1265331 -124108 560651 422343 62073 205355 693451 845343 571586
37604E71586j56526J07235j35714n24425k21806N21169N18796m80705j227383
$$ 571586 415060 522295 386581 -137844 -359650 161519 680315 199610 -1027773
37595a027773p68346J97712N24318L05458L29072M94547P3192p25316q34388q7138
$$ -1027773 -1796119 -1598407 -1074089 -768631 -439559 54988 128180 -597136 -1431524 -1518662
37585a518662M24576J24385j64762K45338O41880J41467o92014o23108L57385
$$ -1518662 -1094086 -969701 -1134463 -889125 -247245 -105778 -797792 -1420900 -1063515
37576a063515J037660O80391k45225r28571r92319m77671J99899L52545k39164
$$ -1063515 -25855 654536 409311 -519260 -1511579 -1989250 -1789351 -1436806 -1675970
37567a675970q08172n08824L45228P42129M96188L68381O79662Q05072K73312
$$ -1675970 -2484142 -2992966 -2647738 -1905609 -1409421 -1041040 -361378 443694 717006
37558G17006m86093q09996n56644K2976N59227O02104N2160l89954L3940Q98995
$$ 717006 230913 -579083 -1135727 -1112751 -553524 48580 100740 -289214 -255274 643721
37548F43721J001251J30826n94480m73140j86499m51742p53174k72077O77752
$$ 643721 1644972 1775798 1181318 708178 521679 69937 -683237 -955314 -277562
37539b77562J076063O05245j62710o75990q36160p57266o26796o30147o76587
$$ -277562 798501 1403746 1241036 565046 -271114 -1028380 -1655176 -2285323 -2961910
37530b961910m53286N1885M84870P20067R47121J018919M85660m39204q26098
$$ -2961910 -3415196 -3363311 -2878441 -2158374 -1211253 -192334 293326 -145878 -971976
37521i71976l83825L7458j49304l30732R5989N42270K40119l78727m22134j9904
$$ -971976 -1355801 -1318343 -1467647 -1798379 -1702390 -1160120 -920001 -1298728 -1720862 -1740766
37511a740766O4347k05384k91324j80207k20711k28404J52528N43913M04210J46950
$$ -1740766 -1676419 -1881803 -2173127 -2353334 -2574045 -2802449 -2649921 -2106008 -1701798 -1554848
37501a554848M92554J033699P74717j13760m95249j40678P7278q0435J35776P87690
$$ -1554848 -1062294 -28595 746122 632362 137113 -3565 73713 -6722 129054 916744
37491I16744Q15775j08734p53004j89951P27787P25104o5921o42542o80976n12359
$$ 916744 1732519 1623785 870781 680830 1408617 2133721 2067800 1425258 744282 231923
37481B31923j86512L81373P39012L62633m10444p32817m02610O088N2190j27815
$$ 231923 45411 426784 1165796 1528429 1117985 385168 -17442 -11354 40836 -86979
37471h6979k06031j2047M11164P23558M53613l59359r33476o24886J59145M35640
$$ -86979 -293010 -305057 106107 829665 1283278 923919 -9557 -634443 -475298 -39658
37461c9658q6290p25307p91453l44471J14996L28803M26927N46459N33115J43142
$$ -39658 -125948 -851255 -1642708 -1987179 -1872183 -1543380 -1116453 -569994 -36879 106263
37451A06263m73960p41749l66438J20564M899n06350m73678L50027J019297P22957
$$ 106263 -367697 -1109446 -1475884 -1355320 -1350421 -1856771 -2330449 -1980422 -961125 -238168
37441b38168o0847l54150q3513R0175j1568M9944L49913M09617J30816O4617M07652
$$ -238168 -299015 -653165 -736678 -646503 -658071 -608127 -258214 151403 282219 346836 754488
37430G54488N04706r7419p26029m52348M97763J021032O68529O1865k43287m08496
$$ 754488 1259194 1161775 435746 -16602 481161 1502193 2170722 2232587 1989300 1580804
37420A580804n60846l20222L24049M86950l53799j180208o66717P33316J257812
$$ 1580804 1019958 699736 1023785 1510735 1156936 -23272 -689989 43327 1301139
37411A301139M02559m01299o7186N97947M27727k56166m77857l51449o29573j089353
$$ 1301139 1703698 1302399 1235213 1833160 2260887 2004721 1526864 1175415 545842 -543511
37401e43511q01302K11056R05892Q08025M65076K40884j70780p75279r16295l38095
$$ -543511 -1344813 -1133757 -227865 580160 1045236 1286120 1115340 340061 -576234 -914329
37391i14329K56776K06699k05780k88294J26149O23268P12651K15111n20228q10288
$$ -914329 -657553 -450854 -656634 -944928 -818779 -195511 517140 732251 212023 -598265
37381e98265m38225l8138j36975k12721M24366J203005R60668j18820o35437j45506
$$ -598265 -1036490 -1074628 -1211603 -1424324 -999958 203047 1163715 1044895 409458 263952
37371B63952K57426j22205n41906l08331Q8635R5886O7234K54676P1207o53688
$$ 263952 521378 399173 -142733 -451064 -362429 -266543 -199309 55367 126574 -527114
37361e27114q79072L6127J014468Q36635P2919K6000N53704N00364k40385o54965
$$ -527114 -1406186 -1370059 -355591 481044 553963 579963 1133667 1634031 1393646 738681
37351G38681l30526J54875L95854M55884J82818n35996j000618m34595O03734
$$ 738681 408155 563030 958884 1414768 1597586 1061590 60972 -373623 230111
37342B30111P85024n7780p80879p07382l12193o0616J83778L92253J87052k97994
$$ 230111 1015135 957355 176476 -530906 -843099 -903715 -719937 -327684 -140632 -438626
37332d38626m07809l6883K67679L64816N91190P17146J18526q06904p93519L05199
$$ -438626 -846435 -883318 -615639 -250823 340367 1057513 1176039 369135 -424384 -119185
37322a19185J065876O02468k31218m43393l31782m01268j99407N75532R64796
$$ -119185 946691 1549159 1317941 874548 542766 141498 -57909 517623 1482419
37313A482419J56118q89777p28056K92827O17137k9845l69588K27645Q07177M48144
$$ 1482419 1638537 748760 20704 313531 930668 900823 531235 758880 1566057 2014201
37303B014201m25663q80760o99257k40171K19295M92927L51854j60508o07632
$$ 2014201 1588538 707778 8521 -231650 -12355 480572 832426 671918 64286
37294F4286o49021l77813l3336K71563M17854K75102o255o0257J78726L58196
$$ 64286 -584735 -962548 -995884 -724321 -306467 -31365 -37620 -97877 80849 439045
37284D39045K18717j31342n19348q30551p32063J09475J233591J464376L67375
$$ 439045 657762 526420 7072 -823479 -1555542 -1446067 -212476 1251900 1619275
37275A619275q82564q75115J05979M92002k56991q70121k65025P02124M93700
$$ 1619275 736711 -138404 -32425 459577 202586 -667535 -932560 -230436 263264
37266B63264o99261j125319n9803J090990Q53522j97877m03618N09050J147553
$$ 263264 -435997 -1561316 -1621119 -530129 323393 125516 -278102 230948 1378501
37257A378501N81767m19171o80725k63880j09087n19900p83070k68272O62635
$$ 1378501 1960268 1541097 860372 596492 487405 -32495 -815565 -1083837 -421202
37248d21202J065911N05788m69001r31040n51360J46438M89003L53774J3260l85199
$$ -421202 644709 1150497 681496 -249544 -800904 -654466 -165463 188311 201571 -183628
37238a83628p60893p53711o7105Q35108J029401L30768l95317m04933R880J69767
$$ -183628 -944521 -1698232 -1765337 -930229 99172 429940 34623 -370310 -360430 -190663
37228a90663J7380p0982l8149n6332J0780L56145O22585K86564l97825n90158
$$ -190663 -173283 -244265 -282414 -338746 -327966 28179 650764 937328 539503 -50655
37218e0655r5600L31215J45647k46255l07216k51755m89858p11498l35895L95956
$$ -50655 -146255 184960 330607 84352 -222864 -474619 -964477 -1675975 -2011870 -1615914
37208a615914O65483L82118L11842O80481O41431k47896r15987k17166J052541
$$ -1615914 -950431 -568313 -256471 424010 1065441 817545 -98442 -315608 736933
37199G36933R73159o54487j744327p87964J000130J443976L60047o16074o09522
$$ 736933 1710092 1055605 -688722 -1476686 -476556 967420 1327467 711393 101871
37190A01871l37161m03986l53400J19485L62514l9611l30342K05769R04381O65528
$$ 101871 -235290 -639276 -992676 -873191 -510677 -550288 -880630 -674861 229520 895048
37180H95048l07031q21336m59111O0488J86864J61811K17368R9003k86295m89809
$$ 895048 588017 -233319 -692430 -631942 -445078 -283267 -65899 33104 -253191 -743000
37170g43000j91124K86774M91664M46362M18857M38932L48104J02346j64656k10309
$$ -743000 -934124 -647350 -155686 290676 709533 1148465 1496569 1598915 1434259 1223950
37160A223950J74782P94179R18879M7928j222837j723543j184172m75650k20272
$$ 1223950 1398732 2192911 3111790 3159718 1936881 213338 -970834 -1446484 -1666756
37151a666756m3513L83619N21941l4934n36324r2618Q14146R83921L48556n9738
$$ -1666756 -1710269 -1326650 -804709 -839643 -1375967 -1468585 -654439 329482 678038 618300
37141F18300J07145P0694n34274r67424p21589l83103m43888l05889N74931J399165
$$ 618300 725445 796139 261865 -705559 -1427148 -1810251 -2254139 -2560028 -1985097 -585932
37131e85932J046889j25089p11785k56350L30730L28030Q3395J27133L45352M05681
$$ -585932 460957 335868 -375917 -632267 -301537 26493 109888 237021 582373 988054
37121I88054K95901P9226l10279p18924p41289l17234J12794K65299L18820L67734
$$ 988054 1283955 1363181 1052902 333978 -407311 -724545 -611751 -346452 -27632 340102
37111C40102J72040k48473l68400Q4491O21805O60014K62826j46948l75222m06436
$$ 340102 512142 263669 -104731 -20240 601565 1261579 1524405 1377457 1002235 595799
37101E95799k36846j05003l68558p99882o33749K35675Q20164M09163l45619m78554
$$ 595799 358953 253950 -114608 -914490 -1548239 -1312564 -492400 -83237 -428856 -907410
37091i07410j25922N0738J71655O62299R71203J93028j180728j572207n35474
$$ -907410 -1033332 -982594 -810939 -148640 822563 1015591 -165137 -1737344 -2272818
37082b272818O20537P20677O1306n11311p33304o33320j22148N48263P68518N25559
$$ -2272818 -1652281 -931604 -870298 -1381609 -2114913 -2748233 -2870381 -2322118 -1553600 -1028041
37072a028041N32811R48882R35251Q7000p11192o54402k89494m53119p92025m88230
$$ -1028041 -495230 453652 1388903 1475903 764711 110309 -179185 -632304 -1424329 -1912559
37062a912559K07260M24449K07279L01343O67709N39299o4158j89445M45930Q88258
$$ -1912559 -1705299 -1280850 -1073571 -772228 -104519 434780 370622 181177 627107 1515365
37052A515365M35967l00566m25331p6145k5806m38934o88972k53847O23583J131957
$$ 1515365 1951332 1650766 1225435 1149290 1123484 684550 -4422 -258269 365314 1497271
37042A497271O40817n76746j397544r70615K26953R04701N30649j91573m91326
$$ 1497271 2138088 1561342 163798 -806817 -579864 324837 855486 663913 172587
37033A72587m24312k79460J06682P82738J043368K55970r56841j286190m71327
$$ 172587 -251725 -531185 -424503 358235 1401603 1657573 700732 -585458 -1056785
37024a056785M00569M86943K20288L30349O10161L83618k69713o05958l71530
$$ -1056785 -656216 -169273 51015 381364 991525 1375143 1105430 499472 127942
37015A27942n5096M4821K04254N00244M29840k25659p87819n67817Q1120K94658
$$ 127942 72846 117667 321921 822165 1252005 1026346 238527 -329290 -248170 46488
37005D6488m0054l13163k77914k56984k92999R189O00150P94493L37294q1480
$$ 46488 6434 -306729 -584643 -841627 -1134626 -1125437 -525287 269206 606500 525020
36995E25020J18585M77160K45259m08959o54661j96682M44643P36876O26672K44773
$$ 525020 643605 1120765 1366024 957065 302404 105722 550365 1287241 1913913 2158686
36985B158686l37035r21967j146434q30279k14145K58659L42351J67512N5832
$$ 2158686 1821651 899684 -246750 -1077029 -1291174 -1032515 -690164 -522652 -466820
$$ [...]
##END NTUPLES=NMR SPECTRUM
##END=
