##TITLE=31Pdec_LR-673-R2-HCR1
 D2O, 24 sc
 18.12.2019
##JCAMPDX= 6.0         $$ Bruker NMR JCAMP-DX V2.0
##DATA TYPE= NMR SPECTRUM
##DATA CLASS= NTUPLES
##ORIGIN= UXNMR, Bruker Analytische Messtechnik GmbH
##OWNER= root
$$ XWIN-NMR		Version 3.5
$$ Wed Dec 18 16:37:39 2019 Russian Standard Time (UT+4h)  she@DPX200
##.OBSERVE FREQUENCY= 81.013821
##.OBSERVE NUCLEUS= ^31P
##.ACQUISITION MODE= SIMULTANEOUS
##.ACQUISITION SCHEME= undefined
##.AVERAGES= 24
##.DIGITISER RES= 17
##SPECTROMETER/DATA SYSTEM= spect
##.PULSE SEQUENCE= zgpg30
##.SOLVENT NAME= D2O
##.SHIFT REFERENCE= (INTERNAL, D2O, 0, 182.463)
##AUDIT TRAIL= $$ (NUMBER, WHEN, WHO, WHERE, WHAT)
$$ ##TITLE= Audit trail, XWIN-NMR		Version 3.5
$$ ##JCAMPDX= 5.01
$$ ##ORIGIN= Bruker BioSpin GmbH
$$ ##OWNER= she
$$ F:/spectra/data/she/nmr/P31/1/pdata/1/auditp.txt
$$ ##AUDIT TRAIL=  $$ (NUMBER, WHEN, WHO, WHERE, WHAT)
(   1,<2019-12-18 16:36:12.03 +0400>,<she>,<DPX200>,
      <created by zg, POWCHK disabled, PULCHK disabled
       configuration hash MD5:
       00 E9 B6 7A A2 85 ED C7 34 08 36 98 17 FE 4E 26
       data hash MD5: 32K
       C1 54 D3 4C BA 59 AA C2 6F D9 D2 CE D8 B5 79 8E>)
(   2,<2019-12-18 16:36:14.59 +0400>,<she>,<DPX200>,
      <Start of raw data processing
       efp BC_mod = 2 LB = 1 FT_mod = 6 PKNL = 1 PHC0 = -1832.494 PHC1 = 547.6014 SI = 64K 
       data hash MD5: 64K
       99 57 67 B5 45 A1 2B 52 A7 5D 8F 26 8B 0C 1A B4>)
(   3,<2019-12-18 16:36:48.17 +0400>,<she>,<DPX200>,
      <pk PHC0 = 152.7419 PHC1 = -479.8002 
       data hash MD5: 64K
       98 6C 95 20 16 1A 24 77 F0 91 CE 44 0D 9A 4F 52>)
(   4,<2019-12-18 16:36:51.60 +0400>,<she>,<DPX200>,
      <abs ABSG = 5 
       data hash MD5: 64K
       EB 45 AC F0 28 02 B4 51 F4 CC 2E 19 D6 EC 11 72>)
$$ ##END=
$$ 
$$ hash MD5
$$ 96 9F F3 AB C6 2E B1 3A D3 74 1F 07 23 12 D4 D7
##$RELAX= 
##$RELAX= 
##$RELAX= 
##$RELAX= 
##$RELAX= 
##$RELAX= 
##$RELAX= 
##$RELAX= 
$$ Bruker specific parameters
$$ --------------------------
##$DU= <F:/spectra>
##$EXPNO= 1
##$NAME= <P31>
##$PROCNO= 1
##$TYPE= <nmr>
##$USER= <she>
##$AMP= (0..31)
100 100 100 100 100 100 100 100 100 100 100 100 100 100 100 100 100 100 
100 100 100 100 100 100 100 100 100 100 100 100 100 100 
##$AQSEQ= 0
##$AQ_mod= 1
##$AUNM= <au_zg>
##$AUTOPOS= <>
##$BF1= 81.014009
##$BF2= 200.13
##$BF3= 200.13
##$BF4= 200.13
##$BF5= 200.13
##$BF6= 200.13
##$BF7= 200.13
##$BF8= 200.13
##$BYTORDA= 1
##$CFDGTYP= 0
##$CFRGTYP= 5
##$CHEMSTR= <none>
##$CNST= (0..31)
1 1 145 1 1 1 1 1 1 1 1 1 1 1 1 1 1 1 1 1 1 1 1 1 1 1 1 1 1 1 1 1 
##$CPDPRG= <waltz16>
##$CPDPRG1= <>
##$CPDPRG2= <waltz16>
##$CPDPRG3= <>
##$CPDPRG4= <mlev>
##$CPDPRG5= <mlev>
##$CPDPRG6= <mlev>
##$CPDPRG7= <mlev>
##$CPDPRG8= <mlev>
##$CPDPRGB= <>
##$CPDPRGT= <>
##$D= (0..31)
0 1 0 0 0 0 0 0 0 0 0 0.03 2e-05 3e-06 0 0 0 0 0 0 0 0 0 0 0 0 0 0 0 0 
0 0 
##$DATE= 1576672571
##$DBL= (0..7)
120 120 120 11 120 120 24 19 
##$DBP= (0..7)
150 150 150 150 150 150 150 150 
##$DBP07= 0
##$DBPNAM0= <>
##$DBPNAM1= <>
$$ [...]
##$SUBNAM3= <"">
##$SUBNAM4= <"">
##$SUBNAM5= <"">
##$SUBNAM6= <"">
##$SUBNAM7= <"">
##$SUBNAM8= <"">
##$SUBNAM9= <"">
##$SW= 369.568048894756
##$SWIBOX= (0..15)
0 1 3 0 0 0 0 0 0 0 0 0 0 0 0 0 
##$SW_h= 29940.119760479
##$TD= 32768
##$TD0= 1
##$TE= 0
##$TE2= 300
##$TE3= 300
##$TEG= 300
##$TL= (0..7)
0 120 53 12 22 120 120 120 
##$TP= (0..7)
150 150 150 150 150 150 150 150 
##$TP07= 0
##$TPNAME0= <>
##$TPNAME1= <>
##$TPNAME2= <>
##$TPNAME3= <>
##$TPNAME4= <>
##$TPNAME5= <>
##$TPNAME6= <>
##$TPNAME7= <>
##$TPOAL= (0..7)
0.5 0.5 0.5 0.5 0.5 0.5 0.5 0.5 
##$TPOFFS= (0..7)
0 0 0 0 0 0 0 0 
##$TUNHIN= 0
##$TUNHOUT= 0
##$TUNXOUT= 0
##$USERA1= <user>
##$USERA2= <user>
##$USERA3= <user>
##$USERA4= <user>
##$USERA5= <user>
##$V9= 5
##$VALIST= <valist>
##$VCLIST= <CCCCCCCCCCCCCCC>
##$VD= 0
##$VDLIST= <DDDDDDDDDDDDDDD>
##$VPLIST= <PPPPPPPPPPPPPPP>
##$VTLIST= <TTTTTTTTTTTTTTT>
##$WBST= 1024
##$WBSW= 4
##$XGAIN= (0..3)
0 0 0 0 
##$XL= 0
##$YL= 0
##$YMAX_a= 66118
##$YMIN_a= -58164
##$ZGOPTNS= <>
##$ZL1= 120
##$ZL2= 120
##$ZL3= 120
##$ZL4= 120
##$ABSF1= 182.463
##$ABSF2= -187.1042
##$ABSG= 5
##$ABSL= 3
##$ALPHA= 0
##$AQORDER= 0
##$ASSFAC= 0
##$ASSFACI= 0
##$ASSFACX= 0
##$ASSWID= 0
##$AUNMP= <proc_1d>
##$AZFE= 0.1
##$AZFW= 0.5
##$BCFW= 0
##$BC_mod= 2
##$BYTORDP= 0
##$COROFFS= 0
##$CY= -3
##$DATMOD= 1
##$DC= 0
##$DFILT= <>
##$DTYPP= 0
##$F1P= 0
##$F2P= 0
##$FCOR= 1
##$FTSIZE= 65536
##$FT_mod= 6
##$GAMMA= 0
##$GB= 0
##$INTBC= 1
##$INTSCL= 5.30512e-09
##$ISEN= 30
##$LB= 1
##$LEV0= 0
##$LPBIN= 0
##$MAXI= 10000
##$MC2= 0
##$MEAN= 0
##$ME_mod= 0
##$MI= 50
##$NCOEF= 0
##$NC_proc= -3
##$NLEV= 6
##$NOISF1= 182.463
##$NOISF2= 159.3651
##$NSP= 0
##$NTH_PI= 0
##$NZP= 0
##$OFFSET= 182.463
##$PC= 4
##$PHC0= -1679.752
##$PHC1= 67.80118
##$PH_mod= 1
##$PKNL= yes
##$PPARMOD= 0
##$PSCAL= 0
##$PSIGN= 0
##$REVERSE= no
##$SF= 81.0140089999434
##$SI= 65536
##$SIGF1= 159.3651
##$SIGF2= -187.1042
##$SINO= 113.3802
##$SIOLD= 16384
##$SREGLST= <1H.CDCl3>
##$SSB= 0
##$STSI= 65536
##$STSR= 0
##$SW_p= 29940.119760479
##$SYMM= 0
##$S_DEV= 0
##$TDeff= 32768
##$TDoff= 0
##$TI= <>
##$TILT= no
##$TM1= 0
##$TM2= 0
##$TOPLEV= 0
##$USERP1= <user>
##$USERP2= <user>
##$USERP3= <user>
##$USERP4= <user>
##$USERP5= <user>
##$WDW= 1
##$XDIM= 65536
##$YMAX_p= 542079931
##$YMIN_p= -1601826
$$ End of Bruker specific parameters
$$ ---------------------------------
##NTUPLES= NMR SPECTRUM
##VAR_NAME=  FREQUENCY,     SPECTRUM/REAL,   SPECTRUM/IMAG
##SYMBOL=    X,             R,               I
##VAR_TYPE=  INDEPENDENT,   DEPENDENT,       DEPENDENT
##VAR_FORM=  AFFN,          ASDF,            ASDF
##VAR_DIM=   65536,         65536,           65536
##UNITS=     HZ,            ARBITRARY UNITS, ARBITRARY UNITS
##FACTOR=    0.456856943014862, 1,           1
##FIRST=     14782.0589164792, 0,            0
##LAST=      -15158.0608439998, 0,           0
##MIN=       -15158.0608439998, -1601826,    0
##MAX=       14782.0589164792, 542079931,    0
$$ Real data points
##PAGE= N=1
##DATA TABLE= (X++(R..R)), XYDATA
$$ [...]
41664D215M80533M64860J75185j09262k51890k83355k15614o7494L8096J8079
41654B53353k0987L6019R0676k448j44858j09121R8096K19740J07238r3723j57805
41643B76180m3787J02738J26034Q667j18765j20873j5794O6153P6103P9175P6933
41632E12764k7607k13263k80465j37777L0968M7740Q773O6973J21191k973j85662
41621e9338j47884Q8992K04426O7386q6097n4704L3371j2625j11832o0528J19381
41610a9452K03567R4070o1745r6847k7915K2823J4511O572K1270j1241j26348
41599A9265k16974j50735K8450J36602J06299P1144J28349J62151L9907j26737
41589A97721j09334Q6098J95982O0340j65951k42276j47173m3545l1281o5658
$$ plain form
41664 4215 484748 949608 1124793 1015531 763641 480286 264672 197178 235274 253353
41654 253353 232366 268385 359061 356613 211755 102634 200730 420470 527708 433985 276180
41643 276180 232393 335131 461165 469832 351067 230194 214400 280553 356656 435831 512764
41632 512764 485157 271894 -8571 -146348 -115380 -67640 -58867 8106 129297 126324 -59338
41621 -59338 -207222 -118230 86196 153582 67485 12781 46152 33527 -78305 -138833 -19452
41610 -19452 184115 278185 216440 119593 91678 114501 129012 135584 156854 145613 19265
41599 19265 -197709 -348444 -319994 -183392 -77093 -5949 122400 284551 324458 197721
41589 197721 88387 174485 370467 430807 264856 22580 -124593 -168138 -199419 -265077
41579b65077q2532p2394k0986J01460K38266K39606N9088j15416o9679J24040
41569A36376J75048j4380j99673j57287k516L6311q972L8450J20889J1790k43445
41558a07409k94354L027L33933L46857R1990j46445k52095k91245k77758j67817
41548g61316k0209M7633M3627Q6567K16859L31146K96755P6987k10340l36846
41538b29137j75994R2428J43594o4180k13134q2509J37926J66081M9716K3487
41528a51722J01172J01703K568k4373P4529J34838K8433j61140k58124j73633
41518c25749L1033J72163R6619r5591r9584J78273M00236K15715k21775m34626
41508h3286k52751L1978J29645O8181r57l3462l0104L4176J14930J07314K9569
$$ plain form
41579 -265077 -347609 -420003 -440989 -339529 -101263 138343 197431 82015 12336 136376
41569 136376 311424 297044 97371 -59916 -62432 -26121 -35093 3357 124246 136036 -107409
41558 -107409 -401763 -398736 -64803 282054 374044 227599 -24496 -315741 -593499 -761316
41548 -761316 -781525 -733892 -690265 -603698 -386839 -55693 241062 318049 107709 -229137
41538 -229137 -405131 -312703 -169109 -233289 -446423 -528932 -391006 -224925 -175209 -151722
41528 -151722 -50550 51153 53721 29348 103877 238715 267148 106008 -152116 -325749
41518 -325749 -294716 -122553 -25934 -121525 -221109 -42836 357400 573115 351340 -83286
41508 -83286 -336037 -304059 -174414 -106233 -107190 -140652 -170756 -136580 -21650 85664 115233
41497A15233K8421J31749J71744M0817j39768k07421j73216j42957j38211j06817
41487d20426l8534K0629L4262J1361O55M5544J12626J12724M5159K9417J01752
41476E5169J09686l4436j37828l208J96264J31585j44931k39415k7225J53235
41466E8896M6893j30859p4584J27442J70674J1710j16976p7397L5423R2237P4258
41455B17717K0839l1978n2434k8746K3093Q9210J42313J00610q2959k79043k84816
41444a66194j08860K4322J8125M1156K02148L10571J62159j09914k13113j15129
41434D5271l1911n3453m2713P7769J73667J14805k2374p0698N046Q8592O7284
41423C51285n1737j60267j58767n8588K9093K3273l0835l1078L6329P2146n609
$$ plain form
41497 115233 143654 275403 447147 487964 348196 140775 -32441 -175398 -313609 -420426
41487 -420426 -458960 -438331 -404069 -392708 -392053 -346509 -233883 -121159 -76000 -46583 55169
41476 55169 164855 130419 -7409 -10617 185647 317232 172301 -67114 -94339 58896
41466 58896 105789 -25070 -99654 27788 198462 210172 93196 15799 51222 143459 217717
41455 217717 238556 206578 154144 125398 148491 237701 380014 480624 397665 118622 -166194
41444 -166194 -275054 -250732 -232607 -191451 10697 321268 483427 373513 160400 45271
41434 45271 13360 -40093 -82806 -5037 168630 283435 261061 190363 195409 284001 351285
41423 351285 299548 139281 -19486 -78074 -48981 -25708 -56543 -87621 -51292 20854 15245
41412A5245j40060j76566l8119J61454K31622J39622M8257P1365J00722m095j49747
41401B59700j24865N4549J38757J5981j28483j10823n485K5988j0845k6105m6077
41390D2292j35830k06635j09218J02179J92643O8385q3115n6019Q1140Q0944j20618
41379a43852k72747j25146K00673L19188R0713j60735q2282K06575K88013N3092
41369C73492j60408q2012J25255J58798J5198p0305M681J03539P2693q1184k30395
41358B29352k57098j56678m5999l0703o5332k9459P2236J25029J16915J47559
41348A05822J94062R9254j18600j96907k5817J31223L5417j31798o0895J70931
41338B02692K27342O2964l7126K8357J1855k16947l85369k20104J10957K32179
$$ plain form
41412 15245 -124815 -301381 -339500 -178046 53576 193198 241455 312820 413542 409447 259700
41401 259700 134835 189384 328141 344122 215639 104816 99331 125319 114474 88369 42292
41390 42292 -93538 -300173 -409391 -307212 -114569 -46184 -129299 -185318 -104178 -23234 -143852
41379 -143852 -416599 -541745 -341072 -21884 68829 -91906 -174188 32387 320400 373492
41369 373492 213084 131072 256327 415125 430323 360018 364699 468238 540931 459747 229352
41358 229352 -27746 -184424 -230423 -261126 -326458 -355917 -283681 -158652 -41737 105822
41348 105822 299884 399138 280538 83631 57814 189037 224454 92656 31761 202692
41338 202692 430034 492998 455872 484229 496084 279137 -106232 -326336 -215379 16800
41328A6800R5828M34J15018K58127K13441M3612n3587n9162j11154k19525k10884
41317H8948j2581J76587J27849j00858k35827j38760M9913J22317M0305p3299
41307D4594j02825n6576l6948r6628j39049m0250J22708J17857q6266j95157J2046
41296d56494L25030L82058J75091q834n2310q2738j32110q4893K1134M998r7974
41285g042n4559J17240J15742j06835j97357J1773J86737L5390k15693k17169
41275c31773l7263N8605Q1259J78281K56776J49955k1920m3754N478o5989j60988
41264F8667p6908O2144n738j76015j24164J12693J74045j9563j66935j19229n7445
41253c28448p0390l80J74424K17973M6939j04039p8531j6078k9690j1713P9337
$$ plain form
41328 16800 112628 113062 228080 486207 699648 743260 689673 630511 519357 299832 88948
41317 88948 76367 252954 380803 279945 44118 -94642 -44729 77588 117893 44594
41307 44594 -58231 -114807 -151755 -248383 -387432 -427682 -304974 -187117 -273383 -468540 -456494
41296 -456494 -131464 250594 425685 416851 364541 281803 149693 64800 85934 90932 -7042
41285 -7042 -61601 55639 171381 64546 -132811 -121038 65699 101089 -114604 -331773
41275 -331773 -369036 -310431 -229172 -50891 205885 355840 333920 290166 295644 229655 68667
41264 68667 -8241 53903 48165 -127850 -252014 -139321 34724 15161 -151774 -271003 -328448
41253 -328448 -398838 -399218 -224794 -6821 40118 -63921 -142452 -158530 -188220 -199933 -120596
41242a20596Q3806k7935l3968J27262J77474j9354j50543M2040K67890J06904
41232D52980l01014m39496j80863Q3186P5153k4428K8936J58466J65021O4845
41222H2786O745M61m9931j13897n6790R9028J39817k6585j89200j17645Q6932
41211a38279J32390k4001j27531m5666M0352j8191o9073N4416K04753J51873k0686
41200A40357n7259M0473M7128q0373j55280j09240p5425j02136p9960N715L3691
41189c92309L813N0871J51872J18697m6939j05259J4022P8354l3920j12113K832
41178b70079J21638L9443j02317p0879N6642N5488l9872j1334J46726K12440R8018
41167B35914l7115n8908k8667m4732p7456m3497M5412Q4125R272j02230j05044
$$ plain form
41242 -120596 -36790 -64725 -98693 28569 206043 186689 36146 78186 346076 452980
41232 452980 151966 -287530 -468393 -385207 -310054 -334482 -305546 -147080 17941 82786
41222 82786 89531 89992 40061 -73836 -130626 -31598 108219 81634 -107566 -225211 -138279
41211 -138279 -5889 -29890 -157421 -203087 -162735 -180926 -249999 -195583 9170 161043 140357
41200 140357 83098 123571 170699 90326 -64954 -174194 -249619 -351755 -431715 -426000 -392309
41189 -392309 -388496 -337625 -185753 -67056 -113995 -219254 -205232 -126878 -160798 -272911 -270079
41178 -270079 -148441 -108998 -211315 -282194 -225552 -170064 -209936 -221270 -74544 137896 235914
41167 235914 198799 139891 111224 66492 -10964 -54461 -9049 75076 84348 -17882 -122926
41156a22926K3934J31228J02635N0367J25880K14001O1950k77449m19768j74867
41146b85015J63875K30568O9483j1209R2707K04140J74605M9666n9965j10999
41136E17856j22019j30593j54114j55033q9658l726J5295m919M9691J60057J55405
41125B38242r124j33736n4939J04746J12896n4815k10104j96173l5003J15477
41115a22533J00402o6814j73364n4482J49943J63823j5922j20805m3648K1761
41105a61639m0177n8611R1433K32730J72562R367o5056o0892p1704n7366L3596
41094B4243J02446O7724J6929M747q4818k69130l08241p4029J65546J31392k9171
41083b52362k7648O3349j1784j85394j73705J5033J15214Q8318J36797K50298
$$ plain form
41156 -122926 -98992 32236 134871 185238 311118 525119 587069 309620 -110148 -285015
41146 -285015 -121140 109428 178911 167702 260409 464549 639154 688820 628855 517856
41136 517856 395837 265244 111130 -43903 -133561 -137287 -121992 -126911 -77220 82837 238242
41125 238242 229118 95382 40443 145189 258085 203270 -6834 -203007 -238010 -122533
41115 -122533 -22131 -88945 -262309 -316791 -166848 -3025 -18947 -139752 -183400 -161639
41105 -161639 -201816 -260427 -168994 63736 236298 245665 180609 119717 48013 -9353 24243
41094 24243 126689 194413 211342 216089 131271 -137859 -446100 -520129 -354583 -223191 -252362
41083 -252362 -280010 -216661 -228445 -413839 -587544 -572511 -457297 -368979 -232182 18116
41073A8116J83640o1221j55902L7455K41648K00625J7912r7385j36114j65986
41063H2788j42227k5152Q8705J07609P9987P6506O7855J1804n8424j00797j07373
41052H1281m9741Q5068J88929J23517o0804j68985j48424j38238j88484j49512
41042d25393N3993K31124J64563p2101j90359l9820K20116L04657J16086j47902
41032B14964k19685p7120N9932N8574L0172P2943O3722j04872k60219j84128J5631
41021c30086O3132l8477l8339J13799J84075N4914r7638j04503j9921M5393P5999
41010i1652O0816l5071j41057j24872j2242M0246J2285K7328P9739L1612p8158
40999b31026l0486J82226K76040J18151n5988l5782M8362J1569n3453J1455J01559
$$ plain form
41073 18116 201756 140535 -15367 22088 263736 464361 482273 384888 248774 82788
41063 82788 -59439 -84591 4114 111723 191710 268216 336071 347875 289451 188654 81281
41052 81281 31540 116608 305537 429054 368250 199265 50841 -87397 -275881 -425393
41042 -425393 -371400 -140276 24287 -47814 -238173 -277993 -57877 246780 362866 214964
41032 214964 -4721 -81841 -21909 36665 66837 139780 203502 98630 -161589 -345717 -330086
41021 -330086 -266954 -305431 -343770 -229971 -45896 9018 -88620 -193123 -213044 -167651 -91652
41010 -91652 -30836 -65907 -206964 -331836 -344078 -303832 -291547 -264219 -184480 -152868 -231026
40999 -231026 -261512 -79286 196754 314905 258917 223135 271497 283066 229613 241068 342627
40988C42627J5899j87980k68153j45253L3498J09972L5715j36371k42126j02479
40978e44651K22695M02205K19018j31999l02100k20425p5686J3531P4393R5470
40968b47549J5648j02140r3994P3783K51013L05414K43253J12246p1504k48623
40958B37547k91285j46411N0074Q9599p1208k41038k03088K4620K07320J90651
40948a53219Q1786N6833R6339O5641j8923j7631N6125K6249j32645k11627r9741
40937b50813K4644j2896r5938k3258J49138K03823J11123M3242O6361N0750p0871
40926A95305j54429o0923J05314J13568p6650k41098j68562O8503K03077J06776
40916I0881o7211j01601K0843J39824J32431K0222r1811j08666k0049O4216K1237
$$ plain form
40988 342627 358526 170546 -97607 -242860 -209362 -99390 -63675 -200046 -442172 -544651
40978 -544651 -321956 80249 299267 167268 -134832 -355257 -430943 -417412 -343019 -247549
40968 -247549 -231901 -334041 -428035 -354252 -103239 202175 445428 557674 486170 237547
40958 237547 -53738 -200149 -150075 -60476 -131684 -372722 -575810 -551190 -343870 -153219
40948 -153219 -71433 -14600 81739 147380 128457 110826 166951 193200 60555 -151072 -250813
40937 -250813 -226169 -239065 -335003 -358261 -209123 -5300 105823 149065 215426 266176 195305
40926 195305 40876 -20047 85267 198835 122185 -118913 -287475 -218972 -15895 90881
40916 90881 23670 -77931 -57088 82736 215167 235389 143578 34912 14863 79079 100316
40905A00316r5539q8655Q7110K12911J15811p1250j30179p3070k2256N3387K02080
40894B90666K39172j8212l55432l75497p9324J46730J22508N4920Q4158O7941
40884A77630o2800j22941j4471Q9178O4199K4441L7488j5167j32793j02063R9547
40873D2248J70638j3368j37033L3794K31072J34745q3513p6472Q3626P7983p4068
40862C89652p1724J11942J75110p714k00741j85245l3543O7335N6911M657K86
40851C06926N7082O5505q1952k71072k36443N6398L08959L01800J69268R4126
40841G70597L600j91874l26486k37606n9347L8253J48927L39391L46027j1890
40831H19592l67522k61034J19918K02083q0627k43125p8572P4675o648p6434P1684
$$ plain form
40905 100316 4777 -83878 3232 216143 331954 260704 130525 57455 35199 88586 290666
40894 290666 529838 511626 156194 -219303 -298627 -151897 -29389 25531 109689 177630
40884 177630 114830 -8111 -22582 66596 130795 155236 192724 177557 44764 -57299 42248
40873 42248 212886 199518 62485 96279 327351 462096 378583 302111 385737 463720 389652
40862 389652 317928 429870 604980 597266 396525 211280 177737 245072 301983 306640 306926
40851 306926 364008 429513 347561 76489 -159954 -103556 205403 507203 676471 770597
40841 770597 774197 582323 255837 18231 -41116 -2863 146064 485455 831482 819592
40831 819592 452070 191036 310954 513037 432410 189285 110713 185388 178740 102306 173990
40820A73990K30754J75791L5734J626p766j21632k32693j96707r4627o0530m0188
40809a36248N9950J52143J06934k0600r0110r0287r6054j11351q9667k4317P9207
40798b60400K17886L02529J94795o6206k19416r8701J23076J56903j7349j48676
40788A84441p1225Q4520Q3480r2746k08619p9625J63201K24655M0510j43942j35758
40777D8892l8130j3920j1116P7269J56533Q9412k0773J0175J02755L6463j47442
40766B90118j97116q3437l7534j26004j33297M6489K19921K21916J52499J43127
40756D96682J36207N4881k2840k0024r372n9111r6125n9990l2706p2938p1766
40745B42898P0536K47989K91231K19490J96442K84089L78104L79154L22446L10870
$$ plain form
40820 173990 404744 580535 616269 617895 610129 488497 255804 59097 -35530 -96060 -136248
40809 -136248 -76298 75845 182779 162179 72069 -18218 -114272 -225623 -315290 -339607 -260400
40798 -260400 -42514 260015 454810 388604 169188 70487 193563 350466 333117 184441
40788 184441 113216 197736 281216 188470 -20149 -99774 63427 288082 328592 184650 48892
40777 48892 10762 -3158 -14274 62995 219528 308940 288167 298342 401097 437560 290118
40766 290118 93002 9565 -27969 -153973 -287270 -240781 -20860 201056 353555 496682
40756 496682 632889 687770 664930 644906 635534 576423 480298 420308 387602 314664 242898
40745 242898 313434 561423 852654 1072144 1268586 1552675 1930779 2309933 2632379 2943249
40735B943249L83558N08288O95591J042370J612068K370929L345366M630574N877961
40726B3409954N913937L582088o75998m620052o179222n374879l829055k742805
40718I483968k073014j458625r82391p91032p00447n41478m10346l24834j09315
40709B092486J56463R3687l01911m79456j69304J30353n9966m21518l87200o4973
40699E88661J8575j72689j98499N1306K05245Q5742l0511N5623J50055O1012p1014
40688G43506n4007L0910R362q4760j06492o6677r0202j67776j47491P065J14495
40677A87933K3976j44670j60991l3838M713j09281j48186J4813J58296Q7695J466
40666a18074J49401L43544K38173n4641j27290K6970L3997j50019j56804O7051
$$ plain form
40735 2943249 3326807 3835095 4530686 5573056 7185124 9556053 12901419 17531993 23409954
40726 23409954 29323891 32905979 32229981 27609929 21430707 16055828 12226773 9483968
40718 9483968 7410954 5952329 4969938 4178906 3478459 2936981 2526635 2201801 2092486
40709 2092486 2248949 2342636 2040725 1561269 1391965 1522318 1462352 1040834 653634 588661
40699 588661 607236 434547 236048 287354 492599 578341 547830 603453 753508 814520 743506
40688 743506 689499 720409 729771 645011 538519 471842 381640 213864 66373 73438 187933
40677 187933 211909 67239 -93752 -127590 -122877 -232158 -380344 -365531 -207235 -119540 -118074
40666 -118074 31327 374871 613044 558403 431113 458083 492080 342061 185257 252308
40656B52308R1546k19010l85522r9495K50974K47388R9825J61564K64497R0034
40646G54109j88708k17377r8822j36440k09148j5614K65959K03622j23741k20892
40636A2948R843J61992N2929l3880O5892J15038m5733j92873j09582P2859J25801
40625B35234M3323n1925j01268q3384K1005J51972K04951J69133R9690k468j25446
40614E60817j55093m6278L3627l9599r8188L3247J75854P0571j39045j15932Q3740
40603C63721R5200j25444k38584j14909j5704q8474j31019l925J20126R2397L3414
40592a3201P2778J36698J39857J21130P6067p4363k54527k58662r4238n705o6813
40581b20979o3561J08492K51179K03120P0391j9858j02817j76444j16717N7861
$$ plain form
40656 252308 343854 124844 -260678 -360173 -109199 138189 238014 399578 664075 754109
40646 754109 565401 348024 249202 112762 -96386 -112000 153959 357581 233840 12948
40636 12948 22791 184783 237712 203832 269724 384762 339029 146156 36574 109433 235234
40625 235234 278557 226632 125364 41980 62985 214957 419908 589041 688731 686263 560817
40614 560817 405724 359446 393073 353474 255286 288533 464387 534958 395913 279981 363721
40603 363721 458921 333477 94893 -20016 -35720 -124194 -255213 -259138 -139012 -46615 -13201
40592 -13201 59577 196275 336132 457262 533329 458966 204439 -54223 -148461 -154166 -220979
40581 -220979 -284540 -176048 75131 278251 348642 328784 225967 49523 -67194 -9333
40571i333J27403K7759k5826P2301J15953l3755j68694o9048J35434J83529N7842
40560D13565p7905j39852j32242n7211L0875M1818J8896Q7548J71882N2762j97925
40549B12211k03639J22747L54423J78086j22502j43122J5294O696j38000j13504
40539A68690Q9851J79816P0104j7823L4948Q9332M4158j0135O040L7636K4919
40528G17536j6135n4891m6651Q0119K83315L46448J58349m6106K5729K73135L29068
40517B049916J07249q9221l9753J12886J46840O7110l421l1395k9851K8253J15651
40506B434264J05462m5651j84205j62920n5235k5116p1975p4204l1410o5164j69978
40495A653868j66254J3625J66076R3696q1789q7608P4185J09077j25798l93265
$$ plain form
40571 -9333 118070 145829 120003 192304 308257 274502 105808 36760 172194 355723 413565
40560 413565 335660 195808 63566 6355 37230 79048 97944 185492 357374 410136 212211
40549 212211 8572 131319 485742 663828 541326 398204 413498 420194 282194 168690
40539 168690 258541 438357 508461 490638 525586 614918 659076 648941 654981 692617 717536
40528 717536 701401 646510 599859 679978 963293 1309741 1468090 1421984 1447713 1720848 2049916
40517 2049916 2157165 2067944 2028191 2141077 2287917 2355027 2351606 2320211 2290360 2318613 2434264
40506 2434264 2539726 2494075 2309870 2146950 2091715 2066599 1994624 1920420 1889010 1823846 1653868
40495 1653868 1487614 1501239 1667315 1761011 1679222 1591614 1665799 1774876 1649078 1255813
40485A255813m09271k13450m4326L242J089j9044p7512j13896n0260M7598O1074
40474D41057K8275O2608J08428J3116j74691k34135j20241k7099n2581n8924L9957
40463B5770J00233l56j32502j01480P2381K03022J76683L6893r5586j23880n7309
40452A03869k987p019L2830J65221K04943j0885k73315k29698O1402J74185l3849
40441A84697k12283r6573R5850P6859m9176k9132R7919J21897L5565j6293k7469
40430A81861r3374j79494j68197o5900K9968R2690J35147J19908N0587L2154R5697
40419B31047J07585M549n4357M4867J33147J6710j82619k04063n1452M2493j6040
40408G1867r8174r8629m5289K0039Q4662J01544L7137l5676k0333N8130R6873
$$ plain form
40485 1255813 846542 633092 588766 592008 593097 574053 496541 382645 332385 379983 441057
40474 441057 469332 531940 640368 653484 478793 244658 124417 97318 44737 -14187 25770
40463 25770 126003 125647 -6855 -108335 -35954 167068 343751 380644 285058 161178 103869
40452 103869 100882 93863 126693 291914 496857 485972 212657 -17041 44361 218546 184697
40441 184697 -27586 -124159 -28309 48550 -626 -29758 68161 190058 225623 209330 181861
40430 181861 88487 -91007 -259204 -325104 -295136 -202446 -67299 52609 103196 135350 231047
40419 231047 338632 343181 288824 333691 466838 483548 300929 96866 45414 87907 71867
40408 71867 -26307 -124936 -170225 -150186 -65524 36020 73157 37481 17148 75278 172151
40397A72151N6418l3682j41344k14864j79950m1428Q9898J34324J13510N3305
40387H338m2838r5309p416J33382J24573k9700j08223m1940o331o2145l7672J01602
40375f3679J31871K72j5944J77177K27007q4945l87842k60028J06063K32880Q0892
40364A43724l3187j8985k3885l5484M3305O6448j27225k92745q9775K90682L39994
40353B62867J8707k05692j05703N0243M0701j5408r215k7673o8093K0882J96829
40342A58445K07765K4382q6505j7873K5543o7619j38847j02671q9866j25277m0777
40331b53300J52737J89184P138r1731O1819K16084J35470j6249k984O7119l6795
40320D28492k38548k55896k4225K22295K45795L4273k20201k99932j70239r283
$$ plain form
40397 172151 228569 194887 53543 -161321 -341271 -382699 -292801 -158477 -44967 8338
40387 8338 -34500 -129809 -137225 -3843 120730 91030 -17193 -59133 -65464 -127609 -165281 -63679
40375 -63679 68192 68464 52520 229697 456704 371759 -16083 -276111 -170048 62832 143724
40364 143724 110537 91552 67667 32183 75488 141936 14711 -278034 -367809 -77127 262867
40353 262867 281574 75882 -29821 20422 61123 45715 36500 8827 -59266 -38384 158445
40342 158445 366210 390592 304087 286214 311757 244138 105291 2620 -87246 -212523 -253300
40331 -253300 -100563 88621 95759 4028 65847 281931 417401 401152 398168 465287 428492
40320 428492 189944 -65952 -90177 132118 377913 412186 191985 -107947 -278186 -287469
40310b87469M3204P0750J59724J57646n8186k21138K50L91664L98303l5916l59949
40299B58883k62755q4291j51639k33632j9674K88029K99868O2977o9579j881O3355
40288A49661K6634q434J6787L1353k5900j46381k75859l01208j28406J45790K92708
40277b23255K45625J46254O0533q7611k39267j86658M2636J35414o401p7192J04408
40266h5514K54224R6839j66731k08254q8219n1317o4140M7758K02311J91946O0590
40255A89493p655l1426j19628j68718l4957J26599P1222r7489q1691J02149J58043
40244A05942P975j26206j24732q9661n5209O4696K00322J40609r6307k12315n4966
40233b39852J64827J96742P7893J2174P8620J69663J33014p2142l01980l38543
$$ plain form
40310 -287469 -244265 -173515 -13791 143855 85669 -135469 -135219 256445 654748 618832 258883
40299 258883 -3872 -88163 -239802 -473434 -493108 -205079 94789 157766 88187 86306 149661
40288 149661 176295 167861 184648 216001 190101 43720 -232139 -533347 -661753 -515963 -223255
40277 -223255 22370 168624 229157 141546 -97721 -284379 -241743 -106329 -112730 -189922 -85514
40266 -85514 168710 265549 98818 -109436 -197655 -248972 -313112 -265354 -63043 128903 189493
40255 189493 181838 150412 30784 -137934 -172891 -46292 24930 -72559 -154250 -52101 105942
40244 105942 113917 -12289 -137021 -226682 -281891 -217195 -16873 123736 27429 -184886 -239852
40233 -239852 -75025 121717 199610 211784 290404 460067 593081 520939 218959 -119584
40223a19584j48841M5020N7739j9558k2069l90p7133j45475p778K46006L10394
40212A18331J19672n9161l6266O0316L7248q8741j72840j45085m5525L7813K6392
40201a47846o4546j06454j8267J00531J19378Q4992J15002J58412P3778r3441
40191B21539j39966j3065J18879J19922K2148r8484j89672j62743K5250K06398
40181A10206J33773j69942l93961l31399j01863Q2599J74319K09326J56515O404
40171a24023j04480k2987K02432L47944K58318N199j97715k08032p9568K4154
40161A01242K5605r398j8500n2050j64536k73274k29455m145K67350M04717L16912
40150C64468P9595r5127n9727O8735L5483j88439l39531k29842J3811J85120K55866
$$ plain form
40223 -119584 -268425 -223405 -165666 -185224 -207293 -207683 -284816 -430291 -438069 -192063 118331
40212 118331 238003 178842 142576 202892 240140 151399 -21441 -166526 -212051 -174238 -147846
40201 -147846 -212392 -318846 -337113 -236582 -117204 -32212 82790 241202 314980 221539
40191 221539 81573 68508 187387 307309 329457 230973 41301 -121442 -96192 110206
40181 110206 243979 74037 -319924 -651323 -753186 -670587 -496268 -286942 -130427 -124023
40171 -124023 -228503 -251490 -49058 298886 557204 562403 364688 156656 77088 101242
40161 101242 126847 117449 98949 46899 -117637 -390911 -620366 -624511 -357161 47556 364468
40150 364468 444063 348936 289209 357944 393427 204988 -134543 -364385 -350574 -165454 90412
40139I0412K51061J07030j31178k01562J1117K06013P9726j69652j30899J54080
40129B66148K46221n14k46219k24407q5080m1698l2010O9987J77047J43545J6005
40118B89025n8297m6436j1813J2518K0778p189o3621j00202r2624m2782O6858
40107c3785K05189K19697N906k69486l20283j28512L4704J2206m6514K2456J37437
40096a60985J43533P2192O0598J13232J01546k9911j66468j49503L0853J89384
40086B04471J36022p6525j90226p9021Q3810R8433J9756j242K571p3606j48155
40075b3712q6696M119p3299k29049j95039J5669J17109K9905k0397O1300R0912
40064c09178k045j5918J29792K09680J04040M2372J79629K57525J3841l30399
$$ plain form
40139 90412 341473 448503 317325 115763 126880 332893 412619 242967 112068 266148
40129 266148 512369 511855 265636 41229 -43851 -85549 -117559 -47572 129475 273020 289025
40118 289025 230728 184292 172479 184997 205775 198586 134965 34763 -57861 -100643 -33785
40107 -33785 171404 391101 397007 127521 -192762 -321274 -286570 -274364 -320878 -298422 -160985
40096 -160985 -17452 54740 115338 228570 330116 300205 133737 -15766 15087 204471
40086 204471 340493 263968 73742 -5279 78531 176964 196720 195478 198049 124443 -23712
40075 -23712 -110408 -106289 -179588 -408637 -603676 -588007 -470898 -440993 -461390 -400090 -309178
40064 -309178 -311223 -327141 -197349 12331 116371 158743 338372 595897 609738 279339
40054B79339l58735o5444J82561J87531Q6643K2900k9905q9669p7313K2443R0812
40043B51163L3352j02339j99297j81092n0739J07607J82524J48362Q8130O2479
40033C40150L3313k3800l5204M7954J38343J37492Q7640P4580N7793n3750k05924
40022E98587k39428j20421P681K3879l2606n8821k8271J8858O0771J00113J07252
40011D37594K7956j24049k26586j64901J4661J36315J02307m605o3510p0949q3149
40000a8916r0265n1868N096K9316L1852L3153n885r1518j22101l8789M0644l52
39988b79633n7788L8332K25202K84817J71379L1313o6457j72449k46691j72476
39978b44451L169R7753Q5921J04059J39986J7095k42485l48176j62418Q3888J46023
$$ plain form
40054 279339 -79396 -144840 37721 225252 311895 334795 304890 215221 137908 160351 251163
40043 251163 284515 182176 -17121 -198213 -248952 -141345 41179 189541 277671 340150
40033 340150 373463 349663 314459 362413 500756 638248 725888 800468 858261 804511 598587
40022 598587 359159 238738 246419 270298 237692 178871 150600 169458 230229 330342 437594
40011 437594 465550 341501 114915 -49986 -35325 100990 203297 198692 135182 64233 -18916
40000 -18916 -109181 -161049 -155953 -126637 -94785 -61632 -67517 -159035 -281136 -319925 -279281 -279633
39988 -279633 -337421 -299089 -73887 210930 382309 413622 347165 174716 -71975 -244451
39978 -244451 -241282 -143529 -57608 46451 186437 203532 -38953 -387129 -549547 -465659 -319636
39967c19636Q0848M5484K8601k1298j6058J04392J94406J06280o4229j30596q9097
39956h0903n0804j6492Q0717J91827K03345J24146O1057M5202J9742l0158n6265
39945D91414m0403j7649j5433k5022k0192J4646M6660N047j06564j53417l8751
39934A40336J15050J09953l2527j05940l9785K4599j174l3517j4121j1794n6175
39923I4905p0242m3388p7400j83097k21500j25658J09O6868J01920J15614P2657
39912b69212L8530J24586K41541J65800q6375k29416j34541Q206N1066R0609J73106
39901A73900J36580n5995j40386N5000L09680L44011K03529Q1019Q524k7361Q1862
39890A170363L36678M54974K22426j62999l66430l55209k99547k30547r6003P197
$$ plain form
39967 -319636 -238788 -193304 -164703 -186001 -202059 -97667 96739 203019 138790 8194 -80903
39956 -80903 -131707 -148199 -67482 124345 327690 451836 512893 558095 577837 547679 491414
39945 491414 451011 433362 417929 392907 372715 387361 434021 439068 332504 179087 140336
39934 140336 255386 365339 332812 226872 187087 211686 210512 176995 162874 151080 94905
39923 94905 24663 -18725 -96125 -279222 -500722 -626380 -626271 -559403 -457483 -341869 -269212
39912 -269212 -230682 -106096 135445 301245 214870 -14546 -149087 -140881 -89815 794 173900
39901 173900 310480 254485 114099 169099 478779 822790 1026319 1107338 1115862 1088501 1170363
39890 1170363 1507041 1962015 2184441 2021442 1655012 1299803 1000256 769709 673706 680903
39880F80903l6418j22720r6931l1939o7433j11808j625J58812J27519q1558k24450
39869A92352j90500p5243N2092J90172K56669J54547k7300j02711o2027n3251
39859C34800j09349r9835L3397J64313J45560j8613j80982j90587n0586N9066
39849H7184l186j27202j01808N1998J22339P2281P3681J41723Q1714j00560j13152
39838A85012J21430K52814L3820k74580l12556j34026q458K0097O1747R7227O5963
39827A08490M3137P7830O4191j2764K9692K07394K15039q6922l57721k72727k3069
39816g430L5836n5507l4044J00272J51993Q7187J689p3064q3267P1472K57282
39805D52419J42219k51656m41543j95691J16822J87176K26848L87196L32462j00630
$$ plain form
39880 680903 644485 521765 424834 392895 325462 213654 212029 370841 498360 416802 192352
39869 192352 1852 -73391 -21299 168873 425542 580089 552789 450078 388051 334800
39859 334800 225451 125616 159013 323326 468886 450273 269291 78704 28118 87184
39849 87184 83998 -43204 -145012 -93014 29325 101606 175287 317010 398724 298164 185012
39838 185012 306442 559256 593076 318496 5940 -128086 -136544 -116447 -54700 42527 108490
39827 108490 151627 229457 293648 280884 310576 517970 733009 646087 288366 15639 -7430
39816 -7430 28406 -27101 -61145 39127 191120 278307 279996 206932 123665 195137 452419
39805 452419 594638 342982 -98561 -294252 -177430 9746 236594 623790 956252 855622
39795H55622m12978k02421J46926J52219L7880J89519L88252L13502K22211L74401
39785B065133M16299J34078J00131O79959J226778J284921J605902K735547L844061
39776A4092809M677925P136781J2029693J5194456J0793221p28090j1438924j4425978
39768C7331893j0839757o586911m684033l782241k463373j373447j171635j191145
39760E239351q30701m82163m83152m67436k14840q5930k49748l57178k42570j80579
39750A645054k63237k25985k6815M7359o0369j06873o6972j43246k67743j69073
39740C62100Q9208J94537J46164J68711J72047q7031m00557l29895J8970J14933
39730D49187j13110j95776K9869J83573P2098k022J41428K20038J4190k52083
$$ plain form
39795 855622 442644 240223 387149 539368 577248 766767 1155019 1468521 1690732 2065133
39785 2065133 2481432 2615510 2715641 3395600 4622378 5907299 7513201 10248748 14092809
39776 14092809 18770734 25907515 37937208 53131664 63924885 63196795 51757871 37331893
39768 37331893 26492136 19905225 15221192 11438951 8975578 7602131 6430496 5239351
39760 5239351 4408650 3926487 3443335 2975899 2761059 2675129 2425381 2068203 1825633 1645054
39750 1645054 1381817 1155832 1129017 1176376 1116007 1009134 942162 798916 531173 362100
39740 362100 451308 645845 792009 960720 1132767 1045736 645179 315284 334254 449187
39730 449187 336077 140301 170170 353743 425841 423819 565247 785285 799475 547392
39720E47392l02452j86697o2801N3444J47448J19377j6482j01613q7616q0950
39710B9050j03923o1628M8469J37948K07450K90107L03813K14925K03316L57911
39700A627438L91752M4079m11808n10620k96498j91678k83010k79347j20219o1013
39690i0924j37520r4905Q7679J26082k4897o2049J14015K22464J20125L1573R4744
39679C86387J15159l3360j61105j17173l4844l1874j088J12841J45276J2056j08027
39668B84248p2679L224q951l7918l835O458q4210j80454j58698k1803J58045K90337
39656A73764K47595J786k18771j49133J24175K47245Q7202j24313j58192l4424
39646A96934J26867K42112K22584M2414j33602j21769j694J3071p3741j02410
$$ plain form
39720 547392 244940 58243 -4558 48886 196334 315711 299229 197616 110000 29050
39710 29050 -74873 -136501 -88032 49916 257366 547473 851286 1066211 1269527 1627438
39700 1627438 2019190 2063269 1651461 1140841 844343 652665 369655 90308 -29911 -90924
39690 -90924 -228444 -323349 -235670 -109588 -134485 -196534 -82519 139945 260070 291643 386387
39679 386387 501546 468186 307081 189908 155064 123190 122102 234943 380219 392275 284248
39668 284248 211569 214793 205842 167924 164089 170547 86337 -94117 -252815 -274618 -116573 173764
39656 173764 421359 423145 204374 55241 179416 426661 513863 389550 231358 196934
39646 196934 323801 565913 788497 830911 697309 575540 573846 586917 513176 410766
39636D10766r1036j68371k37828r4978J48518J66748m9614j76704r3858j0517
39626a96874j4929N4425K01030J85090k4621j41998n2094J1744o1813m6501J60401
39615G3860K77093R7069j49733j71890m8588j7633q9833j26666q8888N06J44627
39604a00076K63692K06326J16j30622r5105l0529M863J14416K44038J51137j50333
39593D77923k88858q9820J25332M1282j83291k31430j14160l3252j553Q7363J88745
39582b1719J81295P7228m6100j72518k47106j51264N9643J24040l7780j46297
39572c80578J8608K63418K82040R3825o5661j01529o8164P271Q4474N3198q0902
39561A06000j22357J4010J22280K4797j34334j39704m4703j3172j3178N7477J04094
$$ plain form
39636 410766 319730 151359 -86469 -181447 -32929 133819 84205 -92499 -186357 -196874
39626 -196874 -211803 -157378 43652 228742 204121 62123 10029 21773 -40040 -86541 73860
39615 73860 350953 448022 298289 126399 77811 60178 -29655 -156321 -245209 -244703 -100076
39604 -100076 163616 369942 370058 239436 144331 113802 118665 233081 477119 628256 477923
39593 477923 189065 99245 224577 265859 82568 -148862 -263022 -296274 -297827 -210464 -21719
39582 -21719 159576 236804 190704 18186 -228920 -380184 -320541 -196501 -234281 -380578
39572 -380578 -361970 -98552 183488 277313 211652 110123 41959 49230 133704 186902 106000
39561 106000 -16357 -2347 119933 144730 10396 -129308 -174011 -187183 -200361 -142884 -38790
39550c8790j4275j86108j82891j2160J22737J49329J65405J94608J37587l0906
39540C04536j96495k49299j77942m2058N7485L2878p9718j28076l7928Q1092R4520
39529c41005J8191l4826M533J24050K42672K36766O7745j12159j23214j5069K0812
39518H8496k2617L4310K21111L46402L20967K81968L08008K74100J01572r2158
39508A862159k08337l01081l91596l78958k41203j05708l6158K5342N4517m8095
39498B30882j97163j71939J6026J27797J14766J51749K01607J5633l08949l01793
39488a21384J17600L85932J43776j75197m7875K99140L00975l4594k27915j36900
39478E03558p0752j66656j94694k5125J46419J34864Q783q7853j23926j29460
$$ plain form
39550 -38790 -53065 -239173 -422064 -434224 -311487 -162158 3247 197855 335442 304536
39540 304536 108041 -141258 -319200 -361258 -303773 -270895 -350613 -478689 -516617 -435525 -341005
39529 -341005 -322814 -357640 -353107 -229057 13615 250381 318126 205967 82753 67684 88496
39518 88496 65879 100189 321300 667702 988669 1270637 1578645 1852745 1954317 1862159
39508 1862159 1653822 1352741 961145 582187 340984 235276 199118 224460 278977 230882
39498 230882 33719 -138220 -122194 5603 120369 272118 473725 489358 180409 -121384
39488 -121384 -3784 382148 525924 350727 302852 601992 902967 868373 640458 503558
39478 503558 432806 266150 71456 46331 192750 327614 336397 248544 124618 -4842
39468d842j20874j07429p2917J8028J31304J77481J66710J92630K10100N5451
39458F45642k25965l47611k12390p9861j25244j45478N5383K87316K76421J00367
39448B28580J7405N9816Q5211O2207M5455K0658j4348J0985N1462o6981l03145
39437A97305l39897p3972J63989J26840L0493J12302J82162M29k28960j83120
39427a2429L0424R4298K2532L4542Q7261p976j50849q3391J38779K08721L6229
39416C98141j81195k74036k05500J1555K38118K21214n5180k43437j21295O0052
39406a51563J7800q5147K2420K09963J97477M8306k2108o6469j93845k14426K8111
39395b09481K39832J00099j56024j13109J15768J26278n6699j00767j9900q1572
$$ plain form
39468 -4842 -125716 -233145 -306062 -288034 -156730 20751 187461 380091 590191 645642
39458 645642 419677 72066 -140324 -220185 -345429 -490907 -435524 -148208 128213 228580
39448 228580 245985 305801 391012 453219 498674 519332 504984 515969 567431 500450 197305
39437 197305 -142592 -216564 -52575 74265 104758 217060 399222 399651 170691 -12429
39427 -12429 17995 112293 134825 169367 256628 248652 97803 14412 153191 361912 398141
39416 398141 216946 -57090 -262590 -251035 -12917 208297 153117 -90320 -211615 -151563
39406 -151563 -133763 -218910 -196490 13473 210950 259256 237148 170679 -23166 -237592 -209481
39395 -209481 30351 130450 -25574 -138683 -22915 103363 46664 -54103 -74003 -155575
39385a55575k06240r0352J75415K26574P6253M4013J25044M7767j21416p1717
39375D9766J10998N1572j94149j91464R3611K32216R1307k017P7366P5248o0067
39364C34387n1807J26815J53541l5632j25620k8580k3822j68694j64964M5104
39354F0728J38362J6378l2444P4635N7615j26814j39185R5906K04542M1330n2525
39343C38528R1728J57096m1591k14362j63204j19613k08346j48701J62418L27659
39333A81612J00147j57000p4861J28516Q9094q9317j00981L1230J00974J01694
39323C11108J12170O6955o6851j49566j29787j41368j67900J222K90948K73945
39313D00876j55538m96861l43030N9515K72063K65146K14453J03839q3579j33583
$$ plain form
39385 -155575 -361815 -452167 -276752 -50178 26075 70088 195132 242899 121483 49766
39375 49766 160764 212336 18187 -173277 -79666 152550 243857 241840 319206 394454 334387
39364 334387 282580 409395 562936 527304 401684 373104 349282 180588 15624 60728
39354 60728 199090 215468 183024 257659 315274 188460 49275 145181 349723 391053 338528
39343 338528 430256 587352 545761 331399 168195 48582 -159764 -308465 -146047 181612
39333 181612 281759 124759 49898 178414 267508 178191 77210 108440 209414 311108
39323 311108 423278 490233 423382 273816 144029 2661 -165239 -164017 126931 400876
39313 400876 245338 -251523 -594553 -535038 -262975 2171 216624 320463 236884 103301
39303A03301N6286K08934Q9614j05427j10677l3646r3387k01031j49685P753Q0656
39292a47309M7314j237l1670j3477Q5360J45598K0125j37423l6452K17861K19559
39281C68249m4938j45768L1716R1178j22409k29104m4282O1792j21528k29840
39271c84934k7522J20231o0543k17205l5484J66741N8566p9918N8452J73065n5151
39260b83702k82475r8514J96944J35743o4610M7497K73068J43867j56284r2854
39250a81320K48797L21019O4845q8584l7371o7032j80095j03303Q4074K5213k31652
39239a45409k75155m3172J17710Q8263Q3422J41147P5607p2061p7640K654o0097
39228a64731j58044J518K90781K84841k8874k26611j32741J2019O5477J31632
$$ plain form
39303 103301 159587 368521 458135 352708 242031 208385 114998 -86033 -235718 -227965 -147309
39292 -147309 -99995 -101232 -132902 -146379 -61019 84579 104704 -32719 -69171 148690 368249
39281 368249 323311 177543 209259 300437 178028 -51076 -95358 -33566 -155094 -384934
39271 -384934 -412456 -292225 -352768 -569973 -605457 -438716 -380150 -460068 -401616 -228551 -283702
39260 -283702 -566177 -664691 -467747 -332004 -396614 -349117 -76049 67818 -88466 -181320
39250 -181320 67477 388496 453341 364757 327386 260354 80259 -23044 61030 86243 -145409
39239 -145409 -420564 -463736 -346026 -257763 -174341 -33194 42413 -29648 -107288 -104634 -164731
39228 -164731 -322775 -321257 -30476 254365 225491 -1120 -133861 -121842 -56365 75267
39218G5267J83871O4611j14375o8407J43971J76265l0546j92176j88532j67194
39208a17245j65999q7705o761n1779o7007J37819L26835J56298j81148k18649
39198b75341o20L7089j22395q9883J44907J82980k86K916K20870K04269j07480
39187A97026k05299O9038J97707r1290l22985j19659J38474J0100k37602j35949
39177e00439J69927K15529N3j02907o299M4506l0166n5557K8646P4754P197o8344
39165b23100n0125M1146J25885J36692N4663n7570j03241n8640K1752Q2362P1502
39154D1326n2588k03092j73801O2337K16235P5751j33842q6791J10063J05855
39144c8547r1696j48186L651O4486r3782k19910j12237J09148K62321L19607K82894
$$ plain form
39218 75267 259138 323749 209374 140967 284938 461203 430657 238481 49949 -117245
39208 -117245 -283244 -370949 -377710 -429489 -496496 -358677 -31842 124456 -56692 -275341
39198 -275341 -275961 -238872 -361267 -451150 -306243 -123263 -123549 -120633 100237 304506 197026
39187 197026 -8273 60765 258472 167182 -155803 -275462 -136988 -126888 -364490 -500439
39177 -500439 -330512 -114983 -114930 -217837 -224136 -179630 -209796 -265353 -236707 -161953 -154756 -223100
39165 -223100 -273225 -232079 -106194 30498 85161 27591 -75650 -134290 -112538 -30176 41326
39154 41326 -11262 -214354 -388155 -325818 -109583 -33832 -167674 -254465 -144402 -38547
39144 -38547 -130243 -278429 -274778 -210292 -304074 -523984 -636221 -527073 -264752 54855 337749
39133C37749J37671l999J0950J09502P3448j08818k39965k38980j88101j05677
39123b16220K5487P5556n3943j54923J6325K81102K57797l3140k15488j54583
39113a72030o2170m5219j0859N395j11619j99956j956L07835K91523l9919k16499
39102b55474n8367J08732P2740K2327P6447M8912j29522k10696m4870J81728K63278
39091G5235J83559m3354l57593m70583j44038L32471M21361J12172r5152n09P6559
39080I0128m0654j04559K4186J20986N3713p464J4191j4593n1713R9380K92404
39069D76005J37952k82690m14161r5816J90090J34267K7748J22604J88999K4280
39059E09278j52753j34743n7625l0947P1051K16236J33195j47637k12836L9227
$$ plain form
39133 337749 475420 471421 482371 591873 665321 556503 316538 77558 -110543 -216220
39123 -216220 -190733 -115177 -169120 -324043 -307718 -26616 231181 198041 -17447 -172030
39113 -172030 -234200 -279419 -290278 -284883 -396502 -596458 -598414 -290579 944 -38975 -255474
39102 -255474 -313841 -205109 -132369 -110042 -33595 15317 -114205 -324901 -369771 -188043 75235
39091 75235 258794 215440 -142153 -612736 -756774 -424303 -2942 109230 14078 13569 90128
39080 90128 49474 -55085 -30899 90087 143800 136336 150527 135934 84221 183601 476005
39069 476005 613957 331267 -82894 -178710 11380 145647 173395 295999 484998 509278
39059 509278 356525 221782 164157 133210 204261 420497 553692 406055 193219 232446
39049B32446J81807j5245k18667j58142m1747n8107l3996J14474J46969j522m7868
39038A00402N7960j3640k81862k88841P4493K79070N2641j52846q38J48650k2978
39027d7789j82243j2627J71345N3982o6571J07518K42908j2042l32014k69687
39017c47220p263O2093K1561R4769J02657j26132k56297K4796L97177M09575J74708
39006E50424K2118q3898k33102j75994J74532L52853N5198k71797j75153L0143
38996B45324q8010k34811J8151L30481J52238k59231k74448K5830R8002n0477
38986c6951Q63J82915P4025k30622k45655K6380J42268L6107K6924J12386L029
38975I1669k17638j84000O2590J43558K7632R049R6810M9181q8557q5018k7017
$$ plain form
39049 232446 414253 399008 180341 22199 -19548 -77655 -111651 2823 149792 148270 100402
39038 100402 158362 144722 -137140 -425981 -351488 -72418 -19777 -172623 -173461 -24811 -47789
39027 -47789 -230032 -242659 -71314 -17332 -83903 23615 266523 254481 -77533 -347220
39017 -347220 -354483 -292390 -270829 -176060 -73403 -199535 -455832 -431036 -33859 375716 550424
39006 550424 572542 488644 255542 79548 254080 606933 662131 390334 215181 245324
38996 245324 157314 -77497 -59346 271135 423373 164142 -110306 -84476 13526 -36951
38986 -36951 -36088 146827 220852 -9770 -255425 -229045 -86777 -50670 -23746 88640 91669
38975 91669 -125969 -309969 -247379 -103821 -76189 -67140 29670 78851 -9706 -94724 -121741
38964a21741j24555j85261Q3373M23617L45339n3984k48359j22725J333L1589
38954B8626J24635J73051m5304l10718k17065J15478K24704Q5603N5532J62469
38944C97011J16042o6989j02502j8540p1539j90103j15174M0061j0534j32896
38934a55163k0916J51954J3836k60317k06141R7739J96323R4145J52152K94763
38924C58375J31515k24461k75395k4544N1568j20910j51615K2939O6539m3210
38914b09199J1673K04985J93802J0594m490Q7516n8078l09292k17705J09820J34667
38903d5707j38897j69290J26105K45874L5494j04957k7692k7789j41716o8427
38893c17002J28301N3222k11155j58909J97633K92161Q044j47146P125P0517r1407
$$ plain form
38964 -121741 -246296 -431557 -348184 75433 420772 366788 118429 -4296 -2963 28626
38954 28626 153261 326312 281008 -29710 -246775 -131297 93407 179010 234542 397011
38944 397011 513053 446064 343562 325022 253483 63380 -51794 -11733 -22267 -155163
38934 -155163 -176079 -24125 -10289 -270606 -476747 -379008 -182685 -88540 63612 358375
38924 358375 489890 265429 -9966 -34510 17058 -103852 -255467 -232528 -165989 -209199
38914 -209199 -197526 7459 201261 211855 207365 294881 236803 -72489 -290194 -180374 -45707
38903 -45707 -184604 -353894 -227789 18085 53579 -51378 -79070 -106859 -248575 -317002
38893 -317002 -188701 -135479 -346634 -505543 -307910 -15749 -7705 -154851 -147726 -77209 -168616
38882a68616j16096O7204P8031j02204k1639L35064M00883K4098k42387j06815
38872A47523M4780l1260l2783J67835K04083n5964k10972o7557L5104q0453j20428
38861i2L8249J01240j2512J119J63678R7020k28342l59781j59593K747j580R7796
38849b60051K60757J18601j97995j20453K98067L43017j18826l55950l2378K54372
38839A89161Q0683j31887r669J14771o7110k59946j83873m4416j102J14878K58547
38828F0037J14789j76570q2341L17707L19351j69110l95543p3344J53988n5484
38818A3480j53799J62924L24175k3274l17972j12994J49788L7036j04897P8931
38808E3398K52756Q8714j13621o4014J5890j3924Q7545K65560Q0280l55411l41140
$$ plain form
38882 -168616 -284712 -217508 -139477 -241681 -263320 71744 472627 496725 254338 147523
38872 147523 192303 161043 128260 296095 500178 444214 233242 165685 200789 120336 -92
38861 -92 38157 139397 126885 128004 291682 388702 160360 -199421 -359014 -356267 -357847 -260051
38849 -260051 706 119307 -78688 -199141 98926 441943 323117 -32833 -65211 189161
38839 189161 269844 137957 128288 243059 175949 -83997 -267870 -312286 -313388 -198510 60037
38828 60037 174826 -1744 -84085 233622 552973 383863 -11680 -85024 68964 13480
38818 13480 -140319 22605 346780 323506 5534 -107460 42328 79364 -25533 53398
38808 53398 306154 394868 281247 217233 233123 219199 306744 572304 652584 297173 -43967
38797d3967J52105K95003j26679k76685J84888M25388k8535l96464q4754K49167
38787C49467j2489k95913K2277M24432K45815j39740j48726n8731k58714l53071
38777b25393K941K77061L0309j97228P9782L18901j101l14476j179M29927K69071
38766F68615j44139j65733j1141j25593k12431P3366K71527l4430l34012j28904
38756a42875J14153q1094k27058J32901M29122J32641j67362J34097M71358J84047
38746I79930k12900l8961K53210K1289k98437j16181J02192j77691l73323R8235
38736B37363N48336K24413k57288r7896J50640k60173o88460k87553K88094P3958
38726f8566l33905R2379P77531N44533k01721k45739K26585J51899l22697k33190
$$ plain form
38797 -43967 108138 403141 276462 -223 184665 610053 581518 185054 100300 349467
38787 349467 336978 41065 63342 487774 733589 593849 445123 386392 127678 -225393
38777 -225393 -222452 54609 84918 -112310 -32528 286373 285272 -29204 -30383 399544 668615
38766 668615 524476 358743 347602 222009 9578 82944 354471 320041 -13971 -142875
38756 -142875 -28722 -109816 -336874 -203973 225149 357790 190428 324525 795883 979930
38746 979930 767030 728069 981279 1002568 704131 587950 690142 512451 139128 237363
38736 237363 785699 1010112 752824 654928 805568 545395 -143065 -430618 -142524 -68566
38726 -68566 -402471 -310092 467439 1011972 810251 564512 791097 942996 620299 387109
38716C87109K72733L05547K8836K42336O72976M83311l6803n6999J08151l01137
38706B106060p67322l68762K94846M4533o53857m91891K52711K67377l26194k97732
38696E9769K93965K90840k64463k54847K91933K98271k14534k14883K55726J99871
38686G41648k92502k14714L10539K48233k72216k00072L25232K36728l10382k21770
38676C50724L35192K28084l75742l02511K97704K23727l92732l32379K92936K70688
38666E95691k70835j16003N39755L76977m29850m64811K05482J94523m52509l68626
38656a90206L83507M19457k06999j50466M42325J91267o07061l56670O50254N80641
38646A156049m51094n24751M32103N39331l67897m76516L74631L88486n51256
$$ plain form
38716 387109 659842 965389 994225 1236561 1909537 2392848 2356045 2299046 2407197 2106060
38706 2106060 1338738 969976 1264822 1309355 655498 163607 416318 683695 357501 59769
38696 59769 353734 644574 380111 125264 417197 715468 500934 286051 541777 741648
38686 741648 449146 234432 544971 793204 520988 320916 646148 882876 572494 350724
38676 350724 685916 914000 538258 235747 533451 757178 364446 32067 325003 595691
38666 595691 324856 208853 748608 1125585 695735 230924 436406 630929 178420 -190206
38656 -190206 193301 612758 405759 255293 697618 888885 281824 -74846 575408 1156049
38646 1156049 704955 180204 612307 1151638 783741 307225 681856 1070342 519086
38637E19086n86483L87566M33071n55477n34992O15702O93212n34520p35658N13090
38627B14597Q63307k83881o71466L51577O10683m74690o65882N96862R38701l03263
38617A176545p13893M36702P17315n86468r09307N35833J037513l77851r83674
38608C32715L38548R31198l31609p96996N94584J050648n04791j101143M60757
38599I73911J129377l67147r18253P07958J201896o59589j245413Q02704J553279
38590C178723n62008j365002R12184J831311n65653j500610J248210K512561l19229
38581E370487j725676J394277L303368M89997j167381J926922L339049o08067
38573A2322976k277036K822364N986974J666471l47682O740113J1946694P471624
$$ plain form
38637 519086 -67397 320169 753240 197763 -337229 278473 971685 437165 -298493 214597
38627 214597 1077904 794023 122557 474134 1084817 610127 -55755 541107 1479808 1176545
38617 1176545 462652 899354 1616669 1030201 120894 656727 1694240 1316389 332715
38608 332715 671263 1602461 1270852 473856 1068440 2119088 1614297 513154 973911
38599 973911 2103288 1736141 817888 1525846 2727742 2068153 822740 1625444 3178723
38590 3178723 2616715 1251713 2163897 3995208 3429555 1928945 3177155 5689716 5370487
38581 5370487 3644811 5039088 8342456 8832453 7665072 9591994 12931043 12322976
38573 12322976 10045940 12868304 18855278 20521749 20174067 26914180 38860874 46332498
38565D6332498O947222K0664369L2298503L0723708M4425331R8625528J48517773
38558D28534932J13544999r641760j22266082j38797002q3567726l8216077l2131221
38551A17460063l2482558j7750603n230614q038614j2080202o028327k16535l485165
38543C2147445p004174k965655J264472j280023m484332k189150N44411j445742
38535A4587252l535369j192885J196590o34221k695819r85832R34988n50486k114820
38526E009398m40470J269204j59935j703744l12766J183635j20998j549080l03246
38517B871998J090417o1241j376807k81397R44711j74554j417319l41780R12371
38508B166399q2333j283932k60092J075817K75049r61425k83173P73602L9455
$$ plain form
38565 46332498 53279720 73944089 106242592 136966300 181391631 280017159 428534932
38558 428534932 542079931 532438171 410172089 271375087 187807361 149591284 117460063
38551 117460063 84977505 67226902 61996288 53957674 41877472 35849145 35632610 32147445
38543 32147445 25143271 22177616 23442088 22162065 17677733 15488583 16032994 14587252
38535 14587252 11051883 9858998 11055588 10421367 7725548 6739716 7674704 7124218 5009398
38526 5009398 4568928 5838132 5678197 3974453 3661687 4845322 4724324 3175244 2871998
38517 2871998 3962415 3901174 2524367 2242970 3187681 3013127 1595808 1254028 2166399
38508 2166399 2084066 800134 540042 1615859 1890908 929483 646310 1419912 1459367
38499A459367r52139j00090J044169L25464q10201k02501Q35047J90886r12486
38490H77516l75275P26898L53836n95192k56810N42900J36302o11865j61997N38688
38480A175001L501p41777k06910N42219J6137o62004K2727Q48065J40124q93083
38470B44000l77752O72020L39286n47435j30701Q55515N85115l18037j04808O76055
38460A893258L91319l89222r0311O47767J87820q43290p19456P1311j30801q55148
38450A63247m55727N77641M84571m02568l42662M75745M27137l31682k54256M86474
38440H27920L59279m56044l93802M04490L17616o17510p33034J57329N08146m8407
38430C25983k57384J87993K32045k42490j92992L53058K56568m11751l82170L51841
$$ plain form
38499 1459367 507228 407138 1451307 1776771 966570 764069 1599116 1790002 877516
38490 877516 502241 1229139 1582975 987783 730973 1273873 1410175 798310 636313 1175001
38480 1175001 1178502 436725 229815 772034 788171 126167 148894 996959 1137083 244000
38470 244000 -133752 538268 877554 330119 199418 1054933 1640048 1322011 1217203 1893258
38460 1893258 2284577 1895355 1805044 2452811 2640631 1797341 1077885 1149196 1018395 163247
38450 163247 -292480 285161 769732 367164 24502 500247 927384 595702 341446 827920
38440 827920 1187199 731155 337353 741843 1059459 441949 -291085 -133756 374390 325983
38430 325983 68599 256592 488637 246147 53155 406213 662781 251030 -131140 220701
38420B20701M53204k15056l43452K94207M38798j85413l32675L64004O89305J26161
38410A509784k44351K20666O84432M77247P7197j18331m12409p50409n72562o3840
38400H07424m4418m04874k27611M01289M15474k30857l93448J69173L77894j23244
38390G46802l50667J02883L32993j00577l69198j2835K18873j31571l76623m7049
38380A3031K68889J29173j3639J12296L7760l48979l90829Q2205L10142l6793
38370A63256k74609k1083J37329j33530k45476J36563M04507J39652j42375j1521
38360A52713J29993o7306k31307o7381P8083k2001k6859J97929K32478n5311j99081
38349A21950l2979M163k06472j90180J39979K22744q3034j87973J06549K26097
$$ plain form
38420 220701 673905 458849 115397 409604 848402 662989 330314 694318 1383623 1509784
38410 1509784 1265433 1486099 2170531 2647778 2724975 2606644 2194235 1443826 871264 807424
38400 807424 763006 358132 130521 531810 947284 716427 322979 492152 870046 746802
38390 746802 396135 499018 832011 731434 362236 349401 568274 436703 60080 13031
38380 13031 281920 411093 397454 509750 547510 198531 -192298 -110093 200049 163256
38370 163256 -111353 -132436 4893 -128637 -374113 -237550 166957 306609 164234 152713
38360 152713 282706 215400 -15907 -83288 -5205 -27206 -54065 143864 376342 321031 121950
38349 121950 88971 93134 -113338 -303518 -163539 59205 -23829 -211802 -105253 120844
38339A20844l9566r7454K82580M39908J4935l51198j23324K48350J83738j20939
38329E57874k37724k07263j65611J9566K82423K25871j58387l42380j44906m745
38319a75282j10655r7650J21778J28550j03861l0689M05780N18623O7612k77622
38309D46584j01461J13586j8283j27945M6384R6806j84418k91358M5591K77753
38299C03239J4076k71321j30047P9886n5572k45605j27655N0591J53k9352J80942
38288b30665L15603J28605p8784o0563n3164j68631p0129L08079M54822J45978
38278F91151j32474o1528k596j87150k26092P1851K25560m1347k66398j23010
38268e2033L847j43774j51441J92090L57450M2296k06175j181J48113j63475m00349
$$ plain form
38339 120844 81278 -16176 266404 706312 721247 370049 246725 495075 678813 557874
38329 557874 320150 112887 -52724 -33158 249265 475136 316749 -25631 -170537 -175282
38319 -175282 -285937 -383587 -261809 -133259 -237120 -267809 137971 656594 724206 446584
38309 446584 345123 458709 440426 312481 358865 455671 271253 -20105 25486 303239
38299 303239 317315 45994 -84053 -4167 -59739 -305344 -432999 -382408 -382255 -411607 -230665
38288 -230665 84938 213543 134759 74196 21032 -147599 -217728 90351 545173 691151
38278 691151 558677 497149 494553 307403 81311 153162 378722 337375 70977 -52033
38268 -52033 -48186 -191960 -343401 -151311 206139 248435 42260 41079 189192 25717 -374632
38257c74632o2873L46075K04390j52447j28829P5038N988j14185Q4472K82743
38247A65740O7231k09270m9362K52568J68224j00951q8185K7445j43910l42680
38237b53150j23167K60323K89896R0206P1602J00100j36579l57703j46543K03325
38227a690J49995j41963j43489P9631Q1205r4236o5943J21171J46600O8542J27425
38216C27248J79546p221k09945j41016j4341r6519j31714J29043L19399R0679
38206D45159j69668j6296K09065M1642j74425M9897L18300L0732m08662k14951
38196A10793L44665L57890j59611l39413J5041J98234q1486k91795j16588R1344
38186A29074P1432J7446M2371K1082J1183J39787J44823k39434n91902l23565
$$ plain form
38257 -374632 -437505 -91430 112960 -39487 -168316 -93278 -87290 -201475 -117003 165740
38247 165740 232971 23701 -25661 226907 395131 294180 205995 233440 89530 -253150
38237 -253150 -376317 -115994 173902 264108 335710 435810 299231 -58472 -205015 -1690
38227 -1690 148305 6342 -137147 -57516 23689 -70547 -136490 -15319 131281 199823 327248
38216 327248 506794 499573 289628 148612 134271 37752 -93962 35081 354480 445159
38206 445159 275491 259195 468260 509902 335477 385374 703674 734406 325744 110793
38196 110793 455458 813348 653737 314324 329365 527599 446113 154318 37730 129074
38186 129074 200506 217952 260323 281405 292588 432375 577198 337764 -254138 -577703
38176e77703K70169L79829j7538j95063M8475J66366m3810j37169M9627J15191
38166E8374o8207j08345J09406J91890J269j16547k8631K653m8347Q2230K75638
38155C51383J09534k87627l02720J06740K91189J8674j84505l8120M7357j51108
38145c9203k17465P7600K92997R4428j90857k10896j19217q2350Q3232L86321
38135G4590M19739N9219k10342p8962Q7454m0992j59694N9254L15655J94078j23755
38124E96244k05442o7401j9259r5701j06591l8953j9874m3343k5799K0100O1343
38113E5324J13864J24136J4859r5246j6941J37447P7529j44737j71840N5385K07048
38102C56828J49330J08985J49135K2308k92221m32313k30337L5832J36054J48720
$$ plain form
38176 -577703 -307534 72295 54757 -140306 -91831 74535 30725 -106444 -56817 58374
38166 58374 -9833 -118178 -8772 183118 184387 67840 39209 41862 -6485 75745 351383
38155 351383 460917 173290 -129430 -22690 268499 287173 102668 64548 111905 -39203
38145 -39203 -256668 -179068 113929 208357 17500 -193396 -312613 -394963 -311731 74590
38135 74590 494329 553548 343206 264244 351698 310706 151012 210266 525921 719999 596244
38124 596244 390802 323401 304142 208441 101850 62897 43023 -320 -26119 -6019 55324
38113 55324 169188 293324 308183 212937 195996 333443 410972 266235 94395 149780 356828
38102 356828 506158 615143 764278 786586 494365 62052 -168285 -132453 3601 152321
38092A52321R9842j21296l47533k18263J54841K23657j00927k57142J0992K17688
38082a85820J2306k14832o6590J72932J23417J334J35765K89037R0613k43635
38072A14527k49077K7697J81415J20343O0927N7047J6303N316J05344J41524m6417
38061E34949k52201k04688k7272j4660j36721j47050k6384M7798L8391K3854k9567
38050a93551j62698k23858o7147J71123K55451J86097J17701Q1053J0849p5236
38040I9784j16564j07506l0919J33987K48689J09007j92980k98686j07261O4248
38030a98201Q370n7628O9102J97519J01748o1686k4038J57381K31509J20905q0347
38019D64634k66559k95805o1005K49505K64858k9832k16490q1548P7317N142r9499
$$ plain form
38092 152321 252163 130867 -216666 -434929 -280088 -56431 -157358 -414500 -403508 -185820
38082 -185820 -173514 -388346 -454936 -282004 -158587 -157253 -21488 267549 358162 114527
38072 114527 -134550 -106853 74562 194905 255832 312879 329182 334498 439842 581366 534949
38061 534949 282748 78060 50788 36128 -100593 -247643 -274027 -226229 -187838 -163984 -193551
38050 -193551 -356249 -580107 -647254 -476131 -220680 -34583 83118 164171 175020 99784
38040 99784 -16780 -124286 -155205 -21218 227471 336478 143498 -155188 -262449 -198201
38030 -198201 -189831 -247459 -178357 19162 120910 59224 35186 192567 424076 544981 464634
38019 464634 198075 -97730 -158735 90770 355628 325796 109306 27758 105075 110217 10718
38008A0718k8405K9982j00708j86273j0002J76854P9660j01043k2410K03372K39438
37997B91183J00241K8998J9192q3070j91671j38614m5159j11572k07072q6076
37987d23620J51016K24262J42882J06184J00167J81q7450o020Q3730n4482k66323
37976b9473k25392P292R8326J6451K3268J52494J73737O5571O4088J96532J92089
37965G34983n0403k69904k34731l9697R2044P8904k4234j26682j56264j31643
37955a27627j47327j88427r1736J60846K96507J24157j30137j40103K8139O2359
37945a53349p5315j25882J4282J50978J24366K0411K930J11385K48364K61451
37935E79621P6124j79188k81198k02777j29955j33125o9375R1032J47123L4948
$$ plain form
38008 10718 -17687 12295 -88413 -274686 -284688 -107834 -28174 -129217 -151627 51745 291183
37997 291183 391424 420422 439614 356544 164873 26259 -18900 -130472 -337544 -423620
37987 -423620 -272604 -48342 94540 200724 300891 301072 213622 207602 291332 236850 -29473
37976 -29473 -254865 -247573 -149247 -132796 -109528 42966 216703 282274 346362 542894 734983
37965 734983 684580 414676 179945 140248 232292 311196 286962 160280 4016 -127627
37955 -127627 -274954 -463381 -555117 -394271 -97764 26393 -103744 -243847 -215708 -153349
37945 -153349 -228664 -354546 -340264 -189286 -64920 -44509 -41579 69806 318170 579621
37935 579621 655745 476557 195359 -7418 -137373 -270498 -339873 -248841 -101718 -66770
37925f6770j2436J22686K08082Q0590n4738k6639k4575j86456k42910J7896K90474
37914A05204K18225j0958l1479N6214l5762j49027M4654L40573K46867j71254
37904F13257l54277j31472Q9609N3153k3967M0784J08637P8458O9905J13947O4111
37893G22145p8712j27119o3528o4018j19795k9581J71502J82468o7021k67909
37883B58432j94666J3744J35158J24732J9314j31624j87381m3137J43046J22796
37873B60414o1299j59317j25627j08319q9528O7786K44755J68551r1116j55159
37863d8859P7377K81376K20191K4838j17274j83321j53744P458J48382O5334j12295
37852B09463n6281K00681K61424n347k67585k75961j76191j32231o2516O6825
$$ plain form
37925 -66770 -79206 43480 251562 332152 277414 250775 226200 39744 -203166 -185270 105204
37914 105204 323429 312471 280992 337206 301444 152417 197071 537644 784511 613257
37904 613257 258980 127508 217117 270270 246303 287087 395724 474182 544087 658034 722145
37893 722145 643433 516314 452786 388768 268973 239392 410894 593362 526341 258432
37883 258432 63766 77510 212668 337400 356714 225090 37709 -5428 137618 260414
37873 260414 199115 39798 -85829 -194148 -283676 -215890 28865 197416 106300 -48859
37863 -48859 28518 309894 530085 554923 437649 254328 100584 108042 256424 321758 209463
37852 209463 153182 353863 615287 609940 342355 66394 -109797 -242028 -304544 -237719
37842b37719Q7031k7132k5614J81312K98692R7491k12605l05207j77932m4252
37832c65935m476l0771r4967j37273o4311R8493K02337J87563J26958L8289j18134
37821a62227k38446j43639J04176K23102J04139p2749j47972j38912o7039Q2379
37811d57188K04016J67054P3133J16895K12102J09654j32463k00140n1324L6035
37801G7774k3926k0471Q2640M9985j39993j88194m505J13717L314j09568o0839
37790b20066j9211j05649j59013q2864k7388m7257J2938J36824R0208q7722m9543
37779e58743K19724K79321r758j91798K393J80982M544k04868o2794J90384J54636
37768D023k8695k2465N4309p4934k31116q7959J79120J73396j6150m201J75098
$$ plain form
37842 -237719 -150688 -177820 -203434 -22122 276570 374061 161456 -143751 -321683 -365935
37832 -365935 -370411 -401182 -496149 -633422 -697733 -599240 -396903 -209340 -82382 -44093 -162227
37821 -162227 -400673 -544312 -440136 -217034 -112895 -185644 -333616 -472528 -539567 -457188
37811 -457188 -253172 -86118 -12985 103910 316012 425666 293203 93063 41739 77774
37801 77774 53848 33377 116017 166002 26009 -162185 -166690 -52973 -49659 -159227 -220066
37790 -220066 -239277 -344926 -503939 -586803 -614191 -661448 -648510 -511686 -421478 -509200 -558743
37779 -558743 -339019 -59698 -69456 -261254 -258861 -77879 -73335 -278203 -340997 -150613 4023
37768 4023 -24672 -47137 7172 -67762 -298878 -386837 -207717 -34321 -50471 -54672 120426
37757A20426J63074l8129q9482M2452N6920q7611j13022K6380O1305p1531j23134
37746e2352k2691j229j18100j11362J25102L09859K07541k4848j13617l7774M8071
37735B08600O1043J1325p6313j49215j39935n6337K3006N4759N3345L6181K7882
37724E4341N9912Q8641J3382j41146k04283j21910n2560p1185j1264K04075L24972
37713A42975J38313j53313k25120j09634m9329m9674M2927J56666R8949l6428
37703d3668J6263K04371J98284n1409k01980n5492J48693J20033q5806k11395
37693C7894j39434L9861J67655J44899J9128m7951Q383M3408o2797j69170q0266
37682c8390J08150J29639m1059j68117j27399l1840J9889N7459P3013q523j40144
$$ plain form
37757 120426 283500 245371 155889 198341 255261 167650 54628 81008 142313 70782 -52352
37746 -52352 -75043 -76272 -194372 -305734 -180632 129227 336768 311920 198303 160529 208600
37735 208600 269643 280968 204655 55440 -84495 -140832 -117826 -63067 -9722 26459 54341
37724 54341 114253 202894 216276 75130 -129153 -251063 -303623 -374808 -386072 -181997 142975
37713 142975 281288 127975 -97145 -206779 -256108 -305782 -262855 -106189 -7240 -43668
37703 -43668 -27405 176966 375250 323841 121861 66369 215062 335095 249289 37894
37693 37894 -101540 -61679 105976 250875 270003 222052 230435 273843 211046 41876 -38390
37682 -38390 69760 199399 158340 -9777 -137176 -169016 -149127 -91668 -18655 -27178 -167322
37671a67322j57459l4463O3000L7121j6287o223O873m9001j09050o2227Q3791
37660d11247J95499J47345m2764j99078j58831K2000J26430P2478J2970P4729
37650a60469J65624J49962M9781n6915j70940k65577k21529k1889J61620K18602
37640a51730K32998K31330P1997k21333l27640j01125J31377P1386o3796M8027
37630g8509K37162J47864r9011j07615Q3806Q6004j20987j55648N9688J54705
37620B07459k5836j67600n9315Q0583N1440p981K7797O638j61371k59619j22883
37609d30688O7499R7029M8847P5847J00745M033j03268n4938Q3843J35921Q9223
37598A14093N5051N8197M1790k974m7091r1540j34437j45621j23050q7115j4294
$$ plain form
37671 -167322 -324781 -359244 -296244 -259123 -275410 -281633 -274760 -323761 -432811 -495038 -411247
37660 -411247 -215748 -68403 -111167 -310245 -469076 -447076 -320646 -248168 -235198 -160469
37650 -160469 5155 155117 204898 147983 -22957 -288534 -510063 -531952 -370332 -151730
37640 -151730 81268 312598 384595 163262 -164378 -265503 -134126 -62740 -126536 -78509
37630 -78509 158653 306517 207506 99891 183697 269701 148714 -6934 52754 207459
37620 207459 181623 14023 -45292 35291 86731 78750 106547 113185 -48186 -307805 -430688
37609 -430688 -363189 -266160 -217313 -141466 -40721 -36688 -139956 -194894 -111051 24870 114093
37598 114093 169144 227341 269131 266157 219066 127526 -6911 -152532 -275582 -362697 -376991
37587c76991J01907J51112L9580j08739j00486P914K884r0282k6751K04099K98592
37576A02839J21390p9314r8716p7272j60570j83357J5397K27191J66465n1723
37566a7670q2345J02317J90389L8310j31165j10500r887k9065j16859o1979J47722
37555h0732K63785J23478r9678j26969L0309J00962k3993j28869l1929J09713
37545A36077M4900j74770k74400j48742M7283J55874J57855Q0520m6353j43888
37535a65644j40255o0351M1747J64761K65408K10225k3163k31743k45929j52816
37525c37760q5206R041J60081J78944k5420j68667o699J94995N8006k35899k00746
37514d59330J43779L01656J10579p3139m8885l6069j37986j17205R2798J79428
$$ plain form
37587 -376991 -275084 -123972 -84392 -193131 -293617 -285703 -282819 -373101 -399852 -195753 102839
37576 102839 224229 144915 46199 -31073 -191643 -375000 -359603 -132412 34053 -17670
37566 -17670 -100015 2302 192691 231001 99836 -10664 -20551 -49616 -166475 -228454 -80732
37555 -80732 183053 306531 206853 79884 110193 211155 187162 58293 26364 136077
37545 136077 180977 6207 -268193 -416935 -369652 -213778 -55923 24597 -21756 -165644
37535 -165644 -305899 -366250 -324503 -159742 105666 315891 292728 60985 -184944 -337760
37525 -337760 -422966 -413925 -253844 -74900 -100320 -268987 -275686 -80691 -22685 -258584 -459330
37514 -459330 -315551 -13895 96684 23545 -25340 -61409 -199395 -316600 -223802 -44374
37504d4374J419j26393L2303K42387K16444M3562o8171j19353j35979j3261K02412
37493B30996K25021j7406j85107n0238J25570K7503k23003l20883k29257q5252
37483e02056P0602J92779J33736q1670j61488J9000J90210J50879J08088K45708
37473C65788L18069O5442k79625l31776j48232n8202j10544j16663o4584o8222
37463d28549m8508J25367K92747J94627p6086j84545m8085J10540J39170Q1025
37453A57703j0998j10404j41254r8512j23071k37614j99381J13742L91486L03781
37443D5478K2875n1265Q3142J01157o8774j74827j05230j5359K768K2543N6271
37432h1221M2689M0101J33866J97475N2683j85850k41179r6202K9159N7947Q4397
$$ plain form
37504 -44374 -42955 -169348 -137045 105342 321786 365348 297177 177824 41845 28584 230996
37493 230996 456017 438611 253504 203266 328836 356339 133336 -187547 -416804 -502056
37483 -502056 -431454 -238675 -104939 -186609 -348097 -329097 -138887 11992 120080 365788
37473 365788 683857 749299 469674 137898 -10334 -68536 -179080 -295743 -360327 -428549
37463 -428549 -477057 -351690 -58943 135684 59598 -124947 -173032 -62492 76678 157703
37453 157703 146705 36301 -104953 -203465 -326536 -564150 -763531 -649789 -258303 45478
37443 45478 68353 17088 100230 201387 132613 -42214 -147444 -162803 -160035 -137492 -81221
37432 -81221 -38532 1569 135435 332910 385593 199743 -41436 -137638 -108479 -50532 33865
37421C3865R2753J899p0073L9799J72249L6661k58838l04673l7989J57247P5310
37410f1790l8477J5369N5254r2115k32729j19765J32291K25817J02834m4376p0744
37399a28431k178O0504L7075o6889j28976l5710J34780J86605Q6869J1997O8770
37388B24416J39200Q1400o3409j60507j68223j43965j34793j29933q6572J8275
37378d24111J34227J63262Q5439O230J3875N6838M1414k5719p8428q9080m1119
37367a57172Q8430K26358K14355L4995j15586j02703l7555m9551o6506K230O3494
37356A00789K9724P878O6296L4546j78964k93822m1562L34754L71842O8123j42691
37345C56913n1708J01230P5194p4344j97144k30195j29316J00187K70020J69057
$$ plain form
37421 33865 126618 128517 58444 98243 270492 307153 48315 -256358 -294347 -137100 -61790
37410 -61790 -100267 -84898 -29644 -121759 -354488 -474253 -341962 -116145 -13311 -57687 -128431
37399 -128431 -130609 -70105 -33030 -99919 -228895 -264605 -129825 56780 143649 155646 224416
37388 224416 363616 445016 381607 221100 52877 -91088 -225881 -355814 -442386 -424111
37378 -424111 -289884 -126622 -41183 -34953 -21078 35760 77174 51455 -26973 -116053 -157172
37367 -157172 -68742 157616 371971 406966 291380 188677 151122 101571 35065 37295 100789
37356 100789 130513 138391 204687 239233 60269 -233553 -275115 59639 431481 499604 356913
37345 356913 305205 406435 481629 407285 210141 -20054 -149370 -49183 220837 389894
37335C89894j16927k85382k18714p2751J1784L7331J1967o8701j18087n1778O1570
37324d19794J28381J90699K54058J50462j48941l14280j09144J71302J40964m2960
37314G47r475R5814j33693n20248m64482M4482L55561K12909J05499L15864L97086
37303D00064J3055l82420k52065J59410K49751k1333k06298j17048K8490O9887
37293e8507O7983O7914L6977l243j5658m1014q6397n4848O8689J37408Q5203L7416
37281B41923M6659k2953j88783k18986j7407J49067N5324j16749q9141P7661J47222
37270F3837R5630N0886K3690k6696j8859R7177J62607L6064j42149j48918r983
37259A83286Q7714Q3675L3844n5198j78175k39103j88046j25195j19632q3590
$$ plain form
37335 389894 272967 -12415 -231129 -303880 -292096 -254765 -242798 -311499 -429586 -481364 -419794
37324 -419794 -291413 -100714 153344 303806 154865 -159415 -268559 -97257 43707 747
37314 747 -8728 87086 -46607 -566855 -1031337 -986855 -631294 -418385 -312886 2978 400064
37303 400064 413119 30699 -221366 -61956 187795 166462 -39836 -156884 -128394 -58507
37293 -58507 9476 77390 114367 111124 95466 54452 -31945 -86793 -18104 119304 204507 241923
37281 241923 288582 265629 76846 -142140 -159547 -10480 44844 -71905 -161046 -83385 63837
37270 63837 159467 210353 234043 207347 188488 285665 448272 484336 342187 193269 183286
37259 183286 271000 354675 388519 333321 155146 -83957 -272003 -397198 -516830 -600420
37249f00420K5746P3762j0672o6412L3025J44971J01865j676J0933J07267J56522
37238b5089J62660J68213R2144j10193k75764k40876q5988J2651K6069L45p3263
37227c49091j39044m0918J90965K46966k5193l12146k45065P3802K57016J87336
37217a55372P3273N8557Q0535O6521K1433m9975j28132j42104q0771l9401m7228
37206c42664o006Q8746P7515o9959j33941M354J48042J29397R7469K09277L03346
37195E05576J79493l5978j22062j41130k52794l47414k18397M8582J89836J44731
37185d9557L7492p3885j56313q8579J18836J85579m3344k70445j62815J06650
37175c96381J30201r0187j94935n7052R6699J06428N3114L3876N9290J28006J67887
$$ plain form
37249 -600420 -574674 -500912 -511584 -577996 -544971 -400000 -298135 -299811 -288878 -181611 -25089
37238 -25089 137571 305784 397928 287735 11971 -228905 -314893 -302242 -276173 -275828 -349091
37227 -349091 -488135 -529053 -338088 -91122 -116315 -428461 -673526 -599724 -342708 -155372
37217 -155372 -82099 -23542 56993 123514 144947 94972 -33160 -175264 -256035 -295436 -342664
37206 -342664 -348670 -259924 -182409 -252368 -386309 -381955 -233913 -104516 -7047 202230 505576
37195 505576 685069 649091 527029 385899 133105 -214309 -432706 -384124 -194288 -49557
37185 -49557 -12065 -85950 -242263 -330842 -212006 -26427 -69771 -340216 -503031 -396381
37175 -396381 -266180 -356367 -551302 -608354 -511655 -405227 -352113 -318237 -258947 -130941 36946
37164C6946K7002k43001k99860N728L05048K21642n2714j08996J0779q698j29637
37153b35761p1560R9064O7950j20981j28409N5584J11391m091j4182J08069R4101
37142c8825o2688p7089L9677m6507l22814l38615L1635L15415J84381n9225l8397
37131d13052J23535J20999k1890r5218o8039k0241N2673J41608J49380P6721N5169
37120A01645Q7004J9953j36103j79170q1873l7675n7154P8718L39212L59120K6530
37109E20207k73151k40128p8638o1865q0646M3555J54619M9820j10385o3483J01086
37098c9009J15207q918m4069M4043P8109j956o4655k4412M5611L8228o3889j69249
37086i4959j46339J6982J38576O5179p2188l8274J14988J24420l0335r2811J2994
$$ plain form
37164 36946 63948 -179053 -478913 -473185 -168137 53505 791 -108205 -97426 -106124 -235761
37153 -235761 -307321 -208257 -140307 -261288 -389697 -334113 -222722 -226813 -240995 -132926 -38825
37142 -38825 -101513 -178602 -138925 -185432 -508246 -846861 -815226 -499811 -315430 -374655 -413052
37131 -413052 -289517 -168518 -190408 -285626 -353665 -373906 -321233 -179625 -30245 46476 101645
37120 101645 188649 208602 72499 -106671 -188544 -226219 -283373 -204655 134557 493677 520207
37109 520207 247056 6928 -71710 -133575 -214221 -170666 -16047 33773 -76612 -140095 -39009
37098 -39009 76198 67280 23211 67254 145363 143407 78752 54340 99951 138179 74290 -94959
37086 -94959 -241298 -224316 -85740 -20561 -92749 -131023 -16035 108385 78050 -14761 -1767
37075a767O3412l9391j00728j8133M0738p838q224P2116J8198j98221k64014m2954
37063d86806J51666P7941l9960L9807J22677m0631k57590k09696L720P2763J3699
37052e52410O4229K03673K03784O0352j2646L5792N1698k2473q5782q6039o5002
37041b04824m5266m0943q7178j23463p321K17648K89027J30597K2511J44451K42956
37030E38195N2262k28695k40872k7707Q6287J2562p7766j14706j56418j62804
37020c19662p4628j5749j01600j63273R575K61932K56421j0932k09556j45317
37010e12789N7961K03989J98556M2009j33643j24649M9795R1295j14730k33704
37000d75910M026K95529J97991j49861k37514K0503K19601J45138N563k9825m6225
$$ plain form
37075 -1767 61645 22254 -78474 -96607 -55869 -63707 -71931 185 18383 -179838 -443852 -486806
37063 -486806 -335140 -257199 -297159 -257352 -134675 -175306 -432896 -642592 -638872 -566109 -552410
37052 -552410 -488181 -284508 -80724 -20372 -33018 2774 54472 31999 -53783 -139822 -204824
37041 -204824 -250090 -291033 -378211 -501674 -508995 -291347 -2320 128277 150788 295239 538195
37030 538195 590457 361762 120890 93183 179470 192032 114266 -440 -156858 -319662
37020 -319662 -394290 -410039 -511639 -674912 -665337 -403405 -146984 -157916 -367472 -512789
37010 -512789 -454828 -250839 -52283 -10274 -143917 -268566 -218771 -127476 -242206 -475910
37000 -475910 -471884 -176355 21636 -128225 -365739 -345236 -125635 19503 25066 -4759 -50984
36989e0984p3565L031J38153J23634k7615o5122O0339J12509R61q0516m3603n3498
36977D3724j58123j42642O9651K10138P3100j49299j66371m030R7401M1341n9246
36966a44356p2586K6651J51014J63309K8954j00577p6582K2639L0834r612O4815
36955H4503J93859J34424j27019l01453k15970l5617L7004L8625R2515J80818
36945H1689K06251J40923K0818r2428j08744n839O6423n0051k50137k61802m0607
36934b93504J45974Q7825j09792k15488j54717k0838P3595Q8167O9774R0818J27786
36923a10400P2633o2326q9158P0869K10368J35274k8283o2933j8641n1532p5115
36912i244P5691K64050K18555p571j26377q3676m7748k2167R8333J71201j0780
$$ plain form
36989 -50984 -124549 -121518 16635 140269 112654 47532 107871 220380 221341 140825 97222 43724
36977 43724 -114399 -257041 -187390 22748 95848 -53451 -219822 -223852 -126451 -85110 -144356
36966 -144356 -216942 -190291 -39277 124032 152986 52409 -24173 -1534 29300 19688 84503
36955 84503 278362 412786 285767 -15686 -231656 -267273 -230269 -191644 -99129 81689
36945 81689 287940 428863 449681 357253 248509 242670 309093 259042 8905 -252897 -293504
36934 -293504 -147530 -59705 -169497 -384985 -539702 -560540 -486945 -398778 -329004 -238186 -110400
36923 -110400 -37767 -100093 -189251 -118382 91986 227260 198977 136044 117403 65871 -9244
36912 -9244 66447 330497 549052 541481 415104 331428 283680 261513 359846 531047 520267
36901E20267k41459j42685J42892J01355k68010l76152p206L10107J70477r7166
36891A12420o5859R9150M4331j30912j25554J4600O1025L6928O8568N8173r4591
36880G8279j86362k3625J77107R9394j53896k38886j03274L1709P8032J14791
36870a26731J38937J04940R2364J48979J22038p3997k17857j19315K1612n2136
36860C8834j84189q0828J38369J34504m6146o3660R2827R2437j20330k01383J1045
36849a88520K44236K58106J68189J40474J12374J638r7763j12171j41095k49253
36839A36215l14503k31147q1638J9923Q3300J36130J38361J02180J19487J72438
36829B80746J05362j01561k25985j18141N5172O0132n5698p3520L0871O1251p0175
$$ plain form
36901 520267 278808 136123 279015 380370 112360 -263792 -270998 39109 209586 112420
36891 112420 46561 145711 190042 59130 -66424 -51824 9201 46129 114697 172870 78279
36880 78279 -108083 -131708 45399 144793 -9103 -247989 -351263 -319554 -241522 -126731
36870 -126731 12206 117146 209510 358489 480527 406530 188673 69358 90970 38834
36860 38834 -145355 -226183 -87814 46690 544 -63116 29711 122148 1818 -199565 -188520
36849 -188520 55716 313822 482011 622485 734859 736497 638734 526563 385468 136215
36839 136215 -178288 -409435 -491073 -471150 -387850 -251720 -113359 -11179 108308 280746
36829 280746 386108 284547 58562 -59579 -4407 55725 27 -73493 -42622 18629 -51546
36818e1546j95229j38344K8587Q9930j5017j10448j8538K02747L20572K00675
36808C13389m6500j95750j26603R2351K75861K66041O9222j33728j70141o2777
36798B81365L9213P9467J06844R2385n5734k46170k12163R4819L29325J77385
36788F86736j93553l49467j63855P4149R9209k6042r1706l0754O7187J17187J17307
36777C06398J06475J01458P5785m131j24477k28335k72760k45306j38718K5992
36767c97619J63609J93193J33656N2812l5956j16448q6199Q9530K10481P6194
36757B83253j50271j19542J52681K67272N5891j69750j46744n4202j25295k16640
36747b23347r4306J27041J86022J04244O8233O2268l3901j32378p0294O3287O5115
$$ plain form
36818 -51546 -246775 -385119 -356532 -266602 -281619 -392067 -410605 -207858 112714 313389
36808 313389 266889 71139 -55464 36887 312748 578789 648011 514283 344142 281365
36798 281365 320578 400045 506889 599274 543540 297370 85207 180026 509351 686736
36788 686736 493183 143716 -20139 54010 153219 127177 35471 4717 71904 189091 306398
36777 306398 412873 514331 590116 585985 461508 233173 -39587 -284893 -423611 -397619
36767 -397619 -234010 -40817 92839 145651 109695 -6753 -92952 -3422 207059 283253
36757 283253 132982 13440 166121 433393 489284 319534 172790 118588 -6707 -223347
36747 -223347 -317653 -190612 -4590 99654 167887 230155 196254 63876 -6418 56869 121984
36736A21984k3961k0167M5482m378j49569k07004j35240k4318J13149K56311K23679
36725A95968o7023l28149k48353K4807J24264L8463K3519Q2383J8801q8144O857
36714b16607J82661Q5871k07516k52439l891R6448p7821j02234K03299L85537
36704I3308J15167k33823j92093Q6165J71751M4438l6052l2261n2359k8322J07036
36693D2955J54329l5015k02365n5749K16642K41483P2757L9792J35521O1043j92474
36682D78919l09321k00591j19121j65047j19803J05595K52843J27706q3226j04917
36672a36963M9067J74745J79250J20156O1138J5478l5665j27498k45534k74400
36662b20226j18995J30322K73160K25247N2805j62114l28452k89138R699L16440
$$ plain form
36736 121984 98023 77856 123338 118960 -30609 -237613 -372853 -397171 -284022 -27711 195968
36725 195968 128945 -199204 -447557 -422750 -298486 -260023 -236504 -154121 -135320 -223464 -216607
36714 -216607 -33946 51925 -155591 -408030 -411921 -315473 -393294 -495528 -292229 93308
36704 93308 208475 -25348 -217441 -131276 40475 84913 48861 16600 -35759 -64081 42955
36693 42955 197284 162269 -40096 -95845 120797 362280 435037 474829 610350 671393 478919
36682 478919 169598 -30993 -150114 -315161 -434964 -329369 -76526 51180 -32046 -136963
36672 -136963 -87896 86849 266099 386255 447393 462871 427206 299708 54174 -220226
36662 -220226 -339221 -208899 64261 289508 342313 180199 -148253 -437391 -427692 -111252
36652a11252L01040P422j86658j13374k2032j22635k28251q1401J98904K89633
36642f8604J46185J2068N939m512r8789j49678p1413n709j09394k91888l20824
36631i56619j20304J63153L43746L34200J51034q6371j85090m6304J85985K67886
36621E1316J58946M6005M5586N9712kl7605L3567Q7191k9973k25282k87726k01776
36609c00041j07739k5580J14506K11351P9540j77677k13716M4008K42622J31166
36599a560o4860k8133J54196J76918J3901r8228p2589m9212q9275p9838K9295
36588a09385J25000J14943M1423j7019k1765L9636J13230P3055r2311j70722j0650
36577H5435J77428Q7153j74068k01769N7477J89606j3143j85504J7357L24299
$$ plain form
36652 -111252 189788 197210 10552 -102822 -124854 -247489 -475740 -557141 -358237 -68604
36642 -68604 77581 89649 95588 91076 -7713 -157391 -228804 -234513 -343907 -635795 -956619
36631 -956619 -1076923 -913770 -570024 -235824 -84790 -171161 -356251 -402555 -216570 51316
36621 51316 210262 256267 301853 361565 361563 323958 357525 444716 414743 189461 -98265 -300041
36609 -300041 -407780 -433360 -318854 -107503 -27963 -205640 -419356 -375348 -132726 -1560
36599 -1560 -66420 -94553 59643 236561 250462 152234 79645 30433 -58842 -138680 -109385
36588 -109385 15615 130558 171981 154962 133197 172833 286063 359118 266807 96085 85435
36577 85435 262863 350016 175948 -25821 31656 221262 208119 22615 39972 364271
36567C64271K61209q4661k05538J7276J56166n3114l16834k84109n4674P8277
36557a21731R3797J38477J66161K4121k09679k94597j86933n2081M5909J78671
36547b17885K89201K07298k1033j25152k6611L2122q6983j63753l172J94116J28562
36536B06710j19713k18761p8443Q6995J33528J35143J58349J42029M1846r0256
36526C97427j91698k13817r9928R8785J57912n6367l21959l10002n3987J15284
36516d78350Q2911O4487J64571J80832q328j81447j11771P9824J41049O8642L6619
36505C9039P9785Q0022n874r3602j04809k5147J10262J88027O6133k28990m41816
36494c36970l49735k5146K60040L23876J90305L936q3300j8014R0267Q6985j0844
$$ plain form
36567 364271 625480 540819 335281 352557 508723 455609 138775 -145334 -200008 -121731
36557 -121731 -27934 110543 276704 300825 91146 -203451 -390384 -442465 -396556 -217885
36547 -217885 71316 278614 257581 132429 105818 137940 50957 -112796 -115968 78148 206710
36536 206710 86997 -131764 -210207 -123212 10316 145459 303808 445837 487683 397427
36526 397427 205729 -8088 -108016 -9231 148681 92314 -229645 -539647 -593634 -478350
36516 -478350 -395439 -330952 -166381 14451 6123 -175324 -287095 -207271 -66222 2420 39039
36505 39039 118824 198846 192972 99370 -5439 -30586 79676 267703 333836 104846 -336970
36494 -336970 -686705 -711851 -451811 -127935 62370 66306 -16994 -35008 55259 142244 131400
36483A31400l7052N0387Q8823k1302j49775j48937o0906J3998Q4509J58982J38197
36472B48324j2847j38813j17463o1433j08184j61074o4725R2354J07484R049N374
36461b01954J27044J78473N9762q3866q0374O2017K03619K14547O3199j39451
36451D03016k10005r7719L8602N2194O286K1030M5801k6425j17833o8123P6495
36440A23319J11904l313j01168q4760l9130l2015o028P6282J48352J51507Q8250
36429D33200n7336k86023m43317l12440O4906L35498K37038o4568j87427j6219
36419b96688J85420J51264m3025j14942J0220Q9829o2473k53687j60398J73650
36409c20830L56828J95931n9481j31646q9422j08148j14108L9595K23686J91353
$$ plain form
36483 131400 94348 144735 233558 212256 62481 -86456 -147362 -133364 -48855 110127 248324
36472 248324 235477 96664 -20799 -82232 -190416 -351490 -416215 -323861 -216377 -207328 -201954
36461 -201954 -74910 103563 163325 79459 -915 61102 264721 479268 542467 403016
36451 403016 193011 95292 133894 186088 192374 213404 259205 232780 114947 46824 123319
36440 123319 235223 231910 130742 45982 6852 -25163 -31191 45091 193443 344950 433200
36429 433200 375864 89841 -353476 -665916 -601010 -265512 -28474 -93042 -280469 -296688
36419 -296688 -111268 39996 -3029 -117971 -107751 -17922 -80395 -334082 -494480 -320830
36409 -320830 35998 231929 172448 40802 -48620 -156768 -270876 -231281 -7595 183758
36399A83758j0918j14132n8532l6201j12259j24257o649Q1352M2959j964L4191
36388a22652L7394p9750j75462q9191P3992O7587j32606k64062j14327J89846
36378f09231L23592J68254m2244m7586P7594O2003j17752j88857k7576J26411
36368b75392N0618j14160j10192M6780J57162J47905N9832j05286k75425k24174
36358f42332J14265M06909L17232j759j43489l9450N5959N1409P1112R3174k6356
36347B56674j88117j39525O4060J16169j0607m4134M5452j7551k41346k52903
36337d11828O0787K98864J84811n771L8015J40936N352k48811l03686j49262K565
36326c88028J08002K43178L21530J92391o9022k30887j87838L293K40338L67150
$$ plain form
36399 183758 172840 58708 176 -36025 -148284 -272541 -279190 -197838 -154879 -156843 -122652
36388 -122652 -85258 -165008 -340470 -429661 -355669 -288082 -420688 -684750 -799077 -609231
36378 -609231 -285639 -117385 -159629 -207215 -129621 -67618 -185370 -374227 -401803 -275392
36368 -275392 -224774 -338934 -449126 -402346 -245184 -97279 -37447 -142733 -418158 -642332
36358 -642332 -528067 -121158 196074 194315 50826 11376 67335 118744 189856 283030 256674
36347 256674 68557 -70968 -6908 109261 98654 54520 99972 82421 -158925 -411828
36337 -411828 -351041 -52177 132634 126863 164878 305814 311166 62355 -241331 -390593 -388028
36326 -388028 -280026 -36848 284682 477073 408051 177164 -10674 -7381 232957 600107
36316F00107K23105j18672l40892k81368j40876j22285j15125L0607J69280R1164
36306d955j06572j75995r0783P765Q3943J60559J49739R69j20841o5957L4793
36295a27335o165j01845o3527M9999N9493M863M2518J22023Q8716R377O6636K05871
36283C50624K12475Q0043j4777m5979j26313k15801j75082p3338j03180k08039
36273c19367j45737P0920J60468M6258j6922J13386K30962J31886p7245j81412
36263A3197j47915p1106o752K0144l227n940J00636K31389J85208m4136k12412
36252E9086j65494m1724k2381n8355P002J67721K61543J87534M640j61281k36935
36241A356k32707j86043r4382N4904J91455J98767Q6220K443J0165J572o4371
$$ plain form
36316 600107 823212 704540 363648 82280 -58596 -180881 -296006 -265399 -96119 -4955
36306 -4955 -111527 -287522 -378305 -370540 -286597 -126038 23701 24670 -96171 -162128 -127335
36295 -127335 -133500 -235345 -298872 -248873 -189380 -184517 -141999 -19976 68740 78117 144753 350624
36283 350624 563099 643142 628365 582386 456073 240272 65190 -8148 -111328 -319367
36273 -319367 -465104 -394184 -233716 -187458 -204380 -90994 139968 271854 194609 13197
36263 13197 -134718 -205824 -212576 -192432 -195659 -201599 -100963 130426 315634 271498 59086
36252 59086 -106408 -148132 -170513 -228868 -221866 -54145 207398 394932 399572 238291 1356
36241 1356 -231351 -417394 -511776 -456872 -265417 -66650 19570 22013 32178 33750 -30621
36230c0621m1175J20405J84608j4981k23234r8721K27132L04688K7701k47419
36220B08383k57887j29902m5965K0217J02016Q8641m9167j29691l2428R5062O2625
36209f8096q5601j59039o8981J07528K16542J41781o1295j60475k4975J40926
36199b1685N7307j87284k37676j4310J74612J23773k761j6536M141n7152j13295
36188b90866o2315R050M277m72O5242R5379j169j10425r3337k562M4069N9515
36176b83614J03555J41135J22257P6365K9354k6314k0875J24210K59157J18233
36166F43463k27659l61334j34828O2076r1824l27167k29669Q8950K06717P5493
36156b95782J2577J10282J31864k063o1819P2817K05144J53839O598p8942r3106
$$ plain form
36230 -30621 -71796 48609 233217 218236 -4998 -103719 123413 428101 455802 208383
36220 208383 -49504 -179406 -225371 -205154 -103138 -14497 -63664 -193355 -225783 -130721 -68096
36209 -68096 -153697 -312736 -381717 -274189 -57647 84134 22839 -137636 -162611 -21685
36199 -21685 35622 -151662 -389338 -403648 -229036 -105263 -108024 -124560 -120419 -177571 -290866
36188 -290866 -353181 -344131 -339854 -340326 -275084 -179705 -180874 -291299 -384636 -387198 -343129 -283614
36176 -283614 -180059 -38924 83333 159698 189052 162738 141863 266073 525230 643463
36166 643463 415804 54470 -80358 -18282 -110106 -437273 -666942 -577992 -371275 -295782
36156 -295782 -283205 -172923 -41059 -43122 -104941 -32124 173020 326859 333457 254515 161409
36145A61409p9996k2323O8463R6543P997j28449k07164j67849j2685J50665J40995
36134G606p4309k57170j78544N2035J50726P9109L1853N0760k3995j85477j78150
36123e25556R3631L56943L32732R0058j14148j56136n9914J20482K68502K18942
36113F25536k5026k24233k04651q3052l7813k3239P7502J62250M3662j96423k64405
36102a49892p5430J24701J12636l4622r4918J4994J91789K74113J61335r6177
36092D28529k84809k16816K5372J58564O6751m9009J2807J42227R4915j20595
36082B57936k48729j58003M113O7698O3322R5724J42709J10669N755p2662o5147
36071B03385J0263J06248J53676Q4180o2764j25016k3875Q6876K7114j17000j07439
$$ plain form
36145 161409 81413 59090 127553 224096 232093 103644 -103520 -271369 -284054 -133389 7606
36134 7606 -66703 -323873 -502417 -450382 -299656 -220547 -188694 -137934 -161929 -347406 -525556
36123 -525556 -431925 -74982 257750 347808 233660 77524 17610 138092 406594 625536
36113 625536 600510 376277 171626 88574 50761 27522 105024 267274 310936 114513 -149892
36102 -149892 -225322 -100621 12015 -22607 -117525 -102531 89258 363371 524706 428529
36092 428529 143720 -73096 -47724 110840 177591 128582 141389 283616 378531 257936
36082 257936 9207 -148796 -144683 -76985 -13663 82061 224770 335439 341194 268532 203385
36071 203385 213648 319896 473572 557752 494988 369972 346097 432973 460087 343087 235648
36060B35648N6379J07090o5902k07284p1505J86410K19990k3376k68664l14914
36050a46128k23404r7310P1532K49577K81647J17598m7289l4169N0092Q019r6268
36039A33897m1686J42130J77645q443j49101p9841j0176j33038k44411p6071J99295
36028h9800J92142q3486k37286j24846m924k6719j1029J21769J46482k9704j34464
36017b81865j354J16762J9766m5876J39045K71377M516l77432l42756L0215J93894
36006b73708K3293p1038Q5523J84997N6775o1747l4841n6516j72975j10155J76639
35995b53753K89588K2661k57055j94778J2768K7123p1950l4286Q2386Q7459L9350
35984b50487P2085Q7618k1009q8486K7490J29088K1431r8018J1241J68313R7581
$$ plain form
36060 235648 292027 399117 333215 125931 54426 240836 460826 437450 168786 -146128
36050 -146128 -369532 -466842 -395310 -145733 135914 253512 206223 172054 222146 230165 133897
36039 133897 92211 234341 411986 403543 254442 174601 164425 31387 -213024 -289095 -89800
36028 -89800 102342 18856 -218430 -343276 -348200 -374919 -385948 -264179 -117697 -147401 -281865
36017 -281865 -283219 -166457 -146691 -192567 -53522 217855 222371 -155061 -497817 -467602 -273708
36006 -273708 -250415 -321453 -235930 -50933 5842 -55905 -90746 -147262 -320237 -430392 -253753
35995 -253753 35835 58496 -198559 -393337 -380569 -353446 -425396 -459682 -377296 -289837 -250487
35984 -250487 -178402 -90784 -111793 -200279 -172789 -43701 -22270 -120288 -109047 59266 156847
35973A56847m1258N3688K27032J07277k11686l01193j15733m642m9702J8185K15115
35962E3930K11059m7190j76031M476J73880P2219j01426j05090n5658j23043j75758
35951b68632n0520J03721P2267m6489j7765J23841J38419k6322j55937p5452J32017
35940g0852K36566J20921q2554j28055L6510J74445P4994j40448k02151q4881
35930f5505J4595J7957J4043J5775m0402q1082J1306J15175J6775j70290j14457
35919b66110J75795L14286J36272q4769j36242j46719k02797j35453P8099J34900
35909a32738p9264k05673J4555K67555J69829r2321q8158J50137K34594O9548
35899C08064q4160r9403r3314r2014O794J43984J36952J3072k5237L2768J792
$$ plain form
35973 156847 115589 169277 396309 503586 291900 -9293 -125026 -129668 -179370 -161185 53930
35962 53930 264989 217799 41768 46244 220124 292343 190917 85827 30169 -92874 -268632
35951 -268632 -319152 -215431 -143164 -189653 -207418 -83577 54842 28520 -127417 -202869 -70852
35940 -70852 165714 286635 204081 76026 112536 286981 361975 221527 19376 -65505
35930 -65505 -50910 -32953 -18910 -3135 -43537 -124619 -113313 1862 18637 -151653 -266110
35919 -266110 -90315 223971 360243 275474 139232 -7487 -210284 -345737 -267638 -132738
35909 -132738 -212002 -417675 -403120 -135565 34264 -58057 -146215 3922 238516 308064
35899 308064 223904 124501 31187 -60827 -54033 89951 226903 239975 214738 247506 249298
35888B49298j29803j59584m1810K1675o1980j19357j3503J43487J92955J41559
35878B22937P0251N386l5527k3918r314p9564j87069j74240j9711J05279Q5867
35867c9623J1006J964L9698M6986K3247J4820L7608Q3889J27224R7220n0653k21345
35855A72041k55856j50709p1887j02494j17567K535J60334J73821M5719m7718
35845a91781k2137N933o9328j37151q930K64395L77562J52747j95473l23762j96233
35834c44158n5905j2585P0700K39524K90095J00937j21674j38350k7104r824q4943
35823i3287q7884k828N0818O4006J06414J09389m2494k31754k07072K3660J74989
35812a36043J02934k2389l2656R724O679J0939P2167R1188j0683j24086j07974
$$ plain form
35888 249298 119495 -40089 -81899 -60224 -122204 -241561 -255064 -111577 81378 222937
35878 222937 293188 298574 263047 239129 229815 150251 -36818 -211058 -230769 -125490 -39623
35867 -39623 -28617 -26653 13045 60031 83278 98098 135706 219595 346819 444039 393386 172041
35855 172041 -83815 -234524 -306411 -408905 -526472 -523937 -363603 -189782 -144063 -191781
35845 -191781 -213918 -207985 -277313 -414464 -423394 -158999 218563 371310 175837 -147925 -344158
35834 -344158 -400063 -412648 -341948 -102424 187671 288608 166934 28584 1480 -8344 -93287
35823 -93287 -181171 -183999 -133181 -69175 37239 146628 104134 -127620 -334692 -311032 -136043
35812 -136043 -33109 -55498 -88154 -78430 -71751 -60812 11355 102543 91860 -32226 -140200
35801a40200n77O2420M4878K309l6775o5290m7249K1443O7708M7828K5830N4545
35789C6870O2182k8618j39335j26696M214J11355J25096J11894J14646O6794o7713
35778B70689j76466j32715K283L7095q4061j96543j50951j9329L9825K7830N7768
35767c24575J16527Q3063j1480J8249J73682J78796j08042m01171l42785r01K51035
35756c67602K49047J46692O9100k1128r8550l5580J22841J31957o7899j92640
35746f3762k3478K35255K30538m9437k90909k79102r2073Q8178J54178O6191j41884
35735a66305l09815k63442m5847R2961J8062r5686q951K29641L43029K18070M8618
35724F0335J9712L0940r7943k67007j90993J46892L85026K34561j40924l40955
$$ plain form
35801 -140200 -140777 -78357 -33479 -31170 -67945 -133235 -180484 -159041 -91333 -43505 -17675 36870
35789 36870 99052 70434 -68901 -195597 -191383 -80028 45068 156962 271608 338402 270689
35778 270689 94223 -38492 -36209 886 -83175 -279718 -430669 -449998 -410173 -382343 -324575
35767 -324575 -208048 -124985 -136465 -118216 55466 234262 126220 -274951 -617736 -618637 -367602
35756 -367602 -118555 28137 97237 76109 -22441 -58021 64820 196777 128878 -63762
35746 -63762 -87240 148015 378553 329116 38207 -240895 -332968 -244790 -90612 -24421 -166305
35735 -166305 -476120 -739562 -785409 -692448 -674386 -770072 -779023 -549382 -206353 11717 60335
35724 60335 80047 110987 13044 -253963 -444956 -298064 86962 321523 180599 -160356
35714a60356k01486R0228K63293K05737J579j54478j28164j1443l0528k14700
35704c40318l04532j20236J45176J99674P2807R446N2967L7428m9238k1050J50913
35693a66963K43440J36735J974L317L6349p1237k58739l04270j16146J67364L24557
35682c619K44727L3817o6074N5289K14175J61007p2329k30177k08835j48465j37721
35671a58205q1540O2792J60123J25042O6919P9555P5935k6627j28008j07989l0457
35660C7540l3215j15876j64066j04894M5435K01803K32296P8303j18369j54593
35650i5636m4487K8076L2806J07025K15898J30102j43926k60260n1747J82058
35640I9909J51766J8153M3497J05770m3640k65878k21703N6891K14186J27869
$$ plain form
35714 -160356 -361842 -271614 -8321 197416 198995 44517 -83647 -95090 -125618 -340318
35704 -340318 -644850 -765086 -619910 -420236 -347429 -337983 -285016 -247588 -296826 -317876 -166963
35693 -166963 76477 213212 215186 218503 254852 183615 -75124 -379394 -495540 -328176 -3619
35682 -3619 241108 274925 208851 264140 478315 639322 566993 336816 127981 -20484 -158205
35671 -158205 -239745 -176953 -16830 108212 175131 254686 330621 303994 175986 67997 37540
35660 37540 4325 -111551 -275617 -380511 -335076 -133273 99023 177326 58957 -95636
35650 -95636 -140123 -112047 -79241 27784 243682 373784 229858 -30402 -82149 99909
35640 99909 251675 269828 313325 419095 375455 109577 -112126 -55235 158951 286820
35630B86820J2927j0762o4095j90930k43738j50688j3180J01065K02491K20528
35620A50438Q4435n0562K2969J71304O3821k60249l74617j13612J76307J99718
35610F9952J19294J56269J69804k4518k22972j24918J38981J78310n8664k43385
35600A58153j89970n9193j2423P429N9023M8525o6141j30112j5285J55015J69802
35589A24823L1943n8672J2248J40736J64024N5387p7786j34595j10752o2823k4419
35578F0114J8472P7710J20860J04884M3177L578K1724M3933m541j05326j58637
35567B25948j24912q5283j08307j27397m8341P3861J02737M3859L2670Q0846L0794
35556I6475j59128k83256j79896K1840J18148J30014J75899J97505Q3055m4023
$$ plain form
35630 286820 299747 288985 224890 33960 -209778 -360466 -373646 -272581 -70090 150438
35620 150438 234873 184311 207280 378584 442405 182156 -192461 -306073 -129766 69952
35610 69952 189246 345515 515319 490801 267829 142911 281892 460202 401538 158153
35600 158153 -31817 -91010 -103433 -96004 -36981 11544 -54597 -184709 -199994 -44979 124823
35589 124823 156766 98094 110342 251078 415102 470489 392703 258108 147356 84533 60114
35578 60114 78586 156296 277156 382040 425217 428795 450519 494452 489911 384585 225948
35567 225948 101036 15753 -92554 -219951 -268292 -194431 -91694 -47835 -15165 65681 96475
35556 96475 -62653 -345909 -525805 -503965 -385817 -255803 -79904 117601 200656 156633
35546A56633K4886J91216J45203j25651k68735r8051J32797J41938J1302l3550
35536B77988J1965K2603O717L2963L7569n7600j48185r6526J9713L2604l1405
35525A08406k6078L1934Q044p3351o5695M938l2951j50017r7180J73230L50987
35514B32267J96795j03740k19442j27377n1517p1266n8651L1421O7931j4473r2344
35503b10396o0242P897J7181K7963J20238J88194P2647j36545j56963P5203K64390
35492B09567J57130r5214j72880n3861J9505k1442J3493J71201J97657m4065k77191
35481A03900j97240M7766Q5121r7340j61459Q830J31757J9805j10254k3319J23504
35470f8929M0219k06996k81800q2759J34945J56802O8591M1469O9832N6713K0557
$$ plain form
35546 156633 181519 372735 517938 392287 123552 25501 158298 300236 311538 277988
35536 277988 289953 312556 319273 352236 389805 332205 184020 87494 107207 139811 108406
35525 108406 82328 114262 122306 48955 -16740 -11802 -44753 -194770 -291950 -118720 232267
35514 232267 429062 325322 105880 -21497 -73014 -144280 -202931 -171510 -103579 -118052 -210396
35503 -210396 -270638 -262741 -245560 -217597 -97359 90835 163482 26937 -130026 -54823 209567
35492 209567 366697 271483 98603 44742 64247 42805 56298 227499 425156 381091 103900
35481 103900 -93340 -45574 39547 -57793 -219252 -210422 -78665 -58860 -169114 -192433 -68929
35470 -68929 -28710 -235706 -517506 -600265 -465320 -308518 -239927 -198458 -128626 -71913 -51356
35459e1356N6519J45460J46113p23j53648j25059O5802J72965J5741k56525l14154
35448b98865p9616J44985Q6646j10830j04910J27945K56473R4111j32537j33540
35438a50138L9632J18434Q156j36463j53830k9695J46007K41519J51268p0484
$$ plain form
35459 -51356 5163 150623 296736 296013 142365 17306 83108 256073 271814 15289 -298865
35448 -298865 -378481 -233496 -146850 -257680 -362590 -234645 21828 115939 -16598 -150138
35438 -150138 -110506 7928 16084 -120379 -274209 -303904 -157897 83622 234890 164406
$$ [...]
##END NTUPLES=NMR SPECTRUM
##END=
