##TITLE=31Pdec_LR-673-H-AK1
 D2O, 24 sc
 22.10.2019
##JCAMPDX= 6.0         $$ Bruker NMR JCAMP-DX V2.0
##DATA TYPE= NMR SPECTRUM
##DATA CLASS= NTUPLES
##ORIGIN= UXNMR, Bruker Analytische Messtechnik GmbH
##OWNER= root
$$ XWIN-NMR		Version 3.5
$$ Tue Oct 22 15:26:39 2019 Russian Standard Time (UT+4h)  she@DPX200
##.OBSERVE FREQUENCY= 81.013821
##.OBSERVE NUCLEUS= ^31P
##.ACQUISITION MODE= SIMULTANEOUS
##.ACQUISITION SCHEME= undefined
##.AVERAGES= 24
##.DIGITISER RES= 17
##SPECTROMETER/DATA SYSTEM= spect
##.PULSE SEQUENCE= zgpg30
##.SOLVENT NAME= DMSO
##.SHIFT REFERENCE= (INTERNAL, DMSO, 0, 182.463)
##AUDIT TRAIL= $$ (NUMBER, WHEN, WHO, WHERE, WHAT)
$$ ##TITLE= Audit trail, XWIN-NMR		Version 3.5
$$ ##JCAMPDX= 5.01
$$ ##ORIGIN= Bruker BioSpin GmbH
$$ ##OWNER= she
$$ F:/spectra/data/she/nmr/P31/1/pdata/1/auditp.txt
$$ ##AUDIT TRAIL=  $$ (NUMBER, WHEN, WHO, WHERE, WHAT)
(   1,<2019-10-22 15:25:03.48 +0400>,<she>,<DPX200>,
      <created by zg, POWCHK disabled, PULCHK disabled
       configuration hash MD5:
       00 E9 B6 7A A2 85 ED C7 34 08 36 98 17 FE 4E 26
       data hash MD5: 32K
       D4 82 88 D6 87 AC 91 EA F6 F2 49 71 F8 39 08 B2>)
(   2,<2019-10-22 15:25:06.48 +0400>,<she>,<DPX200>,
      <Start of raw data processing
       efp BC_mod = 2 LB = 1 FT_mod = 6 PKNL = 1 PHC0 = -831.6592 PHC1 = 369.4006 SI = 64K 
       data hash MD5: 64K
       CF 09 15 F3 08 2D 3C AC 44 8D 44 8B 9B FE 81 13>)
(   3,<2019-10-22 15:25:25.96 +0400>,<she>,<DPX200>,
      <pk PHC0 = -94.97543 PHC1 = 141.8 
       data hash MD5: 64K
       17 F9 92 72 EE 76 FC A0 69 0E 16 2C 10 C3 34 2F>)
$$ ##END=
$$ 
$$ hash MD5
$$ 1F E2 66 0A 25 89 8D FF 89 9A C3 E5 F6 F1 2B 95
##$RELAX= 
##$RELAX= 
##$RELAX= 
##$RELAX= 
##$RELAX= 
##$RELAX= 
##$RELAX= 
##$RELAX= 
$$ Bruker specific parameters
$$ --------------------------
##$DU= <F:/spectra>
##$EXPNO= 1
##$NAME= <P31>
##$PROCNO= 1
##$TYPE= <nmr>
##$USER= <she>
##$AMP= (0..31)
100 100 100 100 100 100 100 100 100 100 100 100 100 100 100 100 100 100 
100 100 100 100 100 100 100 100 100 100 100 100 100 100 
##$AQSEQ= 0
##$AQ_mod= 1
##$AUNM= <au_zg>
##$AUTOPOS= <>
##$BF1= 81.014009
##$BF2= 200.13
##$BF3= 200.13
##$BF4= 200.13
##$BF5= 200.13
##$BF6= 200.13
##$BF7= 200.13
##$BF8= 200.13
##$BYTORDA= 1
##$CFDGTYP= 0
##$CFRGTYP= 5
##$CHEMSTR= <none>
##$CNST= (0..31)
1 1 145 1 1 1 1 1 1 1 1 1 1 1 1 1 1 1 1 1 1 1 1 1 1 1 1 1 1 1 1 1 
##$CPDPRG= <waltz16>
##$CPDPRG1= <>
##$CPDPRG2= <waltz16>
##$CPDPRG3= <>
##$CPDPRG4= <mlev>
##$CPDPRG5= <mlev>
##$CPDPRG6= <mlev>
##$CPDPRG7= <mlev>
##$CPDPRG8= <mlev>
##$CPDPRGB= <>
##$CPDPRGT= <>
##$D= (0..31)
0 1 0 0 0 0 0 0 0 0 0 0.03 2e-05 3e-06 0 0 0 0 0 0 0 0 0 0 0 0 0 0 0 0 
0 0 
##$DATE= 1571743502
##$DBL= (0..7)
120 120 120 11 120 120 24 19 
##$DBP= (0..7)
150 150 150 150 150 150 150 150 
##$DBP07= 0
##$DBPNAM0= <>
##$DBPNAM1= <>
##$DBPNAM2= <>
##$DBPNAM3= <>
##$DBPNAM4= <>
##$DBPNAM5= <>
##$DBPNAM6= <>
##$DBPNAM7= <>
##$DBPOAL= (0..7)
0.5 0.5 0.5 0.5 0.5 0.5 0.5 0.5 
##$DBPOFFS= (0..7)
$$ [...]
##$SUBNAM2= <"">
##$SUBNAM3= <"">
##$SUBNAM4= <"">
##$SUBNAM5= <"">
##$SUBNAM6= <"">
##$SUBNAM7= <"">
##$SUBNAM8= <"">
##$SUBNAM9= <"">
##$SW= 369.568048894756
##$SWIBOX= (0..15)
0 1 3 0 0 0 0 0 0 0 0 0 0 0 0 0 
##$SW_h= 29940.119760479
##$TD= 32768
##$TD0= 1
##$TE= 0
##$TE2= 300
##$TE3= 300
##$TEG= 300
##$TL= (0..7)
0 120 53 12 22 120 120 120 
##$TP= (0..7)
150 150 150 150 150 150 150 150 
##$TP07= 0
##$TPNAME0= <>
##$TPNAME1= <>
##$TPNAME2= <>
##$TPNAME3= <>
##$TPNAME4= <>
##$TPNAME5= <>
##$TPNAME6= <>
##$TPNAME7= <>
##$TPOAL= (0..7)
0.5 0.5 0.5 0.5 0.5 0.5 0.5 0.5 
##$TPOFFS= (0..7)
0 0 0 0 0 0 0 0 
##$TUNHIN= 0
##$TUNHOUT= 0
##$TUNXOUT= 0
##$USERA1= <user>
##$USERA2= <user>
##$USERA3= <user>
##$USERA4= <user>
##$USERA5= <user>
##$V9= 5
##$VALIST= <valist>
##$VCLIST= <CCCCCCCCCCCCCCC>
##$VD= 0
##$VDLIST= <DDDDDDDDDDDDDDD>
##$VPLIST= <PPPPPPPPPPPPPPP>
##$VTLIST= <TTTTTTTTTTTTTTT>
##$WBST= 1024
##$WBSW= 4
##$XGAIN= (0..3)
0 0 0 0 
##$XL= 0
##$YL= 0
##$YMAX_a= 12728
##$YMIN_a= -12913
##$ZGOPTNS= <>
##$ZL1= 120
##$ZL2= 120
##$ZL3= 120
##$ZL4= 120
##$ABSF1= 0
##$ABSF2= 0
##$ABSG= 0
##$ABSL= 0
##$ALPHA= 0
##$AQORDER= 0
##$ASSFAC= 0
##$ASSFACI= 0
##$ASSFACX= 0
##$ASSWID= 0
##$AUNMP= <proc_1d>
##$AZFE= 0.1
##$AZFW= 0.5
##$BCFW= 0
##$BC_mod= 2
##$BYTORDP= 0
##$COROFFS= 0
##$CY= -3
##$DATMOD= 1
##$DC= 0
##$DFILT= <>
##$DTYPP= 0
##$F1P= 0
##$F2P= 0
##$FCOR= 1
##$FTSIZE= 65536
##$FT_mod= 6
##$GAMMA= 0
##$GB= 0
##$INTBC= 1
##$INTSCL= 5.30512e-09
##$ISEN= 30
##$LB= 1
##$LEV0= 0
##$LPBIN= 0
##$MAXI= 10000
##$MC2= 0
##$MEAN= 0
##$ME_mod= 0
##$MI= 50
##$NCOEF= 0
##$NC_proc= -5
##$NLEV= 6
##$NOISF1= 182.463
##$NOISF2= 159.3651
##$NSP= 0
##$NTH_PI= 0
##$NZP= 0
##$OFFSET= 182.463
##$PC= 4
##$PHC0= -926.6346
##$PHC1= 511.2006
##$PH_mod= 1
##$PKNL= yes
##$PPARMOD= 0
##$PSCAL= 0
##$PSIGN= 0
##$REVERSE= no
##$SF= 81.0140089999434
##$SI= 65536
##$SIGF1= 159.3651
##$SIGF2= -187.1042
##$SINO= 113.3802
##$SIOLD= 16384
##$SREGLST= <1H.CDCl3>
##$SSB= 0
##$STSI= 65536
##$STSR= 0
##$SW_p= 29940.119760479
##$SYMM= 0
##$S_DEV= 0
##$TDeff= 32768
##$TDoff= 0
##$TI= <>
##$TILT= no
##$TM1= 0
##$TM2= 0
##$TOPLEV= 0
##$USERP1= <user>
##$USERP2= <user>
##$USERP3= <user>
##$USERP4= <user>
##$USERP5= <user>
##$WDW= 1
##$XDIM= 65536
##$YMAX_p= 380697603
##$YMIN_p= -11909021
$$ End of Bruker specific parameters
$$ ---------------------------------
##NTUPLES= NMR SPECTRUM
##VAR_NAME=  FREQUENCY,     SPECTRUM/REAL,   SPECTRUM/IMAG
##SYMBOL=    X,             R,               I
##VAR_TYPE=  INDEPENDENT,   DEPENDENT,       DEPENDENT
##VAR_FORM=  AFFN,          ASDF,            ASDF
##VAR_DIM=   65536,         65536,           65536
##UNITS=     HZ,            ARBITRARY UNITS, ARBITRARY UNITS
##FACTOR=    0.456856943014862, 1,           1
##FIRST=     14782.0589164792, 0,            0
##LAST=      -15158.0608439998, 0,           0
##MIN=       -15158.0608439998, -11909021,   0
##MAX=       14782.0589164792, 380697603,    0
$$ Real data points
##PAGE= N=1
##DATA TABLE= (X++(R..R)), XYDATA
$$ [...]
42433h16181l53977l46532J95702N80531L75248J5782l3656J31107L48130O54032
$$ -816181 -1170158 -1516690 -1320988 -740457 -365209 -349427 -383083 -251976 96154 750186
42423G50186P99221L11574o02216r57891k53506P43011R28095J74049o78810q23099
$$ 750186 1549407 1860981 1258765 300874 47368 790379 1718474 1892523 1213713 390614
42413C90614j72693O94978J058533O91321N4735l06329m04840n11949m93199p9881
$$ 390614 217921 912899 1971432 2662753 2717488 2411159 2006319 1494370 1001171 921290
42403I21290L49570P6743p87561j245090p50105J20655O03522O26276M29784O8009
$$ 921290 1270860 1347603 560042 -685048 -1435153 -1314498 -710976 -84700 345084 413093
42393D13093k63062j05398M97340P41873J82708m63518l25523K99604M22430j72846
$$ 413093 150031 44633 541973 1283846 1466554 1003036 677513 977117 1399547 1226701
42383A226701p63427q30090n70622k70148J18412N94403Q65862P47826M69681
$$ 1226701 463274 -366816 -937438 -1207586 -1089174 -494771 371091 1118917 1588598
42374A588598L61280M09852K85604k27668q61775r98318l50710N27041P39864
$$ 1588598 1949878 2359730 2645334 2417666 1555891 557573 206863 733904 1473768
42365A473768J14879o19524q10153n46600j77695K32864N97880N49916L1100l53416
$$ 1473768 1588647 969123 158970 -387630 -565325 -332461 265419 815335 846435 493019
42355D93019j58140J81438P8531k32619k11460m2292k21064m63682j24017M68001
$$ 493019 334879 516317 594848 362229 150769 108477 -112587 -576269 -700286 -232285
42345b32285L13699n23662p78831L0491P12272K16048p09239o77459K51832Q17772
$$ -232285 81414 -442248 -1221079 -1190588 -478316 -262268 -971507 -1648966 -1397134 -579362
42335e79362N18825J30549K40097L67186l2544n07133k49482N89370R69458L62113
$$ -579362 -60537 70012 310109 677295 644751 137618 -111864 477506 1446964 1809077
42325A809077n20731o93549j82460J59554m6434k34151J16516O25160N90238l289
$$ 1809077 1288346 594797 412337 571891 525457 291306 407822 1032982 1623220 1619931
42315A619931o00148q95538r35150o30273J01359P87317P62079J66121j41015
$$ 1619931 1019783 124245 -810905 -1441178 -1339819 -552502 209577 375698 234683
42306B34683J67527M52698J99784j91349j38719K27038M17214L31686J34675j71758
$$ 234683 402210 854908 1054692 863343 724624 951662 1368876 1700562 1835237 1663479
42296A663479n19600n21215j0051M88643L89235j21218m24228l88944l70859m78363
$$ 1663479 1143879 622664 612613 1101256 1490491 1369273 945045 556101 185242 -293121
42286b93121m37068j32545J94681K87204R2727k29246k99778J60311P31624N25753
$$ -293121 -730189 -862734 -668053 -380849 -288122 -517368 -817146 -656835 74789 600542
42276F00542n39357j302418q63074J13342M92657M28025P80709J283941Q95696
$$ 600542 61185 -1241233 -2104307 -1990965 -1498308 -1070283 -289574 994367 1890063
42267A890063j26804l10913N24111O81730o59541j833407j142294M79127R23565
$$ 1890063 1763259 1452346 1976457 2658187 1998646 165239 -977055 -497928 425637
42258D25637M9967m98918p8496L03345O2905p3682L60660O94701M22658Q2878
$$ 425637 475604 -23314 -101810 201535 264440 190758 551418 1246119 1668777 1751655
42248A751655J28121O0953m89282q25661k71834N80355P16432K11579j03243m1424
$$ 1751655 1879776 1940729 1451447 625786 353952 934307 1650739 1862318 1759075 1717651
42238A717651r3272l35231l41156r7023n6029k62557k88536r0091n3643r3465
$$ 1717651 1624379 1289148 947992 850969 794940 532383 243847 153756 100113 6648
42228F648L36695J066162J042937j10460j242795j123565r9809N25206K97032
$$ 6648 343343 1409505 2452442 2341982 1099187 -24378 -124187 401019 698051
42219F98051j09158j37376O2038K55536M57434M98158M3441o87884r07392l23861
$$ 698051 588893 451517 513555 769091 1226525 1724683 1768124 1080240 172848 -151013
42209a51013L49655L81096L964r9340J25424J92918R797J1753L59407O19788M28436
$$ -151013 198642 579738 583702 484362 609786 802704 812501 824254 1183661 1803449 2231885
42198B231885j0331l14259m14519l83623j35663L19451N77836K64091l44477n90059
$$ 2231885 2221554 1907295 1492776 1109153 973490 1292941 1870777 2134868 1790391 1200332
42188A200332l57531k32227n51706p96462l50380M84147Q35270N07723K06656
$$ 1200332 842801 610574 58868 -737594 -1087974 -603827 231443 739166 945822
42179I45822L90438N74156J76523m85945o57961k66823R4848J46403J52998J85214
$$ 945822 1336260 1910416 2086939 1600994 943033 676210 771058 917461 1070459 1255673
42169A255673q3272o30373q61964n04939q5206m8865k7264L92973P33237L14022
$$ 1255673 1172401 542028 -319936 -824875 -910081 -958946 -986210 -593237 140000 454022
42159D54022m77054o02590L3613M29879O1994l87719k70267j7311k81160p23724
$$ 454022 -23032 -625622 -592009 -162130 -100136 -487855 -758122 -775433 -1056593 -1780317
42149a780317n14231L24918Q97379O67040M0473l16189k14064Q6899K41068O7348
$$ -1780317 -2294548 -1969630 -1072251 -405211 -364738 -680927 -894991 -808092 -567024 -499676
42139d99676k83476m04996j10439K68360L32313J94150K23286L77030K89307l9180
$$ -499676 -783152 -1188148 -1298587 -1030227 -697914 -503764 -280478 96552 385859 346679
42129C46679j90575j9657J31073K4360j50118j91180j52815m5491K30254M71184
$$ 346679 156104 136447 267520 291880 141762 -49418 -202233 -247724 -17470 453714
42119D53714K48036l34568n37148l2682N12344M02013r1140l22719l60846o48848
$$ 453714 701750 367182 -169966 -202648 309696 711709 620569 297850 -62996 -711844
42109g11844r41312n67881L19337P55543L83735l2702J68619O28214P11104M58261
$$ -711844 -1653156 -2221037 -1901700 -1146157 -762422 -795124 -626505 1709 712813 1171074
42099A171074K25769l7747m98064q59837p69981m83429m45398m61179k6852O52444
$$ 1171074 1396843 1359096 861032 1195 -768786 -1252215 -1697613 -2158792 -2185644 -1533200
42089a533200P87849K02842l63854l32609N8763M34402Q66601J321805J226741
$$ -1533200 -745351 -542509 -906363 -1238972 -1180209 -745807 120794 1442599 2669340
42080B669340L05033o42748o40508M2268K63640k71632o48578l10279J1080m53749
$$ 2669340 2974373 2331625 1691117 1733385 1997025 1725393 1076815 766536 777616 323867
42070C23867j106895p59660N42486J437946J017696j24337q23318o79005j32345
$$ 323867 -783028 -1542688 -1000202 437744 1455440 1331103 507785 -171220 -303565
42061c03565K83443L46824J13477j42211j25324J05830J85493L1693K7290L28290
$$ -303565 -20122 326702 440179 297968 172644 278474 463967 495660 522950 851240
42051H51240M29242q8681p35988p07567j11805J46600k69557o53247l71735K43733
$$ 851240 1280482 1191801 455813 -251754 -363559 -216959 -486516 -1139763 -1511498 -1267765
42041a267765N42091M97123M44151L13570j61243o61429m70542M29669J081767
$$ -1267765 -725674 -228551 215600 529170 367927 -293502 -764044 -334375 747392
42032G47392P29173j35171l84159K23779O86384J18574r51902j173756j79718
$$ 747392 1476565 1341394 957235 1181014 1867398 1985972 1034070 -139686 -319404
42023c19404Q32874O57124l11933o79414j2039O59808M32635k27501l42205J11567
$$ -319404 513470 1170594 858661 179247 167208 827016 1259651 1032150 689945 801512
42013H01512L37479J9700l02026j68603J49779J55912j80098m99396n41984l08599
$$ 801512 1138991 1158691 856665 688062 837841 993753 813655 314259 -227725 -536324
42003e36324P8737M42543N62729L33101o6150k73818j17066J60293J78437k5187
$$ -536324 -457587 -15044 547685 880786 814636 540818 423752 584045 762482 737295
41993G37295M3561N83190R54159M13975o59813r88599r1310R40454Q92503L8642
$$ 737295 780856 1364046 2318205 2732180 2072367 1083768 992458 1932912 2825415 2864057
41983B864057m62165l20565k75379o54226q57794m90807n1533m5429j74599L0591
$$ 2864057 2401892 2081327 1805948 1151722 293928 -196879 -248412 -293841 -468440 -437849
41973d37849L78455M42385L42954M03491L65374k48737j093127j150409j34344
$$ -437849 -59394 382991 725945 1129436 1494810 1246073 152946 -997463 -1131807
41964a131807R17577Q65981j27574q90263p12868k5534L89042L35980J06078j61358
$$ -1131807 -214230 651751 524177 -366086 -1078954 -1104488 -715446 -379466 -273388 -434746
41954d34746n19564p61650m90137K45730Q51319R29378O93966M21075K0001m58144
$$ -434746 -954310 -1715960 -2206097 -1960367 -1109048 -179670 514296 935371 955372 497228
41944D97228m73853J84638P24964L38468m77629n80702L6673L01473q1326j71635
$$ 497228 23375 208013 932977 1271445 793816 213114 249787 551260 469934 298299
41934B98299M06922N81564m04000j474217j146754K69935J144786P63760q4855
$$ 298299 705221 1286785 882785 -591432 -1738186 -1468251 -323465 440295 355440
41925C55440n34178m97845j44369M15009P78357N07247q4946j93279K69625N09117
$$ 355440 -178738 -676583 -820952 -405943 372414 879661 794715 601436 871061 1380178
41915A380178Q4199m78606n71262k59702J44337N24371O19000J5114j013274j370158
$$ 1380178 1464377 985771 414509 154807 299144 823515 1442515 1457629 444355 -925803
41905i25803m93903P06453R66824K80066l37376l43173j15199m8839l0373Q8365
$$ -925803 -1419706 -713253 253571 533637 196261 -146912 -262111 -310950 -341323 -252958
41895b52958J44705J0365j67642k46254k50195j44810J84663N89132O60489K89516
$$ -252958 -108253 -97888 -265530 -511784 -761979 -906789 -722126 -132994 527495 817011
41885H17011r4895j01839O4572n0223m08337m72593K4035O31965O98400J55420
$$ 817011 722116 620277 684849 634626 226289 -246304 -222269 409696 1108096 1263516
41875A263516m26821n22063j76061J67789J74146j44150n26522o64714m20512
$$ 1263516 836695 314632 138571 306360 480506 336356 -190166 -854880 -1275392
41866a275392J0576K49775J73077N9542J57329L11455K66125J04737K9880o8147
$$ -1275392 -1264816 -1015041 -841964 -782422 -625093 -313638 -47513 57224 87104 18957
41856A8957l27277l94224J19168P14893M24860o27940j042058q6235J044693Q38887
$$ 18957 -308320 -702544 -583376 131517 556377 -71563 -1113621 -1199856 -155163 683724
41846F83724l24786p69211j2103O73383L22356l93195m52904m6033N706l28452
$$ 683724 358938 -410273 -422376 251007 573363 180168 -272736 -318769 -313063 -641515
41836f41515l97998l7908K73374K96704K96119M15507M56635L50338K69323J80110
$$ -641515 -1039513 -1077421 -804047 -507343 -211224 204283 660918 1011256 1280579 1460689
41826A460689j62001o37807p29590k72488K40870L36344Q9386k35187n59566p05742
$$ 1460689 1298688 660881 -68709 -341197 -100327 236017 325403 90216 -469350 -1175092
41816a175092k93469N88022J084454N76990l47917n97106l0433M80945L70955
$$ -1175092 -1468561 -880539 203915 780905 432988 -164118 -194551 286394 657349
41807F57349K2402n469K44636L47987N1199n53082j046587q66252Q6651J036620
$$ 657349 679751 674282 918918 1266905 1318104 765022 -281565 -1147817 -1061166 -24546
41797b4546J082057L53543k08503k27869k20384m27718l36141K23676N22947J75471
$$ -24546 1057511 1411054 1202551 974682 754298 326580 -9561 214115 737062 912533
41787I12533j4306O15169J213755N82703q24329j380958n58717N47640R49094
$$ 912533 898227 1513396 2727151 3309854 2485525 1104567 545850 1093490 2042584
41778B042584P82293M27469j93634r98898j397082j089663n01756j6608M89002
$$ 2042584 2824877 3252346 3058712 2059814 662732 -426931 -928687 -945295 -456293
41769d56293R64063Q54480K0753p10730n68296J20741N22029M56662L28592K79513
$$ -456293 507770 1362250 1383003 672273 103977 224718 746747 1203409 1532001 1811514
41759A811514J03283k06233m16388m60034m33318l07237j4524K92572L70606J54927
$$ 1811514 1914797 1708564 1292176 832142 398824 91587 77063 369635 740241 895168
41749H95168k68941p35613r17980n41562J43830N31411M83572M70575O62852N65636
$$ 895168 626227 -109386 -1027366 -1568928 -1425098 -893687 -410115 60460 723312 1288948
41739A288948l3654m81670k46271J63081K8753l73123k89822K01444L60340J5336
$$ 1288948 1255294 773624 527353 690434 719187 346064 56242 257686 618026 633362
41729F33362l02413l25498k66843j53823J78135M56976K12807l30897m69608j69996
$$ 633362 330949 5451 -261392 -415215 -237080 219896 432703 101806 -367802 -537798
41719e37798r9149l88143l60182K08390N35295N8259n99869n24596K26464Q59068
$$ -537798 -636947 -1025090 -1385272 -1176882 -641587 -583328 -1183197 -1707793 -1481329 -622261
41709f22261Q95365M64605q2648l87517k34630J35764J98183j01271k09914J17631
$$ -622261 273104 737709 655061 267544 32914 168678 366861 265590 55676 173307
41699A73307L60809J42216l2263L73522Q44415M67238n79976j110865n39905L87228
$$ 173307 534116 676332 644069 1017591 1862006 2329244 1749268 638403 98498 485726
41689D85726O81154K80270j85262l15503k26866j83823l02753n25424o60211n16848
$$ 485726 1166880 1447150 1261888 946385 719519 535696 232943 -292481 -952692 -1469540
41679a469540j60662M7353j49706m88686l83918L52029J138593J198185M73022
$$ -1469540 -1630202 -1582849 -1732555 -2221241 -2605159 -2253130 -1114537 83648 556670
41670E56670k77896l77720L2941L38410K63139L7581o5933N687J91339L30815
$$ 556670 278774 -98946 -66005 272405 535544 573125 507192 512879 704218 1035033
41660A035033J75875k40716l88888J19281P86869P45555K916n30255l81560j04968
$$ 1035033 1210908 970192 581304 700585 1487454 2233009 2235925 1705670 1324110 1219142
41650A219142k17941l52100l0338L72067J91018m16651o76037k82009L60519Q03718
$$ 1219142 1001201 649101 618763 990830 1181848 765197 89160 -192849 167670 971388
41640I71388Q66066M57862k61198o65439k69188M65379N62902j67932q84334q79227
$$ 971388 1837454 2295316 2034118 1368679 1099491 1564870 2127772 1959840 1075506 196279
41630A96279m01699p4367k7586J5162J44469J68175j2096k10561j72691R0718
$$ 196279 -205420 -279787 -307373 -292211 -147742 20433 8337 -202224 -374915 -284197
41620b84197K37447M738k94796m7799O61851Q34094q7009j076677o98187P44265
$$ -284197 -46750 -42012 -336808 -384607 277244 1111338 1024329 -52348 -750535 -6270
41610f270J382450L69523q96106q06650K35114O80966J79876k69074j87722k07424
$$ -6270 1376180 1745703 849597 42947 278061 959027 1138903 869829 682107 474683
41600D74683o23629o99853p067O08577K65417m80016m08501N07623J073728O35283
$$ 474683 -148946 -848799 -855866 -247289 18128 -461888 -870389 -362766 710962 1346245
41590A346245j11891l12916j29371k24170o13907o66000p3349O76671Q81932M15172
$$ 1346245 1234354 921438 792067 567897 -46010 -712010 -785359 -108688 773244 1188416
41580A188416j77611k98858N6749L66140K88881O6122J1454o4505m37732p36225
$$ 1188416 1010805 711947 768696 1134836 1423717 1489839 1501293 1436788 999056 262831
41570B62831l74473L16890L25315m30744p40195N5702Q54266M15329o06146n86300
$$ 262831 -111642 205248 530563 99819 -640376 -584674 269592 684921 78775 -507525
41560e07525N31937J137539M06730o19430q14487m83228l80306l32740J67191
$$ -507525 24412 1161951 1568681 949251 134764 -348464 -728770 -1061510 -894319
41551h94319P53140O47683m7670m83548l21833m7075n2902j29458K2661L00981
$$ -894319 -141179 506504 458834 -24714 -346547 -393622 -446524 -575982 -553321 -252340
41541b52340M16889K90946Q1114l7813n8171j24175k74339k62563J29697O35556
$$ -252340 164549 455495 536609 498796 440625 316450 42111 -220452 -90755 544801
41531E44801O99505J67727n55948j018967r79280l06090P13882J089321J09094
$$ 544801 1244306 1412033 856085 -162882 -1142162 -1448252 -734370 354951 464045
41522D64045j287979j293031K40574J336437O97002l87176j36999R07389Q85085
$$ 464045 -823934 -2116965 -1876391 -539954 157048 -230128 -367127 540262 1425347
41513A425347l11595r20357j36622Q06953P23791M1740l19988l48622m52472n40176
$$ 1425347 1113752 193395 56773 863726 1587517 1629257 1309269 960647 508175 -32001
41503c2001l49271l9431J34087K12158K00335p4219m32328l10508L51045Q02818
$$ -32001 -381272 -420703 -286616 -74458 125877 51658 -380670 -691178 -340133 462685
41493D62685M84436k23883o28894n62301k35950J78899M50408L12768k3642P1873
$$ 462685 947121 723238 94344 -467957 -703907 -525008 -74600 238168 214526 286399
41483B86399P06311J136344Q01147J20728k06007j69055j91458l67181m99870
$$ 286399 992710 2129054 2930201 3050929 2844922 2675867 2484409 2117228 1617358
41474A617358n47973n49110m04274j28388P277q9584j27251N2836K02207J92792
$$ 1617358 1069385 520275 116001 -12387 -5110 -94694 -221945 -169109 33098 225890
41464B25890K79787N02635M29968p1287m28826k17763J92887L59164M45079N81432
$$ 225890 505677 1008312 1438280 1366993 938167 720404 913291 1272455 1717534 2298966
41454B298966L00554n74976j181175p44652R4484J78392l94024n73058j32475
$$ 2298966 2599520 2024544 843369 98717 193201 371593 -22431 -595489 -727964
41445g27964J57210M3757J40886N73951N51487k56613r85735q17209j05220L48583
$$ -727964 -570754 -526997 -386111 187840 739327 482714 -503021 -1320230 -1425450 -1076867
41435a076867M26461M39657L40015n5550m10329j81522N12430R24764O18280m5664
$$ -1076867 -650406 -210749 129266 73716 -336613 -518135 -5705 919059 1537339 1491675
41425A491675m42913m02648k20933j33547m4275J44362J80471k00326o56376m96345
$$ 1491675 1048762 646114 425181 291634 247359 391721 572192 371866 -284510 -780855
41415g80855K52131O26496N5713o39686l20337P52644J207874N14064l31914l12924
$$ -780855 -528724 97772 153485 -486201 -806538 -53894 1153980 1668044 1336130 1023206
41405A023206K70206M61298L6415l78992k78553J67817M57921L32407j9881k25632
$$ 1023206 1293412 1754710 1791125 1412133 1133580 1301397 1759318 2091725 2071844 1846212
41395A846212j91956k12384m71837o49053l60096J53919K69900j11433m19231
$$ 1846212 1654256 1441872 970035 320982 -39114 114805 384705 273272 -145959
41386a45959k46014J74819M61975N67242N60941L99772J85190K50869O48108Q38965
$$ -145959 -391973 -217154 244821 812063 1373004 1772776 1957966 2208835 2856943 3695908
41376C695908K84145p83542j469645j121044k3609Q02415N57200m94921j238214
$$ 3695908 3980053 3196511 1726866 605822 582213 1384628 1941828 1446907 208693
41367B08693r01452J17624Q05380O65648J9712n34695n59721M9683Q41394J012929
$$ 208693 -692759 -575135 230245 895893 915605 380910 -178811 -129128 712266 1725195
41357A725195L71529k22153p460M57781J19484q17750j090910l24782M10556K49499
$$ 1725195 2096724 1874571 1867111 2324892 2444376 1626626 535716 210934 621490 870989
41347H70989l55248n85336l59413r692K94162L55340j0443l85972r0114N71089
$$ 870989 515741 -69595 -429008 -438700 -144538 210802 200359 -185613 -275727 295362
41337B95362M62120n36945j074448l76200N40608N98033K92620M30673M93847
$$ 295362 757482 220537 -853911 -1230111 -689503 -91470 201150 631823 1125670
41328A125670k30616r47782n29508L88499L52342m05164l89220M93570P77452
$$ 1125670 895054 -52728 -582236 -193737 158605 -246559 -635779 -142209 635243
41319F35243L0491m50346L3544M83340J31480k77809m9931J64444k86337p34423
$$ 635243 665734 215388 248932 732272 863752 585943 536012 700456 414119 -320304
41309c20304l94577K08729K31285P227L01159Q01897O54883k2248m01925l63208
$$ -320304 -714881 -506152 -274867 -267640 33519 835416 1490299 1468051 1066126 702918
41299G02918m52705o63464m34661J72057L99268M4427j62140K81471Q50775P32826
$$ 702918 250213 -413251 -847912 -675855 -276587 -232160 -394300 -112829 737946 1470772
41289A470772j10666r37600j029375l37077N15108Q23484M74377o5670m06550
$$ 1470772 1360106 422506 -606869 -943946 -428838 394646 869023 803353 396803
41280C96803n49268n14898k13158J18006K736l89155k08851O74480J093603K52866
$$ 396803 -152465 -667363 -880521 -762515 -759779 -1148934 -1357785 -683305 410298 663164
41270F63164q26581p07815K27831L94061m49937q78029j57917O47744M84748j34598
$$ 663164 -163417 -871232 -643401 -249340 -699277 -1577306 -1735223 -1087479 -602731 -737329
41260g37329j81128L13657O20917N19702L00331J01867k7168J37306N61598O95403
$$ -737329 -918457 -604800 16117 535819 836150 938017 910849 1048155 1609753 2305156
41250B305156K44053k52723k25961k634k38066q09749j017991o37651p8924L17337
$$ 2305156 2549209 2296486 2070525 2067891 1829825 1020076 2085 -635566 -714490 -397153
41240c97153N15082M77507K17855J4228M9062L1027l00694n72610l08200J93202
$$ -397153 117929 595436 813291 827519 876581 907608 606914 34304 -273896 -80694
41230h0694K36615j73834l77200j15195J92201K07293O259l15414o52133n67911
$$ -80694 155921 -17913 -395113 -510308 -318107 -110814 -104555 -419969 -1072102 -1640013
41220a640013K22812J080566J046810K67336j75076L4814N0542n04178p61027
$$ -1640013 -1417201 -336635 710175 977511 802435 837249 887791 383613 -377414
41211c77414j34597N20549K30056n33486o80159j98574J11106O8224R7858J59389
$$ -377414 -512011 8538 238594 -294892 -975051 -1173625 -1062519 -994295 -896437 -737048
41201g37048j00383l42352P7277P76920O82736j76514n08877K10926Q02902J90729
$$ -737048 -837431 -1179783 -1102506 -325586 357150 180636 -328241 -117315 685587 876316
41191H76316q94315j008842j16891M85283J03568n12444l86277L70885Q21206
$$ 876316 -17999 -1026841 -1143732 -658449 -554881 -1067325 -1453602 -1082717 -261511
41182b61511M25410l37558n56248N3321P98783P97528j1169q64292j114808q40075
$$ -261511 163899 -173659 -729907 -676586 122197 919725 908556 44264 -1070544 -1910619
41172a910619m74273k08044M6756L35154N22676M22870L8977k56915K1764P85011
$$ -1910619 -2384892 -2592936 -2546180 -2211026 -1688350 -1265480 -1226503 -1483418 -1461654 -676643
41162f76643J190329O35056k98113n55070j21435O8924k36402j87904N58749R79685
$$ -676643 513686 1148742 850629 295559 174124 243048 6646 -181258 377491 1357176
41152A357176K64534o97255n54730M22435P89400J27377n42859n34214l61732
$$ 1357176 1621710 924455 369725 792160 1581560 1708937 1166078 631864 270132
41143B70132n31991o37415k30864L00599L98145J99075J12715Q4731q7650j85518
$$ 270132 -261859 -899274 -1130138 -829539 -431394 -232319 -119604 -34873 -122523 -308041
41133c08041K4279J95744r1216n12073l96922K08743N83929L90203L1876p3140
$$ -308041 -283762 -88018 -179234 -691307 -1088229 -879486 -295557 94646 126522 53382
41123E3382M5253K61976N36024N77021N558q41429r36791P3325J080814Q12480
$$ 53382 98635 360611 896635 1473656 1479214 637785 -299006 -225681 855133 1667613
41113A667613m14547j057414l90720O53519Q72567K53625l76681n59271m46808
$$ 1667613 1253066 195652 -195068 458451 1331018 1584643 1207962 648691 201883
41104B01883j94380K11565N83211N72614J92225j16036o5551J34560J49060m9044
$$ 201883 7503 219068 802279 1374893 1567118 1451082 1385531 1520091 1669151 1620107
41094A620107k60633l49229k78414k1721L84754P46379P67919K56129o23429j239071
$$ 1620107 1359474 1010245 731831 710110 1094864 1841243 2609162 2865291 2241862 1002791
41084A002791r07278K71647J180162P81014n52481j342624q02602K27750M94799
$$ 1002791 95513 367160 1547322 2328336 1775855 433231 -369371 -141621 353178
41075C53178k1982k86675K04924P40895M72668l47188o53589K9961Q96624P82331
$$ 353178 331196 44521 249445 990340 1463008 1115820 462231 492192 1388816 2171147
41065B171147l84492j422571j289872k78862N02364N45119K88123J77656R8135
$$ 2171147 1786655 364084 -925788 -1204650 -702286 -157167 130956 308612 406747
41056D06747p9696o8328K78859M85224Q1908n84387p28740j60224N46826Q27357
$$ 406747 327051 258723 537582 1022806 1104714 520327 -208413 -368637 178189 1005546
41046A005546O33907K05347k60292o28230p94619p20205m08016P7151M94587N46316
$$ 1005546 1639453 1844800 1584508 956278 161659 -558546 -966562 -889411 -394824 151492
41036A51492K64990M1171P9664J21274o6081k77034k75192k34477l39196k95073
$$ 151492 416482 457653 537317 658591 592510 315476 40284 -194193 -533389 -828462
41026h28462K06680P92472P88835J78694l98559n36870m20248l35775l41489m03990
$$ -828462 -621782 170690 959525 1138219 739660 202790 -217458 -553233 -894722 -1298712
41016a298712m20282j66688L50192O55691M17890O4486J53188L70248n75p29491
$$ -1298712 -1718994 -1885682 -1535490 -879799 -461909 -397423 -244235 126013 125438 -604053
41006f04053p74928Q9727P93115M91538l04278o30995l41316J04226M61741O83576
$$ -604053 -1378981 -1289254 -496139 -4601 -308879 -939874 -1281190 -1176964 -715223 -31647
40996c1647N86954J75858r7238N6074K63610J19917j20241n3716J01151n5152
$$ -31647 555307 731165 633927 690001 953611 1073528 953287 899571 1000722 945570
40986I45570k49565O3188O35216O18535j52029q55482q43260m23201k00956k13651
$$ 945570 696005 759193 1394409 2012944 1860915 1005433 162173 -261028 -461984 -675635
40976f75635j26746J02348K14048J16715j2498l9170p006J7617P025j24424m40948
$$ -675635 -802381 -700033 -485985 -369270 -381768 -420938 -427944 -410327 -403302 -527726 -968674
40965i68674p32243n82708R3178P51781P78335K88861j9292J32338K49328n1358
$$ -968674 -1700917 -2283625 -2190447 -1438666 -660331 -371470 -390762 -258424 -9096 -60454
40955f0454l52442j37364K77801K40303r1414L0226O25547Q27713K28388n02385
$$ -60454 -412896 -550260 -272459 -32156 -123570 -93344 532203 1359916 1588304 1085919
40945A085919o98388n68916m96070k66673K89444N75450M8236o74689n20215M07281
$$ 1085919 387531 -181385 -677455 -944128 -654684 -79234 -30998 -705687 -1225902 -818621
40935h18621Q91405L74263k81494j50200M17918M20092l02724q98694p23990r6296
$$ -818621 72784 447047 165553 15353 433271 853363 550639 -348055 -1072045 -1168341
40925a168341L28775M30717M91169N12942K51220j19218j7390O16349R93140N23431
$$ -1168341 -839566 -408849 82320 595262 846482 727264 709874 1326223 2319363 2842794
40915B842794l11020p14172p26507q32644q18316q5422R99032J240120L25350
$$ 2842794 2531774 1817602 1091095 258451 -559865 -645287 353745 1593865 1919215
40906A919215o69559q63730o44374o35592n83381k8165O94109R70110Q63260P63017
$$ 1919215 1249656 385926 -258448 -894040 -1477421 -1505586 -811477 158633 1021893 1784910
40896A784910N60947m3221p82110j089871q55859l41659K97054Q57614Q92964
$$ 1784910 2345857 2302636 1520526 430655 -425204 -766863 -469809 387805 1280769
40887A280769K88597l49006m65484l02121l01325k91804N1035M42826M53235K76488
$$ 1280769 1569366 1220360 754876 452755 151430 -140374 -89339 353487 806722 1083210
40877A083210K66764J66894l69490r24498q60852l34903P8317L34481O12607N76680
$$ 1083210 1349974 1516868 1147378 222880 -637972 -972875 -894558 -560077 52530 629210
40867F29210k3796n09217j82375L57296P7436p08388q45711l25181j68421m30282
$$ 629210 605414 96197 -86178 271118 348554 -359834 -1205545 -1530726 -1699147 -2129429
40857b129429o2047J000734J358066L48835p86064p45563P0290N02181L21189
$$ -2129429 -2191476 -1190742 167324 516159 -269905 -1015468 -945178 -442997 -121808
40848a21808R1384Q4599J19889J5658k75818n67465l53309N29799J207289O91977
$$ -121808 -30424 54175 174064 189722 -86096 -653561 -1006870 -477071 730218 1422195
40838A422195n09300r18664l15050L765m82869n95488M15057J359843Q68589n43313
$$ 1422195 912895 -5769 -320819 -317054 -799923 -1395411 -980354 379489 1248078 704765
40828G04765j367364j130678l97594M34269J189084J402872Q28638O390m42769
$$ 704765 -662599 -1793277 -2190871 -1756602 -567518 835354 1663992 1670382 1227613
40819A227613n42502m07790J74464R23253Q56111j95990r24632m51405J95031
$$ 1227613 685111 277321 451785 1375038 2231149 2035159 1110527 659122 854153
40810H54153k11460r72266o28496N83425J178500P89935L54040K57044J8614k97675
$$ 854153 642693 -329573 -958069 -374644 803856 1593791 1947831 2204875 2223489 1925814
40800A925814l4892N98177N47716l53834r97760o34719K16771P27402O37050O2498
$$ 1925814 1890922 2489099 3036815 2682981 1685221 1050502 1267273 1994675 2631725 2694223
40790B694223o39321q15001k45622K23051j97888p99231l46557P79803R98389
$$ 2694223 2054902 1239901 994279 1217330 1019442 220211 -126346 653457 1651846
40781A651846M8232o13552j89290L91061K84851r296O0988L8799m33959p20551
$$ 1651846 1700078 1086526 897236 1288297 1573148 1563852 1624840 1663639 1229680 509129
40771E09129l31576J39014J11536J6936L04009M63134J2157m55562k19909L55751
$$ 509129 177553 316567 428103 445039 749048 1212182 1224339 768777 548868 904619
40761I04619N31008L63007K34359k8569n58870p20175r0765M92297Q8002p04699
$$ 904619 1435627 1798634 2032993 2004424 1445554 725379 634614 1126911 1214913 510214
40751E10214n73572M15767R33563M38878k36813m17302l94137m38250j97519M03704
$$ 510214 -63358 352409 1285972 1724850 1488037 1070735 676598 238348 40829 444533
40741D44533O47060Q7777n64880l95770L08587L94024m97449j308131r03726L97679
$$ 444533 1091593 1179370 614490 218720 527307 921331 423882 -884249 -1787975 -1390296
40731a390296J172963P17055j02839j52110L95431N27032P1856j41226J95244
$$ -1390296 -217333 499722 396883 244773 640204 1167236 1239092 1097866 1293110
40722A293110L60059l3434l24828q3696J7075n05151q21671j45404O79642L90624
$$ 1293110 1653169 1619735 1294907 1211211 1228286 723135 -98536 -243940 435702 826326
40712H26326n27918n53557L14360N27080l72631r17660j07582R92845R79428J34470
$$ 826326 298408 -255149 59211 586291 213660 -704000 -811582 181263 1160691 1295161
40702A295161l77452l36152k83362k31671J88211O87716N97428K0133k99494j75402
$$ 1295161 917709 581557 298195 66524 254735 942451 1539879 1560012 1260518 1085116
40692A085116j24508l39964m36157k94441k72372l86612j60696L93943M86504
$$ 1085116 960608 620644 184487 -109954 -382326 -768938 -929634 -535691 -49187
40683d9187k64301j067297j011913l10060K19637M29967P42243J035404O39907
$$ -49187 -313488 -1380785 -2392698 -2702758 -2483121 -2053154 -1310911 -275507 364400
40674C64400m45647j206648q66752J12103P09892N90130K26234J02448K33731
$$ 364400 -81247 -1287895 -2154647 -2042544 -1332652 -742522 -516288 -413840 -180109
40665a80109L35118J54894k50206m22963L2347P27198O98467k66970j026218m85581
$$ -180109 155009 309903 59697 -363266 -330919 396279 1094746 827776 -198442 -684023
40655f84023P42122J006614j03588j163481r06811J04384M67421o8649m93887
$$ -684023 58099 1064713 961125 -202356 -1109167 -1004783 -537362 -606011 -1099898
40646a099898j45237M95829P13368N06186K83043J51308o230o5614J71131M44731
$$ -1099898 -1245135 -749306 -35938 470248 753291 904599 898369 832755 1003886 1448617
40636A448617K45662l42757n62170n8841M46491J18249p04850r28120l08810K09289
$$ 1448617 1694279 1351522 789352 730511 1177002 1295251 590401 -337719 -646529 -437240
40626d37240m7074n37179m69937K6981L36134L57674L54965K72062K0528N9459
$$ -437240 -484314 -1021493 -1491430 -1464449 -1128315 -770641 -415676 -143614 -123086 -63627
40616f3627P61855J448208J063435k36568j174282j101007o64971n33735m66438
$$ -63627 698228 2146436 3209871 2973303 1799021 698014 33043 -500692 -967130
40607i67130q1849L37340L78963J78926M3947m4267j08787O0768L81251L07455
$$ -967130 -1048979 -711639 -332676 -153750 -109803 -154070 -262857 -202089 179162 486617
40597D86617l05890p51649m52289J34154K31780p2587o9223M45125R52964R90116
$$ 486617 180727 -570922 -1023211 -889057 -657277 -729864 -799087 -353962 599002 1589118
40587A589118N91176N8018l03503l37804k43699m24366q70084j006772m81893
$$ 1589118 2180294 2238312 1934809 1597005 1353306 928940 58856 -947916 -1429809
40578a429809K50276N12414K47636j11035k93840l11096k06026p3803p0832j20195
$$ -1429809 -1179533 -667119 -419483 -530518 -824358 -1135454 -1341480 -1415283 -1486115 -1606310
40568a606310N9217M00532M38822P8899j75966r6537j15168l81069k68667M62064
$$ -1606310 -1547093 -1146561 -707739 -628840 -804806 -901343 -1016511 -1397580 -1666247 -1204183
40558a204183Q63013J51103q32964p19334L03181P94249K40236l92008l14536
$$ -1204183 -341170 -190067 -1023031 -1742365 -1439184 -644935 -404699 -796707 -1111243
40549a111243J11002L15031L50703L93177K85871N489j17174N78j7472l06008
$$ -1111243 -1000241 -685210 -334507 58670 344541 350030 232856 233434 215962 -90046
40539i0046m28239p4643M01505M71361Q9254l65226n08458k00678L44432O68072
$$ -90046 -518285 -592928 -191423 279938 369192 3966 -504492 -705170 -360738 307334
40529C07334N47164K82038K32440K99819K35012J19068M6977k47244p99497r16402
$$ 307334 854498 1136536 1368976 1668795 1903807 2022875 2069852 1822608 1023111 106709
40519A06709j30774P55223O29701k25851n74222j73653M6657k40869k75677K27359
$$ 106709 -24065 731158 1360859 1135008 560786 387133 433790 192921 -82756 144603
40509A44603M74754Q5372j51417K91583O98542L75419k00831l92109n32659j026271
$$ 144603 619357 704729 553312 844895 1543437 1918856 1718025 1325916 793257 -233014
40499b33014j225219m12535P58025J052439M86679J79911N73382Q99570M63926
$$ -233014 -1458233 -1870768 -1112743 -60304 426375 606286 1179668 2079238 2543164
40490B543164m29086r82004p47841P8808P77225O14302l29741j038855p06774
$$ 2543164 2114078 1132074 384233 463041 1240266 1854568 1524827 485972 -220802
40481b20802K40264P45716M60916q5938m05086m72581l62665j00198R1464q0184
$$ -220802 19462 765178 1226094 1140156 735070 262489 -100176 -200374 -108910 -189094
40471a89094n06428p07669m12701J25174M02030J42737l72277m25256L67718J315467
$$ -189094 -695522 -1403191 -1815892 -1690718 -1288688 -1145951 -1518228 -1943484 -1575766 -260299
40461b60299J195477j69046j406920j157213K72703J345057J109157O3234o30188
$$ -260299 935178 766132 -640788 -1798001 -1525298 -180241 928916 992150 361962
40452C61962l56032M47252P66280J42277o72748o11851J93627N66092Q3665l09792
$$ 361962 5930 453182 1219462 1361739 688991 77140 270767 836859 920524 610732
40442F10732L2723L44006j31646o66815k52019N60395M97792k80410m81860J08696
$$ 610732 643455 987461 855815 189000 -63019 497376 995168 714758 232898 341594
40432C41594L94033l663j66222K85047M07426k96061p98267k53043M45812P6146
$$ 341594 735627 731964 565742 850789 1258215 962154 163887 -89156 356656 432802
40422D32802q49279q85533r575L77842k42957p05849j02977P37120N89068k21785
$$ 432802 -416477 -1302010 -1311585 -933743 -1176700 -1882549 -1985526 -1248406 -659338 -881123
40412h81123l64471L88836Q65782M24760n5279K65421P02259K07353p08283o58135
$$ -881123 -1245594 -856758 9024 433784 378505 643926 1346185 1553538 845255 187120
40402A87120K72509N03957m47953j033581j36750J021979P51764m68671q16788
$$ 187120 459629 963586 515633 -517948 -654698 367281 1119045 650374 -166414
40393a66414Q9714R17423Q31461L36499j01282o85407j250970j043674o2490N92264
$$ -166414 -76700 840723 1672184 2008683 1907401 1221994 -28976 -1072650 -1135140 -542876
40383e42876L05792j81886j00895J88057R1864r7237J33583M82334M03795J52244
$$ -542876 -237084 -418970 -519865 -331808 -239944 -337181 -203598 278736 682531 834775
40373H34775K95309N90459L31457l77352o40963j02824N49167N92570J48302k43226
$$ 834775 1130084 1720543 2052000 1674648 1033685 930861 1480028 2072598 2220900 1977674
40363A977674m49708p33028j100220j098518m22473M73961P30760J60608l93280
$$ 1977674 1527966 794938 -305282 -1403800 -1826273 -1352312 -621552 -460944 -854224
40354h54224j48534M77555M55692k52995n33202K11730J071888R18712N7100k50927
$$ -854224 -1002758 -525203 -69511 -322506 -855708 -643978 427910 1346622 1403722 1152795
40344A152795L53661Q32822K49704r29671j428764p08702M88206J064114P11576
$$ 1152795 1506456 2339278 2588982 1659311 230547 -478155 10051 1074165 1785741
40335A785741L6227k62931j00760J02317R197l01702m89189k99948J80740N61892
$$ 1785741 1821968 1559037 1458277 1560594 1569791 1268089 778900 478952 659692 1221584
40325A221584N16023J37305k12455l76217m39843l52346l76K76314q0246q13651
$$ 1221584 1737607 1874912 1662457 1286240 846397 494051 493675 769989 689743 -123908
40315a23908q26948K52276J228388Q76317l05756q89293n71425k54855l53803
$$ -123908 -950856 -698580 529808 1406125 1100369 211076 -360349 -615204 -969007
40306i69007l28044O5862K94896O3883k23940k53465j14348K76145J026400J453135
$$ -969007 -1297051 -1231189 -936293 -872410 -1096350 -1349815 -1464163 -1188018 -161618 1291517
40296A291517O40646r20839j548575o50445M80604O63287K69334Q864k91300p57454
$$ 1291517 1932163 1011324 -537251 -1187696 -707092 -43805 225529 234393 -56907 -814361
40286h14361o83435J57042O39095L0852n40980J39368J185642R30576l54450r65031
$$ -814361 -1497796 -1340754 -701659 -670807 -1211787 -1072419 113223 1043799 689349 -275682
40276b75682m98964j14074k49098r3973N14083N91762j20524n08549L0016N67406
$$ -275682 -774646 -888720 -1137818 -1231791 -717708 -125946 -246470 -755019 -725003 -157597
40266a57597L02758j21181J18044O09687N85375K52556J83658J41749l69487r42638
$$ -157597 145161 23980 142024 751711 1337086 1589642 1773300 1915049 1545562 602924
40256F02924p82723p1473K35345j44930n10995l33969R6302L28490L64611L61114
$$ 602924 -179799 -251272 -15927 -160857 -671852 -1005821 -909519 -581029 -216418 144696
40246A44696K36903r7356m38192n06090k90884J5652K91717N04874N58519L38233
$$ 144696 381599 284243 -153949 -660039 -950923 -935271 -643554 -138680 419839 758072
40236G58072p0159l85614m44832l74885l25663j86931J76760N22219M46560K9749
$$ 758072 687913 302299 -142533 -517418 -843081 -1030012 -853252 -331033 115527 145276
40226A45276j83617J5947J93242J0231k27301j70725q7520l40431o05715l40786
$$ 145276 -38341 -22394 170848 181079 -46222 -216947 -304467 -644898 -1250613 -1591399
40216a591399K03573K55750k23338l82411K27636R13414P75208q5207p06469m00580
$$ -1591399 -1387826 -1132076 -1355414 -1737825 -1510189 -596775 178433 93226 -613243 -1013823
40206a013823N35922J166905Q78409L0685m52775k19575J04934j04485n31741
$$ -1013823 -477901 689004 1567413 1598098 1145323 925748 1030682 926197 394456
40197C94456m85330k1597K40612J95061K72079M51492J91616n07018q76726n43105
$$ 394456 -90874 -112471 128141 323202 595281 1046773 1238389 731371 -145355 -688460
40187f88460r8437j04429k66652j09561J86297K21223J23430K25672L88728K74164
$$ -688460 -786897 -891326 -1157978 -1267539 -1081242 -860019 -736589 -510917 -122189 151975
40177A51975J6864K9631K99242M01724J38886k67354n63009o89851o49962m17637
$$ 151975 168839 198470 497712 899436 1038322 770968 207959 -481892 -1131854 -1549491
40167a549491j168N22874R64644R97760M31560m04071q39520n83387q266L74526
$$ -1549491 -1550659 -1027785 -63141 934619 1366179 962108 122588 -460799 -469065 -94539
40157i4539M09511J81722j82954m36167l32133k1101Q5077j9506Q1447L96177
$$ -94539 314972 496694 313740 -122427 -454560 -475661 -390584 -410090 -328643 67534
40147F7534L41054k58548o83405l81644J38552J74310j5881J87132M75024K8916
$$ 67534 408588 150040 -533365 -915009 -776457 -602147 -618028 -430896 44128 73044
40137G3044r34690j187617k58920Q02813Q56201J16362l24402P7329Q45603J145313
$$ 73044 -861646 -2049263 -2308183 -1505370 -649169 -532807 -857209 -779880 65723 1211036
40127A211036N89530l86855q21711k26760O41347N42381n46850j193666m17091
$$ 1211036 1800566 1413711 592000 365240 1006587 1548968 1002118 -191548 -608639
40118f08639Q69619J100233K22984m17135j70835J55023j04782l02359L19103
$$ -608639 260980 1361213 1584197 1167062 996227 1151250 1046468 744109 1063212
40109A063212J111337Q19508m76174j348211r74232j05609J77118j73934m89548
$$ 1063212 2174549 2994057 2517883 1169672 195440 89831 266949 93015 -396533
40100c96533l89578L2346N29570P45030L80145k64929m20660M1870K41283l69886
$$ -396533 -786111 -753765 -224195 520835 900980 636051 215391 257261 498544 128658
40090A28658r56235m79860O04343R44780K98030k78556k15965j61800o23028j012915
$$ 128658 -827577 -1307437 -703094 241686 539716 261160 45195 -116605 -739633 -1752548
40080a752548o31979K17134P10148N56000J01713j85576j8445N20221R00685P01435
$$ -1752548 -2384527 -2167393 -1457245 -901245 -799532 -985108 -1003553 -483332 417353 1118788
40070A118788K71986K50818M78937K30003m66115p73732m92615l71302o34275
$$ 1118788 1390774 1641592 2120529 2350532 1884417 1110685 618070 246768 -387507
40061c87507m90823K95895O94757J29639l86116L9678N58171O7341p48989n43496
$$ -387507 -878330 -582435 112322 241961 -144155 -104477 453694 521035 -227954 -771450
40051g71450L18143L57388m72368p47569q843N90970K91439k78314m90650n92418
$$ -771450 -453307 -95919 -568287 -1315856 -1324699 -733729 -442290 -720604 -1211254 -1803672
40041a803672o86657k57351O47138J030692M82903m6011K08678N80743K02114
$$ -1803672 -2490329 -2747680 -2100542 -1069850 -586947 -632958 -424280 156463 358577
40032C58577m59383l83256L42855P62807N59768K66182J33342k23433r34920j395576
$$ 358577 -100806 -484062 -141207 621600 1181368 1447550 1580892 1357459 422539 -973037
40022i73037j000882J4426P72352O93530Q4832k84940j32987R1422L6857O1275
$$ -973037 -1973919 -1959493 -1187141 -493611 -408779 -693719 -826706 -735284 -698427 -637152
40012f37152N24387Q98356M12968o05658j016332n17653n50k8334l2988N00874
$$ -637152 -112765 785591 1198559 592901 -423431 -941084 -941634 -969968 -1002956 -502082
40002e02082J043643R05272L31037k6078j05203j95930k41419q8120L4755o1507
$$ -502082 541561 1446833 1777870 1751792 1646589 1450659 1209240 1121120 1155875 1094368
39992A094368q2564J41357J17924n25185j197160j070485k80790L57579M93072
$$ 1094368 1011804 1153161 1271085 745900 -451260 -1521745 -1802535 -1444956 -951884
39983i51884L48838N7543l02798l28748J92131O45725L50669k84950l05622K88039
$$ -951884 -603046 -545503 -848301 -1177049 -984918 -339193 11476 -273474 -579096 -291057
39973b91057O12275L82831J99081K77087Q4438m53380n30463J93576Q00093L93824
$$ -291057 321218 704049 903130 1180217 1264655 811275 280812 474388 1274481 1668305
39963A668305n59640r50320n26419R6411N18893Q22248R22944M63338n17529j336028
$$ 1668305 1108665 158345 -368074 -271663 247230 1069478 1992422 2455760 1938231 602203
39953F02203j335271n83104K37369N37210L57673K02357L52431N05576K73317
$$ 602203 -733068 -1316172 -1078803 -541593 -183920 18437 370868 876444 1149761
39944A149761j54789k46823M4164K15385O1786J999K81750M18459o8584p80280
$$ 1149761 994972 748149 792313 1007698 1069484 1071483 1353233 1771692 1703108 922828
39934I22828q91935k88017L41229M79081L01239J52754M1845j10155j39435O9959
$$ 922828 30893 -257124 84105 563186 864425 1017179 1059024 948869 809434 879393
39924H79393K18538n9348n57508o49936j77709K33948L1377m27612l59724K75705
$$ 879393 1097931 1038583 481075 -168861 -346570 -112622 -81245 -508857 -868581 -592876
39914e92876O74470L19448l53999o53612m69455q4777L44188O52720M66671k66804
$$ -592876 81594 401042 47043 -606569 -1076024 -1160801 -816613 -163893 302778 35974
39904C5974q84384p70550k35150K0931P568K29296O33432P16567N45361O29970
$$ 35974 -848410 -1618960 -1854110 -1833179 -1825611 -1596315 -962883 -246316 299045 929015
39894I29015P97710L50034n22012p57163k03973l651n74834o81904M39323J402842
$$ 929015 1726725 2076759 1554747 797584 593611 589960 15126 -666778 -227455 1175387
39884A175387O40767r62446j216760J33029J196878Q49313J136l03752l31923
$$ 1175387 1816154 853708 -363052 -230023 966855 1816168 1817304 1513552 1181629
39875A181629n56918n68593J6346O25348O16064K84063J75748J15175k67401o57247
$$ 1181629 624711 56118 72464 697812 1313876 1597939 1773687 1888862 1621461 964214
39865I64214n51550j61038j5571n7438R8035L18906J56949l04001n14269k68513
$$ 964214 412664 251626 236055 178617 276652 595558 752507 448506 -65763 -334276
39855c34276J36284M18891M53125Q0914o22821j052457o56268K51501Q14422O92253
$$ -334276 -197992 220899 674024 754938 132117 -920340 -1576608 -1325107 -510685 181568
39845A81568K73135l7316j31125R9861O74225J084457O46873m95060j281837r46819
$$ 181568 454703 417387 286262 386123 1060348 2144805 2791678 2296618 1014781 67962
39835F7962O7980O48562K06723p86185j261253n59867P95726J483345Q46036k72991
$$ 67962 135942 784504 991227 205042 -1056211 -1616078 -820352 662993 1509029 1236038
39825A236038o23224j48520K20220J06557K0834J55068j5120n86959p75570j99401
$$ 1236038 612814 464294 684514 791071 811905 966973 951853 364894 -410676 -610077
39815f10077L43746J62699j28119L20613J034888R46773K47842J28117P14969
$$ -610077 -266331 -103632 -231751 88862 1123750 2070523 2318365 2446482 3161451
39806C161451P09234n06579j677142j426439k69004K27461k34792m50480K34794
$$ 3161451 3870685 3364106 1686964 260525 -8479 218982 -15810 -466290 -231496
39797b31496Q83019M83137m56719p28092k66302p6174m56272m90425L46706J162736
$$ -231496 651523 1134660 677941 -50151 -316453 -392627 -848899 -1339324 -992618 170118
39787A70118R79683K66742J20946M53177K18139p02059j133453m04670N94510
$$ 170118 1149801 1416543 1537489 1990666 2208805 1506746 373293 -31377 563133
39778E63133O94228l0717o32100o02005k22815J2458j32724m75367m72921J94861
$$ 563133 1257361 1226644 594544 -7461 -230276 -217818 -350542 -825909 -1298830 -1103969
39768a103969J001676J080686M46884k1671K7747J842l50339l58326K28429M74859
$$ -1103969 -102293 978393 1425277 1403606 1431353 1433195 1082856 724530 952959 1427818
39758A427818k11779q40373l43106N52716M05162o07553j001692l06257N07611
$$ 1427818 1216039 375666 32560 585276 990438 382885 -618807 -925064 -417453
39749d17453Q01577R04954Q79997K12808q89716j293759n81428K63494L59673
$$ -417453 384124 1289078 2169075 2381883 1492167 198408 -383020 -119526 240147
39740B40147N7518J0940J39885J56652K22371M07500K81763l06314p35295n00496
$$ 240147 297665 308605 448490 605142 827513 1235013 1516776 1210462 475167 -25329
39730b5329L8937L26567L56326K58807j18280o45735o78773m7106M22198Q7746
$$ -25329 13608 340175 696501 955308 837028 191293 -487480 -534586 -112388 -24642
39720b4642m55159k92537M02313P11899L06377l34662o97717n73376L1753P17325
$$ -24642 -479801 -772338 -370025 341874 648251 313589 -384128 -957504 -925751 -208426
39710b08426Q03330J84781l65617k83439k4339j51761k84281J83210Q84310R99792
$$ -208426 594904 779685 414068 130629 106290 -45471 -329752 -146542 737768 1737560
39700A737560N42294J23431j82465o76979j049205p09208L4999K82783k2126j05202
$$ 1737560 2279854 2403285 2220820 1543841 494636 -214572 -179573 103210 81084 -24118
39690b4118J76617J28685l27655k89047N41985J068885L66339q46835j165894
$$ -24118 152499 281184 -46471 -335518 206467 1275352 1641691 794856 -371038
39681c71038l49355O14375R22497O80066L66641K10533J25714q2518m64551p45272
$$ -371038 -720393 -106018 816479 1496545 1863186 2073719 2199433 2116915 1652364 907092
39671I07092n54400M6332N29182N52062L42337K34939J78695M928j38863n3330
$$ 907092 352692 399024 928206 1480268 1822605 2057544 2236239 2241167 2102304 2048974
39661B048974J5623l50107r66518j024442q1779J204166J693660J081754K68143
$$ 2048974 2064597 1714490 747972 -276470 -358249 845917 2539577 3621331 3889474
39652C889474K41399Q34768R44858m4329j443507k039105j431286l52709K13494
$$ 3889474 4130873 4965641 5910499 5866170 4422663 2383558 952272 599563 813057
39643H13057J2575l69013k66471K42377M36397j1905m29440m2147P63749Q48316
$$ 813057 825632 456619 190148 432525 868922 857017 427577 385430 1149179 1997495
39633A997495K600o79402m31831R5469j002m31995l16886L11053O00093K41638
$$ 1997495 2000095 1320693 888862 984331 983329 551334 234448 545501 1145594 1387232
39623A387232j90335k17629J9729K71289N21905O95387N48563L7187n32592p86668
$$ 1387232 1196897 979268 998997 1270286 1792191 2487578 3036141 3073328 2540736 1754068
39613A754068n48186L4358M46550J99021m94652q24472m55782J8449O3958j2423
$$ 1754068 1205882 1240240 1686790 1885811 1391159 566687 110905 129354 193312 180889
39603A80889J76373K61767j64750o09794l70780L11235P17378Q06226R29715Q72953
$$ 180889 357262 619029 454279 -155515 -526295 -215060 502318 1308544 2238259 3111212
39593C111212K87458l09559j55996M34372N75700L47233N14291R18593N85975
$$ 3111212 3398670 3089111 2933115 3367487 3943187 4290420 4804711 5723304 6309279
39584F309279n42861j360464j198260m53105M24024J276817J581774Q71959o4154
$$ 6309279 5766418 4405954 3207694 2754589 3178613 4455430 6037204 6909163 6845009
39575F845009J17448J226856J668695R18985K65502O46669J361396J548255J468743
$$ 6845009 6962457 8189313 9858008 10776993 11042495 11689164 13050560 14598815 16067558
39566A6067558J635031J983765K514745L491598M580623N135256N602488P098919
$$ 16067558 17702589 19686354 22201099 25692697 30273320 35408576 41011064 48109983
39558D8109983R473137J1723076J4441672J9415403K6537535L4063897M2148266
$$ 48109983 57583120 69306196 83747868 103163271 129700806 163764703 205912969
39551B05912969N1578008N7122350M7657737J8426539j9324875m6592268n4165554
$$ 205912969 257490977 314613327 362271064 380697603 361372728 314780460 260614906
39544B60614906m8017430l8591730l0521568k3652838j8163621j4734941j2427226
$$ 260614906 212597476 174005746 143484178 119831340 101667719 86932778 74505552
39537G4505552r800416p106390n409983m628792m039725l693185l869291l989070
$$ 74505552 64705136 57598746 52188763 47559971 43520246 39827061 35957770 31968700
39529C1968700l363434k364250j800134j710127j617886j406833j225696j047712
$$ 31968700 28605266 26241016 24440882 22730755 21112869 19706036 18480340 17432628
39521A7432628q64587q00535p08315k97842J33636p0358p71888j081141p90425
$$ 17432628 16568041 15767506 15059191 14761349 14894985 14824627 14052739 12971598 12181173
39512A2181173o80897j069904j230554p52599l20544m99737q00426o27680k06926
$$ 12181173 11500276 10430372 9199818 8447219 8126675 7626938 6826512 6198832 5991906
39503E991906P6657L19145M66017L0252q89989j309012q02436k78961n15587r06599
$$ 5991906 6068563 6387708 6853725 6883977 5993988 4684976 3882540 3603579 3087992 2181393
39493B181393n87947J01075L13713J10586J23225L67327L80802J23170j12273
$$ 2181393 1593446 1694521 2008234 2118820 2242045 2609372 2990174 3113344 3001071
39484C001071l05521n17429m99705j22037K53178L49275L95193N09775L54663
$$ 3001071 2695550 2178121 1678416 1556379 1809557 2158832 2554025 3063800 3418463
39475C418463j09956l33743j83341l00692q12061p75366K07026R64926M93298
$$ 3418463 3308507 2974764 2791423 2490731 1678670 903304 1110330 2075256 2568554
39466B568554l60168l06506K46641P1190o29465o56176n1092O706n60132m87773
$$ 2568554 2208386 1901880 2148521 2219711 1590246 934070 882978 889684 329552 -158221
39456a58221N64840J259841O79297k78966l81535K05585N16682L01211R2209K37140
$$ -158221 406619 1666460 2345757 2066791 1685256 1890841 2407523 2708734 2800943 3038083
39446C038083N46298O95300N66339K87825O2049j40406n51142j038547r61947
$$ 3038083 3584381 4279681 4846020 5133845 5195894 5055488 4504346 3465799 2503852
39437B503852j03456O66305M11709m75891p90186k39042K85631J28359l82548
$$ 2503852 2400396 3066701 3478410 3002519 2212333 1973291 2258922 2387281 2004733
39428B004733o83843o09452j84578M04687O13597J54452k49840K61604J109984
$$ 2004733 1320890 711438 526860 931547 1545144 1699596 1449756 1711360 2821344
39419B821344Q40197n64741j367388o05549M81353M47562k12620j65328M69295
$$ 2821344 3661541 3096800 1729412 1123863 1605216 2052778 1840158 1674830 2144125
39410B144125M45766m27248r63130n11992R9781l8424n56238m78373K80485Q03917
$$ 2144125 2589891 2162643 1199513 687521 787302 748878 192640 -285733 -5248 798669
39400G98669M52731k97915n25510q1915K68616j9046m58017k39040N43183R62638
$$ 798669 1251400 953485 427975 346060 614676 595630 137613 -101427 441756 1404394
39390A404394N05634l45883q49466p69697k92219K60630M43759m633o18294n32274
$$ 1404394 1910028 1564145 714679 -55018 -347237 -86607 357152 352519 -265775 -798049
39380g98049L40686J039072Q18144Q8565l56940m21346l86384j04821O41433J324286
$$ -798049 -457363 581709 1399853 1488418 1131478 710132 323748 218927 860360 2184646
39370B184646J126990J37799p07295q69569o42264l16671K14188P46547N25907
$$ 2184646 3311636 3449435 2742140 1872571 1230307 913636 1127824 1874371 2400278
39361B400278o52669j681589j287469K63769J380815J122002K39441n9089K52584
$$ 2400278 1747609 66020 -1221449 -957680 423135 1545137 1784578 1725489 1978073
39352A978073K71330l07804q08903p94422p61090j122188j243185l44094J059553
$$ 1978073 2249403 1941599 1132696 338274 -422816 -1545004 -2788189 -3132283 -2072730
39343b072730J637543J091465M96041O07055Q40459M18822l55557o98567n57164
$$ -2072730 -435187 656278 1152319 1759374 2599833 3018655 2663098 1964531 1407367
39334A407367m11258l36215j11870O9838j07506l07118K0243N20739K87281n72969
$$ 1407367 996109 659894 548024 617862 510356 203238 223481 744220 1031501 458532
39324D58532q02781J64768J208299J034662n8963p49752m88466J36837N06989
$$ 458532 -344249 -179481 1028818 2063480 2004517 1254765 766299 903136 1410125
39315A410125N33500K31907l76465q50624o20986Q5452L29129k18233p06714l18517
$$ 1410125 1943625 2175532 1799067 948443 327457 412909 742038 523805 -182909 -501426
39305e01426N35536Q27392L19123k82813l48520J07601P34065J117130Q21869
$$ -501426 34110 861502 1180625 897812 549292 656893 1390958 2508088 3329957
39296C329957k15516j275429j405940n40913L98931O52418L87775J68175J68035
$$ 3329957 3114441 1839012 433072 -107841 291090 943508 1331283 1499458 1667493
39287A667493K18015K04427P4943k41308o14157o93741l81272k8396R2598J85213
$$ 1667493 1885508 2089935 2164878 1923570 1309413 615672 234400 206004 298602 483815
39277D83815M81508P35684N69346P4428l37689n03221n36140m55730j89169J29508
$$ 483815 965323 1701007 2270353 2344781 2007092 1503871 967731 512001 322832 452340
39267D52340K14326r357k87212k53557K61039R45314J075086K89113o99516q08034
$$ 452340 666666 657309 370097 116540 377579 1322893 2397979 2687092 1987576 1179542
39257A179542j26136J12193n33413q67204L6403J126615Q71613k87227n96881
$$ 1179542 1053406 1165599 632186 -235018 -198615 928000 1799613 1512386 915505
39248I15505K27004O65553k7725o98475l41747L01483J64917l87960m02631o405
$$ 915505 1142509 1808062 1780337 1081862 740115 1041598 1206515 818555 415924 409519
39238D09519Q263l37296l86345j44161j89683m22057p0202Q88798J348774N45280
$$ 409519 417782 80486 -305859 -450020 -639703 -1061760 -1131962 -243164 1105610 1650890
39228A650890q02142j339460o73037L48565P61526M88010J56126J62632J88798
$$ 1650890 848748 -490712 -1163749 -815184 -53658 434352 590478 753110 941908
39219I41908k24183q26809q19844L7374R10798Q28365j16958q80790o80339K23419
$$ 941908 717725 -109084 -928928 -891554 19244 847609 730651 -150139 -830478 -607059
39209f07059R22224Q01903R0545m05819j61417M41431N22534k03760j039790j169253
$$ -607059 315165 1117068 1207613 801794 640377 1081808 1604342 1400582 360792 -808461
39199h08461n91464P6727M34650N43113N14970L07587n4469l67512m53111l24509
$$ -808461 -1399925 -1323198 -888548 -345435 169535 477122 422653 55141 -397970 -722479
39189g22479j33172n3520j79268m23196n54037m06764j9812M36686P65220Q04098
$$ -722479 -855651 -909171 -1088439 -1511635 -2065672 -2472436 -2492248 -2055562 -1290342 -486244
39179d86244N72957L47746L67559M73966L16800p8357k88543r1183K77082N27711
$$ -486244 86713 434459 802018 1275984 1592784 1514427 1225884 1134701 1411783 1939494
39169A939494N82594L47430k70555r18868r09839j18353O89777Q11766M60337
$$ 1939494 2522088 2869518 2598963 1680095 770256 651903 1341680 2153446 2613783
39160B613783K41395K26456R2524j78098l66228n32158q11973q70188k68023O42993
$$ 2613783 2855178 3081634 3174158 2996060 2629832 2097674 1285701 415513 147490 790483
39150G90483R10391K27988o09520p60503l39175j3252r66M1145K81657L68355
$$ 790483 1700874 1928862 1319342 558839 219664 206412 205446 246591 528248 896603
39140H96603k0642n70289n99340N2264O96097N86152j25418n84042l74033k2740
$$ 896603 875961 305672 -293668 -241404 454693 1040845 915427 331385 -42648 -65388
39130f5388j57021n52121m48701L45174J121601J110758L46986m51203o90602
$$ -65388 -222409 -774530 -1223231 -878057 243544 1354302 1701288 1250085 559483
39121E59483m09007l5923J22071L9041j97167m12194k76504L59925R78377P62837
$$ 559483 150476 114553 236624 275665 78498 -333696 -610200 -250275 728102 1490939
39111A490939k57977r94269o83306P1873L05668J50380L45166P31971M67108m00528
$$ 1490939 1232962 238693 -444613 -372740 -67072 83308 428474 1160445 1627553 1227025
39101A227025q53171n24356j43920j17527N4076N31932O30527J57148j9284M91081
$$ 1227025 373854 -150502 -294422 -411949 -357873 174059 804586 961734 942450 1433531
39091A433531P30838J6952p38237m61082L49612N59578J80273q6958k85181p79398
$$ 1433531 2164369 2181321 1443084 982002 1331614 1891192 2071465 1984507 1699326 919928
39081I19928j073648n26573K67434K85813j78085r6718L57458J25831o83779q02664
$$ 919928 -153720 -680293 -412859 -127046 -305131 -401849 -44391 81440 -602339 -1405003
39071a405003O2136P64216O56273M23294N66624N31330n9300n66057m06300M2092
$$ -1405003 -1342867 -578651 77622 500916 1067540 1598870 1539570 973513 567213 609305
39061F09305J97865R0745l2427j42207j60560n747o894m19239o00661J87957J219144
$$ 609305 807170 897915 865488 723281 562721 556974 550080 130841 -469820 -281863 937281
39050I37281R70780m90447j386670q70942j14907j18645j72486M79557J040248
$$ 937281 1908061 1417614 30944 -839998 -954905 -1073550 -1246036 -766479 273769
39041B73769N71524k53980k60856L27740N06514K30616J53357K27284p1313n28150
$$ 273769 845293 591313 330457 658197 1164711 1395327 1548684 1775968 1704655 1176505
39031A176505m50118J19205N00531M52457K34308q7378n12220o29558j54510L75258
$$ 1176505 726387 845592 1346123 1798580 2032888 1945510 1433290 803732 649222 1024480
39021A024480K81011j98248l34882n8046J33920P5212k5586j20692k07469p1924
$$ 1024480 1305491 1107243 772361 714315 848235 923447 897861 777169 569700 497776
39011D97776K19321J15875m53974o20329R9707P81499M19968m59395o68159j47914
$$ 497776 717097 832972 378998 -241331 -141624 639875 1059843 600448 -67711 -215625
39001b15625L42865O47578R32651O56875n78819j668581j231497J35126O30462
$$ -215625 127240 774818 1707469 2364344 1785525 116944 -1114553 -979427 -348965
38992c48965K4549k91211Q4075P7519m97314l68357P45588J267528L42611o53295
$$ -348965 -324416 -615627 -531552 -454033 -951347 -1319704 -574116 693412 1036023 382728
38982C82728l90148L83475M61181K42659N80672Q91640J88288r41607j126625
$$ 382728 -7420 376055 837236 1079895 1660567 2552207 2740495 1798888 672263
38973F72263l57397K15763J31344j56580m25052o86854n13852K79495P58158J13271
$$ 672263 314866 530629 661973 505393 80341 -606513 -1120365 -840870 -82712 30559
38963C0559o98920j90974J155418J457736L81269m50930k04889L5028n05238q79906
$$ 30559 -668361 -859335 296083 1753819 2135088 1684158 1479269 1514297 1009059 129153
38953A29153k82187L53129o2297q63743p40543K03916Q91065J012754R80373P65112
$$ 129153 -153034 200095 137798 -725945 -1466488 -1262572 -371507 641247 1621620 2386732
38943B386732J70361k56041J0998K47489m68783j370123r23349M97025Q56998
$$ 2386732 2557093 2301052 2312050 2559539 2090756 720633 -202716 294309 1151307
38934A151307l24612j104831k70204O65109J6810j208986r11081P50509J666803
$$ 1151307 826695 -278136 -548340 116769 133579 -1075407 -1986488 -1235979 430824
38925D30824R47793j87078n91383m70839k89024J2392L13694J82173j73504l4762
$$ 430824 1378617 1191539 600156 129317 -159707 -147315 166379 348552 175048 140286
38915A40286M38301K72323n08429o35719K28380O48252k84861j295811q82114
$$ 140286 578587 850910 342481 -293238 -64858 583394 298533 -997278 -1879392
38906a879392L23786O96573J48829j75101l8786j44200m07136l3755P42731P56114
$$ -1879392 -1555606 -859033 -710204 -885305 -924091 -1068291 -1475427 -1509182 -766451 -10337
38896a0337q2691n19429n2983K97846j10866m15381J39127P65357M08010n17961
$$ -10337 -93028 -612457 -665440 -367594 -478460 -893841 -754714 10643 418653 -99308
38886i9308q06876k40182L58664M13899L6931m83444q19846n26480M11209J167499
$$ -99308 -906184 -1146366 -787702 -373803 -336872 -820316 -1640162 -2166642 -1755433 -587934
38876e87934R28760r312o33499n23091j20212J50280L11122L93009K50332l8651
$$ -587934 340826 331514 -301985 -825076 -945288 -795008 -483886 -90877 159455 120804
38866A20804j22422R8617L17524L31369L03152L41767K08843k74867p91654q18729
$$ 120804 -1618 96999 414523 745892 1049044 1390811 1599654 1324787 533133 -285596
38856b85596k70424L91329O67411M66472N4166k38434j87383K28676P01045P12881
$$ -285596 -556020 -164691 502720 969192 1023358 784924 597541 826217 1527262 2240143
38846B240143J13158m91960l61271L01376M59670k67402q77001l84572N81948
$$ 2240143 2353301 1861341 1500070 1801446 2261116 1993714 1116713 732141 1314089
38837A314089N74114n07761j197225o02520L72382N10771J6927j09368K32897
$$ 1314089 1888203 1380442 183217 -419303 -46921 463850 480777 371409 604306
38828F04306K40041l57646q60653o91364j30382K60287L31257J80724j79931n99245
$$ 604306 844347 486701 -373952 -1065316 -1195698 -935411 -604154 -423430 -603361 -1202606
38818a202606n96557J07956J010438J226140N24032l83357o92916l42684J86505
$$ -1202606 -1799163 -1691207 -680769 545371 1069403 686046 -6870 -349554 -163049
38809a63049N52757O63563L91151k20330n53496J7151R83393R62894m01225j596479
$$ -163049 389708 1053271 1444422 1224092 670596 687747 1671140 2634034 2232809 636330
38799F36330j132350L33506Q70058k9371q95257n24458M63428P93380K64193l78976
$$ 636330 -496020 -162514 707544 678173 -217084 -741542 -278114 515266 779459 400483
38789D00483o15729m79923j37313K55695N00940N46229M85837K07243m93053j235118
$$ 400483 -215246 -695169 -832482 -576787 -75847 470382 956219 1163462 670409 -564709
38779e64709j155332j13418Q26982P16074j0744k62690J39624M33414K16158p0016
$$ -564709 -1720041 -1833459 -1006477 -290403 -301147 -563837 -424213 9201 225359 155343
38769A55343p083J49039m7100n11005p01408l11985K79255L76220j41507n12586
$$ 155343 148260 297299 250199 -260806 -962214 -1274199 -994944 -618724 -760231 -1272817
38759a272817n0098P77962Q68871Q2109n06629j87267M36986N60206L43997K67104
$$ -1272817 -1322915 -544953 323918 406027 -100602 -287869 149117 709323 1053320 1320424
38749A320424J36972k97792m40996K77496J089759P64309l98966q31096o4623
$$ 1320424 1457396 1159604 718608 996104 2085863 2850172 2451206 1620110 1555487
38740A555487N52263R71q17469n42599M91230P31185l08637j373644j237172k62673
$$ 1555487 2107750 2108721 1291252 748653 1239883 1971068 1662431 288787 -948385 -1211058
38730a211058L10167J10731q1946K63622N67977J39630n50999m44463M52816R65318
$$ -1211058 -900891 -790160 -872106 -608484 -40507 99123 -451876 -896339 -443523 521795
38720E21795M68057k59534l48452r5650j91864m67523l27953J15726L37381M13498
$$ 521795 989852 730318 381866 286216 94352 -373171 -701124 -585398 -248017 165481
38710A65481P16802Q79714J94827j013642j531037r08556k220L55121L10823L28935
$$ 165481 882283 1761997 1956824 943182 -587855 -1496411 -1498631 -1143510 -832687 -503752
38700e03752M00988L16044R2122j70360l48601j13638O52592J217425O62088o25115
$$ -503752 -102764 213280 305402 135042 -213559 -327197 325395 1542820 2204908 1579793
38690A579793j130915l09141N38721J49622q79145j096353l09700M29488N56544
$$ 1579793 448878 139737 678458 828080 -51065 -1147418 -1457118 -1027630 -471086
38681d71086N29239O75407O03250P2248l86358k39816J68124Q4418n30110r04757
$$ -471086 58153 733560 1336810 1409058 1022700 782884 951008 1035426 505316 -399441
38671c99441n45857N2580J26524j99051m1468Q73120J597517J161525q0404r51528
$$ -399441 -945298 -892718 -766194 -965245 -1006713 -133593 1463924 2625449 2545045 1593517
38661A593517j016236q44540q08975n49041J29177O66910N44936M1161k99673
$$ 1593517 577281 -267259 -1076234 -1625275 -1496098 -829188 -284252 -243091 -542764
38652e42764m25769m89125k95952L12791Q84664Q45241L68668R9482J12646j42217
$$ -542764 -968533 -1457658 -1753610 -1440819 -556155 289086 657754 757236 869882 727665
38642G27665p79753j063780m23819N84887Q70970K00381n30702n33014j56007
$$ 727665 -52088 -1115868 -1539687 -954800 -83830 116551 -414151 -947165 -1103172
38633a103172k49863p71763p53273J91172J087662R20026J48992K1544O44794
$$ -1103172 -1353035 -2124798 -2878071 -2686899 -1599237 -679211 -530219 -508675 136119
38624A36119Q42802N1140p48847n06687L80758P87645M63979N3396j05995k61567
$$ 136119 978921 1030061 281214 -225473 155285 942930 1406909 1460305 1354310 1092743
38614A092743m35712k50977K50943L83142j90924p90089n82816K04446N80616
$$ 1092743 657031 406054 656997 1040139 849215 59126 -523690 -319244 261372
38605B61372K26277o2753L36417P67439J89248j109519j638585p19751N44070
$$ 261372 487649 424896 761313 1528752 1718000 608481 -1030104 -1749855 -1205785
38596a205785Q23625K69073j30217j95789m51811p51736l20868P78455J421850
$$ -1205785 -382160 -113087 -243304 -439093 -890904 -1642640 -1963508 -1185053 236797
38587B36797R66026K1477o26083q76134p43524l2603Q30537P30693n03031j324887
$$ 236797 1202823 1224300 598217 -277917 -1021441 -1054044 -223507 507186 4155 -1320732
38577a320732m17004J275437J667883L24288j099726j146306j85494M70914K42323
$$ -1320732 -1737736 -462299 1205584 1529872 430146 -716160 -901654 -430740 -188417
38568a88417l30613m11874K21936R46071R35293J32400o59566p98468m92505j94720
$$ -188417 -519030 -930904 -708968 237103 1172396 1304796 645230 -153238 -645743 -840463
38558h40463J00882M28241L25052m42859j071940o07205N77261J170206P30927
$$ -840463 -739581 -311340 13712 -429147 -1501087 -2108292 -1531031 -360825 370102
38549C70102J16097L6588K03461J70104O2349K7723k05036o55650o95686O221
$$ 370102 486199 522787 726248 896352 958701 986424 781388 125738 -569948 -563727
38539e63727P00755M84588l41008o36608k5279O40479N26683j13705m43363j80554
$$ -563727 137028 621616 280608 -356000 -381279 259200 785883 672178 228815 48261
38529D8261K03505K57529Q0192m467J9315r5543l98786o10042m97446j81054O7836
$$ 48261 251766 509295 589487 585020 604335 508792 110006 -500036 -997482 -1178536 -1110700
38518a110700J98485L88315P08242R18376O86710K6751n65771n81977j31854J38322
$$ -1110700 -912215 -523900 184342 1102718 1789428 1816179 1250408 668431 536577 674899
38508F74899r7386l75551j31509M49611P39493N82802L00500o1164p15785j349607
$$ 674899 577513 201962 70453 520064 1259557 1842359 2142859 2081695 1365910 16303
38498A6303j208709k57528N12617L58137k66532m89320j81292J67716K59545J66609
$$ 16303 -1192406 -1449934 -937317 -579180 -845712 -1335032 -1516324 -1348608 -1089063 -922454
38488i22454N9140J47095N40772R01107O91282J068m65959m32063l16638k44834
$$ -922454 -863314 -716219 -175447 725660 1416942 1418010 952051 519988 203350 -41484
38478d1484J97483P98809N41438o44019j205385j74382J111858R08269l08418
$$ -41484 155999 954808 1496246 852227 -353158 -527540 584318 1492587 1184169
38469A184169p59680j41638L60674L20738L62243M35157j69801j025713q02965
$$ 1184169 424489 282851 643525 964263 1326506 1761663 1591862 566149 -236816
38460b36816L95109Q90906J26052m51675P7247O19433J69944l96971j912O90180
$$ -236816 158293 1049199 1175251 723576 800823 1420256 1590200 1193229 1191317 1881497
38450A881497N43986l2610J8158M33397K33344l63268l14598L11460L82051m01691
$$ 1881497 2425483 2392873 2411031 2844428 3077772 2714504 2399906 2711366 3093417 2691726
38440B691726j063022r08405l44816K2034J05574j1368k79502l89714l2734M61274
$$ 2691726 1628704 720299 375483 397517 503091 491723 212221 -177493 -210227 251047
38430B51047M56040L856k47031j52411k21341n29996m07604L99004J039361O45615
$$ 251047 707087 710943 463912 311501 90160 -439836 -847440 -448436 590925 1236540
38420A236540l98478r09888l86905N10036Q83368N38926p3971m91234n58872l26373
$$ 1236540 838062 -71826 -458731 51305 934673 1473599 1399628 908394 349522 23149
38410B3149L1645J61927k33529q83461r82802j29649R99692J395896R62555M21317
$$ 23149 54794 216721 -16808 -900269 -1883071 -2012720 -1013028 382868 1345423 1766740
38400A766740J08294l17440q69440q64021r46R30720J023728M07662j23147j93981
$$ 1766740 1875034 1557594 688154 -175867 -176813 753907 1777635 2185297 2062150 1868169
38390A868169j4658J70942K65030J94000o98j82595m14962q11128r88955m00257
$$ 1868169 1853511 2024453 2289483 2483483 2482785 2300190 1885228 1074100 85145 -315112
38380c15112N51788O65008k93617r99945n15120K53415J25580l30973J36906J094011
$$ -315112 236676 901684 608067 -391878 -906998 -653583 -528003 -858976 -722070 371941
38370C71941R19026n13227j463183r02994J40237L62982n2330j97679R8694L95250
$$ 371941 1290967 777740 -685443 -1588437 -1448200 -1085218 -1137548 -1335227 -1236533 -841283
38360h41283M87566M12328J31546k27171k75559N5897K93016J15504j88672k41373
$$ -841283 -353717 58611 190157 -37014 -312573 -256676 36340 151844 -36828 -278201
38350b78201l2592L61131Q97546J160015N66450o14812j196085n61605M18315
$$ -278201 -310793 50338 947884 2107899 2674349 2059537 863452 301847 720162
38341G20162N71074n8028n40100m22161j2765L40245N24382M25741N8792k21277
$$ 720162 1291236 1233208 693108 270947 258182 598427 1122809 1548550 1607342 1386065
38331A386065j64563o3798k20782k93765J31820N83191J95837q41121j261405
$$ 1386065 1221502 1157704 936922 643157 774977 1358168 1554005 712884 -548521
38322e48521m45214O17404O33655k46362o85596O959R76523R77667J0204o63245
$$ -548521 -993735 -376331 257324 10962 -674634 -667675 308848 1286515 1296719 633474
38312F33474j23005J025625J415132O24480m24421q17507p44543q47611j033379
$$ 633474 510469 1536094 2951226 3575706 3151285 2333778 1589235 741624 -291755
38303b91755o84203J49691O07496K33112l60432m04060o263K26426K08360L64880
$$ -291755 -975958 -826267 -218771 14341 -346091 -750151 -756414 -529988 -321628 43252
38293D3252P36740P71900J75699n55774p74829n10311k81976l03865l04563r5915
$$ 43252 779992 1551892 1727591 1171817 396988 -113323 -395299 -699164 -1003727 -1099642
38283a099642R5028r088l17104m89766l32834M1933L33948K80359q4942l62381
$$ -1099642 -1004614 -1013702 -1330806 -1820572 -2153406 -2111473 -1777525 -1497166 -1582108 -1944489
38273a944489j76675L10280N36442L01294O8503K60642N67528L90576j87410m17297
$$ -1944489 -2121164 -1810884 -1274442 -973148 -904645 -644003 -76475 314101 126691 -290606
38263b90606N3462O31404N91320R4156p6876K99358N01453q7295r59124j033344
$$ -290606 -237144 394260 985580 1079736 1002860 1302218 1803671 1716376 757252 -276092
38253b76092j20151P77882Q02312K73121l9456j13133m03830p33400m24736M45094
$$ -276092 -396243 381639 1183951 1457072 1417616 1304483 900653 167253 -257483 187611
38243A87611R05131M88468j02427j57390L6590n2754j91047R3304N12003M16222
$$ 187611 1092742 1581210 1478783 1321393 1357983 1305229 1114182 1207486 1719489 2135711
38233B135711j29809m80822m09601k47989j98083j81937k27737l70196l41847
$$ 2135711 2005902 1525080 1115479 867490 669407 487470 259733 -110463 -452310
38224d52310J7118K88778R5652j26635J98247O52380L86049l70448n43628J1026
$$ -452310 -435192 -146414 -50762 -177397 20850 673230 1059279 688831 145203 156229
38214A56229K48278k77397o47579j73320M32613L18345n0536K38904Q83097P56319
$$ 156229 404507 127110 -520469 -693789 -261176 57169 6633 245537 1128634 1884953
38204A884953k66991r76759m74503O22397R98121K73650n85478n14324K73658
$$ 1884953 1617962 641203 166700 789097 1787218 2060868 1475390 961066 1234724
38195A234724N50690k09946j002029p41723K4928n8899r08585r95201J74749J102219
$$ 1234724 1785414 1575468 573439 -168284 -143356 -202255 -1110840 -2106041 -1931292 -829073
38185h29073N85669l96067k85883O19528Q30328J11731l60934j02378L7934m21700
$$ -829073 -243404 -639471 -925354 -305826 524502 636233 275299 172921 210855 -210845
38175b10845o74265k7598Q44807Q70463J22986m06970k32842J48192R8449l79875
$$ -210845 -885110 -912708 -67901 802562 925548 518578 285736 433928 532377 152502
38165A52502p78847o84345j44255M14650N78021L09560m8096j32703R7289L63214
$$ 152502 -626345 -1310690 -1454945 -1040295 -462274 -152714 -200810 -333513 -236224 126990
38155A26990L63834O7533k85743m61668m30952k49651Q7125M87803O42870L88703
$$ 126990 490824 558357 272614 -189054 -620006 -869657 -782532 -294729 348141 736844
38145G36844O9836J19090L52432K10877k88173m86301j35789J81543M7937n0550
$$ 736844 806680 925770 1278202 1489079 1200906 714605 578816 760359 808296 757746
38135G57746M44064J105319J014871O3334q91579j096242o40504j53671j17987
$$ 757746 1201810 2307129 3322000 3385334 2493755 1397513 757009 603338 485351
38126D85351m62272o43557k52095L96056N94359K48665J1512K13295L44406J6596
$$ 485351 23079 -620478 -872573 -476517 117842 366507 378019 591314 935720 952316
38116I52316k91259q9004K01725Q855k82738J6488N53642L68548m88773r15011
$$ 952316 661057 572053 773778 782633 499895 516383 1070025 1438573 949800 34789
38106C4789m05900K85324L89437J29300J14728M08833N96628L68284j93762o29090
$$ 34789 -371111 -85787 303650 432950 547678 956511 1553139 1921423 1727661 1098571
38096A098571m46817J92006M06017k42705r01500n75734K53245L22646k94250
$$ 1098571 651754 843760 1249777 1007072 105572 -470162 -216917 105729 -188521
38087a88521k31201Q17748J378316N18212n55467l23798P27366R56346K8622q58899
$$ -188521 -419722 398026 1776342 2294554 1739087 1415289 2142655 3099001 3127623 2268724
38077B268724q96699n07330k82137j83444j9695J12263J19633Q1010n491j58109
$$ 2268724 1372025 864695 582558 399114 379419 491682 611315 692325 686834 528725
38067E28725j17156L16025O94757L81740l64990n54110P7436O05507L58813k5205
$$ 528725 411569 727594 1422351 1804091 1439101 884991 962427 1567934 1926747 1901542
38057A901542K52635O47236M6929j230163j553373l59522Q37367N61935n10899
$$ 1901542 2154177 2801413 2848342 1618179 64806 -294716 542651 1104586 593687
38048E93687o90370J61223O36245J47798l10772r4800l0414p61892j318158o06775
$$ 593687 -96683 64540 700785 848583 537811 443011 412597 -349295 -1667453 -2274228
38038b274228O13606P62475j14366n20128O7821N70494K75697j07139J20822M78152
$$ -2274228 -1660622 -898147 -1012513 -1532641 -1464820 -894326 -618629 -725768 -604946 -126794
38028a26794L03291j14645k09085j27905k57846l98299j60509L05577O16678P27757
$$ -126794 176497 61852 -147233 -275138 -532984 -931283 -1091792 -786215 -169537 558220
38018E58220O82056L37017j35408j00439N60743R39677K90728q13685j275176
$$ 558220 1240276 1577293 1441885 1341446 1902189 2841866 3132594 2318909 1043733
38009A043733r16607l60704M1102L01543K59436j28927l06572J58728O88031M76297
$$ 1043733 127126 -233578 -192476 109067 368503 239576 -66996 91732 779763 1256060
37999A256060j63666k96431P2847J22496k42689k81763Q8331M8223n77616q62917
$$ 1256060 1092394 795963 868810 991306 748617 466854 555185 603408 25792 -837125
37989h37125l88166l8919m35768p05284J47903J474448J750060O74613n48604
$$ -837125 -1225291 -1264210 -1699978 -2405262 -2257359 -782911 967149 1641762 1093158
37980A093158q51901l57878J58377J81733k03262m51328r2301O02273P72781J22080
$$ 1093158 241257 -116621 41756 223489 20227 -431101 -523402 78871 851652 973732
37970I73732n17909k81515M85943P47234K32907l62731m76042k08852J78326N69334
$$ 973732 455823 174308 660251 1407485 1640392 1277661 801619 592767 771093 1340427
37960A340427P24701L78261k60583o49871o44419n43912l96018P1253O90219P66764
$$ 1340427 2065128 2443389 2182806 1532935 888516 344604 -51414 19839 710058 1476822
37950A476822Q5821o26905o67715k59765n2854j72550k60692j31731P3201J51366
$$ 1476822 1562643 935738 268023 8258 -44596 -217146 -477838 -609569 -536368 -385002
37940c85002p4970o31881j064404o89389M02221J106727O79362j22031o2418P44281
$$ -385002 -459972 -1091853 -2156257 -2845646 -2443425 -1336698 -657336 -779367 -841785 -97504
37930i7504J026605L00332m41643k61018M24307N95641L5506o22890q35387n82551
$$ -97504 929101 1229433 787790 526772 951079 1546720 1582226 959336 123949 -458602
37920d58602j10065K95453L85969J35879k18777m65602n60181m17130Q3572P03113
$$ -458602 -568667 -273214 112755 248634 29857 -435745 -995926 -1413056 -1329484 -626371
37910f26371Q67268L90133j78784k74290m4397L7790l3776R3357M22634N46912
$$ -626371 240897 631030 452246 177956 133559 171349 137573 230930 653564 1200476
37900A200476K62847j81706m64495m75958k42529J19714L65070K99073K3723j73342
$$ 1200476 1463323 1281617 817122 341164 98635 218349 583419 882492 906215 732873
37890G32873j37603P1815K93727L21725M8012k85384k41679J91434M58284K02468
$$ 732873 595270 667085 960812 1282537 1330549 1045165 803486 994920 1453204 1655672
37880A655672j79218j47082J67298K64609J01675J4812J4476k01515n92906p28913
$$ 1655672 1476454 1329372 1496670 1761279 1862954 1877766 1892242 1690727 1097821 368908
37870C68908m17994Q4886M69814N52334K12713l49508n08060K7553N53115K27873
$$ 368908 -49086 35800 505614 1057948 1270661 921153 413093 440646 993761 1221634
37860A221634n74521o99751J9594M92580J00102l89728j59625L74125L89600L2142
$$ 1221634 647113 -52638 -33044 459536 559638 169910 10285 384410 774010 806152
37850H06152L1888L76114L18326l62554r09090n95790K78591O98929J20589q23968
$$ 806152 838040 1214154 1532480 1169926 260836 -334954 -56363 642566 763155 -60813
37840f0813r58964K2495J060602J003749J05954m04627j21576R6128l25562o91382
$$ -60813 -1019777 -997282 63320 1067069 1173023 768396 646820 742948 417386 -273996
37830b73996k34605M96971L72401o02852j220398o63546N66080J412544J389243
$$ -273996 -508601 -11630 360771 -242081 -1462479 -2126025 -1559945 -147401 1241842
37821A241842P52103j7180n73628p20650m08389J20176L47300j8146n25395m08573
$$ 1241842 1993945 1976765 1403137 682487 274098 394274 741574 723428 198033 -210540
37811b10540K71457M93912k44836r84172o65252J49958J42148n42411m70838O28585
$$ -210540 60917 554829 309993 -674179 -1339431 -1189473 -1047325 -1589736 -2060574 -1431989
37801a431989J275920O09588k47957q2114N45919M66639j88769n17129m09385
$$ -1431989 -156069 453519 205562 123448 669367 1136006 947237 430108 20723
37792B0723l06934r9095M48299P39374J27570p79053q49305j26529M03878M01539
$$ 20723 -286211 -385306 62993 802367 929937 150884 -698421 -824950 -421072 -19533
37782a9533K82117N9338n54377j045782n19465P18187J319423Q10011R9742j27755
$$ -19533 262584 321922 -232455 -1278237 -1797702 -1079515 239908 1049919 1149661 1021906
37772A021906k53647n76061n67884R5489P62137P44489K88530M960k6560l6963
$$ 1021906 768259 192198 -375686 -280197 481940 1226429 1514959 1519919 1493359 1456396
37762A456396j9374O9050K0448k41872l96902k48380j24584l27735n03015n2363
$$ 1456396 1437022 1506072 1526520 1284648 887746 639366 514782 187047 -315968 -368331
37752c68331R05444J396681O12933r99523j932626j195749M24523J207651N99547
$$ -368331 537113 1933794 2546727 1547204 -385422 -1581171 -1156648 51003 650550
37743F50550k93098m82062l10609l06806k881R88943J691883J019187l15073p05922
$$ 650550 357452 -124610 -435219 -742025 -744906 244037 1935920 2955107 2640034 1934112
37733A934112p8783K33662j92600m38177j62942j73671p20719q91404k54892L63591
$$ 1934112 1855329 2088991 1896391 1458214 1295272 1121601 400882 -490522 -745414 -381823
37723c81823L51430J87335K59393J57133k14376j62087M42838O81390K23489N2733
$$ -381823 -30393 156942 416335 573468 359092 197005 639843 1321233 1544722 1597455
37713A597455O46979Q99312O5448n85534L69601K029281K290649Q73492m64953
$$ 1597455 2244434 3143746 3209194 2623660 2993261 5022542 7313191 8186683 7721730
37704G721730n36135k1780m4157o67931j208496j246547r31283o22537m54560
$$ 7721730 7185595 7163815 7119658 6451727 5243231 3996684 3065401 2442864 1988304
37695A988304k34999J36894L09986p405l33500K1512P27784P75817J30052j61323
$$ 1988304 1753305 1890199 2200185 2192780 1859280 1880792 2608576 3384393 3514445 3353122
37685C353122K15031K72656m88568j142537r54190n58865n97591n53396m6596
$$ 3353122 3568153 3840809 3352241 2209704 1255514 696649 99058 -454338 -500934
37676e00934J09196n12330o58456O91729K263912K131770N47211o76863q67526
$$ -500934 -391738 -904068 -1562524 -870795 1393117 3524887 4072098 3395235 2527709
37667B527709p21554m79599J37836N70135o465r13855o90693M89026R79092K67110
$$ 2527709 1806155 1326556 1464392 2034527 2028062 1114207 423514 912540 1891632 2158742
37657B158742m43111m07334k57594m32018m41354j38259j10741l69202j76081
$$ 2158742 1715631 1308297 1050703 618685 177331 39072 -71669 -440871 -616952
37648f16952M16415M38254j70333k77869L57348M97175l26405p71571L0673Q38626
$$ -616952 -200537 237717 67384 -210485 146863 644038 317633 -453938 -423265 415361
37638D15361L29544o55424n15972N07097Q60122J83699l73009j31023K78004J57986
$$ 415361 744905 89481 -426491 80606 940728 1124427 751418 620395 898399 1056385
37628A056385k81772m79563l04773j2473J65228K06985K52395L73049L95411J63328
$$ 1056385 774613 295050 -9723 -22196 143032 350017 602412 975461 1370872 1534200
37618A534200q5051j1648K00998Q8417k47357k38120J20334J59951l04509n58621
$$ 1534200 1449149 1437501 1638499 1726916 1479559 1241439 1361773 1521724 1217215 658594
37608F58594j22002M59780M33223j68941p66667r11239m28509M91848J092861
$$ 658594 536592 996372 1429595 1260654 493987 -417252 -845761 -353913 738948
37599G38948O51810m36767r60001n55737j74722m76685p82287k84434O02916R35213
$$ 738948 1390758 953991 -6010 -561747 -736469 -1213154 -1995441 -2279875 -1676959 -741746
37589g41746N99665J84459L979l7570k9717o1900k35177k97367J61317Q29848
$$ -741746 -142081 42378 46357 8787 -20930 -82830 -318007 -615374 -454057 375791
37579C75791P66612k03889j033881r17353l29138j0429J30632L86318M80065K64855
$$ 375791 1142403 938514 -95367 -1012720 -1341858 -1352287 -1221655 -835337 -355272 -90417
37569i0417K62615O24544N32262l64054r50153l10067O12607M61092l05332k92964
$$ -90417 172198 796742 1329004 964950 14797 -295270 317337 778429 473097 180133
37559A80133L91665M41612k77878n64159n4200K52422j36092m81817l29889k03928
$$ 180133 571798 1013410 735532 171373 117173 369595 233503 -248314 -578203 -782131
37549g82131l33082j35784M73498O39171P6231k80226J10822M00622r9630n46939
$$ -782131 -1115213 -1250997 -777499 -138328 -62097 -342323 -231501 169121 69491 -477448
37539d77448P5157J136495J236068L47900k40096R1025O01300N37194R3781k57028
$$ -477448 -402291 734204 1970272 2318172 2078076 2169101 2770401 3307595 3401376 3144348
37529C144348n47025r47167j180826q51152j32734L13630J23446l47565m73026
$$ 3144348 2597323 1650156 469330 -381822 -514556 -200926 -77480 -425045 -898071
37520h98071q2047M01058M98119J92375j66182l30820l62853l92299l43118j1730
$$ -898071 -980118 -579060 -80941 111434 -54748 -385568 -748421 -1140720 -1483838 -1495568
37510a495568N79470J005187Q00303Q2650m20499k35474J69217j1537p36742j112980
$$ -1495568 -916098 89089 889392 972042 551543 316069 485286 473749 -262993 -1375973
37500a375973o26243K18561O77686O21145L58022J55685J97694M75951N12025
$$ -1375973 -2002216 -1783655 -1105969 -484824 -126802 28883 226577 702528 1214553
37491A214553j40386r00944n96354O86399J287824L04878q82324n95174N83662
$$ 1214553 1074167 173223 -423131 263268 1551092 1855970 973646 378472 962134
37482I62134P76759k73186j013789o39131o5312j04503k89208j00066K340m24879
$$ 962134 1738893 1465707 451918 -187213 -252525 -357028 -646236 -746302 -743962 -1168841
37472a168841q11476m34120M31843R59435Q57529M41120P2973m962K68281M98690
$$ -1168841 -1980317 -2414437 -1982594 -1023159 -165630 275490 348463 343501 611782 1110472
37462A110472J10396p37240j046107k69204P66840Q16506j61547r04808l88396
$$ 1110472 1220868 483628 -562479 -831683 -64843 751663 590116 -314692 -703088
37453g03088R00607J460769N54008p77496r22784J40643P69162R5457n89189P7135
$$ -703088 197519 1658288 2212296 1434800 512016 652659 1421821 1517278 928089 1005224
37443A005224J116932O05802j104329j678188l88111P87070L37601n68385k80381
$$ 1005224 2122156 2727958 1623629 -54559 -442670 344400 682001 113616 -166765
37434a66765O63136P02595j19245m87857p1280K40408J9546k51008k93767l40948
$$ -166765 496371 1198966 1079721 591864 520584 760992 780538 529530 235763 -105185
37424a05185l53151k6412M12955L90245j9497j51221J66280L94192J97237j45843
$$ -105185 -458336 -484748 -71793 318452 298955 147734 314014 708206 905443 759600
37414G59600k89332j72635J37644M14613K44750l94073p98969m43419J32624J21597
$$ 759600 470268 297633 435277 849890 1094640 700567 -98402 -541821 -409197 -287600
37404b87600k50368k06345J40533N0130l00094N6878J040623J250778N2996j318943
$$ -287600 -537968 -744313 -603780 -553650 -853744 -796866 243757 1494535 1547531 228588
37394B28588j470544o13038J66051M65405M99132K50792k81927n49325j52832
$$ 228588 -1241956 -1854994 -1688943 -1223538 -724406 -473614 -755541 -1304866 -1457698
37385a457698L16729Q7729n00280n02093J05426M72238L31810K69587M51187K59536
$$ -1457698 -1140969 -1053240 -1553520 -2055613 -1950187 -1477949 -1146139 -876552 -425365 -165829
37375a65829m37358p64670k13609M10890K46381j92371J18801R09476R00103j92898
$$ -165829 -603187 -1367857 -1581466 -1170576 -924195 -1116566 -997765 -88289 811814 618916
37365F18916j126687r02652p2845K68230L0315o6008K36541M50890K23329j60447
$$ 618916 -507771 -1410423 -1483268 -1215038 -1184723 -1250731 -1014190 -563300 -339971 -500418
37355e00418k47024J2250K79097K04358k37296o58292n97732q2522L36593K82182
$$ -500418 -747442 -735192 -456095 -251737 -489033 -1147325 -1745057 -1827579 -1490986 -1208804
37345a208804J9579k1496J25221J87283J88504K59778J86837k32498n59759j73797
$$ -1208804 -1189225 -1210721 -1085500 -898217 -709713 -449935 -263098 -495596 -1055355 -1229152
37335a229152O62738R54656L44550l71823l69621J92042O31882O78088N09605
$$ -1229152 -566414 388242 732792 360969 -8652 183390 815272 1493360 2002965
37326B002965K65328n4796m16406p46532r20659p03435p1162L97363M9455p68369
$$ 2002965 2268293 2213497 1797091 1050559 129900 -573535 -644697 -247334 -197879 -966248
37316i66248q78841J24916J164689J123743L56817r250K04487J54240n41996j176613
$$ -966248 -1845089 -1720173 -555484 568259 925076 915826 1120313 1274553 732557 -444056
37306d44056j002196k45637K67445J57585j38307M0566P51166J301369J055103
$$ -444056 -1446252 -1691889 -1424444 -1266859 -1405166 -1364600 -613434 687935 1743038
37297A743038K74145k11125j52013j25733m57433o16161j69066L26147J25946
$$ 1743038 2017183 1806058 1654045 1528312 1070879 454718 285652 611799 737745
37288G37745m77039o06133j91357K6771k03346l03022L3929K95769P6730j92194
$$ 737745 260706 -345427 -536784 -510013 -713359 -1016381 -982452 -686683 -609953 -802147
37278h02147M1042N21924N68205R6949k94642k13122M5989K6999j99939j70741
$$ -802147 -761105 -239181 329024 425973 131331 -81791 -35802 -8803 -208742 -379483
37268c79483K38492N42706L00414j95579k57381K19304N70678K88810l05882n67673
$$ -379483 -140991 401715 702129 506550 249169 468473 1039151 1327961 1022079 454406
37258D54406l20308J54211N56965O40155J94861n62244q78070k82096O45281Q56252
$$ 454406 134098 288309 845274 1485429 1680290 1118046 239976 -42120 603161 1459413
37248A459413J21020p54920r80679n87787j29476L5444P492R6524M02443O24698
$$ 1459413 1580433 825513 -155166 -742953 -872429 -836985 -829493 -732969 -330526 294172
37238B94172M10694q8560l23459j32079l038k83910n76340l40297K81541P26424
$$ 294172 704866 616306 292847 160768 157730 -126180 -702520 -1042817 -761276 -34852
37228c4852P80040N98475K73760j12627k99032k21121k65359o21310p74041k79372
$$ -34852 745188 1343663 1617423 1504796 1205764 984643 719284 97974 -676067 -955439
37218i55439L67210M23641J11106K09332O71039O67618L57n36860l70634J42575
$$ -955439 -588229 -164588 -53482 155850 826889 1494507 1494864 958004 587370 729945
37208G29945M42284M43498K61197p2615l93123m66083l81642l48428j43798N36064
$$ 729945 1172229 1615727 1876924 1804309 1411186 945103 563461 215033 71235 607299
37198F07299J238312J128593K75028l40756k67944j37404m98984r83007r88080
$$ 607299 1845611 2974204 3249232 2908476 2640532 2503128 2004144 1021137 33057
37189C3057m51607L71240J148612J267175K79505j124024j540109o80231J81147
$$ 33057 -418550 -47310 1101302 2368477 2647982 1523958 -16151 -696382 -515235
37180e15235Q7794l01731j1248O46803P18796J24985m61987p11842o91859l01985
$$ -515235 -427441 -729172 -740420 -93617 625179 750164 288177 -423665 -1115524 -1417509
37170a417509M31242Q80560N28694j46407l24084p4408p3892l42465k26369L90077
$$ -1417509 -986267 -105707 422987 276580 -47504 -121912 -195804 -538269 -764638 -374561
37160c74561P49225K87743n92952j039937o43343K79081J014327J065389N96117
$$ -374561 374664 662407 69455 -970482 -1613825 -1334744 -320417 744972 1341089
37151A341089J52183q3825l53490n71947k26882O21429J028154M69280k75876
$$ 1341089 1493272 1409447 1055957 484010 257128 878557 1906711 2375991 2100115
37142B100115l30108r1151l91359r02406o53963J83871M27287j96807n81436P372
$$ 2100115 1770007 1678856 1287497 385091 -268872 -85001 342286 145479 -435957 -428585
37132d28585Q68988J034912N33294o7485n64276r29505q57178k08601M68571M95303
$$ -428585 440403 1475315 2008609 1941124 1376848 447343 -409835 -618436 -149865 345438
37122C45438n6991n02803m11099L7744M39967N69381M26542J48359q5067j63103
$$ 345438 288447 -214356 -625455 -587711 -147744 421637 848179 996538 911471 748368
37112G48368r8106K1660R2845N8001j6648J6712J92109L64459M00504K97074O6108
$$ 748368 650262 671922 764767 822768 806120 822832 1014941 1379400 1779904 2076978 2143086
37101B143086k71271n11067m02331p7808K7172j45460j33160K59091N49737L34027
$$ 2143086 1871815 1360748 958417 880609 907781 762321 629161 888252 1437989 1772016
37091A772016q6187k92449m16571o47416o52432k21542N6928l49851q47372n07548
$$ 1772016 1685829 1393380 976809 329393 -323039 -544581 -487653 -837504 -1684876 -2192424
37081b192424M10588Q43936O04293M64949O32894M28649l23168q23152n95014
$$ -2192424 -1781836 -937900 -333607 131342 764236 1192885 869717 46565 -548449
37072e48449j61705m028J17607L41898K55060j76977k48160K52300M52418j54411
$$ -548449 -710154 -714182 -596575 -254677 383 -176594 -424754 -172454 279964 125553
37062A25553o57450j33554P53161P65379P3035j27709L65917N30010q8024o53436
$$ 125553 -531897 -665451 87710 853089 926124 798415 1164332 1694342 1606318 952882
37052I52882m67445k7865j13176n80700p07287k58975L44542O78882O82551N01477
$$ 952882 485437 457572 344396 -236304 -943591 -1202566 -858024 -179142 503409 1004886
37042A004886K87955J09881j06908m62789q15300q01790l09161K25046K44010
$$ 1004886 1292841 1402722 1295814 833025 17725 -784065 -1093226 -868180 -624170
37033f24170k13072m91506j35513M92167O58930K26515j94280j17535J86803J89965
$$ -624170 -837242 -1328748 -1464261 -972094 -313164 -86649 -280929 -398464 -211661 -21696
37023b1696j10515l03681k37713j24389r8670j16689j81649k19749J06682Q92846
$$ -21696 -132211 -435892 -673605 -797994 -896664 -1013353 -1195002 -1414751 -1308069 -415223
37013d15223J456082J045344L3642m66802k55018k75931q91194j076485q9282
$$ -415223 1040859 2086203 2119845 1653043 1398025 1122094 230900 -845585 -934867
37004i34867J078260J011277m3121o42006l34854q3454n06580r51125o70612M6789
$$ -934867 143393 1154670 1111549 469543 134689 51235 -455345 -1406470 -2077082 -2030293
36994b030293M57127L91868J88227O4899M3456J60837L57215L93654J95037M2564
$$ -2030293 -1573166 -1181298 -993071 -928172 -884716 -723879 -366664 26990 222027 264591
36984B64591J37544K05202j39341p80594j176353r81253l46034L62747Q88829
$$ 264591 402135 607337 467996 -312598 -1488951 -2470204 -2816238 -2453491 -1564662
36975a564662J096160Q84702K89733l63250n87172j83595M57535O98997L73043
$$ -1564662 -468502 416200 705933 342683 -244489 -428084 29451 728448 1101491
36966A101491l3615n1823J35252Q290m92283q70919p58406k92570K59565Q36602
$$ 1101491 1067876 1016053 1151305 1159595 667312 -203607 -962013 -1254583 -995018 -158416
36956a58416J307696J248912M28292o54761j171739r09578m11707j14150J82187
$$ -158416 1149280 2398192 2826484 2171723 999984 90406 -321301 -435451 -253264
36947b53264O96368R73549M01941p12028j260188p17455J43363K96853k00154
$$ -253264 443104 1416653 1818594 1106566 -153622 -871077 -727714 -430861 -631015
36938f31015m34162N9885Q05060J132071Q74969K66952l52262n91680k43997L13848
$$ -631015 -1065177 -1005292 -200232 931839 1806808 2073760 1721498 1129818 885821 1199669
36928A199669L56591k83677q81496o89844J10882O55326M25624k36425n73119
$$ 1199669 1556260 1272583 391087 -298757 -187875 467451 893075 656650 83531
36919H3531j91398N37986Q07060K32091o32659r06351m76196n8065j01101j87641
$$ 83531 -107867 430119 1237179 1469270 836611 -69740 -545936 -604001 -705102 -892743
36909h92743J99726Q46296J185702J088963P57393J83872o54850j286224j114369
$$ -892743 -693017 153279 1338981 2427944 3185337 3369209 2714359 1428135 313766
36900C13766l04794K96585K28781r8288j22585J27211K51726J02360j18197k03813
$$ 313766 8972 305557 534338 436050 313465 440676 692402 794762 676565 472752
36890D72752j33671L4394K61898M61828M32371K6686n23422o33977k0104P37449
$$ 472752 339081 373475 635373 1097201 1529572 1556258 1032836 398859 378755 1116204
36880A116204P04070k15374j041532r30973j90473K88489K10802p758j5620J57107
$$ 1116204 1820274 1604900 563368 -367605 -558078 -269589 -58787 -66545 -82165 74942
36870G4942M04988O27599N82071J53652k90693k98086O334J63445J72358L91750
$$ 74942 479930 1107529 1689600 1843252 1552559 1254473 1260807 1424252 1596610 1988360
36860A988360O76401L87686n31410j232710j105209o15625n00547o39479l84107
$$ 1988360 2664761 3052447 2521037 1288327 183118 -432507 -933054 -1572533 -1956640
36851a956640L06421P76751O66164L53309K77581L23325J59162j42905j97878
$$ -1956640 -1650219 -873468 -207304 146005 423586 746911 906073 763168 565290
36842E65290Q2954L01576P9700m35520p28922n14935l0767K70490J97178m8860
$$ 565290 648244 949820 1029520 594000 -134922 -649857 -680624 -410134 -212956 -261816
36832b61816j31359O4837K93911K07113j72166l61964j5898N39250P11573M91444
$$ -261816 -393175 -328338 -34427 172686 520 -361444 -377342 161908 873481 1364925
36822A364925L85227M89004K88114l76865q43717o25889k67971n16424j093025
$$ 1364925 1750152 2239156 2527270 2150405 1306688 680799 412828 -103596 -1196621
36813a196621j106074m12528K69753M82055M27304K84364l4954l45175k12655
$$ -1196621 -2302695 -2715223 -2445470 -1963415 -1536111 -1251747 -1286701 -1631876 -1844531
36804a844531K74301M90732K54312R9052L12190M52222J92438r5771p4031m6467
$$ -1844531 -1570230 -1079498 -825186 -726134 -413944 38278 230716 134945 60914 14447
36794A4447k59960k60918L07610P96447L18695q50742j502143j037899m0984O97566
$$ 14447 -245513 -506431 -198821 597626 916321 65579 -1436564 -2474463 -2515447 -1817881
36784a817881R84798R30160N42264k8111l15337l2511M81171O31861K76906k01861
$$ -1817881 -833083 97077 639341 611230 295893 263382 744553 1376414 1653320 1451459
36774A451459m73303o20440q16555q65217m03824M05638P99156L51822l05147
$$ 1451459 978156 357716 -458839 -1324056 -1727880 -1322242 -523086 -171264 -476411
36765d76411k40057M46037P20581J33696n18294l93383K15610M78349K84727J81339
$$ -476411 -716468 -270431 450150 583846 65552 -327831 -112221 366128 650855 832194
36755H32194L37684L16904j72725q79064j353243j255147m39169P50051J407700
$$ 832194 1169878 1486782 1314057 434993 -918250 -2173397 -2612566 -1862515 -454815
36746d54815R31677o9090l85843K17428P37100L95404l61780o76158m10233L5088
$$ -454815 476862 407772 21929 239357 976457 1371861 1010081 333923 -76310 -41222
36736d1222M72038Q53195Q40431J76798o64923q75388l46244K50832M43407M31331
$$ -41222 430816 1284011 2124442 2301240 1636317 760929 414685 665517 1108924 1540255
36726A540255M55530L01245k25853p80593q82266n75437k71568j20210L2411J86605
$$ 1540255 1995785 2297030 2071177 1290584 408318 -167119 -438687 -558897 -526486 -339881
36716c39881J80127J26946L53217P64702P81395J90776l74450k44687L25906N45625
$$ -339881 -159754 -32808 320409 1085111 1866506 2057282 1682832 1438145 1764051 2309676
36706B309676K35100m9013k5840j17468o07040r95251o90221O9300N44177N08694
$$ 2309676 2544776 2495763 2469923 2352455 1745415 750164 59943 129243 673420 1182114
36696A182114L51818K86629R6637k60373m06430j57370R6381m3978m04269n68000
$$ 1182114 1533932 1820561 1917198 1656825 1250395 1093025 1189406 1145428 741159 173159
36686A73159m69267k79581o273L37900M17422k2636n86675o47567k48948L9302
$$ 173159 -296108 -575689 -581962 -244062 173360 150724 -435951 -1083518 -1332466 -1293164
36676a293164R6327K99532N61573K94234l62996l55945N95401J174000L39917
$$ -1293164 -1196837 -897305 -335732 -41498 -404494 -760439 -165038 1008962 1348879
36667A348879q79252q15497K70653O65774m2759m76455J28205Q04674O71100K06091
$$ 1348879 469627 -345870 -75217 590557 547798 71343 199548 1004222 1675322 1881413
$$ [...]
##END NTUPLES=NMR SPECTRUM
##END=
