##TITLE=31Pdec_LR-669K1M-Et2O
 CDCl3, 74 sc
 11.4.2019
##JCAMPDX= 6.0         $$ Bruker NMR JCAMP-DX V2.0
##DATA TYPE= NMR SPECTRUM
##DATA CLASS= NTUPLES
##ORIGIN= UXNMR, Bruker Analytische Messtechnik GmbH
##OWNER= root
$$ XWIN-NMR		Version 3.5
$$ Thu Apr 11 14:24:58 2019 Russian Standard Time (UT+4h)  she@DPX200
##.OBSERVE FREQUENCY= 81.013821
##.OBSERVE NUCLEUS= ^31P
##.ACQUISITION MODE= SIMULTANEOUS
##.ACQUISITION SCHEME= undefined
##.AVERAGES= 74
##.DIGITISER RES= 17
##SPECTROMETER/DATA SYSTEM= spect
##.PULSE SEQUENCE= zgpg30
##.SOLVENT NAME= CDCl3
##.SHIFT REFERENCE= (INTERNAL, CDCl3, 0, 182.463)
##AUDIT TRAIL= $$ (NUMBER, WHEN, WHO, WHERE, WHAT)
$$ ##TITLE= Audit trail, XWIN-NMR		Version 3.5
$$ ##JCAMPDX= 5.01
$$ ##ORIGIN= Bruker BioSpin GmbH
$$ ##OWNER= she
$$ F:/spectra/data/she/nmr/P31/1/pdata/1/auditp.txt
$$ ##AUDIT TRAIL=  $$ (NUMBER, WHEN, WHO, WHERE, WHAT)
(   1,<2019-04-11 14:23:47.14 +0400>,<she>,<DPX200>,
      <continue with go, POWCHK disabled, PULCHK disabled
       configuration hash MD5:
       00 E9 B6 7A A2 85 ED C7 34 08 36 98 17 FE 4E 26
       data hash MD5: 32K
       C3 29 59 E0 CE 36 BB FA 26 6A 32 3F 21 19 EC FC>)
(   2,<2019-04-11 14:23:53.46 +0400>,<she>,<DPX200>,
      <Start of raw data processing
       efp BC_mod = 2 LB = 1 FT_mod = 6 PKNL = 1 PHC0 = -1817.201 PHC1 = 107.999 SI = 64K 
       data hash MD5: 64K
       19 7B 07 A5 5A 6D C3 C8 DF 05 EA 78 47 C9 81 DF>)
(   3,<2019-04-11 14:24:12.29 +0400>,<she>,<DPX200>,
      <pk PHC0 = -11.24972 PHC1 = 30.2 
       data hash MD5: 64K
       A1 78 5B C9 4D 1A 32 EF D2 20 2B 59 B9 DB 4F 3F>)
(   4,<2019-04-11 14:24:15.17 +0400>,<she>,<DPX200>,
      <abs ABSG = 5 
       data hash MD5: 64K
       A5 81 4B D8 50 EF A4 E5 21 84 2D 99 32 03 5E F3>)
$$ ##END=
$$ 
$$ hash MD5
$$ 3D AD 9B 80 48 A7 2E 5F 18 22 35 2E 6A 9D 03 70
##$RELAX= 
##$RELAX= 
##$RELAX= 
##$RELAX= 
##$RELAX= 
##$RELAX= 
##$RELAX= 
##$RELAX= 
$$ Bruker specific parameters
$$ --------------------------
##$DU= <F:/spectra>
##$EXPNO= 1
##$NAME= <P31>
##$PROCNO= 1
##$TYPE= <nmr>
##$USER= <she>
##$AMP= (0..31)
100 100 100 100 100 100 100 100 100 100 100 100 100 100 100 100 100 100 
100 100 100 100 100 100 100 100 100 100 100 100 100 100 
##$AQSEQ= 0
##$AQ_mod= 1
##$AUNM= <au_zg>
##$AUTOPOS= <>
##$BF1= 81.014009
##$BF2= 200.13
##$BF3= 200.13
##$BF4= 200.13
##$BF5= 200.13
##$BF6= 200.13
##$BF7= 200.13
##$BF8= 200.13
##$BYTORDA= 1
##$CFDGTYP= 0
##$CFRGTYP= 5
##$CHEMSTR= <none>
##$CNST= (0..31)
1 1 145 1 1 1 1 1 1 1 1 1 1 1 1 1 1 1 1 1 1 1 1 1 1 1 1 1 1 1 1 1 
##$CPDPRG= <waltz16>
##$CPDPRG1= <>
##$CPDPRG2= <waltz16>
##$CPDPRG3= <>
##$CPDPRG4= <mlev>
##$CPDPRG5= <mlev>
##$CPDPRG6= <mlev>
##$CPDPRG7= <mlev>
##$CPDPRG8= <mlev>
##$CPDPRGB= <>
##$CPDPRGT= <>
##$D= (0..31)
0 1 0 0 0 0 0 0 0 0 0 0.03 2e-05 3e-06 0 0 0 0 0 0 0 0 0 0 0 0 0 0 0 0 
0 0 
##$DATE= 1554978111
##$DBL= (0..7)
120 120 120 11 120 120 24 19 
##$DBP= (0..7)
150 150 150 150 150 150 150 150 
##$DBP07= 0
##$DBPNAM0= <>
##$DBPNAM1= <>
$$ [...]
##$SUBNAM3= <"">
##$SUBNAM4= <"">
##$SUBNAM5= <"">
##$SUBNAM6= <"">
##$SUBNAM7= <"">
##$SUBNAM8= <"">
##$SUBNAM9= <"">
##$SW= 369.568048894756
##$SWIBOX= (0..15)
0 1 3 0 0 0 0 0 0 0 0 0 0 0 0 0 
##$SW_h= 29940.119760479
##$TD= 32768
##$TD0= 1
##$TE= 0
##$TE2= 300
##$TE3= 300
##$TEG= 300
##$TL= (0..7)
0 120 53 12 22 120 120 120 
##$TP= (0..7)
150 150 150 150 150 150 150 150 
##$TP07= 0
##$TPNAME0= <>
##$TPNAME1= <>
##$TPNAME2= <>
##$TPNAME3= <>
##$TPNAME4= <>
##$TPNAME5= <>
##$TPNAME6= <>
##$TPNAME7= <>
##$TPOAL= (0..7)
0.5 0.5 0.5 0.5 0.5 0.5 0.5 0.5 
##$TPOFFS= (0..7)
0 0 0 0 0 0 0 0 
##$TUNHIN= 0
##$TUNHOUT= 0
##$TUNXOUT= 0
##$USERA1= <user>
##$USERA2= <user>
##$USERA3= <user>
##$USERA4= <user>
##$USERA5= <user>
##$V9= 5
##$VALIST= <valist>
##$VCLIST= <CCCCCCCCCCCCCCC>
##$VD= 0
##$VDLIST= <DDDDDDDDDDDDDDD>
##$VPLIST= <PPPPPPPPPPPPPPP>
##$VTLIST= <TTTTTTTTTTTTTTT>
##$WBST= 1024
##$WBSW= 4
##$XGAIN= (0..3)
0 0 0 0 
##$XL= 0
##$YL= 0
##$YMAX_a= 47466
##$YMIN_a= -68724
##$ZGOPTNS= <>
##$ZL1= 120
##$ZL2= 120
##$ZL3= 120
##$ZL4= 120
##$ABSF1= 182.463
##$ABSF2= -187.1042
##$ABSG= 5
##$ABSL= 3
##$ALPHA= 0
##$AQORDER= 0
##$ASSFAC= 0
##$ASSFACI= 0
##$ASSFACX= 0
##$ASSWID= 0
##$AUNMP= <proc_1d>
##$AZFE= 0.1
##$AZFW= 0.5
##$BCFW= 0
##$BC_mod= 2
##$BYTORDP= 0
##$COROFFS= 0
##$CY= -3
##$DATMOD= 1
##$DC= 0
##$DFILT= <>
##$DTYPP= 0
##$F1P= 0
##$F2P= 0
##$FCOR= 1
##$FTSIZE= 65536
##$FT_mod= 6
##$GAMMA= 0
##$GB= 0
##$INTBC= 1
##$INTSCL= 5.30512e-09
##$ISEN= 30
##$LB= 1
##$LEV0= 0
##$LPBIN= 0
##$MAXI= 10000
##$MC2= 0
##$MEAN= 0
##$ME_mod= 0
##$MI= 50
##$NCOEF= 0
##$NC_proc= -5
##$NLEV= 6
##$NOISF1= 182.463
##$NOISF2= 159.3651
##$NSP= 0
##$NTH_PI= 0
##$NZP= 0
##$OFFSET= 182.463
##$PC= 4
##$PHC0= -1828.451
##$PHC1= 138.199
##$PH_mod= 1
##$PKNL= yes
##$PPARMOD= 0
##$PSCAL= 0
##$PSIGN= 0
##$REVERSE= no
##$SF= 81.0140089999434
##$SI= 65536
##$SIGF1= 159.3651
##$SIGF2= -187.1042
##$SINO= 113.3802
##$SIOLD= 16384
##$SREGLST= <1H.CDCl3>
##$SSB= 0
##$STSI= 65536
##$STSR= 0
##$SW_p= 29940.119760479
##$SYMM= 0
##$S_DEV= 0
##$TDeff= 32768
##$TDoff= 0
##$TI= <>
##$TILT= no
##$TM1= 0
##$TM2= 0
##$TOPLEV= 0
##$USERP1= <user>
##$USERP2= <user>
##$USERP3= <user>
##$USERP4= <user>
##$USERP5= <user>
##$WDW= 1
##$XDIM= 65536
##$YMAX_p= 455109966
##$YMIN_p= -21730119
$$ End of Bruker specific parameters
$$ ---------------------------------
##NTUPLES= NMR SPECTRUM
##VAR_NAME=  FREQUENCY,     SPECTRUM/REAL,   SPECTRUM/IMAG
##SYMBOL=    X,             R,               I
##VAR_TYPE=  INDEPENDENT,   DEPENDENT,       DEPENDENT
##VAR_FORM=  AFFN,          ASDF,            ASDF
##VAR_DIM=   65536,         65536,           65536
##UNITS=     HZ,            ARBITRARY UNITS, ARBITRARY UNITS
##FACTOR=    0.456856943014862, 1,           1
##FIRST=     14782.0589164792, 0,            0
##LAST=      -15158.0608439998, 0,           0
##MIN=       -15158.0608439998, -21730119,   0
##MAX=       14782.0589164792, 455109966,    0
$$ Real data points
##PAGE= N=1
##DATA TABLE= (X++(R..R)), XYDATA
$$ [...]
42355C897200R05227p82278j101418M01831J206483J17572r41413l89812M83755
$$ 3897200 4802427 4020149 2918731 3320562 4527045 4644617 3703204 3313392 3797147
42346C797147m2776j214971j161435J01078Q65337L63758m32660n78646l53730
$$ 3797147 3754371 2539400 1377965 1479043 2344380 2708138 2275478 1696832 1343102
42337A343102l59812m41064j22577M97328R88970J349815J740266J668923M65247
$$ 1343102 983290 542226 419649 916977 1905947 3255762 4996028 6664951 7130198
42328G130198j261050j778046n12827Q47535N60651p26402j078845j57035O68865
$$ 7130198 5869148 4091102 3578275 4425810 4986461 4260059 3181214 3024179 3693044
42319C693044P33166O78611N94998l61577j928532k343068j002273K79779m6985
$$ 3693044 4426210 5104821 5699819 5338242 3409710 1066642 64369 344148 297163
42310B97163r54786p49378J43916K00943m18359j97088J080690J940797J470067
$$ 297163 -657623 -1407001 -1263085 -1062142 -1480501 -1677589 -596899 1343898 2813965
42301B813965L82117k89157l03212Q7220N18536N60046J89178M0841M37700O53753
$$ 2813965 3196082 2906925 2603713 2690933 3209469 3769515 3958693 3999534 4437234 5090987
42291E090987P6716n27734j37080P19166P19155j01487n31645k64788j47494m12278
$$ 5090987 5167703 4639969 4502889 5222055 5941210 5839723 5308078 5043290 4895796 4483518
42281D483518l31627K16451M03323p6795n94365q17240r65654p92872J29064J069813
$$ 4483518 4151891 4368342 4771665 4694870 4100505 3283265 2317611 1524739 1653803 2723616
42271B723616Q50898j6183Q1610R35918N99640j029083j481533J40097J122474
$$ 2723616 3574514 3558331 3639941 4575859 5175499 4146416 2664883 2804980 3927454
42262C927454o48542k919932k320758M62842J967733J249690M74306O72493M60121
$$ 3927454 3278912 358980 -1961778 -1498936 468797 1718487 2192793 2865286 3325407
42253C325407n89495o41383J094663K511397J749001L4643n16987k10940o91940
$$ 3325407 2735912 2094529 3189192 5700589 7449590 7484233 6967246 6756306 6064366
42244F064366j722914j479820K50449J423834P27602n19229l36003J164901K066471
$$ 6064366 4341452 2861632 3112081 4535915 5263517 4744288 4408285 5573186 7639657
42235G639657J231213l81504j096946n94424r9888n99977j431958j165534L21844
$$ 7639657 8870870 8489366 7392420 6797996 6698108 6098131 4666173 3500639 3822483
42226C822483J466844J029464k67921q28701l88547r7221n34241q69758m12298
$$ 3822483 5289327 6318791 6050870 5222169 4833622 4736401 4202160 3332402 2920104
42217B920104J33578j43544p23558m50507M14074L91902q09982j573440p38358
$$ 2920104 3053682 2910138 2186580 1736073 2150147 2542049 1732067 158627 -579731
42208e79731N82911P04116p6152j16616Q57397J391754P28822m5342J43928P27028
$$ -579731 3180 707296 631144 514528 1371925 2763679 3492501 3447159 3591087 4318115
42198D318115O00072j68921p65307j006020j214156j216337n55219N20315J222115
$$ 4318115 4918187 4749266 3983959 2977939 1763783 547446 -7773 512542 1734657
42189A734657J276987J022307N92692j49563r20582j097597o10220n7260J68605
$$ 1734657 3011644 4033951 4626643 4477080 3556498 2458901 1848681 1791421 1960026
42180A960026K40003L22360L30708L79153P58449J220134R49543l62507j898895
$$ 1960026 2200029 2522389 2853097 3232250 3990699 5210833 6160376 5797869 3898974
42171C898974k518233j838509l36267J183120J970440J662331O17916l19144o20440
$$ 3898974 1380741 -457768 -794035 389085 2359525 4021856 4639772 4320628 3700188
42162C700188m09773J4586N00931P48353L18516o47710j218806p03357M02405
$$ 3700188 3290415 3305001 3805932 4554285 4872801 4225091 3006285 2302928 2705333
42153B705333R66873N23821l58837q19382m78590L32252Q40132N46828j26947
$$ 2705333 3672206 4196027 3837190 3017808 2539218 2871470 3711602 4258430 4131483
42144D131483k81976J71325K81351m33584r88001l33397Q06598P51309o40418
$$ 4131483 3849507 4020832 4302183 3868599 2880598 2547201 3353799 4105108 3464690
42135C464690j636510j059000K11945P32450L73321j20695m91365q06013o35812
$$ 3464690 1828180 769180 981125 1713575 2086896 1966201 1474836 668823 33011
42126C3011L42347J286820J024930j47018p52782k96775J86025N8152J41292J074907
$$ 33011 375358 1662178 2687108 2540090 1787308 1490533 1676558 1734710 1876002 2950909
42116B950909J871050J329415P4044k22585P05068J383504P37550n91049j292186
$$ 2950909 4821959 6151374 6225418 6002833 6707901 8091405 8828955 8237906 6945720
42107F945720q59462K34674J101723R92495l1673q92796o74980M0003o944o23415
$$ 6945720 6086258 6320932 7422655 8415150 8383477 7490681 6815701 6855704 6848760 6225345
42097F225345k76214J245943J913636L32797j833861j996118l17936P05929N7604
$$ 6225345 5949131 7195074 9108710 9441507 7607646 5611528 5293592 5999521 6057125
42088F057125n62930K50761J335084Q81029p22616j507202p35160M16588Q70658
$$ 6057125 5494195 5744956 7080040 7961069 7238453 5731251 4996091 5412679 6283337
42079F283337R62827J346264J676853J255623M65075N51928J856037L048345K676985
$$ 6283337 7246164 8592428 10269281 11524904 11989979 12541907 14397944 17446289 20123274
42070B0123274J036441k53847m35394m78237j413323k637635k720821j465665
$$ 20123274 21159715 20905868 20470474 19992237 18578914 15941279 13220458 11754793
42062A1754793j68375J34906k55002n89114p70595j060312j282500r64311n2054
$$ 11754793 11586418 11721324 11466322 10877208 10106613 9046301 7763801 6799490 6747436
42053F747436R26187J291370O52877p50033j951787j965033r26385q4667k16114
$$ 6747436 7673623 8964993 9617870 8867837 6916050 4951017 4024632 3939965 3723851
42044C723851n73811q4535Q88331J009247Q5706m68614L06234J413577J279691
$$ 3723851 3150040 3065505 3953836 4963083 5048789 4580175 4886409 6299986 7579677
42035G579677m757q42712l25248P40832J179780R64890Q94463J301480J716772
$$ 7579677 7574920 6732208 6406960 7147792 8327572 9292462 10186925 11488405 13205177
42026A3205177J624445J029658K71071l82985q90751j365648j842092k063179
$$ 13205177 14829622 15859280 16130351 15747366 14856615 13490967 11648875 9585696
42018I585696j716004r99682n89378p25749p55572r5187P50701Q99212N31662
$$ 9585696 7869692 6870010 6280632 5554883 4799311 4704124 5454825 6354037 6885699
42009F885699N89264J034865O54188r49381k321663j997291n29787L61377R6008
$$ 6885699 7474963 8509828 9164016 8214635 5892972 3895681 3365894 3727271 3823279
42000C823279m50205n94174n83134o84942o78822n09819m93413n12581R4251J305928
$$ 3823279 3373074 2778900 2195766 1510824 832002 322183 -171230 -683811 -589560 716368
41990G16368J866717P84295j028657j498547J75272K464217L147142J643899n86063
$$ 716368 2583085 3367380 2338723 840176 1015448 3479665 6626807 8270706 7684643
41981G684643j752504j404635l73431M18991O56958M60864J64045K13196O80173
$$ 7684643 5932139 4527504 4154073 4573064 5230022 5690886 5854931 6068127 6748300
41972F748300Q82332J83301q46070j015143l76638k39132q59039o50562J214472
$$ 6748300 7630632 7813933 6967863 5952720 5576082 5336950 4477911 3827349 5041821
41963E041821K868540K116276k75745j665333j301375p92154j010934r50797q7320
$$ 5041821 7910361 10026637 9750892 8085559 6784184 5992030 4981096 4030299 3942979
41954C942979M30389o9755l82350N42317J693293J521209K19120q53183j131584
$$ 3942979 4373368 4303613 3921263 4463580 6156873 7678082 7897202 7044019 5912435
41945E912435j006274p53082m30047k56157j93531K18518Q89000Q92034o2249
$$ 5912435 4906161 4153079 3723032 3466875 3273344 3491862 4380862 5272896 5210647
41936E210647q84809p50231l65374m91291l98054P59824K065134J990431O50753
$$ 5210647 4325838 3575607 3210233 2718942 2320888 3080712 5145846 7136277 7787030
41927G787030o95058j587127k076178j375863R96728L234274K813207R0424j913980
$$ 7787030 7091972 5504845 3428667 2052804 3049532 6283806 9097013 9187437 7273457
41918G273457j572506l17057J44242J1654j7393k50723r09156j197218o74754
$$ 7273457 5700951 5383894 5528136 5539790 5522397 5271674 4362518 3165300 2490546
41909B490546j93180l91730n69998r4478M01366L26380L16226Q95878J253663
$$ 2490546 2297366 1905636 1335638 1241160 1642526 1968906 2285132 3181010 4434673
41900D434673P01709J05217L22280M16103p53727k131666j745650J71538J454459
$$ 4434673 5136382 5241599 5563879 5979982 5226255 3094589 1348939 1520477 2974936
41891B974936J183491N25936L58387J32172m64867o65089k05670o8663o84539
$$ 2974936 4158427 4684363 5042750 5174922 4710055 4044966 3839296 3770633 3086094
41882C086094q90330J59226J317578J068600j32097o54310k01574R7166j62383
$$ 3086094 2195764 2354990 3672568 4741168 4609071 3954761 3753187 3850353 3687970
41873C687970j22438M97945O43956k54166j031624n14588M44373J55444j101379
$$ 3687970 3565532 4063477 4707433 4453267 3421643 2907055 3351428 3506872 2405493
41864B405493j207168N46355K036283J227714p54659j147940M51597J597142P12050
$$ 2405493 1198325 1744680 3780963 5008677 4254018 3106078 3557675 5154817 5866867
41855E866867o67219m32423Q55869R93674l74809j262298m13191R00589Q94824
$$ 5866867 5199648 4767225 5623094 6616768 6241959 4979661 4566470 5467059 6361883
41846F361883k41768j005001r01677p63026r47582n96985Q47910K358260K414219
$$ 6361883 6120115 5115114 4213437 3450411 2502829 1905844 2753754 5112014 7526233
41837G526233R96892l94417p04478m61149o08174r45832n38340O24042J327415
$$ 7526233 8523125 8128708 7424230 6963081 6354907 5409075 4870735 5494777 6822192
41828F822192P20966n31624j145308p47499L8366O63327J073305J167327O49225
$$ 6822192 7543158 7011534 5866226 5118727 5157093 5820420 6893725 8061052 8710277
41819H710277l05447q72482n66078J2381J1056l51896p9322R75359J650169J076755
$$ 8710277 8404830 7532348 6966270 6978651 6989707 6637811 6558489 7533848 9184017 10260772
41809A0260772j7844l67543J6575R6688l79245n18870J03196O60884M22145j20690
$$ 10260772 10242928 9875385 9891960 9988648 9609403 9090533 9193729 9854613 10276758 10156068
41799A0156068j56274K50059O14044Q93500J065353O44515m01529j047393o39622
$$ 10156068 9999794 10249853 10863897 11757397 12822750 13467265 13065736 12018343 11378721
41790A1378721j00962l44244m00291R66929K453698J516918j498707l204333j898283
$$ 11378721 11277759 10933515 10533224 11500153 13953851 15470769 13972062 10767729 8869446
41781H869446Q5503J36499q31954l94092J303557J996108R98965l5906J3383K48953
$$ 8869446 8954949 9091448 8259494 7865402 9168959 11165067 12164032 12128126 12141509 12390462
41771A2390462l95843j387330j431620k30313J193323J592070P56583j93496n4197
$$ 12390462 11994619 10607289 9175669 8945356 10138679 11730749 12487332 12293836 12239639
41762A2239639Q21156Q61671m10569j517745j251497n14075o28666r58510o6336
$$ 12239639 13060795 13922466 13511897 11994152 10742655 10228580 9599914 8641404 8575068
41753H575068J483809J674219K41346q47807m69950J47551k56244r69452p50902
$$ 8575068 10058877 11733096 11974442 11126635 10656685 10804236 10547992 9578540 8827638
41744H827638J27846O07102O36102Q83585J208369P39961n96113j669637j497481
$$ 8827638 8955484 9562586 10198688 11082273 12290642 13030603 12434490 10764853 9267372
41735I267372l86037N67189P61683N07917K17271l09796j301788k038109j426170
$$ 9267372 8881335 9448524 10210207 10718124 10935395 10625599 9323811 7285702 5859532
41726E859532K49581J260407P36585p3728J79944Q14154M40240n34068o48304
$$ 5859532 6109113 7369520 8106105 8032377 8212321 9026475 9466715 8932647 8284343
41717H284343q2957m05180j637892j853532k67896J283731R51439o19517j475743
$$ 8284343 8201386 7796206 6158314 4304782 4036886 5320617 6272056 5652539 4176796
41708D176796r02346J86358N65521k37180j442079j365525O67576K743568K274109
$$ 4176796 3274450 3460808 4026329 3789149 2347070 981545 1649121 4392689 6666798
41699F666798l01881j713866l95410J360841J003314o20277j033535M5023P80400
$$ 6666798 6364917 4651051 4255641 5616482 6619796 5999519 4965984 5011007 5791407
41690E791407K11461p64154r56760l7651J429883K150578J077604r28718j602253
$$ 5791407 6002868 5238714 4281954 4244303 5674186 7824764 8902368 7973650 6371397
41681F371397l57707O96881O2026p63078k1446J138258P44339m11037k59373O93542
$$ 6371397 6013690 6710571 6772597 6009519 5988073 7126331 7870670 7459633 7200260 7893802
41671G893802L30285r95474q91983P03460J180922k96248j443609q23359N9828
$$ 7893802 8224087 7228613 6336630 7040090 8221012 7924764 6481155 5657796 5717624
41662E717624j66416n61591k34927j32945p93095q52546L52633J046158j17654
$$ 5717624 5551208 4989617 4754690 4621745 3828650 2976104 3328737 4374895 4257241
41653D257241j583333j437325m53404l10910n84154j0307P99099N75737M5982
$$ 4257241 2673908 1236583 783179 472269 -111885 -122192 676907 1252644 1298626
41644A298626O14214J439624P27532q07023q29023N91203R64558m45217j474424
$$ 1298626 1912840 3352464 4079996 3272973 2443950 3035153 3999711 3554494 2080070
41635B080070p20735M64095O78132O37071J240325J597941O70102o79343r23581
$$ 2080070 1359335 1823430 2501562 3138633 4378958 5976899 6647001 5967658 5044077
41626E044077p6970P54865J107292J136984O72745m07171j387070j445880q04369
$$ 5044077 4967107 5721972 6829264 7966248 8638993 8231822 6844752 5398872 4594503
41617D594503k39615J20254O45736J233752J349533Q33643K4469p00580j045972
$$ 4594503 4354888 4475142 5120878 6354630 7704163 8537806 8562275 7861695 6815723
41608F815723q34229l52510j93679l54303j29338O25424R57500K71533n41449
$$ 6815723 5981494 5628984 5435305 5081002 4951664 5577088 6534588 6806121 6264672
41599F264672m54781m2039n37786j607121j575179N9005J712101J757106M81216
$$ 6264672 5809891 5767852 5230066 3622945 2047766 2106771 3818872 5575978 6057194
41590F057194n13832k08864R48384J609689P79796j082542k228017j434967M23744
$$ 6057194 5543362 5334498 6282882 7892571 8672367 7589825 5361808 3926841 4350585
41581D350585J366492P77602p8675j19357J72995m5404m79805l00266M61759J037805
$$ 4350585 5717077 6494679 6416004 6296647 6469642 6424238 5944433 5644167 6105926 7143731
41571G143731R98252M27869n22933j441199j437238j23084J392162J490124O6326
$$ 7143731 8141983 8569852 8046919 6605720 5168482 5045398 6437560 7927684 7994010
41562G994010j286553j220725o203J127067J265678L18178r70820j342739j88704
$$ 7994010 6707457 5486732 5480529 6607596 7873274 8191452 7220632 5877893 5689189
41553E689189J361580J417929k02566j461781p35259R63627J420920K32920q85794
$$ 5689189 7050769 8468698 8266132 6804351 6069092 7032719 8453639 8686559 7800765
41544G800765o02880M65435R15115L20673n98063r81558o11205q086Q0211m46875
$$ 7800765 7197885 7663320 8578435 8899108 8301045 7319487 6708282 6700196 6780407 6333532
41534F333532p65774j51619R07117J288129Q02790K90310J20279k70397r91903
$$ 6333532 5567758 5416139 6323256 7611385 8414175 8704485 8824764 8554367 7562464
41525G562464j105882k45554K93209o37612j916915j448909O90679K094933J268467
$$ 7562464 6456582 6211028 6504237 5866625 3949710 2500801 3191480 5286413 6554880
41516F554880n19009j260139p37314o3995J95053J99444j26026q37718j136657
$$ 6554880 6035871 4775732 4038418 3974423 4169476 4368920 4242894 3405176 2268519
41507B268519j97260J233117J453933K33852p60372m46692J22894l96505j410454
$$ 2268519 2071259 3304376 4758309 4992161 4231789 3785097 3907991 3511486 2101032
41498B101032j314929K6730J186815J331371J090608J124422J046165K62270r75429
$$ 2101032 786103 812833 1999648 3331019 4421627 5546049 6592214 6854484 5879055
41489E879055j889411k003365j310886j35948R07873J320719J269989J234572
$$ 5879055 3989644 1986279 675393 539445 1447318 2768037 4038026 5272598
41481E272598J090300L37262p02005j012883n78263o86073j783170k263058o51292
$$ 5272598 6362898 6700160 5998155 4985272 4407009 3720936 1937766 -325292 -976584
41472i76584J911786K900999J641625k02602j135414j226201r23131j15267J005200
$$ -976584 935202 3836201 5477826 5275224 4139810 2913609 1990478 1875211 2880411
41463B880411J434353O13187n71794q45470j52076M19478P3590p59012q92775
$$ 2880411 4314764 4927951 4356157 3510687 3358611 3778089 3851679 3092667 2199892
41454B199892K31868J570294J317666p89606k628753k127247n2538J011266K37056
$$ 2199892 2431760 4002054 5319720 4530114 1901361 -225886 -278424 732842 969898
41445I69898o11283j18330Q80130J086163P23470N86714N06154P3730k33282j871
$$ 969898 358615 240285 1120415 2206578 2930048 3516762 4022916 4096646 3863364 3861493
41435C861493M1327p11669j361139q71432N2865J48244j37306M87873J563180
$$ 3861493 3902820 3191151 1830012 958580 1011445 1159689 1022383 1510256 3073436
41426C073436J375368k8454o14008M40381J444090Q93903l85420q54029m52757
$$ 3073436 4448804 4420350 3806342 4246723 5690813 6584716 6199296 5345267 4892510
41417D892510J048L28901O51623N66435j02155n71181k62336J31081j00898k77022
$$ 4892510 4893558 5222459 5874082 6440517 6338362 5767181 5504845 5635926 5535028 5258006
41407E258006L93220R48991n4867j832588k017652k32343J061666J07163j564097
$$ 5258006 5651226 6600217 6545350 4712762 2695110 2462767 3524433 3631596 2067499
41398B067499j474864K01875J184434N48440k90190r6608M87458M35558Q8341
$$ 2067499 592635 794510 1978944 2527384 2237194 2140586 2628044 3063602 3151943
41389C151943L23759R06119Q97353K33894k75211k94285k26160k65478k60993
$$ 3151943 3475702 4381821 5279174 5513068 5237857 4943572 4717412 4451934 4190941
41380D190941m21955r64010j090204K05579K092486K351660N19973j152207r17526
$$ 4190941 3768986 2804976 1714772 1920351 4012837 6364497 6884470 5732263 4814737
41371D814737Q1379J43587q7295P09950J438273J23616k127573k033686P36662
$$ 4814737 4896116 5039703 4952408 5662358 7100631 7224247 5096674 3062988 3799650
41362C799650K589443J228425j084531j245201J75872M64705q81500j888170j356303
$$ 3799650 6389093 7617518 6532987 5287786 5463658 5928363 5046863 3158693 1802390
41353A802390r3677Q05152J049994O37101k21392o94189j31489Q14534R53410
$$ 1802390 1708713 2513865 3563859 4200960 3979568 3285379 3153890 3968424 4921834
41344D921834K11217n29779q76587j031136q16349P8867J081677J249230O71815
$$ 4921834 5133051 4603272 3726685 2695549 1879200 1958067 3039744 4288974 4960789
41335D960789J71658j39735o65876r83316l25130O63449M49161q50269j261830
$$ 4960789 5132447 4992712 4326836 3343520 3018390 3681839 4131000 3280731 2018901
41326B018901J08577J616466J429715q1876j277687j341358m65358Q98567J884656
$$ 2018901 2127478 3743944 5173659 5091783 3814096 2472738 2007380 2905947 4790603
41317D790603J363209n22251j814343j009556Q16969J451520N30511l57197k50590
$$ 4790603 6153812 5631561 3817218 2807662 3624631 5076151 5606662 5249465 4998875
41308D998875O2792k96814q69044p18967O1355M53062q5020p81103l51391J307351
$$ 4998875 5061667 4764853 3895809 3176842 3238197 3691259 3606239 2825136 2473745 3781096
41298C781096K550514J730741n53922j926671j265512j17101k93367j226178j087874
$$ 3781096 6331610 8062351 7508429 5581758 4316246 4199145 3905778 2679600 1591726
41289A591726K63710J201223R33946M35634N38420O84102J68333o18926r10799
$$ 1591726 1855436 3056659 3990605 4426239 4964659 5648761 5817094 5198168 4287369
41280D287369o05165r006O24264Q34065J65096q25447p93318M53359J285259M78614
$$ 4287369 3682204 3673198 4297462 5131527 5296623 4471176 3677858 4131217 5416476 5895090
41270E895090q59533q47449M10594J095122L76854o44825p76280j81832L22762
$$ 5895090 5035557 4188108 4598702 5693824 6070678 5425853 4649573 4467741 4790503
41261D790503L73484N8415l55950l84616K23702P73921K44761j082989j610768
$$ 4790503 5163987 5222402 4866452 4481836 4705538 5479459 5724220 4641231 3030463
41252C030463n57610Q49157J065783K76588j95305J25591N75819O95043P07375
$$ 3030463 2472853 3322010 4387793 4664381 4469076 4594667 5170486 5865529 6572904
41243F572904O67666J46562r37741j849336j740780n31169R83774J668706R12098
$$ 6572904 7240570 7387132 6449391 4600055 2859275 2328106 3311880 4980586 5892684
41234E892684o34933j439199p11254O40372J241229R70959N89168J38420r20127
$$ 5892684 5257751 3818552 3107298 3747670 4988899 5959858 6549026 6687446 5767319
41225E767319k065592j810033M4371J602783J192173n18133j581617j128271K15244
$$ 5767319 3701727 1891694 1936065 3538848 4731021 4212888 2631271 1503000 1718244
41216A718244J476799J934236J205705k18056r95747m38607M60753M21885k66773
$$ 1718244 3195043 5129279 6334984 6116928 5121181 4682574 5143327 5565212 5298439
41207E298439m17343L4939P3221n46439r45555p25644n33697p00759n83607K08074
$$ 5298439 4881096 4916035 4989256 4442817 3497262 2771618 2237921 1537162 953555 1161629
41197A161629R93183J051719O35420L49098K22475k7112l56293n13364m05213
$$ 1161629 2154812 3206531 3841951 4191049 4413524 4386412 4030119 3516755 3111542
41188C111542j00676J23571k23648j124262j450379j59479J848215K393733R21970
$$ 3111542 3010866 3134437 2910789 1786527 336148 176669 2024884 4418617 5340587
41179E340587o59615p01659R0429K94626O4398K76206N03649k85847j565672j669827
$$ 5340587 4680972 3979313 4069742 4364368 4428766 4704972 5208621 4922774 3357102 1687275
41169A687275l24252Q88334P91193o9906o64698p35109l81653M29527J318975
$$ 1687275 1363023 2251357 3042550 2972644 2307946 1572837 1191184 1620711 2939686
41160B939686J371918K80888r70549j158169j84000R77877J352266P19463l47940
$$ 2939686 4311604 4592492 3621943 2463774 2279774 3257651 4609917 5329380 4981440
41151D981440r76231p61434j14054L59298N80540O90888M17294m49957j206974
$$ 4981440 4005209 3243775 3129721 3489019 4069559 4760447 5177741 4727784 3520810
41142C520810r37066r1665j82348j499651k267649q76305J794073L225619K170578
$$ 3520810 2583744 2492079 2309731 810080 -1457569 -2333874 -539801 2685818 4856396
41133D856396l4696j074127j32948J370610J470104m8532j402764j094514J69644
$$ 4856396 4821700 3747573 3614625 4985235 6455339 6406807 5004043 3909529 4079173
41124D079173N69614l24567j272266j365886r60407m73582L14112J257625J438778
$$ 4079173 4648787 4324220 3051954 1686068 725661 252079 566191 1823816 3262594
41115C262594N10092n72606q66338n54578j49933L25886O71067K27024q27402
$$ 3262594 3772686 3200080 2333742 1779164 1629231 1955117 2626184 2853208 2025806
41106B025806j147193k78825K38825p94926k066933j634853P0675J134783J232662
$$ 2025806 878613 599788 838613 43687 -2023246 -3658099 -3587424 -2452641 -1219979
41097a219979J533264J995383J289676m64670j337018n46381L88497K59414r6958
$$ -1219979 313285 2308668 3598344 3133674 1796656 1250275 1638772 1898186 1801228
41088A801228K80546O82490J96605n40250n13114p7297j02968l12932J06616R21615
$$ 1801228 2081774 2764264 2960869 2420619 1907505 1830208 1727240 1414308 1520924 2442539
41078B442539J191919P28875J18453k96532n50471o23947o38112r12229j166959
$$ 2442539 3634458 4363333 4481786 4185254 3634783 3010836 2372724 1460495 293536
41069B93536m88268J114064K065798J185000o07755j657534j731505j531944j033535
$$ 293536 -194732 919332 2985130 4170130 3562375 1904841 173336 -1358608 -2392143
41060b392143O1460R48547O23050k54315j60894Q87519J491718J225577R80329
$$ -2392143 -2330683 -1382136 -759086 -1013401 -1174295 -286776 1204942 2430519 3410848
41051C410848R72422L58688q50074j317145l74274J025035J811254J853869J225228
$$ 3410848 4383270 4741958 3891884 2574739 2200465 3225500 5036754 6890623 8115851
41042H115851j1943r50365n06278N77555K33539j751726k968395j740160N91857
$$ 8115851 8103908 7153543 6647265 7224820 7458359 5706633 2738238 998078 1589935
41033A589935J868128J790718J106355n5172j367985j477728P4088J383736O27415
$$ 1589935 3458063 5248781 6355136 6299964 4931979 3454251 3528339 4912075 5539490
41024E539490j101316j400650p8754J029054J034872O38006K59442l55385q97914
$$ 5539490 4438174 3037524 2958770 3987824 5022696 5660702 5920144 5564759 4666845
41015D666845p86523n27818j015578j726811j405345k26215N90301R21525J412301
$$ 4666845 3880322 3352504 2336926 610115 -795230 -1021445 -431144 490381 1902682
41006A902682J431325j39059k182069k168372m6335J418848Q26257j12131M9604
$$ 1902682 3334007 3194948 1012879 -1155493 -1201828 217020 1043277 931146 980750
40997I80750K27180n96841j202190n16893J59175m34596q97691N02253K476421
$$ 980750 1207930 611089 -591101 -1107994 -948819 -1383415 -2281106 -1778853 697568
40988F97568K459216O52956m52837m1376K59647n08802j247859r21437l0323O16910
$$ 697568 3156784 3809740 3356903 3315527 3575174 3066372 1818513 897076 866753 1483663
40978A483663J002352J186055Q06903j06223p94318p18798j72923K85803M56703
$$ 1483663 2486015 3672070 4478973 4372750 3578432 2859634 2686711 2972514 3429217
40969C429217N29993R47387J946877K782642K055772l86014k629057k869525j726407
$$ 3429217 3959210 4906597 6853474 9636116 11691888 11305874 8676817 5807292 4080885
40960D080885j091106j311015j121068k7437R90069J227959J159696J285535J311025
$$ 4080885 2989779 1678764 557696 530259 1520328 2748287 3907983 5193518 6504543
40951F504543P87378k90969j515573j950967n48568K162793L540301J725849j396493
$$ 6504543 7291921 7000952 5485379 3534412 2985844 5148637 8688938 10414787 9018294
40942I018294k204991j51899J690032J114545n78273j182967n88763N4110L76513
$$ 9018294 6813303 6661404 8351436 9465981 8887708 7704741 7115978 7170088 7546601
40933G546601N97653N79832K93815K16687L90539J64413m47380m63080L00414
$$ 7546601 8144254 8724086 9017901 9234588 9625127 9789540 9342160 8879080 9179494
40924I179494O49695L7083m59263j71966r4889q21879j083897k2879Q37980j7664
$$ 9179494 9829189 9866272 9407009 9235043 9140154 8318275 7234378 7211499 8049479 8031815
40914H031815j287371q99015L26568p9859j926473k339474k58486J838480J568145
$$ 8031815 6744444 5845429 6171997 6092138 4165665 1826191 1567705 3406185 4974330
40905D974330k29250j164355m59982P78661J322532P67484n21485j578005j467762
$$ 4974330 4745080 3580725 3120743 3899404 5221936 5989420 5467935 3889930 2422168
40896B422168k94514Q66389J247244R77992L21282p40617j812572j936351p91519
$$ 2422168 2127654 2994043 4241287 5219279 5540561 4799944 2987372 1051021 259502
40887B59502N96768J026890N86597L08963N78845N59239n56067k079582k222408
$$ 259502 856270 1883160 2469757 2778720 3357565 3916804 3360737 1281155 -941253
40878i41253k72733K080736K457148P53045o98328k59903R85008J142647J97582
$$ -941253 -1213986 866750 3323898 4076943 3378615 3118712 4103720 5246367 5443949
40869E443949n14230n79614o64450r47301j011706r91386j230099j012795O30277
$$ 5443949 4929719 4350105 3685655 2738354 1726648 735262 -494837 -1507632 -877355
40860h77355K801665L198370J123844j478751k507766j853033n91692N25776J066232
$$ -877355 1924310 5122680 6246524 4767773 2260007 406974 -184718 341058 1407290
40851A407290O64386l16831p70619j96529O87944J092458R61646L03763j039128
$$ 1407290 2071676 1754845 984226 787697 1475641 2568099 3529745 3833508 2794380
40842B794380k359821k151944j41980J846849K085932J052405L12383K23182J7934
$$ 2794380 434559 -1717385 -1859365 -12516 2073416 3125821 3438204 3661386 3679320
40833C679320m77470o04532j53288K52455J16595l14009m38433R8027J040036
$$ 3679320 3201850 2597318 2444030 2696485 2813080 2499071 2060638 2158665 3198701
40824C198701J535780R35804k13348o35505q3677K34605m94947j369698j084373
$$ 3198701 4734481 5670285 5456937 4821432 4737755 4972360 4477413 3107715 2023342
40815B023342K54157J523346K073662J887533R69766l34305j002925m87839K38435
$$ 2023342 2277499 3800845 5874507 7762040 8731806 8397501 7394576 6906737 7145172
40806G145172n9268r72695j071986j82938L50508k34731j041189q99371J34963
$$ 7145172 7085904 6113209 5041223 4858285 5208793 4974062 3932873 3033502 3168465
40797C168465J080940J125249J40213j249950j910576j131392M57044J451306
$$ 3168465 4249405 5374654 5514867 4264917 2354341 1222949 1679993 3131299
40789C131299J311946Q44963Q87918J211835J134568O54500L42438L34244Q9051
$$ 3131299 4443245 5288208 6176126 7387961 8522529 9177029 9519467 9853711 9942762
40780I942762o86097j352734j077467j16833L04292l36561j020086o87416P3210
$$ 9942762 9256665 7903931 6826464 6709631 7013923 6677362 5657276 4969860 5043070
40771E043070k6494p43629n63103P30627J451744O02106n52979n15789K56080
$$ 5043070 5016576 4272947 3709844 4440471 5892215 6494321 5941342 5425553 5681633
40762E681633M78588J39943k8993j95846q79461j467830r76378J77593P76445
$$ 5681633 6160221 6300164 6271171 6075325 5195864 3728034 2751656 2929249 3705694
40753C705694P84382J077823J516892J085999q7379o24104j5437O98880O21965
$$ 3705694 4490076 5567899 7084791 8170790 8083411 7459307 7443870 8142750 8764715
40744H764715l1257q06832j441608j352433k46093O83501p3240j759209j915331
$$ 8764715 8733458 7926626 6485018 5132585 4886492 5569993 5496753 3737544 1822213
40735A822213l5570J448971P67638o75194p63904J86531N40853J88382K44545
$$ 1822213 1786643 3235614 4003252 3328058 2564154 2750685 3291538 3479920 3724465
40726C724465P50452O74265j13188o03852l84738j83315n28547r91956r98018
$$ 3724465 4474917 5149182 5035994 4432142 4047404 3864089 3335542 2343586 1345568
40717A345568n63823j8628M34826P34718Q83943Q81319O23120J16702k28457j02620
$$ 1345568 781745 763117 1197943 1932661 2816604 3697923 4321043 4437745 4209288 4106668
40707D106668p8682r41310k046884j640180N60310K426724K112647M89388m06776
$$ 4106668 4027986 3086676 1039792 -600388 -40078 2386646 4499293 4988681 4581905
40698D581905k62813j66146k41080L55273J341359J279508n2090j021274n04545
$$ 4581905 4319092 4152946 3911866 4267139 5608498 6888006 6835916 5814642 5310097
40689E310097N52278P35382J73579o79N71750J190931J217394P40181K67646K06341
$$ 5310097 5862375 6597757 6771336 6770657 7342407 8533338 9750732 10490913 10758559 10964900
40679A0964900N41587P78730L68717o06304j352556j178361k94932L66836J75560
$$ 10964900 11506487 12285217 12653934 12047630 10695074 9516713 9221781 9588617 9764177
40670I764177m35204m14859N53275J483045J369901P13961P82852J417365R97901
$$ 9764177 9328973 8914114 9467389 10950434 12320335 13034296 13817148 15234513 16232414
40661A6232414q53821k085216r93794J024926J264226m73322j810357j361076
$$ 16232414 15378593 13293377 12299583 13324509 14588735 14115413 12305056 10943980
40653A0943980l67408m10137j236498j624942j102631J6653J314520K227496K096190
$$ 10943980 10576572 10166435 8929937 7304995 6202364 6219017 7533537 9761033 11857223
40644A1857223R17821m95231j455202j880412j746711j016971l03240m31166r83562
$$ 11857223 12775044 12279813 10824611 8944199 7197488 6180517 5877277 5446111 4462549
40635D462549n80017Q34661J443112K21619j291806j216841m8870M94146L03599
$$ 4462549 3882532 4717193 6160305 6381924 5090118 3873277 3824407 4318553 4622152
40626D622152N39112J071519N67753q39070j231931R9381J327909P94039o07430
$$ 4622152 5161264 6232783 6800536 5961466 4729535 4828916 6156825 6950864 6343434
40617F343434j070652n61276k42847j99276L84194J216001J064678N0103j41720
$$ 6343434 5272782 4711506 4468659 4269383 4653577 5869578 6934256 6984359 6842639
40608F842639J028386J764313O15220j071792j017605N49824J239997K5789j549521
$$ 6842639 7871025 9635338 10250558 9178766 8161161 8710985 9950982 9976771 8427250
40599H427250k016488j913933k130672j963093m00157J647550K186874Q92177
$$ 8427250 6410762 4496829 2366157 403064 2907 1650457 3837331 4729508
40591D729508n68558r55686p29806o34028m26513K78110R72549R57752M37613
$$ 4729508 4160950 3205264 2475458 1841430 1414917 1693027 2665576 3623328 4060941
40582D060941R9018J5892k66934p65381q67618j86743Q16778J255953P83105J9898
$$ 4060941 4159959 4175851 3908917 3143536 2275918 2089175 2905953 4161906 4945011 4964909
40572D964909j67703J49523j5637j011211j666736q48715O18625R15326m8284
$$ 4964909 4797206 4946729 4931092 3919881 2253145 1404430 2023055 2938381 2890097
40563B890097m65888N33245J624166J597188J162423J187786Q04958q62577k368615
$$ 2890097 2424209 2957454 4581620 6178808 7341231 8529017 9333975 8471398 6102783
40554F102783j687733L84946J106870m7362p07208M20026J486207O13118j163356
$$ 6102783 4415050 4799996 5906866 5859504 5152296 5572322 7058529 7671647 6508291
40545F508291j782509j276256r82647q62270J60145J752130K240499J109391l53222
$$ 6508291 4725782 3449526 2466879 1604609 1764754 3516884 5757383 6866774 6513552
40536F513552j039933j073271p06254K10438J240330J320545L32277n07655l88318
$$ 6513552 5473619 4400348 3694094 3904532 5144862 6465407 6797684 6290029 5901711
40527E901711J42320M81830Q88729J372644J069484k46860j298100j146899p15075
$$ 5901711 6044031 6525861 7414590 8787234 9856718 9609858 8311758 7164859 6449784
40518F449784j064686j331416j64547J632344J966765N86819o70357o75430j06810
$$ 6449784 5385098 4053682 3889135 5521479 7488244 8075063 7404706 6729276 6622466
40509F622466L46691R23302J556376J548102J002717Q62579R86440M1443j962510
$$ 6622466 6969157 7892459 9448835 10996937 11999654 12862233 13848673 13890116 11927606
40500A1927606k987218j916768l78401k51837r83999r39334k3179P03541Q77614
$$ 11927606 8940388 7023620 6645219 6393382 5409383 4470049 4446870 5150411 6028025
40491F028025P24168J74971m36571l4677J308701J624145L1163j211874o8134
$$ 6028025 6752193 6927164 6490593 6455916 7764617 9388762 9419925 8208051 8139917
40482H139917J543569N80630j819725j838821N98672J306996j414874l784841
$$ 8139917 9683486 10264116 8444391 6605570 7204242 8511238 7096364 3311523
40474C311523k317704R19742J648588m99261k241438j570702M11047J923024K433675
$$ 3311523 993819 1913561 3562149 3062888 821450 -749252 -338205 1584819 4018494
40465D018494K281879J958460J734788J216881j74391j769937j924280n10569
$$ 4018494 6300373 8258833 9993621 11210502 11036111 9266174 7341894 6831325
40457F831325M05243m30465j433426p63863O62646P87067k84759r03101q21263
$$ 6831325 7236568 6806103 5372677 4608814 5271460 6058527 5773768 4870667 4049404
40448D049404j021387j229553k76098J205652J114027o89096j717966m69139J376645
$$ 4049404 3028017 1798464 1522366 2728018 3842045 3152949 1434983 965844 2342489
40439B342489J505103J24169p62266k25464P21423P27287l24440j345165j306643
$$ 2342489 3847592 3971761 3209495 2984031 3705454 4432741 4108301 2763136 1456493
40430A456493l87206L50932M51639N13028P68346L28269j147852k125050j131594
$$ 1456493 1069287 1420219 1871858 2384886 3153232 3481501 2333649 208599 -922995
40421i22995P46219J206861J45116l65260N51492J404065R65114K2511k96962
$$ -922995 -176776 1030085 1175201 809941 1361433 2765498 3730612 3753123 3456161
40412C456161k06109k86079k92943K9335J32640l30972o59886j71177O99014J139239
$$ 3456161 3250052 2963973 2671030 2700365 2833005 2502033 1842147 1670970 2369984 3509223
40402C509223J051046P31115K18596m08703p54555o43819l58013o6431K63841
$$ 3509223 4560269 5291384 5509980 5101277 4346722 3702903 3344890 3278459 3542300
40393C542300L00705l33241j071043r04845m8543K32325l08941n25268L4134L66874
$$ 3542300 3843005 3509764 2438721 1533876 1485333 1717658 1408717 883449 917583 1284457
40383A284457K0774P9406J141844J962887J323698j51622j195897j510715j121825
$$ 1284457 1305231 1384637 2526481 4489368 5813066 5661444 4465547 2954832 1833007
40374A833007K07752J662868J362354p00598j682660M6856J874714P28261j884296
$$ 1833007 2040759 3703627 5065981 4365383 2682723 2729579 4604293 5332554 3448258
40365C448258k113654Q8642J115936k16109j020759L35088J333852k79941k534819
$$ 3448258 1334604 1423246 2539182 2323073 1302314 1637402 2971254 2691313 156494
40356A56494k338652j26908J429090J621810J680850J672135M69499j483290k148942
$$ 156494 -2182158 -2309066 -879976 741834 2422684 4094819 4564318 3081028 932086
40347I32086r45128M27654O83362M66519N18141K60643p11356j344041p21420
$$ 932086 -13042 414612 1097974 1564493 2082634 2343277 1631921 287880 -433540
40338d33540K36036J84051m05002r6515R22246R86744k81880j207085o16104M61998
$$ -433540 -197504 -13453 -418455 -514970 407276 1394020 1112140 -94945 -711049 -249051
40328b49051N98364N5581j99642m01374j230464j889842q66858J490542K969993
$$ -249051 349313 404894 205252 -196122 -1426586 -3316428 -4183286 -2692744 277249
40319B77249K374912Q73974M7487J9769Q9427j36294q77450k133077k830906j496371
$$ 277249 2652161 3526135 3573622 3593391 3682818 3546524 2669074 535997 -2294909 -3791280
40309c791280J313930K801839J464530n87689n15152J271232K057902R51308k53872
$$ -3791280 -2477350 324489 1789019 1201330 686178 1957410 4015312 4966620 4712748
40300D712748j63691M56868M11162k17450p19597q33811o06433j51366J26752
$$ 4712748 4549057 5005925 5417087 5199637 4480040 3646229 3039796 2888430 3015182
40291C015182o3010k26132J81628M79075m24851j915799j989294j16533J733084
$$ 3015182 2952172 2726040 2907668 3386743 2961892 1046093 -943201 -1059734 673350
40282F73350J660303J39226j051972j078181l65617L73470N75210M0842n93683
$$ 673350 2333653 2472879 1420907 342726 -22891 350579 925789 966631 372948
40273C72948l54832N89796R23201K23044k01309N79156J399175P21109q81666
$$ 372948 18116 607912 1531113 1754157 1552848 2132004 3531179 4252288 3370622
40264C370622j529848p76082N4283O5361j75488O0025O09700J008356J137028
$$ 3370622 1840774 1064692 1118975 1184336 1008848 1068873 1678573 2686929 3823957
40255C823957R41664L15696m13569n80065o8948M78427N71715L66149L8855n86444
$$ 3823957 4765621 5081317 4667748 4087683 4018735 4497162 5068877 5435026 5473881 4887437
40245D887437j360569j455753m08900Q89292J065132M8266p67345l40623O85153
$$ 4887437 3526868 2071115 1662215 2551507 3616639 3664905 2897560 2556937 3242090
40236C242090R34259J63094n18029k66527L36676J43240r53994j838906j555202
$$ 3242090 4176349 4339443 3821414 3554887 3891563 4034803 3080809 1241903 -313299
40227c13299l75813P02249J171911J308090J314733P46798p12627k153391k040468
$$ -313299 -689112 13137 1185048 2493138 3807871 4554669 3842042 1688651 -351817
40218c51817l17350R90752K53898j339589j292293N58122J814216J260835O20823
$$ -351817 -669167 321585 575483 -764106 -2056399 -1498277 315939 1576774 2197597
40209B197597J376786J977162L75534k158217k541668n57468Q85183K88747n00463
$$ 2197597 3574383 5551545 5927079 3768862 1227194 669726 1554909 1843656 1343193
40200A343193K37922J304877Q59849m62158p05376K80095Q30163J37173p21120
$$ 1343193 1581115 2885992 3745841 3283683 2578307 2858402 3688565 3825738 3104618
40191C104618m88785O44008J394585Q40681o22943j659511j426104n07177m2567
$$ 3104618 2615833 3259841 4654426 5495107 4872164 3212653 1786549 1279372 1236805
40182A236805k43649n12383o74130r70822j050486l50074N43105M37730m57338
$$ 1236805 993156 480773 -193357 -1164179 -2214665 -2564739 -2021634 -1583904 -2041242
40173b041242p35366j65191M3211l31554m8500R64981R43752n95235j505218l80229
$$ -2041242 -2776608 -2941799 -2898588 -3230142 -3278642 -2313661 -1369909 -1965144 -3470362 -3850591
40163c850591J048852Q16894j85648k51475J35440j01181k8226J319349K141847
$$ -3850591 -2801739 -1984845 -2170493 -2421968 -2286528 -2387709 -2415935 -1096586 1045261
40154A045261M68674j858453j561101O65896J168457o45403j551028o5806J438388
$$ 1045261 1513935 -344518 -1905619 -1239723 -71266 -716669 -2267697 -2333503 -895115
40145h95115J131608L28978L21739K06890m66681k60541J076406J345222j65079
$$ -895115 236493 565471 887210 1094100 627419 366878 1443284 2788506 2623427
40136B623427p05655J363563L099673J322810k078432k882613q00909Q27796N15821
$$ 2623427 1917772 3281335 6381008 7703818 5625386 2742773 1941864 2769660 3285481
40127C285481n2858J84255K08871m09709n06911L41392J034375J132782J479576
$$ 3285481 3232623 3416878 3625749 3216040 2709129 3050521 4084896 5217678 6697254
40118F697254J986350J167265j132861k715111k063541o23432n00380j274772
$$ 6697254 8683604 9850869 8718008 6002897 3939356 3315924 2815544 1540772
40110A540772r16425Q68735K045899J088957r40534j768017p18662O10752N25476
$$ 1540772 624347 1493082 3538981 4627938 3687404 1919387 1200725 1811477 2336953
40101B336953n99276r93981m2205R42080P50269r3450m94037m82748o19542n96705
$$ 2336953 1737677 743696 701491 1643571 2393840 2300390 1806353 1323605 704063 107358
40091A07358J35658R42872P41775j49517m07246K12447O78068N07113K43439L9020
$$ 107358 243016 1185888 1927663 1778146 1370900 1583347 2261415 2768528 3011967 3050987
40081C050987o48473j652920j912963j118344j63341M22609J024710J488067Q10865
$$ 3050987 2402514 749594 -1163369 -2281713 -2445054 -2022445 -997735 490332 1301197
40072A301197q85915j720105n68935J143585J529881R05487P73327J074031L79003
$$ 1301197 415282 -1304823 -1873758 -730173 799708 1705195 2478522 3552553 3931556
40063C931556j441347k586139j756635P5102R67976L43042n96369m96990N35480
$$ 3931556 2490209 -95930 -1852565 -1777463 -809487 -466445 -1062814 -1559804 -1024324
40054a024324J124072M13553o88578o51753M57777R12271k17833j640404j622165
$$ -1024324 99748 513301 -175277 -827030 -369253 543018 325185 -1315219 -2937384
40045b937384k58000J027148J478738J332246P06147m27280j356930j101169Q1981
$$ -2937384 -3195384 -2168236 -689498 642748 1348895 921615 -435315 -1536484 -1454503
40036a454503Q18114N19708J06091M27928R67163P56829j10648o48351l19632
$$ -1454503 -636389 -116681 -10590 417338 1384501 2141330 2030682 1382331 1062699
40027A062699L91655O74715K80135l15517n00070k22106M5042Q8610L20213J014335
$$ 1062699 1454354 2129069 2409204 2093687 1593617 1371511 1416553 1505163 1825376 2839711
40017B839711J609051J387349N65564k4492j11305j0711K85731R43323J277681
$$ 2839711 4448762 5836111 6401675 6377183 6265878 6255167 6540898 7484221 8761902
40008H761902L40310j114899p83929K084154M979982M934052K273635O1649J08258
$$ 8761902 9102212 7987313 7203384 9287538 14267520 19201572 21475207 21536856 21645114
39999B1645114J074993O84996j513074m052914n252839m499393k532878q97466
$$ 21645114 22720107 23405103 21892029 17839115 12586276 8086883 5554005 4656539
39991D656539n81839r53720o33191M52469Q10636l81111j784058j568217P6757
$$ 4656539 4074700 3120980 2487789 2940258 3750894 3369783 1585725 17508 94265
39982I4265J217923P36045m56767q48001p9544J042452J647078J496094R31488
$$ 94265 1312188 2048233 1591466 743465 663921 1706373 3353451 4849545 5781033
39973E781033M46326J87114j43719p12751j091292q28253k96026k29117m35739
$$ 5781033 6227359 6414473 6270754 5558003 4466711 3638458 3342432 3113315 2677576
39964B677576N6241J230815J546630M7348j830839j876679j85451Q71675k6175
$$ 2677576 2733817 3964632 5511262 5558610 3727771 1851092 1665641 2537316 2511141
39955B511141j329389r50034P43434J589664P36487m15464m58582J82969K68690
$$ 2511141 1181752 231718 975152 2564816 3301303 2885839 2427257 2610226 2878916
39946B878916l84057r25932q29276l23787K53037P06136P02399P0611n92562m40856
$$ 2878916 2494859 1568927 739651 415864 668901 1375037 2077436 2148047 1555485 1114629
39936A114629L50140O75460J41958l04459Q1187N93261K10807p61375j252256
$$ 1114629 1464769 2140229 2282187 1977728 2058915 2652176 2862983 2101608 849352
39927H49352j091120q93672o22131L18687J551294J789588Q03209p8049j4036
$$ 849352 -241768 -1135440 -1757571 -1438884 112410 1901998 2705207 2627158 2613122
39918B613122J58784l67716q47167m05561J72886k95645j163473q47157M33912
$$ 2613122 2771906 2404190 1557023 1151462 1324348 1028703 -134770 -981927 -548015
39909e48015Q27412j42629p60983M7345R21671K70101j133857j243495L64946
$$ -548015 279397 136768 -624215 -576870 344801 614902 -518955 -1762450 -1397504
39900a397504K107949K561424J837645R10534M75535M85837K80507o24193j522557
$$ -1397504 710445 3271869 5109514 6020048 6495583 6981420 7261927 6637734 5115177
39891E115177r76162J039232K323438J028059j575376k484540r15197Q47802P42725
$$ 5115177 4139015 5178247 7501685 8529744 6954368 4469828 3554631 4402433 5145158
39882E145158o62113j684481j829969j507311p36770M99553J435644J366112P96779
$$ 5145158 4483045 2798564 968595 -538716 -1275486 -775933 659711 2025823 2822602
39873B822602O18345O51163J95778m62408m67405p669m1262m86227k39779Q12322
$$ 2822602 3440947 4092110 4287888 3825480 3358075 3350406 3309144 2822917 2583138 3395460
39863C395460J411626J068708J026476K189011L455067L333056K156060J260665
$$ 3395460 4807086 5875794 6902270 9091281 12546348 15879404 18035464 19296129
39855A9296129O99858n83675k537654l600402k885190j511064j090316j686095
$$ 19296129 19995987 19412312 16874658 13274256 10389066 8878002 7787686 6101591
39847F101591j999319j183358J87851R18013N30357l50241q13738o15417j65843
$$ 6101591 4102272 2918914 3106765 4024778 4555135 4204894 3391156 2775739 2609896
39838B609896J89687M30674M77636K15657O6896P56757K057700K563134J488415
$$ 2609896 2799583 3230257 3707893 3923550 3990446 4747203 6804903 9368037 10856452
39829A0856452P0796K10785K160687M679494P250660J0755139J5429549J9018401
$$ 10856452 10927248 11138033 13298720 17978214 25228874 35984013 51413562 70431963
39821G0431963J7817480R847402k700605j4095926j8995239j6713740j1385570
$$ 70431963 88249443 98096845 95396240 81300314 62305075 45591335 34205765
39814C4205765p358008n154368k853816k06353Q33311n38689k461318l000721
$$ 34205765 26847757 21693389 18839573 18633220 19466531 18927842 16466524 13465803
39806A3465803k454721k096267k106190j914726j481882j082656o14369o3460
$$ 13465803 11011082 8914815 6808625 4893899 3412017 2329361 1714992 1651532
39798A651532O3327m13953p80894m04598M46914J275890J920577K010652J118862
$$ 1651532 1714859 1300906 520012 115414 562328 1838218 3758795 5769447 6888309
39789F888309N3756M43195K090057K473471K91561k201724k268291n87312J74608
$$ 6888309 6942065 7385260 9475317 11948788 12240349 10038625 7770334 7183022 7357630
39780G357630n25529j053722q80553j038942j479174q14934R18229J822893J116895
$$ 7357630 6832101 5778379 4897826 3858884 2379710 1564776 2483005 4305898 5422793
39771E422793K49280K80524L66991j80860m57620J82496P13500K63451l00322
$$ 5422793 5672073 5952597 6319588 6138728 5681108 5863604 6577104 6840555 6540233
39762F540233o2357J94079m41744j015020j30744J543553K060532R76965l13163
$$ 6540233 6477876 6671955 6230211 5215191 5084447 6628000 8688532 9665497 9352334
39753I352334p63552o96745o97700p66468p05829m50557L3190N21918M11135m85395
$$ 9352334 8588782 7892037 7194337 6427869 5722040 5271483 5304673 5826591 6237726 5752331
39743E752331j284531r46365L65672J537740J902620J712545J442854J293291
$$ 5752331 4467800 3521435 3887107 5424847 7327467 9040012 10482866 11776157
39735A1776157J208935Q40092k51310j792591k586927j806153k16364O13946J34384
$$ 11776157 12985092 13825184 13573874 11781283 9194356 7388203 7171839 7785785 7920169
39726G920169q42587j422844j491698j297435q57636k3349J126213K035802J870366
$$ 7920169 7077582 5654738 4163040 2865605 2007969 1984620 3110833 5146635 7017001
39717G017001L52428j481238j987669p85875O69136Q98323J92900q8260M94658
$$ 7017001 7369429 5888191 3900522 3114647 3783783 4682106 4875006 4786746 5281404
39708E281404J048978P16804l05863j103329r08368K61157J470768J604139N79123
$$ 5281404 6330382 7047186 6741323 5637994 4729626 4990783 6461551 8065690 8644813
39699H644813m69720n41331J24194O60614P61759O90827N45568J77554l48348
$$ 8644813 8175093 7633762 7757956 8418570 9180329 9871156 10416724 10594278 10245930
39690A0245930o87345n02211L20421J412543J917051J404474P91715J375671K825047
$$ 10245930 9558585 9056374 9376795 10789338 12706389 14110863 14902578 16278249 19103296
39681A9103296L385791K462578J543926J848570K600530K753548K945069M232162
$$ 19103296 22489087 24951665 26495591 28344161 30944691 33698239 36643308 40875470
39673D0875470O080026P264766P856173Q696560R775398J0741870J2106529J4128338
$$ 40875470 46955496 54220262 62076435 70772995 80548393 91290263 103396792 117525130
39665A17525130J5422383J4776036J3675698J4830993J8686009K3573661K8674247
$$ 117525130 132947513 147723549 161399247 176230240 194916249 218489910 247164157
39658B47164157L4142371L8647755L9822438L7269819L1937632K2106677M019117
$$ 247164157 281306528 319954283 359776721 397046540 428984172 451090849 455109966
39651D55109966k1353279m5264891n8029392n7645230m9677644m0303029l2026305
$$ 455109966 433756687 388491796 330462404 272817174 223139530 182836501 150810196
39644A50810196k5012572j9288364j4885081j1580153r280851p966446p204189
$$ 150810196 125797624 106509260 91624179 80044026 70763175 62796729 55592540
39637E5592540o416513n525741m749614m005609l080449k116497j450858j235776
$$ 55592540 49176027 43650286 38900672 34895063 31814614 29698117 28247259 27011483
39629B7011483j470569j959132k098353j402126l88851p5081m15165l40280L74294
$$ 27011483 25540914 23581782 21483429 20081303 19692452 19617371 19202206 18861926 19236220
39620A9236220O17027j32661p83610l83437M11292O38661O27420J151726K036936
$$ 19236220 19853247 19720586 18936976 18553539 18964831 19603492 20230912 21382638 23419574
39611B3419574K811860L816351N364285O514193N923582L507786M29982j958004
$$ 23419574 26231434 30047785 35412070 41926263 47849845 51357631 51787613 49829609
39603D9829609k636847j526188l52489j506067m876995p262292o353349l822267
$$ 49829609 47192762 45666574 45314085 43808018 38931023 31668731 25315382 21493115
39595B1493115k626086k731192j978582j99126M41122q91768k332870k138120
$$ 21493115 18867029 16135837 14157255 13958129 14399251 13507483 11174613 9036493
39587I036493q24506J29197J14917n85665j279474j054749K54649J224796L61709
$$ 9036493 8211987 8341184 8456101 7870436 6590962 5536213 5790862 7015658 7377367
39578G377367j510861k008112n39308Q18803L33194j106660j554894o12662M60838
$$ 7377367 5866506 3858394 3319086 4137889 4471083 3364423 1809529 1196867 1657705
39569A657705M79831n10201j390290j086107J00876O29730j43227p17573M06207
$$ 1657705 2137536 1627335 237045 -849062 -748186 -118456 -261683 -979256 -573049
39560e73049K129218K162809N51765m44789O5933N54152m0569p82008q50645q69259
$$ -573049 1556169 3718978 4270743 3825954 3891887 4446039 4405470 3623462 2772817 1903558
39550A903558j114325o41481N78334Q63894l18017q56635P41900K571972K114822
$$ 1903558 789233 147752 726086 1589980 1271963 415328 1157228 3729200 5844022
39541E844022J95700m80426L68478O19239m12898j017926k56431M17761m32483
$$ 5844022 6039722 5559296 5927774 6547013 6134115 5116189 4859758 5277519 4845036
39532D845036k024552k625396j845754o96107l9598K17033O14902J253726J526902
$$ 4845036 2820484 195088 -1650666 -2346773 -2386371 -2169338 -1554436 -300710 1226192
39523A226192R24147K5775m609Q34034J114058P5490j078499r63348p2484K30947
$$ 1226192 2150339 2176114 2171505 3005539 4119597 4195087 3116588 2153240 2080756 2311703
39513B311703j00431j48908J17578M0586j47137K74722P94813K35620r98237j176231
$$ 2311703 2211272 2062364 2179942 2220528 2073391 2348113 3142926 3378546 2380309 1204078
39503A204078K1636R40029N89579j5674J32774M84557L36676J39364K48854r6964
$$ 1204078 1225714 2165743 2755322 2739648 2872422 3356979 3693655 3833019 4081873 3984909
39493C984909j184197j584948j96102J532075J315010o00382j736509r17044L99140
$$ 3984909 2800712 1215764 1019662 2551737 3866747 3266365 1529856 612812 1011952
39484A011952O51177L04162N55327J175874R19046m14351j490381j147673J45833
$$ 1011952 1663129 1967291 2522618 3698492 4617538 4203187 2712806 1565133 1710966
39475A710966R09978L88083p37251j286422q26583J74281J022494J225429N80761
$$ 1710966 2620944 3009027 2271776 985354 158771 333052 1355546 2580975 3161736
39466C161736n00228r04860R4578J542982J539644k80241j931110j529064K23664
$$ 3161736 2661508 1756648 1851226 3394208 4933852 4653611 2722501 1193437 1417101
39457A417101J106282M30586l39645J247P70100P11165j31491p16204n69991j85824
$$ 1417101 2523383 2953969 2614324 2615571 3385671 4096836 3965345 3249141 2679150 2493326
39447B493326j04349l07132m61042k66585L46489R41473O92417o23900j861702
$$ 2493326 2388977 2081845 1620803 1354218 1700707 2642180 3334597 2710697 848995
39438H48995j496614M32564K076354J860642K37989j151709j524791j396418j303563
$$ 848995 -647619 -215055 1861299 3721941 3959930 2808221 1283430 -112988 -1416551
39429a416551j057297m15028K87738N82788N05132M66905P85928J458695K012431
$$ -1416551 -2473848 -2888876 -2601138 -2018350 -1513218 -1046313 -260385 1198310 3210741
39420C210741J562403l07747k488899k978653j166381J148063J752291N34726
$$ 3210741 4773144 4465397 1976498 -1002155 -2168536 -1020473 731818 1266544
39412A266544p99559j034516m18601L71421R81221R96445M6869j251401j490891
$$ 1266544 466985 -567531 -986132 -614711 366510 1362955 1409824 158423 -1332468
39403a332468k66285J028422R28956k06739q38479l05669O42400J152056J187700
$$ -1332468 -1598753 -570331 358625 151886 -686593 -992262 -349862 802194 1989894
39394A989894J039782O50386j62145j114943j490234q61231K69836P74503J02472
$$ 1989894 3029676 3680062 3517917 2402974 912740 51509 321345 1095848 1198320
39385A198320r32395j009201N1770J045266R17332o4826r25795j108399o35312
$$ 1198320 265925 -743276 -691506 353760 1271092 1206266 280471 -827928 -1463240
39376a463240J48060N33331o4290r96276p03645R79962J931584N42379j539643
$$ -1463240 -1315180 -781849 -846139 -1842415 -2546060 -1566098 365486 907865 -631778
39367f31778j452503O08894J607569L24912q84075p9004J082035K01157j726623
$$ -631778 -2084281 -1475387 132182 457094 -426981 -505985 576050 777207 -949416
39358i49416j758621L53962J833287J151444k7362J24548R08340P12450l60178
$$ -949416 -2708037 -2354075 -520788 630656 603294 727842 1636182 2348632 1988454
39349A988454j026718r35701p17127n23801L5281P20607O98691j31565q17248
$$ 1988454 961736 26035 -691092 -1214893 -1179612 -459005 239686 108121 -709127
39340g09127n98506K11487Q05565P86553K95800k82063n20967k46559J54208N0108
$$ -709127 -1307633 -1096146 -290581 495972 791772 509709 -11258 -257817 -103609 -53501
39330e3501n68635q48123n0271J376852K125082J505301K55023l96080k12401
$$ -53501 -622136 -1470259 -1520530 -143678 1981404 3486705 3741728 3345648 3133247
39321C133247j9416l33211o20735l14867O1845m12952j524506j989220j116049
$$ 3133247 3113831 2780620 2159885 1845018 1906863 1493911 -30595 -2019815 -3135864
39312c135864M01961J490720J676776Q88642p15125k209194k176320m03186J366661
$$ -3135864 -2733903 -1243183 433593 1322235 607110 -1602084 -3778404 -4181590 -2814929
39303b814929J347434m6527q33720o3048J218207J548688P03369l94240p56185
$$ -2814929 -1467495 -1514022 -2347742 -2410790 -1192583 356105 1059474 665234 -90951
39294i0951j77157N70749M34340o31065j332272n73888R91589J717824J026907
$$ -90951 -268108 302641 736981 105916 -1226356 -1800244 -808655 909169 1936076
39285A936076j66208r08744j043052o07271M14018J456463J583678P93982J78420
$$ 1936076 1769868 861124 -181928 -789199 -375181 1081282 2664960 3458942 3637362
39276C637362K83755K72530o40353j817629k101770j367406k93714P59643J622989
$$ 3637362 3921117 4193647 3553294 1735665 -366105 -1733511 -2027225 -1267582 355407
39267C55407J610291K48923j408900j525684J55333J770358J697453N41322j8525
$$ 355407 1965698 2214621 805721 -719963 -564630 1205728 2903181 3444503 3425978
39258C425978L58850N18216k01882j040300j140981p57999n24928l82112q7684
$$ 3425978 3784828 4303044 4101162 3060862 1919881 1161882 636954 254842 167158
39249A67158o9627o16799p78266M10912J844517J368822q18051j881018m20589
$$ 167158 97531 -519268 -1297534 -886622 957895 2326717 1508666 -372352 -792941
39240g92941J237940M98896j530612j828968m0698J382491J104230K56921j75782
$$ -792941 444999 943895 -586717 -2415685 -2456383 -1073892 30338 287259 111477
39231A11477o88690j387814j179898J96482J303085J221627R19766J319982J603207
$$ 111477 -577213 -1965027 -3144925 -2948443 -1645358 -423731 496035 1816017 3419224
39222C419224O68152j009217k141354k228792j516745m00978M32549M16408J60475
$$ 3419224 4087376 3078159 936805 -1291987 -2808732 -3209710 -2777161 -2360753 -2200278
39213b200278P51535J666811J229319l74245q50724N01589J427741M96632m30626
$$ -2200278 -1448743 218068 1447387 1073142 222418 724007 2151748 2648380 2217754
39204B217754M47699J633105J043583l16049m15650M0930p22379j776983j073943
$$ 2217754 2665453 4298558 5342141 5026092 4610442 4651372 3928993 2152010 1078067
39195A078067M21812J43486j314712j037146R01959J376522k08314q03051P17608
$$ 1078067 1499879 1643365 328653 -708493 193466 1569988 1361674 558623 1276231
39186A276231J342463p28423k578736j238707J403185J668392k27500j026884
$$ 1276231 2618694 1890271 -688465 -1927172 -523987 1144405 916905 -109979
39178a09979L19525J504737O50310j304434k238881j268224O94732J881626J224321
$$ -109979 209546 1714283 2364593 1060159 -1178722 -2446946 -1752214 129412 1353733
39169A353733n39301j637930j280376j97153P20040J117147O27639p26149j531280
$$ 1353733 814432 -823498 -2103874 -2301027 -1580987 -463840 163799 -562350 -2093630
39160b093630l40624J759772K167503O78714k39840L14144L06001j135059j639573
$$ -2093630 -2434254 -674482 1493021 2171735 1931895 2246039 2552040 1416981 -222592
39151b22592K59138K086121J331016l73919k45211Q46335K79901j398042j493702
$$ -222592 36546 2122667 3453683 3079764 2834553 3680888 3960789 2562747 1069045
39142A069045m1437L70800p66617j240974j52603Q98304R46452P60747M66675
$$ 1069045 1027608 1398408 631791 -609183 -761786 136518 1082970 1843717 2310392
39133B310392p53071k092852j470935P68716J640298R0577j252347l42881J161420
$$ 2310392 1557321 -535531 -2006466 -1237750 402548 493125 -759222 -1102103 59317
39124E9317R51560k39829k78506Q50857J473559J002655K52447k64475o75587
$$ 59317 1010877 771048 492542 1343399 2816958 3819613 4072060 3807585 3131998
39115C131998r14397q37456p01195o19646k12386M74836O30804P3578r1924P69071
$$ 3131998 2217601 1380145 678950 59304 -153082 321754 952558 1026136 934212 1703283
39105A703283J461669O25226j061963j727719q88443J23353J75627l23682k94022
$$ 1703283 3164952 3790178 2728215 1000496 112053 235406 411033 87351 -206671
39096b06671M73096R78382K14054j341896j885139m86122J386313J610962L20123
$$ -206671 266425 1244807 1458861 116965 -1768174 -2254296 -867983 742979 1063102
39087A063102m20102K47862R59929O30704M4746P6072J03794n32034j000332l96185
$$ 1063102 643000 890862 1850791 2481495 2526241 2602313 2706107 2174073 1173741 777556
39077G77556M91327L83531m14968o63176j84446K51440M57194P83485R89780N67165
$$ 777556 1268883 1652414 1237446 574270 389824 641264 1098458 1881943 2871723 3438888
39067C438888j22457l36740k91972p01671j221114p73370N63564J365544Q40518
$$ 3438888 3316431 2979691 2687719 1986048 764934 -8436 555128 1920672 2761190
39058B761190j39295l95369O9257M25351K16644l05840p27789r56045j163156
$$ 2761190 2621895 2226526 2295783 2721134 2937778 2631938 1904149 948104 -215052
39049b15052j344680j105938k05767P86401J002744N43355M34935J033817J392049
$$ -215052 -1559732 -2665670 -2871437 -2085036 -1082292 -538937 -104002 929815 2321864
39040B321864P45186l25644r63409j303448j687236j528729k75373J147225J317999
$$ 2321864 3067050 2741406 1777997 474549 -1212687 -2741416 -3016789 -1869564 -551565
39031e51565M34052J7206O02851J101865O12270l69869q72061n83449K48990J204852
$$ -551565 -117513 -100307 502544 1604409 2216679 1846810 974749 391300 640290 1845142
39021A845142J652668J079111j93211j160380j216747o18236J38545P88279J089210
$$ 1845142 3497810 4576921 4383710 3223330 2006583 1388347 1526892 2315171 3404381
39012C404381P84736k5388q80092j374044j295603o12736K03274K33169p75673
$$ 3404381 4189117 4163729 3283637 1909593 613990 1254 204528 437697 -337976
39003c37976j682501j241073J26637Q77227N38691J66926M99605R13008O87540
$$ -337976 -2020477 -3261550 -3134913 -2257686 -1718995 -1552069 -1052464 -139456 548084
38994E48084K27750K95147P55602Q21600J46686q11411j229768n22030J043094
$$ 548084 775834 1070981 1826583 2648183 2794869 1983458 753690 231660 1274754
38985A274754K200261J804066L00677o25883j67508O41396N06647m22977j127220
$$ 1274754 3475015 5279081 5579758 4953875 4786367 5427763 5934410 5511433 4384213
38976D384213j256123j189521j036549n72789R803J99568M806p5171N1804m6620
$$ 4384213 3128090 1938569 902020 329231 339034 538602 543408 468237 520041 473421
38966D73421m47787o43275m03419j08246J09984P05663J602647J596156p3710
$$ 473421 25634 -617641 -1021060 -1129306 -1019322 -313659 1288988 2885144 2811434
38957B811434k081155k280279n39641J042898J000877J64067j26748J1748o0648
$$ 2811434 730279 -1550000 -2089641 -1046743 -45866 118201 -8547 3201 -57447
38948e7447Q0345R58612J567735O37351r40237j013949N57022J631208J037616
$$ -57447 22898 981510 2549245 3186596 2246359 1232410 1789432 3420640 4458256
38939D458256l2653m41765o90297j121789p62930O01357J245893K28366n53423
$$ 4458256 4425603 3983838 3293541 2171752 1408822 2010179 3256072 3484438 2931015
38930B931015P56316K598824K124809l98209k114891j901144j256465j065640
$$ 2931015 3687331 6286155 8410964 8012755 5897864 3996720 2740255 1674615
38922A674615m62097O74631R21527q2835o99474p6188L54691n03336j330253n72026
$$ 1674615 1212518 1887149 2808676 2725841 2026367 1950179 2304870 1801534 471281 -100745
38912a00745R51852J428779Q06192L44555K94333j60105j062676j415776p30312
$$ -100745 851107 2279886 3086078 3430633 3724966 3564861 2502185 1086409 356097
38903C56097L17891Q56804P05609L37862L94237R64949J136574p9596k063070
$$ 356097 673988 1530792 2236401 2574263 2968500 3933449 5070023 4990427 2927357
38894B927357k821429j533605K10004O23933J35574L16973J251643J557129P07248
$$ 2927357 105928 -1427677 -1217673 -593740 -458166 -141193 1110450 2667579 3374827
38885C374827k20416k48582K89098N92666N50852O06654R72843J317889J069828
$$ 3374827 3154411 2905829 3194927 3787593 4338445 4945099 5917942 7235831 8305659
38876H305659K1145j266180j873264j461442m80606N44242J307136J312517K35394
$$ 8305659 8326804 7060624 5187360 3725918 3245312 3789554 5096690 6409207 6644601
38867F644601r86515p02763J066424K095037Q97181j053596j524816p89464p47401
$$ 6644601 5658086 4955323 6021747 8116784 9013965 7960369 6435553 5646089 4898688
38858D898688j587738j660967m97739M25514L18842K67302R81734J329029K88793
$$ 4898688 3310950 1649983 1152244 1577758 1896600 2163902 3145636 4474665 4763458
38849D763458j191413j624554j071543n21737k15199J25552K95886J74460M58429
$$ 4763458 3572045 1947491 875948 354211 139012 264564 560450 734910 1193339
38840A193339J404148J643444K910k065562j957029K42907J592953N03186j042655
$$ 1193339 2597487 4240931 4243841 2178279 221250 464157 2057110 2560296 1517641
38831A517641o48815R45347J266040j22382j283937r03846K80477J064428J126203
$$ 1517641 868826 1814173 3080213 2957831 1673894 770048 1050525 2114953 3241156
38822C241156N07046p37945j820393j465056L78823K090903K323802J436931L78406
$$ 3241156 3748202 3010257 1189864 -275192 103631 2194534 4518336 5955267 6333673
38813F333673o96200j782323k173847j513229p61125p31631n24229R19261K404611
$$ 6333673 5637473 3855150 1681303 168074 -593051 -1324682 -1848911 -929650 1474961
38804A474961J719029q94202k657998k011761m30050J99401J09818M39575J069191
$$ 1474961 3193990 2299788 -358210 -2369971 -2800021 -2600620 -2490802 -2051227 -982036
38795i82036J148933P63086O24008P07645M36800j44149m17321k09947R015j98034
$$ -982036 166897 929983 1553991 2261636 2698436 2554287 2136966 1927019 1936034 1738000
38785A738000q29221j427782j257828p7008J100561R29010k78402o68795M57245
$$ 1738000 908779 -519003 -1776831 -1853839 -753278 175732 -102670 -771465 -314220
38776c14220J418126O03885j123278j826616j252824o36511n05590l50052o3978
$$ -314220 1103906 1707791 584513 -1242103 -2494927 -3131438 -3637028 -3987080 -4051058
38767d051058j11912l88878k84015J92947N26640P67187J335966J976289K040933
$$ -4051058 -4162970 -4551848 -4835863 -4642916 -4116276 -3349089 -2013123 -36834 2004099
38758B004099J559688Q90809k29123j909553k886492j843279K66198J141299M49291
$$ 2004099 3563787 4454596 4225473 2315920 -570572 -2413851 -2147653 -1006354 -557063
38749e57063J68698J197767J771693L23092j869502k378531q30961J017612J699496
$$ -557063 -388365 809402 2581095 2904187 1034685 -1343846 -2174807 -1157195 542301
38740E42301J235235L11250n85244j168329j186901m92988P51440J835619J765781
$$ 542301 1777536 2088786 1503542 335213 -851688 -1344676 -593236 1242383 3008164
38731C008164L56831j149243j356565m80328P6815k16728n23227k11417L27309
$$ 3008164 3364995 2215752 859187 378859 455674 238946 -284281 -495698 -168389
38722a68389O37068P40163M98646k73388q41560j81964J086817J097481l78690
$$ -168389 468679 1208842 1707488 1434100 592540 410576 1497393 2594874 2216184
38713B216184j310172n67265K85348k66793j082364m28088R37730J063833R5587
$$ 2216184 906012 338747 624095 357302 -725062 -1153150 -215420 848413 944000
38704I44000k24438K89926K04768n93760n14375P48967J265867j14736j802779
$$ 944000 719562 1009488 1214256 620496 106121 855088 2120955 2006219 203440
38695B03440j829850o21085J05364R4094M91883J511374J834741O11842j117542
$$ 203440 -1626410 -2247495 -2142131 -2048037 -1556154 -44780 1789961 2401803 1284261
38686A284261j629751n85631P32010J082828N64101J9858l14335q59729j513345
$$ 1284261 -345490 -931121 -199111 883717 1447818 1467676 1153341 293612 -1219733
38677a219733j403241k73827P49019O10821q9257m1265O61806O83503k93929q97627
$$ -1219733 -2622974 -2896801 -2147782 -1536961 -1626218 -1667483 -1005677 -322174 -616103 -1513730
38667a513730j58366R55761R83225O1808n00484k19619J70137J64772J72844N12056
$$ -1513730 -1672096 -716335 266890 328698 -171786 -391405 -221268 -56496 116348 628404
38657F28404P28540M66296K49351O39001J125671P71455k82639r41416p93188
$$ 628404 1356944 1823240 2072591 2711592 3837263 4608718 4326079 3384663 2591475
38648B591475n59850o41216l75873N52134J060946J71803j199201j334678j97049
$$ 2591475 2031625 1390409 1014536 1566670 2627616 2799419 1600218 265540 68491
38639F8491O41512M11789l6976J7712J56852J8367P3899M96251N10330k81589
$$ 68491 710003 1121792 1084816 1102528 1259380 1277747 1351646 1847897 2358227 2076638
38629B076638j028127r72155o31687o70699o05505J88004J027394Q29826q0955
$$ 2076638 1048511 76356 -555331 -1226030 -1831535 -1643531 -616137 213689 132734
38620A32734m00917K09098Q12754P27249L06840J26915J60371q5336r34839j915176
$$ 132734 -268183 -59085 753669 1480918 1787758 1914673 2075044 1989708 1054869 -860307
38610h60307j757736K20497K567423K750922M09936j771887j463785L74707J312162
$$ -860307 -2618043 -2397546 169877 2920799 3330735 1558848 95063 469770 1781932
38601A781932Q65853K77561l7361n96720j030085m62594M94076L48637o87256
$$ 1781932 2647785 2925346 2887985 2291265 1261180 798586 1292662 1641299 954043
38592I54043r06974l0664L35521m47510j002254m40163K32093J64987J32004P76176
$$ 954043 47069 16405 351926 -95584 -1097838 -1538001 -1305908 -1140921 -1008917 -232741
38582b32741J181350N24144l81916n46616m18797o49549n53055O05086J816522
$$ -232741 948609 1472753 1090837 544221 125424 -524125 -1077180 -472094 1344428
38573A344428J520198l3561j121754q92869j08809K36451K5554j56001L00791
$$ 1344428 2864626 2831065 1709311 816442 707633 944084 969638 813637 1114428
38564A114428J300291J796071R29866n13063r45305m49127p29818k032315k200013
$$ 1114428 2414719 4210790 5140656 4627593 3682288 3233161 2503343 471028 -1728985
38555a728985j20743J950790J524174l38868p93466M37408J169081N20249k21709
$$ -1728985 -1849728 101062 1625236 1286368 492902 930310 2099391 2619640 2397931
38546B397931l53448o80159j377732j375249m70101J09413m7492K16180J276656
$$ 2397931 2044483 1364324 -13408 -1388657 -1858758 -1749345 -1796837 -1580657 -304001
38537c04001J660045N31573n20305K59697K006983K310431L71464k222305l448724
$$ -304001 1356044 1887617 1367312 1627009 3633992 5944423 6315887 4093582 644858
38528F44858k595433m63832J334033J584934N69347l48482m64410m09373p93440
$$ 644858 -1950575 -2414407 -1080374 504560 1073907 725425 261015 -148358 -941798
38519i41798j105029n90536N27817J393948J506973Q91739n8777n35900L8837
$$ -941798 -2046827 -2637363 -2109546 -715598 791375 1683114 1624337 1088437 1127274
38510A127274R19719O45997p38057j374906l32162P92639K88850j009454j221073
$$ 1127274 2046993 2692990 1954933 580027 247865 1040504 1329354 319900 -901173
38501i01173m62337k43245n06810K41944J877022K250712N28597j287960j309249
$$ -901173 -1363510 -1606755 -2113565 -1871621 5401 2256113 2784710 1496750 187501
38492A87501l94669l92515j172818j140541J31133J449829J808300J243996J26879
$$ 187501 -207168 -599683 -1772501 -2913042 -2781909 -1332080 476220 1720216 1847095
38483A847095j129291j738235j132416M0022N44911K53141J61359O17574P06716
$$ 1847095 717804 -1020431 -2152847 -2112825 -1567914 -1314773 -1153414 -535840 170876
38474A70876j72027j177066j143429o8521J148653J797373J600037N67988o67325
$$ 170876 -1151 -1178217 -2321646 -2390167 -1241514 555859 2155896 2723884 2056559
38465B056559r99085j25518Q40442Q39108L21691K43595K82936m88046j555950
$$ 2056559 1057474 931956 1772398 2611506 2933197 3176792 3459728 2971682 1415732
38456A415732j403018j06904M24084n21694j088797K25620J917213J585911l69542
$$ 1415732 12714 -94190 329894 -191800 -1280597 -1054977 862236 2448147 2078605
38447B078605j335953l68104P16854L61579o50059r13580n19046k82932j16532
$$ 2078605 742652 374548 1091402 1452981 802922 -110658 -629704 -912636 -1029168
38438a029168M56169R41459M94701m41289n10987M74651J060928J68223j350102
$$ -1029168 -572999 368460 863161 421872 -89115 385536 1446464 1614687 264585
38429B64585j813874q00269N72649J148208Q21274J73717l03491l77283J8497
$$ 264585 -1549289 -2349558 -1776909 -628701 192573 366290 62799 -314484 -295987
38420b95987N90457O95767N0980p17165p64942j98429Q9602k26845n07308l22468
$$ -295987 294470 990237 1041217 324052 -440890 -639319 -549717 -776562 -1283870 -1606338
38410a606338j06714j06991L26613J443164J957172O33482j461304j968888n42639
$$ -1606338 -1713052 -1820043 -1493430 -50266 1906906 2540388 1079084 -889804 -1432443
38401a432443N66580k41394j661911j489635L26442J909907K019382J126752K85277
$$ -1432443 -865863 -1107257 -2769168 -4258803 -3932361 -2022454 -3072 1123680 1408957
38392A408957K1088K48737M52668K4830r48882j457128p57537M94517J043269
$$ 1408957 1430045 1678782 2131450 2156280 1207398 -249730 -1007267 -512750 530519
38383E30519O60053J31613j20621l98929p73250q42070o14771o07532p35270j29442
$$ 530519 1190572 1322185 1201564 802635 29385 -812685 -1427456 -2034988 -2770258 -2899700
38373b899700J364766K429103J871242L54076m65455j75068J21238k36012m39035
$$ -2899700 -1534934 894169 2765411 3119487 2654032 2478964 2600202 2364190 1925155
38364A925155K66113J005208L63236j304686j983717p43406Q35787Q36798l47130
$$ 1925155 2191268 3196476 3559712 2255026 271309 -472097 363690 1200488 853358
38355H53358q58458k90121j3335n56183n96105O12048J543302O19137j106769
$$ 853358 -5100 -295221 -308556 -864739 -1460844 -848796 694506 1313643 206874
38346B06874j306651K14473J357751Q32119l77075q85787o51008k98390m7088
$$ 206874 -1099777 -885304 472447 1304566 927491 41704 -609304 -907694 -954782
38337i54782K5504k75164n96200o4680J355852K386244J972489N51649q00178
$$ -954782 -929278 -1204442 -1800642 -1865322 -509470 1876774 3849263 4400912 3600734
38328C600734j643628j933855j410532j72802Q07207P39917J32231m3070J60662
$$ 3600734 1957106 23251 -1387281 -1560083 -752876 -12959 119272 76202 236864
38319B36864l2326o69069r78596o47543k17175j00154j9282L10913N43804J25692
$$ 236864 204538 -464531 -1443127 -2090670 -2307845 -2407999 -2427281 -2116368 -1572564 -1446872
38309a446872q57516j512807r44890O32451J771307J291215j35952o71757K74093
$$ -1446872 -2304388 -3817195 -4762085 -4129634 -2358327 -1067112 -1203064 -1874821 -1600728
38300a600728J305356J142749L26746j3330L978l56598q20985o00800j4878n8754
$$ -1600728 -295372 847377 1174123 1160793 1164771 808173 -12812 -613612 -628490 -687244
38290f87244n65016l38769Q30135J750391J642818J028447M95789j25880r10515
$$ -687244 -1252260 -1591029 -760894 989497 2632315 3660762 4156551 4030671 3120156
38281C120156j331249j164470q94298p13401j15321R61755J566642J028314M4692
$$ 3120156 1788907 624437 -269861 -983262 -1098583 -136828 1429814 2458128 2502820
38272B502820k47079K67843P49084M98025m44744j429595j692993j090584l23502
$$ 2502820 2255741 2523584 3272668 3770693 3325949 1896354 203361 -887223 -1210725
38263a210725J9324L03784R47198J215419K56221j064010j095200k4208M63737
$$ -1210725 -1191401 -887617 59581 1275000 1531221 467211 -627989 -652197 -188460
38254a88460J88567O87286J946221J761902m12524j845299o70442J005272O13717
$$ -188460 107 687393 2633614 4395516 3982992 2137693 1467251 2472523 3086240
38245C086240o98750m85302M90017j30135j584969j052219J145904J638035m36668
$$ 3086240 2387490 1902188 2392205 2262070 677101 -375118 770786 2408821 1972153
38236A972153k025994j210169J47758J80849q8921M92032P31748l37064j090480
$$ 1972153 -53841 -1264010 -1116252 -935403 -1024324 -532292 199456 -137608 -1228088
38227a228088k7272J360282R97862l59748p38103l35109n68801j069424n00682
$$ -1228088 -1255360 104922 1102784 743036 4933 -330176 -898977 -1968401 -2469083
38218b469083N44538L60871p06212p26501M31739R28003K08577k37895K17748
$$ -2469083 -1924545 -1563674 -2269886 -2996387 -2564648 -1636645 -1428068 -1665963 -1448215
38209a448215K28277r35183j855154j119302O53377J936309K124339J440585K37906
$$ -1448215 -1219938 -2155121 -4010275 -5129577 -4476200 -2539891 -415552 1025033 1262939
38200A262939q61754j171080q43453o37391n66186o971P12505M54454o09599q24148
$$ 1262939 401185 -769895 -1613348 -2250739 -2816925 -2823896 -2111391 -1656937 -2266536 -3090684
38190c090684K73485R54953Q3367r00647l06492J019901J107742l3473p17803
$$ -3090684 -2817199 -1862246 -1778879 -2679526 -2986018 -1966117 -858375 -891848 -1609651
38181a609651l29438K01287L53265N64480Q28396M63047m60702r31871n87285
$$ -1609651 -1939089 -1737802 -1384537 -820057 8339 471386 10684 -921187 -1508472
38172a508472j98015k15382q5057N11272R05077N65483q198j74991p3039j1613
$$ -1508472 -1706487 -1921869 -2006926 -1495654 -590577 -25094 -33292 -208283 -281322 -292935
38162b92935K04581O11651N65098k33961q87443m72464M89979Q06942L83881J1650
$$ -292935 -88354 523297 1088395 854434 -33009 -505473 -15494 791448 1175329 1186979
38152A186979k43836r46363j652835j112911M38557R61479l77611j472728j74329
$$ 1186979 943143 -3220 -1656055 -2768966 -2330409 -1368930 -1746541 -3219269 -3393598
38143c393598K288460K890301J217735j04929M56980J237187L51012j319748j743726
$$ -3393598 -1105138 1785163 3002898 2897969 3354949 4592136 4943148 3623400 1879674
38134A879674q51381j39227q8937N3743L71982J01128o40086p28165L1906M22290
$$ 1879674 1028293 889066 800129 853872 1225854 1326982 686896 -41269 -9363 412927
38124D12927k23758r68119q42269k33656J01856L10505P51797R28191K30114p83639
$$ 412927 189169 -778950 -1621219 -1854875 -1753019 -1442514 -690717 237474 467588 -316051
38114c16051r31935j7430R75613J189223P18487J82104n666O2841p2697o73269
$$ -316051 -1247986 -1265416 -289803 899420 1617907 1800011 1794345 1857186 1784489 1111220
38104A111220j265134j086910k34068K87501L071k99947J23727P39171O94089
$$ 1111220 -153914 -1240824 -1474892 -1187391 -1184320 -1484267 -1360540 -621369 72720
38095G2720L36826N82718J164428Q83597l89914j308163j001078k95118l51271
$$ 72720 409546 992264 2156692 3040289 2650375 1342212 341134 46016 -305255
38086c05255r70718j055981k22846Q31540J315544J047323K86014n62612j004218
$$ -305255 -1275973 -2331954 -2554800 -1723260 -407716 639607 925621 363009 -641209
38077f41209o56538L60516J358200J581215Q65914j80624p27993n14876j7863
$$ -641209 -1297747 -937231 420969 2002184 2868098 2687474 1959481 1444605 1426742
38068A426742K12830J64084J28614J45243M7370j14778j58001j64261l08722m04726
$$ 1426742 1639572 1803656 1932270 2077513 2124883 2010105 1852104 1687843 1379121 974395
38058I74395k24291j64891p47252j390522q20633Q18486J498032O59j958327j869914
$$ 974395 750104 585213 -162039 -1552561 -2373194 -1554708 -56676 -56017 -2014344 -3884258
38048c884258l9551R26991J43868l72865P39441J809573R69053n71071m87393
$$ -3884258 -3923809 -2996818 -2852950 -3225815 -2486374 -676801 292252 -278819 -766212
38039g66212O97766N41595r72308j293035J27394N55806j306249k542791m44268
$$ -766212 -68446 473149 -499159 -1792194 -1664800 -1108994 -2415243 -4958034 -5402302
38030e402302K827661L217156P61025r86791o75031m47037j402303j624467O5042
$$ -5402302 -2574641 642515 1403540 416749 -258282 -705319 -2107622 -3732089 -3667047
38021c667047J685377J276802q2852m67525j48428k71264l45463N11744J254787
$$ -3667047 -1981670 -704868 -787720 -1255245 -1403673 -1674937 -2020400 -1508656 -253869
38012b53869M06437j127119j322345m14739l28131j103749p75714R66413J835600
$$ -253869 152568 -974551 -2296896 -2711635 -3039766 -4143515 -4919229 -3952816 -2117216
38003b117216N63574j021576r06679J40196K42669m24661j55174J311495K235031
$$ -2117216 -1553642 -2575218 -3481897 -3341701 -3099032 -3523693 -3678867 -2367372 -132341
37994a32341J356788m40650j386028r32215r0643N7036l12413j92853O44704J125157
$$ -132341 1224447 783797 -602231 -1534446 -1625089 -1568053 -1880466 -2073319 -1428615 -303458
37984c03458M00578o83161n80064P43353J680070J143208k06133j156086j333805
$$ -303458 97120 -586041 -1166105 -422752 1257318 2400526 2194393 1038307 -295498
37975b95498r54653j74947O20595O67288k37141j126314r12690K82464J398656
$$ -295498 -1250151 -1425098 -804503 -137215 -374356 -1500670 -2413360 -2130896 -732240
37966g32240J705177J277311N15550k35316p09540q03901o36369l50683N792L24921
$$ -732240 972937 2250248 2765798 2530482 1820942 1017041 380672 29989 35781 360702
37956C60702M03819J74507k32957o27426p14067j56828Q15371J154707J60207
$$ 360702 764521 939028 706071 78645 -635422 -792250 23121 1177828 1338035
37947A338035j242208j397923j68786Q42311N84385j43255k40760Q0552J55062
$$ 1338035 95827 -1302096 -1470882 -628571 -44186 -187441 -428201 -347649 -192587
37938a92587K61275R07868J410252N88122j287544k456878j761480L4305J216877
$$ -192587 68688 976556 2386808 2974930 1687386 -769492 -2530972 -2496667 -1279790
37929a279790Q99162k95676r89686m53299O29538R91982L64398l43283n34839
$$ -1279790 -380628 -676304 -1665990 -2119289 -1489751 -497769 -133371 -476654 -1011493
37920a011493o87862j154637j230822l42327O72066O57514l0349q9087O58952
$$ -1011493 -1699355 -2853992 -4084814 -4427141 -3755075 -3097561 -3127910 -3216997 -2558045
37911b558045J115646P62057L05520K66802J89562k78586n92917k45453K99223
$$ -2558045 -1442399 -680342 -374822 -108020 81542 -197044 -789961 -1035414 -736191
37902g36191K84421k33299n37091j91290N49849J006276N72827o40048j540390
$$ -736191 -451770 -685069 -1222160 -1413450 -863601 142675 715502 75454 -1464936
37893a464936r97843O99293J938072J704138P84922M86585P27333L09061j093555
$$ -1464936 -2462779 -1763486 174586 1878724 2663646 3150231 3877564 4186625 3093070
37884C093070k208701j796664l47514M95992N771q16556o91738K27257O81219
$$ 3093070 884369 -912295 -1259809 -763817 -758046 -1574602 -2266340 -2039083 -1357864
37875a357864J20490n73516l83261N18148J215215J278420Q74976O4433j106377
$$ -1357864 -1237374 -1810890 -2194151 -1676003 -460788 817632 1692608 1757041 650664
37866F50664j899567j285652N94536K113557J858804K26835j165844j323259o01109
$$ 650664 -1248903 -2534555 -1940019 173538 2032342 2259177 1093333 -229926 -831035
37857h31035J36702M20968K12103l29865p96573o85382l6155L61107q0288p50880
$$ -831035 -694333 -273365 -61262 -391127 -1187700 -1873082 -1909237 -1548130 -1628418 -2379298
37847b379298n17423N47888J000093N7117j083156q88775K31817O32410P0273
$$ -2379298 -2896721 -2348833 -1348740 -1291623 -2374779 -3263554 -3031737 -2399327 -2329054
37838b329054k6902Q28347J088202l58311k075088j901561j5804J379807J043622
$$ -2329054 -2355956 -1527609 -439407 -797718 -2872806 -4774367 -4790171 -3410364 -2366742
37829b366742r5449o60696m41890j2771K68572M27936N56356N80411J93903p36372
$$ -2366742 -2462191 -3122887 -3564777 -3577548 -3308976 -2881040 -2324684 -1744273 -1550370 -2286742
37819b286742j482550q78999R41498K089985J280014j41882k4874J302009J505902
$$ -2286742 -3769292 -4648291 -3706793 -1616808 -336794 -478676 -503550 798459 2304361
37810B304361p7721j401951q99019L08701M89571r8209j78308K14106R5601m58643
$$ 2304361 2226640 824689 -74330 234371 723942 625733 447425 661531 757132 298489
37800B98489l79447M82580R73440L85131n05628n58468K54298R14065O05511l52068
$$ 298489 -80958 401622 1375062 1760193 1254565 696097 950395 1864460 2469971 2117903
37790B117903q14717j13639J030211J262112K78921q25012j065990o86911l58229
$$ 2117903 1303186 1189547 2219758 3481870 3760791 2935779 1869789 1182878 824649
37781H24649n2607N50420J118248R99790K12265o62158j331844j836355j951342
$$ 824649 772042 1322462 2440710 3440500 3652765 2990607 1658763 -177592 -2128934
37772b128934j328151j84609P93426J245107J325996J207440R14279N64042K57330
$$ -2128934 -3457085 -3641694 -2848268 -1603161 -277165 930275 1844554 2408596 2665926
37763B665926j47009o61933q23680l44918J34248k23015j063475j129277o8454
$$ 2665926 2518917 1856984 1033304 688386 822634 599619 -463856 -1593133 -1661587
37754a661587R76713R61494K74555q8076K0870N5949m7164K11525Q26381R83272
$$ -1661587 -684874 276620 551175 463099 483969 539918 492754 704279 1530660 2513932
37744B513932J97148p90791q22038J51720R29479N75657m25044r06443n58806
$$ 2513932 2711080 1920289 1098251 1249971 2179450 2755107 2330063 1423620 864814
37735H64814j29945j98834m50931l62684J7432L29814M36721K96716j95341p67910
$$ 864814 734869 536035 85104 -277580 -260148 69666 506387 803103 607762 -160148
37725a60148o95328K02208R55096O30786k83566o52072n10189q21777j429205
$$ -160148 -855476 -653268 301828 932614 649048 -3024 -513213 -1334990 -2764195
37716b764195q27181J352098L046247K226783k13271j524368o95042N57758N10231
$$ -2764195 -3591376 -2239278 806969 3033752 2820481 1296113 601071 1158829 1669060
37707A669060l77909p05232l59593k99784o69050m59804P94682J998785J716852
$$ 1669060 1291151 585919 226326 -73458 -742508 -1202312 -407630 1591155 3308007
37698C308007m4168j771784k024058p74546P35315J269306P01751r1703l87724
$$ 3308007 3263839 1492055 -532003 -1306549 -571234 698072 1399823 1308120 920396
37689I20396m11218p30764j156400r10300M4391O30225Q9982q02856o93852N02708
$$ 920396 509178 -221586 -1377986 -2288286 -2243895 -1613670 -1523688 -2326544 -3020396 -2517688
37679b517688J504889J386450O39840K72554M24274L43693m82409j597577k064212
$$ -2517688 -1012799 373651 1013491 1286045 1710319 2054012 1571603 -25974 -2090186
37670b090186j511417m88241K70858O34408Q18965P13235K15038P6985J237973
$$ -2090186 -3601603 -4089844 -3818986 -3184578 -2365613 -1652378 -1437340 -1360355 -122382
37661a22382K999510L219831J189552r62561j048569J26746K49639q68545j407122
$$ -122382 2877128 6096959 7286511 6323950 5275381 5402127 5651766 4783221 3376099
37652C376099q78286p22422j282763r20936Q26264J776313M70364j167034p19408
$$ 3376099 2497813 1775391 492628 -428308 397956 2174269 2644633 1477599 758191
37643G58191Q64578Q78392p59638j551764n52347K83166o33337k147803k209601
$$ 758191 1622769 2501161 1741523 189759 -362588 -79422 -712759 -2860562 -5070163
37634e070163n41310J476526K512628K138830Q43266k21390k08797L44899J60168
$$ -5070163 -5611473 -4134947 -1622319 516511 1359777 1138387 929590 1274489 1434657
37625A434657q76893j421313o15497P37429J493598J626678J582974J099940k20034
$$ 1434657 557764 -863549 -1479046 -741617 751981 2378659 3961633 5061573 4841539
37616D841539j652953j865797p18293L71913J98161o99494p80311M50839J754805
$$ 4841539 3188586 1322789 604496 976409 1174570 475076 -305235 145604 1900409
37607A900409J742365O44853j60318j93671m38670j536088k462924j903739k32617
$$ 1900409 3642774 4287627 4127309 3933638 3494968 1958880 -504044 -2407783 -2640400
37598b640400R67653R65398L63136j99970o37837p79892l33057L79839O63996
$$ -2640400 -1672747 -707349 -344213 -544183 -1182020 -1961912 -2294969 -1915130 -1251134
37589a251134N43583O29126Q95562P32060K27374O1643q22q90040k095845j629469
$$ -1251134 -707551 -78425 817137 1549197 1776571 1838214 1837392 947352 -1148493 -2777962
37579b777962Q78440K796330J761086r93529k367696j506841k22026J34070Q0496
$$ -2777962 -1899522 896808 2657894 1664365 -703331 -2210172 -2432198 -2298128 -2217632
37570b217632K83296M19433K81796L96075Q27210P13918k15075q54243l75629
$$ -2217632 -1934336 -1514903 -1233107 -837032 -9822 704096 489021 -365222 -740851
37561g40851L81201K69358l10250k48742K17135r3322j018967r15208P51723K225496
$$ -740851 -359650 -90292 -400542 -649284 -432149 -525471 -1544438 -2459646 -1707923 517573
37551E17573J824852K91570m80506k12267k03752r23805j314697o89694J81537
$$ 517573 2342425 2633995 2153489 1941222 1737470 813665 -501032 -1190726 -1009189
37542a009189M37914L25137L13194J21335m88695q80953n11144L7949J5657k06426
$$ -1009189 -571275 -246138 67056 188391 -300304 -1181257 -1692401 -1654452 -1638795 -1845221
37532a845221Q1052N25045L92244Q5811M71910J044670M70362j024286j551922
$$ -1845221 -1764169 -1239124 -846880 -761069 -289159 755511 1225873 201587 -1350335
37523a350335k79954J299395J495004N13064l81249o98383p58480o60884j96906
$$ -1350335 -1630289 -330894 1164110 1677174 1295925 597542 -160938 -821822 -1018728
37514a018728N55155J205747J430264J094276L38690l43607n59058n26346n87756
$$ -1018728 -463573 742174 2172438 3266714 3605404 3261797 2702739 2176393 1588637
37505A588637m22601L78389J145942P22640p36453j795562j724294j158429o04483
$$ 1588637 1166036 1544425 2690367 3413007 2676554 880992 -843302 -2001731 -2606214
37496b606214K03974J075625J117753L77907J48263Q43996J177461L68041n07369
$$ -2606214 -2402240 -1326615 -208862 169045 317308 1161304 2338765 2706806 2199437
37487B199437n16818m90954j180025j478007l10921J144752J167416K17246j82271
$$ 2199437 1682619 1191665 11640 -1466367 -1777288 -632536 534880 752126 569855
37478E69855k13229j016470j975878j389447M47466J402659P94553R6443J43009
$$ 569855 356626 -659844 -2635722 -4025169 -3577703 -2175044 -1380491 -1284048 -1141039
37469a141039O5702m72362l53601P97442J594677J139892M48356M81143M82494
$$ -1141039 -1075337 -1547699 -1901300 -1103858 490819 1630711 2079067 2560210 3042704
37460C042704l71179j192915q34387N7371J01632m92139l41217P50026J418664
$$ 3042704 2671525 1478610 644223 701594 803226 311087 -30130 719896 2138560
37451B138560Q01604k66189m77737K75421Q73415L14084j148307k212451j913882
$$ 2138560 2940164 2673975 2196238 2471659 3345074 3659158 2510851 298400 -1615482
37442a615482o91423J93299J75921j36103K9318O93307J317806J417045Q77828
$$ -1615482 -2306905 -2113606 -1937685 -2073788 -2044470 -1351163 -33357 1383688 2261516
37433B261516R2129k42224J06640M78447K07657l40110l84588r8187l23466j036623
$$ 2261516 2353645 2111421 2218061 2696508 2904165 2564055 2179467 2081280 1757814 721191
37423G21191j263944o40529J00987M06752M97938M16666k42937j152694j081119
$$ 721191 -542753 -1183282 -1082295 -675543 -177605 239061 -3876 -1156570 -2237689
37414b237689L18425J631845J489020L68990l01605j13194K06292R8952k82248
$$ -2237689 -1919264 -287419 1201601 1570591 1268986 1155792 1362084 1461036 1178788
37405A178788n31215l57035K02626N39954n2520j270733j773582p66145R58062
$$ 1178788 647573 290538 493164 1033118 980598 -290135 -2063717 -2829862 -1871800
37396a871800K016106J886328R56672j48970p73724m85746K67936M26752k24203
$$ -1871800 144306 2030634 2987306 2838336 2064612 1578866 1846802 2273554 2049351
37387B049351o24669q3237N28744J16269q48675r73326K1139R57534Q04690j54173
$$ 2049351 1424682 1341445 1870189 1986458 1137783 164457 185596 1143130 1947820 1793647
37377A793647p96210l82135O49964J006202j8967j442888j599878k70116J112060
$$ 1793647 997437 615302 1265266 2271468 2252501 809613 -790265 -1060381 51679
37368E1679J482391J181290O70019k89159j421034j422165J21306J510584J025308
$$ 51679 1534070 2715360 3385379 3096220 1675186 253021 374327 1884911 2910219
37359B910219o76136j619156j193394l89822j4934m1820k49539k97960L26724
$$ 2910219 2234083 614927 -578467 -968289 -983223 -1025043 -1274582 -1572542 -1245818
37350a245818J380035J581001L65413r73397j136239p54240r84838j338480p73498
$$ -1245818 134217 1715218 2080631 1107234 -29005 -783245 -1768083 -3106563 -3880061
37341c880061J38013L43920O32380K236669L851482L011717J95154j565379j306895
$$ -3880061 -3742048 -3398128 -2765748 -529079 3322403 6334120 6529274 4963895 3657000
37332C657000j121104j957044j901659J9687J561239P54762r75554j370007p17615
$$ 3657000 2535896 578852 -1322807 -1303120 258119 1012881 37327 -1332680 -2050295
37323b050295m04204j49196P87285J359450L62632j015888q75579K83663O90672
$$ -2050295 -2454499 -2603695 -1816410 -456960 -94328 -1110216 -1985795 -1702132 -1011460
37314a011460M52002P88404J077983j77624j939449j559918Q03576K051880R60944
$$ -1011460 -559458 228946 1306929 1129305 -810144 -2370062 -1566486 485394 1446338
37305A446338j74290K65152O63330m91511j658478r58185M84103N15080m55848
$$ 1446338 1272048 1537200 2200530 1709019 50541 -907644 -423541 91539 -364309
37296c64309n40659K20521L24588j38435K33852J110219N28649j632929k910507
$$ -364309 -904968 -684447 -359859 -498294 -264442 845777 1374426 -258503 -3169010
37287c169010j789101K45511J242465J387802J701996J818269Q42397n89719r25538
$$ -3169010 -4958111 -4712600 -3470135 -2082333 -380337 1437932 2280329 1690610 765072
37278G65072Q950P93050M03544p15100j568027j650533j004956l1251N97593L98774
$$ 765072 774022 1567072 1970616 1255516 -312511 -1963044 -2968000 -2999251 -2401658 -2002884
37268b002884l73766r50241q05694k2465Q66774J178570O10337k24581k70409
$$ -2002884 -2376650 -3326891 -4132585 -4155050 -3288276 -2109706 -1499369 -1723950 -1994359
37259a994359N92211J220676P38391k90273q34735p77779m84200J79247J225939
$$ -1994359 -1402148 -181472 556919 266646 -568089 -1345868 -1830068 -1650821 -424882
37250d24882J664835O92480o74640p29316M01690J003047M48711j60453j88828
$$ -424882 1239953 1932433 1257793 528477 930167 1933214 2381925 2221472 2032644
37241B032644l65182r57692r50005L3006O47224j54916j401736j619340r16939
$$ 2032644 1667462 709770 -240235 -207229 439995 285079 -1116657 -2735997 -3652936
37232c652936l42505j75325q2290r8478k74465j11212N92591J086593P99391K58152
$$ -3652936 -3995441 -4170766 -4253056 -4351534 -4625999 -4737211 -4144620 -3058027 -2258636 -2000484
37222b000484J1355k70554o52222k38962J095341J708238N47909q43725o19841
$$ -2000484 -1989129 -2259683 -2911905 -3150867 -2055526 -347288 200621 -643104 -1262945
37213a262945L47665L6453j174673j212260j879M07089n82889j166567k34796
$$ -1262945 -915280 -878827 -2053500 -3265760 -3267639 -2860550 -3443439 -4610006 -4844802
37204d844802J008607J237851P22733J31530m92141q46988k28157J034848J582887
$$ -4844802 -3836195 -2598344 -1875611 -1744081 -2236222 -3083210 -3311367 -2276519 -693632
37195f93632J013275L08808k2189m45208p85976k28360O43499J31241j559774
$$ -693632 319643 628451 606262 161054 -624922 -853282 -209783 -78542 -1638316
37186a638316k052765n21900Q83439O39915K25140J117386J989664J207499q3329
$$ -1638316 -3691081 -4212981 -3329542 -2689627 -2464487 -1347101 642563 1850062 1766733
37177A766733j2322O55307K4043j444668j818725j047524n85463m48501M54246
$$ 1766733 1754411 2409718 2433761 989093 -829632 -1877156 -2462619 -2911120 -2456874
37168b456874J548042J126258m31489q51615L56264J111111J94448j019210j052486
$$ -2456874 -908832 217426 -214063 -1065678 -709414 401697 596145 -423065 -1475551
37159a475551l26277K39782O48393Q83104L54444o98568r22636j8103M20118n78932
$$ -1475551 -1801828 -1562046 -913653 -30549 323895 -374673 -1297309 -1315412 -895294 -1474226
37149a474226j546321p52665J062255J836781J212822O26885P51436O10882n17650
$$ -1474226 -3020547 -3773212 -2710957 -874176 338646 965531 1716967 2327849 1810199
37140A810199j734202j731157n74434M78029O05385J88742o5826j26257l14223
$$ 1810199 75997 -1655160 -2229594 -1751565 -1146180 -957438 -1023264 -1149521 -1463744
37131a463744m07399J25480R89011J085834Q6274q59048o38363K81578O30292
$$ -1463744 -1871143 -1745663 -756652 329182 415456 -443592 -1081955 -800377 -170085
37122a70085P4261o75227r90659o65563L81135J728448K197577J054973q11296
$$ -170085 -95824 -771051 -1761710 -2427273 -2046138 -317690 1879887 2934860 2123564
37113B123564j899849j909590j537863j016948j69377N17681L96387p18L22005
$$ 2123564 223715 -1685875 -3223738 -4240686 -4410063 -3892382 -3495995 -3496713 -3174708
37104c174708R50364O24484l70353l24066J068112J965209J170965j41383m61482
$$ -3174708 -2224344 -1599860 -1970213 -2294279 -1226167 739042 1910007 1768624 1307142
37095A307142j02092j39572n02616m61684j41393k69329q84826j236312p04577
$$ 1307142 1205050 1065478 562862 101178 -40215 -309544 -1194370 -2430682 -3135259
37086c135259O21248J883832J887834L70920j162077j013764K73028N71153n58924
$$ -3135259 -2514011 -630179 1257655 1628575 466498 -547266 -274238 296915 -262009
37077b62009j206849l71404L39024l79651j032458J86989K044200J934993j7622
$$ -262009 -1468858 -1840262 -1501238 -1880889 -2913347 -2726358 -682158 1252835 1235213
37068A235213j187746n01800K99464j72489q22357j25859J327094J690277M70836
$$ 1235213 47467 -454333 -154869 -327358 -1149715 -1275574 51520 1741797 2212633
37059B212633q86576q97037J75251O70936l91347j876014j713300M00398K338638
$$ 2212633 1326057 429020 604271 1275207 883860 -992154 -2705454 -2305056 33582
37050C3582K125440L36332r62686r37287m47268k48791j26688J74856L66826K36908
$$ 33582 2159022 2495354 1532668 595381 148113 -100678 -227366 -52510 314316 551224
37040E51224K296j68538l12646k86644J08568O05669P31361N43845M33654L04961
$$ 551224 553520 384982 72336 -214308 -105740 499929 1231290 1775135 2208789 2513750
37030B513750k44619r92086j224502q64643n80235o26500m67322J84721P97859
$$ 2513750 2269131 1277045 52543 -812100 -1392335 -2018835 -2486157 -2301436 -1503577
37021a503577Q83867O89499N54861K30347n76919j430780j568089q67713P2141
$$ -1503577 -619710 69789 624650 854997 278078 -1152702 -2720791 -3588504 -3516363
37012c516363P03356R55674R61385P84946N36676M18171M15554J82423m20442
$$ -3516363 -2813007 -1857333 -895948 -111002 425674 843845 1259399 1441822 1021380
37003A021380q45936n05904J04494j93343j327995j499625L47518K500444K503505
$$ 1021380 175444 -330460 -225966 -419309 -1747304 -3246929 -2899411 -398967 2104538
36994B104538O27266o74304n61576o12892j421783j206616P75380K067544N68312
$$ 2104538 2731804 2057500 1495924 883032 -538751 -1745367 -969987 1097557 1665869
36985A665869j793621j730907M68228J715647R55139k0747k73269q43317j766476
$$ 1665869 -127752 -1858659 -1390431 325216 1280355 1259608 986339 143022 -1623454
36976a623454j253231J008500K560941J715847K9108m19712r8906m61821j134045
$$ -1623454 -2876685 -1868185 692756 2408603 2437711 2017999 1919093 1457272 323227
36967C23227q90509j67759l12909j060162q98977L37180J105409L83881j141243
$$ 323227 -567282 -735041 -1047950 -2108112 -3007089 -2669909 -1564500 -1180619 -2321862
36958b321862k106407j608063L98693K700475L236048J253944j228131j562443
$$ -2321862 -4428269 -6036332 -5637639 -2937164 298884 1552828 324697 -1237746
36950a237746R9435J104105Q3562j324499j137371K07064Q82281L85462j49681
$$ -1237746 -1138311 -34206 49356 -1275143 -2412514 -2205450 -1323169 -937707 -1087388
36941a087388R7226O29041O53623K05417j14674l6164J40621N8616k11523k45489
$$ -1087388 -990162 -361121 292502 497919 383245 347081 487702 546318 334795 89306
36931H9306K54192J068540J524258J007143m11384j789353j972296p09236R35042
$$ 89306 343498 1412038 2936296 3943439 3532055 1742702 -229594 -938830 -3788
36922c788J526982O43398q27317j643027j258495j18273P35210M88710n81951
$$ -3788 1523194 2166592 1339275 -303752 -1562247 -1680520 -945310 -456600 -1038551
36913a038551j183205l79178J219703K118329J619629L07492q77490j311298p36849
$$ -1038551 -2221756 -2600934 -1381231 737098 2356727 2664219 1786729 475431 -261418
$$ [...]
##END NTUPLES=NMR SPECTRUM
##END=
