##TITLE=31Pdec_LR-669H-CR3
 D2O, 24 sc
 7.6.2019
##JCAMPDX= 6.0         $$ Bruker NMR JCAMP-DX V2.0
##DATA TYPE= NMR SPECTRUM
##DATA CLASS= NTUPLES
##ORIGIN= UXNMR, Bruker Analytische Messtechnik GmbH
##OWNER= root
$$ XWIN-NMR		Version 3.5
$$ Fri Jun  7 14:14:13 2019 Russian Standard Time (UT+4h)  she@DPX200
##.OBSERVE FREQUENCY= 81.013821
##.OBSERVE NUCLEUS= ^31P
##.ACQUISITION MODE= SIMULTANEOUS
##.ACQUISITION SCHEME= undefined
##.AVERAGES= 24
##.DIGITISER RES= 17
##SPECTROMETER/DATA SYSTEM= spect
##.PULSE SEQUENCE= zgpg30
##.SOLVENT NAME= CDCl3
##.SHIFT REFERENCE= (INTERNAL, CDCl3, 0, 182.463)
##AUDIT TRAIL= $$ (NUMBER, WHEN, WHO, WHERE, WHAT)
$$ ##TITLE= Audit trail, XWIN-NMR		Version 3.5
$$ ##JCAMPDX= 5.01
$$ ##ORIGIN= Bruker BioSpin GmbH
$$ ##OWNER= she
$$ F:/spectra/data/she/nmr/P31/1/pdata/1/auditp.txt
$$ ##AUDIT TRAIL=  $$ (NUMBER, WHEN, WHO, WHERE, WHAT)
(   1,<2019-06-07 14:12:42.18 +0400>,<she>,<DPX200>,
      <created by zg, POWCHK disabled, PULCHK disabled
       configuration hash MD5:
       00 E9 B6 7A A2 85 ED C7 34 08 36 98 17 FE 4E 26
       data hash MD5: 32K
       67 63 8F 10 FE DC 39 EC 4B 07 59 18 90 F2 34 44>)
(   2,<2019-06-07 14:12:57.60 +0400>,<she>,<DPX200>,
      <Start of raw data processing
       efp BC_mod = 2 LB = 1 FT_mod = 6 PKNL = 1 PHC0 = -2492.246 PHC1 = -325.0009 SI = 64K 
       data hash MD5: 64K
       A1 2A F2 9A 66 E1 C8 A1 D6 53 D1 9B BA 64 2C C5>)
(   3,<2019-06-07 14:13:39.40 +0400>,<she>,<DPX200>,
      <pk PHC0 = 57.93299 PHC1 = 80.8 
       data hash MD5: 64K
       91 5B 03 03 45 35 34 48 2E E5 0D 04 8F 10 80 57>)
$$ ##END=
$$ 
$$ hash MD5
$$ 28 07 1D 1F B8 2E 07 E3 24 FB 74 B6 FD 6C D1 BF
##$RELAX= 
##$RELAX= 
##$RELAX= 
##$RELAX= 
##$RELAX= 
##$RELAX= 
##$RELAX= 
##$RELAX= 
$$ Bruker specific parameters
$$ --------------------------
##$DU= <F:/spectra>
##$EXPNO= 1
##$NAME= <P31>
##$PROCNO= 1
##$TYPE= <nmr>
##$USER= <she>
##$AMP= (0..31)
100 100 100 100 100 100 100 100 100 100 100 100 100 100 100 100 100 100 
100 100 100 100 100 100 100 100 100 100 100 100 100 100 
##$AQSEQ= 0
##$AQ_mod= 1
##$AUNM= <au_zg>
##$AUTOPOS= <>
##$BF1= 81.014009
##$BF2= 200.13
##$BF3= 200.13
##$BF4= 200.13
##$BF5= 200.13
##$BF6= 200.13
##$BF7= 200.13
##$BF8= 200.13
##$BYTORDA= 1
##$CFDGTYP= 0
##$CFRGTYP= 5
##$CHEMSTR= <none>
##$CNST= (0..31)
1 1 145 1 1 1 1 1 1 1 1 1 1 1 1 1 1 1 1 1 1 1 1 1 1 1 1 1 1 1 1 1 
##$CPDPRG= <waltz16>
##$CPDPRG1= <>
##$CPDPRG2= <waltz16>
##$CPDPRG3= <>
##$CPDPRG4= <mlev>
##$CPDPRG5= <mlev>
##$CPDPRG6= <mlev>
##$CPDPRG7= <mlev>
##$CPDPRG8= <mlev>
##$CPDPRGB= <>
##$CPDPRGT= <>
##$D= (0..31)
0 1 0 0 0 0 0 0 0 0 0 0.03 2e-05 3e-06 0 0 0 0 0 0 0 0 0 0 0 0 0 0 0 0 
0 0 
##$DATE= 1559902361
##$DBL= (0..7)
120 120 120 11 120 120 24 19 
##$DBP= (0..7)
150 150 150 150 150 150 150 150 
##$DBP07= 0
##$DBPNAM0= <>
##$DBPNAM1= <>
##$DBPNAM2= <>
##$DBPNAM3= <>
##$DBPNAM4= <>
##$DBPNAM5= <>
##$DBPNAM6= <>
##$DBPNAM7= <>
##$DBPOAL= (0..7)
0.5 0.5 0.5 0.5 0.5 0.5 0.5 0.5 
##$DBPOFFS= (0..7)
$$ [...]
##$SUBNAM2= <"">
##$SUBNAM3= <"">
##$SUBNAM4= <"">
##$SUBNAM5= <"">
##$SUBNAM6= <"">
##$SUBNAM7= <"">
##$SUBNAM8= <"">
##$SUBNAM9= <"">
##$SW= 369.568048894756
##$SWIBOX= (0..15)
0 1 3 0 0 0 0 0 0 0 0 0 0 0 0 0 
##$SW_h= 29940.119760479
##$TD= 32768
##$TD0= 1
##$TE= 0
##$TE2= 300
##$TE3= 300
##$TEG= 300
##$TL= (0..7)
0 120 53 12 22 120 120 120 
##$TP= (0..7)
150 150 150 150 150 150 150 150 
##$TP07= 0
##$TPNAME0= <>
##$TPNAME1= <>
##$TPNAME2= <>
##$TPNAME3= <>
##$TPNAME4= <>
##$TPNAME5= <>
##$TPNAME6= <>
##$TPNAME7= <>
##$TPOAL= (0..7)
0.5 0.5 0.5 0.5 0.5 0.5 0.5 0.5 
##$TPOFFS= (0..7)
0 0 0 0 0 0 0 0 
##$TUNHIN= 0
##$TUNHOUT= 0
##$TUNXOUT= 0
##$USERA1= <user>
##$USERA2= <user>
##$USERA3= <user>
##$USERA4= <user>
##$USERA5= <user>
##$V9= 5
##$VALIST= <valist>
##$VCLIST= <CCCCCCCCCCCCCCC>
##$VD= 0
##$VDLIST= <DDDDDDDDDDDDDDD>
##$VPLIST= <PPPPPPPPPPPPPPP>
##$VTLIST= <TTTTTTTTTTTTTTT>
##$WBST= 1024
##$WBSW= 4
##$XGAIN= (0..3)
0 0 0 0 
##$XL= 0
##$YL= 0
##$YMAX_a= 4474
##$YMIN_a= -6073
##$ZGOPTNS= <>
##$ZL1= 120
##$ZL2= 120
##$ZL3= 120
##$ZL4= 120
##$ABSF1= 0
##$ABSF2= 0
##$ABSG= 0
##$ABSL= 0
##$ALPHA= 0
##$AQORDER= 0
##$ASSFAC= 0
##$ASSFACI= 0
##$ASSFACX= 0
##$ASSWID= 0
##$AUNMP= <proc_1d>
##$AZFE= 0.1
##$AZFW= 0.5
##$BCFW= 0
##$BC_mod= 2
##$BYTORDP= 0
##$COROFFS= 0
##$CY= -3
##$DATMOD= 1
##$DC= 0
##$DFILT= <>
##$DTYPP= 0
##$F1P= 0
##$F2P= 0
##$FCOR= 1
##$FTSIZE= 65536
##$FT_mod= 6
##$GAMMA= 0
##$GB= 0
##$INTBC= 1
##$INTSCL= 5.30512e-09
##$ISEN= 30
##$LB= 1
##$LEV0= 0
##$LPBIN= 0
##$MAXI= 10000
##$MC2= 0
##$MEAN= 0
##$ME_mod= 0
##$MI= 50
##$NCOEF= 0
##$NC_proc= -8
##$NLEV= 6
##$NOISF1= 182.463
##$NOISF2= 159.3651
##$NSP= 0
##$NTH_PI= 0
##$NZP= 0
##$OFFSET= 182.463
##$PC= 4
##$PHC0= -2434.313
##$PHC1= -244.2009
##$PH_mod= 1
##$PKNL= yes
##$PPARMOD= 0
##$PSCAL= 0
##$PSIGN= 0
##$REVERSE= no
##$SF= 81.0140089999434
##$SI= 65536
##$SIGF1= 159.3651
##$SIGF2= -187.1042
##$SINO= 113.3802
##$SIOLD= 16384
##$SREGLST= <1H.CDCl3>
##$SSB= 0
##$STSI= 65536
##$STSR= 0
##$SW_p= 29940.119760479
##$SYMM= 0
##$S_DEV= 0
##$TDeff= 32768
##$TDoff= 0
##$TI= <>
##$TILT= no
##$TM1= 0
##$TM2= 0
##$TOPLEV= 0
##$USERP1= <user>
##$USERP2= <user>
##$USERP3= <user>
##$USERP4= <user>
##$USERP5= <user>
##$WDW= 1
##$XDIM= 65536
##$YMAX_p= 550582386
##$YMIN_p= -37361322
$$ End of Bruker specific parameters
$$ ---------------------------------
##NTUPLES= NMR SPECTRUM
##VAR_NAME=  FREQUENCY,     SPECTRUM/REAL,   SPECTRUM/IMAG
##SYMBOL=    X,             R,               I
##VAR_TYPE=  INDEPENDENT,   DEPENDENT,       DEPENDENT
##VAR_FORM=  AFFN,          ASDF,            ASDF
##VAR_DIM=   65536,         65536,           65536
##UNITS=     HZ,            ARBITRARY UNITS, ARBITRARY UNITS
##FACTOR=    0.456856943014862, 1,           1
##FIRST=     14782.0589164792, 0,            0
##LAST=      -15158.0608439998, 0,           0
##MIN=       -15158.0608439998, -37361322,   0
##MAX=       14782.0589164792, 550582386,    0
$$ Real data points
##PAGE= N=1
##DATA TABLE= (X++(R..R)), XYDATA
$$ [...]
##PAGE= N=2
##DATA TABLE= (X++(I..I)), XYDATA
5105D4433k806363n05932M374910P430175L950343l499618o760976l111157O57585
5096b26600j428454n465789m313543J115057M036262K444463K83210m18230j119283
5087e092907j198526J494918M348651K160755l339320m382204L24949K698657
5079b985027j338607m455398L8664O764875P198217L706122M470382Q178188N417188
5070B6994604m693132j0542248m383185O247627R146556L120527l520780n833482
5062A6536487o082151o322418m737909r12339J132366j459763n340750n190744
5054a2377221r31554K795670L189352J808360R19626Q71481J583944L268986M405625
5045E534269K100181l467365p386390n347867Q36274N335861M929508J584019
$$ y = [44433, -2761930, -3267862, 1107048, 8537223, 12487566, 8987948, 2226972, -884185, -226600, -1655054, -7120843, -11434386, -10319329, -6283067, -3838604, -3555394, -3973624, -5092907, -6291433, -4796515, -447864, 1712891, -1626429, -6008633, -5683684, -2985027, -4323634, -8779032, -8740368, -1975493, 5222724, 8928846, 13399228, 21577416, 26994604, 22301472, 11759224, 7376039, 13623666, 22770222, 25890749, 22369969, 16536487, 10454336, 4131918, -605991, -1518330, -385964, -1845727, -7186477, -12377221, -13308775, -10513105, -7323753, -5515393, -4595767, -3724286, -2140342, 1128644, 5534269, 7634450, 4167085, -3219305, -8567172, -7730898, -2395037, 2534471, 4118490]
5037D118490p76390l52498J209780O24161l150613o644023n339308L35107N200292
5028d775002O023626M392017K028783j671706n075167l249309L934147Q218252
5020I825641L807194l018403k872762K188203K622334k453684m062595J328561
5012G364489O308175N143164J836834J072923J12651m291549q308668p078298
5004B159721k708846O2937J197098K213295P81373m501032q084623l952379M556600
4995h275856Q810125O796232L713889K289353M04700k025726j970476k05910j505428
4986H030903n406670m328888M595915J2192984Q344683l390301r792974n687772
4978D557880J8966j693810o684225m396130N458210J1094440M956714n433097
$$ y = [4118490, 3342100, 2989602, 4199382, 4823543, 1672930, -4971093, -10310401, -9975294, -4775002, 1248624, 5640641, 7669424, 5997718, 922551, -2326758, 1607389, 9825641, 13632835, 10614432, 7741670, 9929873, 12552207, 10098523, 6035928, 7364489, 13672664, 18815828, 20652662, 21725585, 21838236, 17546687, 9238019, 2159721, -549125, -486188, 710910, 2924205, 3705578, -795454, -8880077, -12832456, -8275856, 534269, 7330501, 11044390, 13333743, 13738443, 11712717, 9742241, 9536331, 8030903, 2624233, -1704655, 2891260, 15084244, 23428927, 20038626, 10245652, 4557880, 4576846, 2883036, -3801189, -8197319, -2739109, 8355331, 13312045, 7878948]
4970G878948p988374k448664J109430j907545m828222j318466M894779O326991
4962A718877K584602m38386N46647L013636L253105N63495k946545m615037l659361
4953B1033k164251k397537l195432j756138R85145J048894j568146j775260K347378
4944h454314N584602L637992R4758M61138L494946M096182J529284j085597k949707
4935F409284n349819p034820n469246j508289K042759M902087P574926P572361
4927I139243L195231j147692k39460K835588M49073p168757j1345153p764741
4919a2046668j944669L70866Q19380K793934M705720L657238J081728j29031o46654
4910a338156k304511l392291j011777L335679M874846K201601o25134K74358K975512
$$ y = [7878948, -109426, -2558090, -1448660, -3356205, -8184427, -9502893, -4608114, 1718877, 4303479, 3865093, 4411740, 7425376, 10678481, 11241976, 8295431, 3680394, 21033, -2143218, -4540755, -7736187, -9492325, -8507180, -7458286, -9026432, -10801692, -8454314, -2869712, 768280, 863038, 1324176, 4819122, 8915304, 10444588, 9358991, 6409284, 1059465, -5975355, -11444601, -12952890, -10910131, -6008044, 1566882, 9139243, 12334474, 11186782, 10947322, 13782910, 14231983, 7063226, -4281927, -12046668, -13991337, -13620471, -12801091, -10007157, -5301437, -1644199, -562471, -691502, -1338156, -3642667, -7034958, -8046735, -4711056, 163790, 2365391, 1740257, 2014615, 4990127]
4901D990127J959611l867016p727189k738080P427882J0863033K827721o722420
4893G013669o281223J372098M371803k72866l933112j469113J629529L71260j306076
4884A495969R79907L109224n20884o566002p258662k039731K775511M025181M415398
4875D15911N921626O794460N541569K802815j188925o403504r821108p290785
4867c227941m2567M932551L275760j311232k599570l1961J845716M21254k262035
4858I99975l567676l394973k153487R93938N207518N884177k40280q700333j0884711
4849a5855852m998780J336665J738715n26117J183625O412733R178284P456151
4841E925424M704556K892721L79640k944058m305954l073850k160730l177680
$$ y = [4990127, 6949738, 3082722, -4644467, -7382547, 45335, 10908368, 13736089, 7013669, 732446, 2104544, 6476347, 6203481, 2270369, 801256, 2430785, 2802045, 1495969, 2475876, 5585100, 5064216, -1501786, -8760448, -10800179, -8024668, -3999487, 415911, 6337537, 13131997, 18673566, 21476381, 20287456, 13883952, 4062844, -3227941, -3270508, 1662043, 4937803, 3626571, 1027001, 995040, 2840756, 3262010, 999975, -2567701, -5962674, -8116161, -7122223, -1914705, 3969472, 3729192, -4971141, -15855852, -20854632, -19517967, -17779252, -18305369, -17121744, -10709011, -1530727, 5925424, 10629980, 13522701, 13902341, 10958283, 6652329, 3578479, 1417749, -1759931]
4833a759931m594501n395462n760068l666297L326177J1593690J3054031N837481
4825A2635120k360632m546851k538365j549994k329899k884926l032749k701087
4817i309383j36995L800283M174024m41940l716396n56609M233600L101679k125854
4808i77591l054226K340537P406296P057250L236309m64639l333133n204166m789750
4799B216887k376954o17497j082335k515643l056754j964446O76190L675228M745818
4790b99506K978800L28031j255711k247034l028265j942955J176026L024949K090077
4781H24412J819234L888167L306455l008128p859120l470696M117450K249042
4773A866816p771618j0708490o21637R329471O799744j700151k419995M456960
$$ y = [-1759931, -6354432, -11749894, -17509962, -21176259, -17850082, -6256392, 6797639, 12635120, 10274488, 5727637, 3189272, 1639278, -690621, -3575547, -6608296, -9309383, -9446378, -5646095, -1472071, -1914011, -5630407, -6187016, -1953416, 1148263, -977591, -4031817, -1691280, 5715016, 12772266, 16008575, 15543936, 12210803, 7006637, 2216887, -160067, -777564, -1859899, -4375542, -7432296, -9396742, -8720552, -5045324, -299506, 2679294, 3007325, 1751614, -495420, -3523685, -5466640, -4290614, -1265665, 824412, 2643646, 6531813, 9838268, 6830140, -1028980, -4499676, -382226, 1866816, -5904802, -16613292, -17234929, -7905458, -1105714, -2805865, -5225860, -768900]
4765g68900O941105L05208p311922p846554k692081K239610M019052L182400J434201
4756d97881Q04769K138680L539875K633635K15263r36501l50760P0797q1549P61482
4746H297810K361687J691387k838840q328557j0174724o980514j670087J935854
4738a5705984L019891L812184N591129N955196K157739l561774n548351k401212
4730f681182R39169Q34568L86051L445692P003139N178430j208210n266638l934808
4721F96211j269787r88757j540021q05325m86919k323658l858064j950652K077967
4712a0449005M461036M122483K454522o845k914985l781017o37972L688980M241282
4703A178479P41009k330993k457594j339143m89K913627O125654M784140j783691
$$ y = [-768900, 6172205, 6477413, -834509, -8681063, -11373144, -9133534, -5114482, -1932082, -497881, 306888, 2445568, 5985443, 8619078, 8834341, 7897840, 7547080, 7617877, 7536328, 8297810, 10659497, 12350884, 9512044, 1183487, -8991237, -15971751, -17641838, -15705984, -12686093, -8873909, -3282780, 2672416, 4830155, 1268381, -4279970, -6681182, -5742013, -4907445, -4521394, -1075702, 5927437, 11105867, 9897657, 4631019, 696211, -573576, -1562333, -3102354, -3907679, -4394598, -6718256, -10576320, -12526972, -10449005, -5987969, -1865486, 589036, 582191, -2332794, -6113811, -6751783, -3062803, 1178479, 1919488, -411505, -2869099, -4208242, -4208731, -1295104, 4830550, 9614690, 7830999]
4694G830999o572936m295409J73633o65367m470133k644205M981657Q847473M678222
4685G863934M2160J393457L516271o97076p003880o172877M52383K712149j764454
4676C42067l675214K612928R571748P886215J06323m097950j827851J270865R68139
4667A3157270r55727k086615l141405m606693m221443m39844M335148O217021
4659H257712L865712j177087o148120p893506m675917Q29110K948624K66181j193280
4650d920571L646838R523528O471678m930311j1879624o599672K238282K371567
4642d078285l695443l475890M933926R388891K937351n274516m574145J390126
4634b447985K367313j765255k713343J315209L501356R24401r69396J434814L665083
$$ y = [7830999, 1258063, -3037346, -2863713, -3529080, -7999213, -10643418, -5661761, 3185712, 7863934, 7906094, 9299551, 12815822, 12118746, 5114866, -1058011, -605628, 2106521, 342067, -3333147, -720219, 8851529, 16737744, 16844067, 12746117, 10918266, 12189131, 13157270, 12201543, 10114928, 6973523, 2366830, -1854613, -2294457, 2040691, 8257712, 12123424, 10946337, 4798217, -3095289, -7771206, -6942096, -3993472, -3727291, -4920571, -1273733, 8249795, 14721473, 9791162, -2088462, -8688134, -6449852, -4078285, -7773728, -11249618, -6315692, 3073199, 6010550, 736034, -3838111, -2447985, -80672, -1845927, -4559270, -3244061, 257295, 1181696, 212300, 1647114, 5312197]
4625E312197P88231m883936p600225n416211o45436L422922M110779J029800k279317
4616f161196j821450R41472Q97043k427930l890744j375342R46948M94549N47337
4607a1849313K669074J943061m152188q365856l217330O449595R532955M973341
4599b016661K376410O352628R821560N749741k467505p035457o328267m059264
4591B393185j909538J118907L859653L196776n50455k846730j036741J861492
4583F086549J532706j559886l152487j318835J370181K135890J412970N28404
4575G035492j101719l733385m722376k053958J265624J066845p89356J071025
4567a961808N783812O145886M23520l307470O41359N878751L503787l764822n744838
$$ y = [5312197, 6100428, 1216492, -6383733, -11799944, -12445380, -9022458, -4911679, -3881879, -6161196, -7982646, -7041174, -6144131, -8572061, -12462805, -13838147, -12891199, -12396650, -11849313, -9180239, -7237178, -11389366, -19755222, -22972552, -16522957, -6990002, -2016661, 359749, 6712377, 16533937, 22283678, 19816173, 12780716, 6452449, 2393185, 483647, 1602554, 5462207, 8658983, 8108528, 5261798, 4225057, 6086549, 7619255, 6059369, 2906882, 1588047, 2958228, 5094118, 6507088, 7035492, 5933773, 2200388, -2521988, -4575946, -3310322, -2243477, -3032833, -1961808, 3822004, 9967890, 10391410, 7083940, 7725299, 13604050, 17107837, 13343015, 7598177]
4558G598177l32928M388933L203306j17303j378259k295068m664047n151013r45603
4549C06195M205028M810977J310226j723192k485356k349257j241140K153773
4541D987254N827855N073072p96884n964239m790353J147956N327533M426785
4533A5238979J182672r02039k156269m049656n034557l085791o53086j744978
4525a204725m237881j560769O016282Q938566J951024o424905n240280L128979
4517A366291P587091N119212K161766O29898m725394j2813121j3075518k175532
4509a5925307P349653M183770m780547n360515K418298O151894J182429m025769
4501h806094l005750K8591k29187j648396m35974K011970L049561L713001M857254
$$ y = [7598177, 7265249, 11654182, 14857488, 14740185, 13361926, 11066858, 6402811, 1251798, 306195, 4511223, 9322200, 10632426, 8909234, 6423878, 4074621, 2833481, 4987254, 10815109, 15888181, 15091297, 9127058, 4336705, 5484661, 10812194, 15238979, 16421651, 15519612, 13363343, 9313687, 4279130, 1193339, 540253, -1204725, -5442606, -7003375, -987093, 7951473, 9902497, 3477592, -1762688, 1366291, 8953382, 14072594, 16234360, 16864258, 12138864, -674257, -13749775, -15925307, -8575654, -4391884, -9172431, -14532946, -12114648, -5962754, -4780325, -8806094, -11811844, -11783253, -12012440, -13660836, -14096810, -12084840, -9035279, -5322278, -465024]
4492d65024L469485j950456o481902m781379R22794M068717K788844N92277l25083
4483b161727j094083j994650j280502J178148K973274K693886J331875k11592
4475A434629j944410k810236j293112J224350J113472k107734m135142j480648
4467i998831L886969P467842P451068M910433J094242k792287m790213m018399
4459C210824k261801j322331r3577K949850N732228M764191Q47252j460593n57468
4450A1808575J8438k529537n907821o432935l958006n29168L124984O636339P740068
4441I970937M686636k05972k864549k720323k469715l118422k802850p04923J291708
4432A062527J625629Q29923m35970k213759l306861j704745J721429L090281Q88504
$$ y = [-465024, 3004461, 1054005, -5427897, -10209276, -9286482, -5217765, -2428921, -1836644, -2161727, -3255810, -5250460, -6530962, -5352814, -2379540, 314346, 1646221, 1434629, -509781, -3320017, -4613129, -3388779, -2275307, -4383041, -8518183, -9998831, -6111862, 1355980, 8807048, 13717481, 14811723, 12019436, 7229223, 3210824, 949023, -373308, -466885, 2482965, 8215193, 12979384, 13826636, 12366043, 11808575, 11827013, 9297476, 3389655, -3043280, -7001286, -7530454, -4405470, 2230869, 9970937, 14657573, 14451601, 11587052, 8866729, 6397014, 3278592, 475742, -229181, 1062527, 2688156, 3518079, 3082109, 868350, -2438511, -4143256, -2421827, 668454, 1556958]
4423A556958j512989r33034R42530P94752r27177j198542P42776L016207M155381
4414F636862L553222N59846l542975m686072j312556J494352j350975n643156
4406d291452k358706Q176392J4475021R048976j905095q290575q660133o939519
4398g45091l059621M375800J0007880O452179l488704q617774m537114J312617
4390A700172J907198l22085m05232P94460N11936M17369K904209N330457L890382
4381A6728866j6847k620887l751341m635618l280003J623583N273649K520062
4373A1841464l083660l767866K29190J345770k619342n520385l826802j382998
4365f784629m60328K627317Q292162R031008J055127o804100m535781L880652
$$ y = [1556958, 43969, -889065, 53465, 848217, -78960, -1277502, -534726, 2481481, 6636862, 10190084, 10749930, 7206955, 2520883, 1208327, 2702679, 1351704, -4291452, -6650158, 1526234, 16001255, 25050231, 23145136, 14854561, 6194428, -745091, -3804712, 571088, 10578968, 17031147, 13542443, 4924669, 387555, 1700172, 3607370, 3285285, 2880053, 3674513, 4186449, 4603818, 7508027, 12838484, 16728866, 16712019, 14091132, 10339791, 5704173, 2424170, 4047753, 9321402, 11841464, 8757804, 4989938, 5219128, 6564898, 3945556, -1574829, -5401631, -6784629, -7244957, -4617640, 3674522, 12705530, 13760657, 6956557, 2420776, 6301428]
4357F301428O282528K99827m524179k271738J371418n61974n564621o069783n63347
4348e300441M460756K778324m070870q259251m429730L738574P634881M511048
4340A063291N10144J080046L130803J264509k389977j533206L159012M126213
4332A0410835j393331p010023o564029j791669K106889L397475L096000J478044
4324C730191j265776l652159m674307m698192l492902n26861K084094J280718
4316a1215194j173620O1600M926772O401055J419012l128218q24849L674507J979122
4307B120187m283620n841180l7436O136653P222073M973063J654627l638889q769861
4298d64383o959019K942343J1037389Q292384o42387m320607j181350m9645m233008
$$ y = [6301428, 12583956, 12883783, 8359604, 6087866, 7459284, 6897310, 1332689, -4737094, -5300441, -839685, 1938639, -2132231, -10391482, -14821212, -11082638, -3447757, 1063291, 1573435, 2653481, 5784284, 7048793, 4658816, 3125610, 6284622, 10410835, 9017504, 2007481, -4556548, -6348217, -4241328, -843853, 2252147, 3730191, 2464415, -1187744, -5862051, -10560243, -14053145, -14580006, -12495912, -11215194, -12388814, -12327214, -7400442, -999387, 419625, -2708593, -3533442, 141065, 2120187, -2163433, -8004613, -8042049, -1905396, 5316677, 10289740, 11944367, 8305478, -464383, -7423402, -4481059, 6556330, 14848714, 14206327, 9885720, 8704370, 8654725, 4421717]
4289D421717n460624K018536R947422O852927m396979r621550l402372L575975
4281C935052P41076p011767p300652J187351P117524L040442m890290o787801
4273i969065k357407Q26296j070556m122062l736647p10874J533665K383690L651619
4264a3571341N020953L385019k040312o516627m726390J905803O520039O029047
4256c993809M763458O643410Q299889M775418j341260l099449j04888J027632
4248A6970401k415637n310406l831943j374479j591847k017829K71874K174836
4240B874970o1421l239736j845893K540640L424679n54049m349341m583759k701435
4231h495345k71369K801886M955730L622881K39227n78609J940001L363718J063496
$$ y = [4421717, -1038907, 979629, 10927051, 17779978, 13382999, 3761449, 359077, 3935052, 4676128, -2335639, -9636291, -8448940, -1331416, 1709026, -3181264, -9969065, -12326472, -11500176, -12570732, -16692794, -20429441, -21140315, -19606650, -17222960, -13571341, -8550388, -5165369, -7205681, -13722308, -18448698, -16542895, -10022856, -3993809, 769649, 7413059, 15712948, 20488366, 19147106, 16047657, 15942769, 16970401, 14554764, 9244358, 5412415, 4037936, 2446089, 428260, 700134, 2874970, 2813549, -426187, -2272080, 268560, 3693239, 3139190, -1210151, -5793910, -8495345, -8766714, -5964828, -1009098, 2613783, 2853010, 2274401, 4214402, 7578120, 8641616]
4222H641616k059290k403076j701L346488O078296N741019M30336o934287j0146825
4213B692576p333195k825195r6225J995047M017314L101442j244325m066786k128871
4204e888218Q19755O46887k52922J754659M033813K202360j550547k031898j08723
4195c74834l75220j805372O99666O153157P717861L766827J00695m52710j904137
4186A3525933n770170o659961j753583L126272K485423o61303j544511j841062
4178I07038m055402m158160J331666O122414K289214n775716o710852P2968L828783
4169f148047J93437k801988L88232L823952J816227q76948J427557M326110J341808
4160C490340l671989k582901K996588M440293L65128k350277p18908J541702L328083
$$ y = [8641616, 6582326, 4179250, 4177549, 7524037, 13602333, 19343352, 19773688, 12839401, 2692576, -4640619, -7465814, -7562039, -5566992, -1549678, 1551764, 307439, -3759347, -5888218, -5068463, -4421576, -4674498, -2919839, 1113974, 3316334, 1765787, -266111, -374834, -750054, -2555426, -1855760, 4297397, 12015258, 15782085, 15882780, 15430070, 13525933, 7755763, 1095802, -657781, 2468491, 4953914, 4292611, 2748100, 907038, -3148364, -7306524, -5974858, 147556, 2436770, -3338946, -10049798, -9976830, -6148047, -5954610, -8756598, -8368366, -4544414, -2728187, -3605135, -2177578, 2148532, 3490340, -181649, -2764550, 232038, 4672331, 5037459, 2687182, 1968274, 3509976, 6838059]
4151F838059P497318J1242421O265885p102042j5990925j1588431j468972K045323
4143b261364j056869j820676K166102M463727J312736l320951m703879k582019
4135g803193J274643N102407O020312K122151l363352m708116j358285J551485
4127a161948J099051m8828L38166q0869l286645o022070l856644K137678O296289
4118d585820N014201K00840l252016k142089K075677M433132J811231k967541
4110E87615m594003k415837n14526m01972J311146N784551P831313L472684k445526
4101H615445k247905L080473N012182k8151n735590n350184n42882K500902J935148
4092G239438Q72889J173874J059218r90850l313877l400332j456150r3036p39111
$$ y = [6838059, 14335377, 25577798, 31843683, 24741641, 8750716, -2837715, -4306687, -2261364, -3318233, -5138909, -2972807, 1490920, 2803656, -517295, -5221174, -7803193, -6528550, -1426143, 4594169, 6716320, 3352968, -1355148, -2713433, -1161948, -62897, -111725, 226441, 145572, -3141073, -9163143, -13019787, -10882109, -4585820, 428381, 629221, -2622795, -4764884, -2689207, 1743925, 3555156, 587615, -4006388, -6422225, -6936751, -7338723, -6027577, -243026, 7588287, 11060971, 8615445, 6367540, 9448013, 14460195, 14432044, 8696454, 3346270, 2803388, 5304290, 7239438, 8112327, 9286201, 10345419, 9354569, 6040692, 2640360, 1184210, 1091174, 352063]
4083C52063j453119Q04602N693034Q609692N781860m72935l981589k483694k55616
4074A2594298j403020l552134j724847L207553M745620J21958n032173m178681
4066D778574R33767K579785k267064p599668o075166J592097P453833N885404
4058G281562q3501l062983n14371K660496J168535l537255n667456l337185o23302
4049e715460p90723j388366J383836O333886Q825680P058373L293809j42146k464379
4040A6394510k762815q14753N10112j955288n882264n266151L47766L643814j53891
4031D061040n468385l924333L568633Q459124O850872L495154K825409K544492
4023B2412006p33571m648256m898304k881629l659335o957530o353034N49286
$$ y = [352063, -1101056, -296454, 5396580, 14006272, 19788132, 19315197, 15333608, 12849914, 12594298, 11191278, 7639144, 5914297, 9121850, 13867470, 13989428, 8957255, 4778574, 5712341, 8292126, 6025062, -1574606, -7649772, -6057675, 1396158, 7281562, 7198061, 4135078, 3620707, 6281203, 7449738, 3912483, -1754973, -5092158, -5715460, -6506183, -7894549, -6510713, -176827, 8648853, 15707226, 19001035, 18858889, 16394510, 13631695, 12816942, 13327054, 11371766, 5489502, 223351, 571117, 4214931, 4061040, -1407345, -5331678, -1763045, 6696079, 13546951, 17042105, 19867514, 22412006, 21678435, 17030179, 12131875, 9250246, 5590911, -1366619, -7719653, -7170367]
4015g170367O518539L888821l963194o511742p47646M688461J986548n188959
4007f499539p593148k480815N156621J0122001J0379371N530482k000996n960910
3999F653067k706285K526151K168044k353354l524188p78939q89639m795403n210478
3990h911024l92120J361234l560896o532529j884377J730023l731809r417571
3982c1339069k578674J1077376J4298756M457972l624497j202057L873547L227212
3974a809434P6552k50514L33696m91594O20255N012670O861989K486817k718880
3965A0121557l172693j777571l089022m756148l112803j106792k709556m540494
3957a4143522j304688M309059N280644J112876k384979k085756M06668L670633
$$ y = [-7170367, -651828, 3236993, -726201, -7237943, -7985589, -3297128, -1310580, -6499539, -14092687, -16573502, -11416881, -1294880, 9084491, 14614973, 12613977, 6653067, 3946782, 6472933, 8640977, 6287623, 2763435, 1984496, 1094857, -3700546, -8911024, -9303144, -7941910, -11502806, -18035335, -19919712, -18189689, -21921498, -31339069, -33917743, -22840367, -8541611, -4083639, -7708136, -8910193, -5036646, -1809434, -1732882, -1983396, -1649700, -2141294, -1521039, 3491631, 10353620, 12840437, 10121557, 6948864, 5171293, 2082271, -2673877, -5786680, -6893472, -9603028, -14143522, -15448210, -11139151, -5858507, -4745631, -7130610, -9216366, -8809698, -5139065]
3949e139065O814025O633435J048258n650563p027739l124615O86546K195931
3941c563787L627743N242433M217265M11766k581843l246140l916583n471658
3933e280804n059426j260339K279149J187700l550804o131668k342065N276189
3925a4882068R191083M832093l550258p260651l395920K746186N900088O419707
3917B60N798619K747097k150719l660611M55033L978988J143050l559334k555378
3908B197005J580669K5878o771460q407241q21205O884000N882387m43968l399189
3899c273124j447676N46682O11416J609577M837920O812911L818251k580618o271372
3890D663967l218629L254998N588621J002753n056782o100213k241769J970962
$$ y = [-5139065, 1674960, 8308395, 9356653, 3706090, -3321649, -6446264, -5759718, -3563787, 63956, 5306389, 9523654, 9935420, 7353577, 4107437, 190854, -5280804, -10340230, -11600569, -9321420, -8133720, -11684524, -17816192, -20158257, -14882068, -5690985, -858892, -4409150, -11669801, -15065721, -12319535, -6419447, 260, 5798879, 8545976, 6395257, 2734646, 3189679, 7168667, 8311717, 4752383, 2197005, 3777674, 3803552, -2967908, -11375149, -12196354, -5312354, 570033, 126065, -3273124, -4720800, -4174118, -3562702, -1953125, 2884795, 9697706, 13515957, 10935339, 4663967, 1445338, 4700336, 10288957, 11291710, 6234928, 134715, -2107054, -136092]
3882a36092M028829L832970P74049m397066p072307l694998K413675N287983M329331
3873E366374K579690p8378m697953o796565j289300O942933P269923j126009p754981
3864D15734o612493l114227k130149q4967N275919P392781J313535o175491n729260
3855i448618R18878N131433M603518L596337L229683O64973l220882l554090O82375
3846B603607M771021M894752J901625j642622l996586m015603j987585k39197
3838B289412j04989J43226J515635J344661j778253l304187J221779P546503O887261
3829A5761048j700472r521594r471559l404326K748590N726094N021614J276602
3821F435997k677694k942881O18970L555758K847258O66755r5175o55012l224392
$$ y = [-136092, 3892737, 7725707, 8499756, 4102690, -2969617, -6664615, -4250940, 1037043, 5366374, 7946064, 7867686, 3169733, -3626832, -4916132, 2026801, 9296724, 8170715, 415734, -6196759, -9310986, -11441135, -11526102, -6250183, 1142598, 2456133, -3719358, -9448618, -8529740, -3398307, 1205211, 4801548, 8031231, 8696204, 5475322, 1921232, 2603607, 7374628, 12269380, 14171005, 12528383, 8531797, 4516194, 2528609, 2289412, 2184423, 2327649, 3843284, 5187945, 3409692, 105505, 1327284, 8873787, 15761048, 14060576, 4538982, -4932577, -8336903, -5588313, 137781, 5159395, 6435997, 3758303, 815422, 1434392, 4990150, 7837408, 8504163, 8408988, 7753976, 4529584]
3812D529584n659461l754540J889289N778337N099655L349496M227139N377499
3804B0836998K173897m112266o980270l871816K84334O14249j309930j909441
3796E725755k023110l961309n500418k879110K112390M172394K380810o1423k513847
3787b547868o071170p225091j331158P202126Q163619J124255k779785J466483
3779a998589M634662n19267o079275k052647O494945P659210J691691j463642
3771H367088J97617o79454n643885p210102k417538K111044J635293m07740r81496
3762e029173k637604n735031m522516L122466R458509P027016m98845m119302
3754b934480j861349J196786K179997K939948M334991L898384K10711m101141
$$ y = [4529584, -1129877, -4884417, -2995128, 2783209, 7882864, 11232360, 15459499, 20836998, 23010895, 18898629, 11918359, 8046543, 8330877, 8945126, 7635196, 5725755, 3702645, -258664, -5759082, -8638192, -6525802, -2353408, 27402, -34021, -2547868, -8619038, -15844129, -17175287, -9973161, -1809542, -685287, -3465072, -1998589, 2636073, 2116806, -3962469, -6015116, 479829, 8139039, 9830730, 8367088, 8564705, 7885251, 2241366, -4968736, -7386274, -5275230, -3639937, -4047677, -5029173, -7666777, -13401808, -17924324, -14801858, -5343349, 1683667, 1184822, -2934480, -4795829, -3599043, -1419046, 1520902, 5855893, 9754277, 9964988, 5863847]
3746E863847n256535k716434J48879l09125l512984m540184r3962O188671P290279
3737C062452J792048m026524m179269L8113K962574K047572l8859K75768L083775
3728E017650N007826K989612k003560n585058m838077j627192J26513o00914j313200
3719b826400M44696M327296P357514O252605J082210l208957j841518K749333
3711A4336779L261416j745971n292965l081561k29606j619518k709306J905968
3703D825236O830578L202994o115018r938226n450519j44870K147948N167418
3695E25541R181372Q139841R61393n095176n996698n943146p294662n797864k74055
3686a1593454L052196J085490q82980L61143K47326l023026k843924L553642P632469
$$ y = [5863847, 607312, -2109122, -1960243, -2269368, -5782352, -10322536, -10416498, -4227827, 3062452, 4854500, 827976, -3351293, -3313180, -350606, 1696966, 1658107, 1933875, 5017650, 10025476, 13015088, 11011528, 5426470, 588393, -1038799, -912286, -1513200, -2826400, -2381704, 1945592, 9303106, 15555711, 16637921, 13428964, 11587446, 14336779, 17598195, 15852224, 10559259, 7477698, 7248092, 5628574, 2919268, 4825236, 11655814, 14858808, 8743790, -1194436, -6644955, -6789825, -4641877, 525541, 9706913, 17846754, 18808147, 13712971, 7716273, 1773127, -5521535, -11319399, -11593454, -8541258, -7455768, -8338748, -7977605, -7730279, -10753305, -13597229, -10043587, -2411118]
3677b411118L023363l234792k525808J499345J501410J15213L095345O493934
3669G556892L644706j417260r55363J576917k097442q295946o299962K581203
3661c706255O546727K926985N05865J820675n35877p253923q164445j50890N568296
3652b442842J393582m343595j655394N419064O885185K055848k527465l982579
3644H01804l642807k011410k18844j610841n830898o572854r58631M612041M023855
3635a1408585Q10558J154410L374914K214518j221726k014226k47234N82279Q46816
3626e908276K796468M101102J251576k780528k208803J744546K539884r62304
3618E73665l156062j058570K156622L512508L517706K400947o83982l791748l489534
$$ y = [-2411118, 612245, -2622547, -5148355, -3649010, -2147600, -2032387, 1062958, 7556892, 11201598, 9784338, 8828975, 10405892, 8308450, 12504, -6287458, -3706255, 2840472, 5767457, 6273322, 8093997, 7558120, 304197, -7860248, -8011138, -2442842, -1049260, -5392855, -7048249, -1629185, 5256000, 7311848, 4784383, 801804, -2841003, -4852413, -5071257, -6682098, -12512996, -19085850, -20044481, -15432440, -11408585, -10598027, -9443617, -6068703, -3854185, -5075911, -7090137, -7337371, -6755092, -5908276, -3111808, 989294, 2240870, -539658, -2748461, -1003915, 1535969, 573665, -2582397, -3640967, -1484345, 2028163, 5545869, 7946816, 7262834, 3471086, -18448]
3609a8448j006007j185921m195612m454939K75671M790184M244616Q29363o26219
3600a347312O69046K496588L595412L397326J057850k289910l432385j997782
3592B148833k031692n441597p614214m035380J898514L446633J091030J748745
3584h789128O991440R139429K685883n885537n835798K600966P658003J801617
3576A0366875q118473j0522209m627953m8681k108945m733888n39173P667359
3568a2665088J0646650N302101j992416m339531j918293N77627O01036l99187
3560d187101j36453J521777K636527J615995o80057j840105j108602k98331n26621
3551c002971Q0116L264021O790779O848299L577452O95505m57198k528822o449986
$$ y = [-18448, -1024455, -2210376, -6405988, -10860927, -10585256, -5795072, -1550456, -721093, -1347312, -678266, 1818322, 5413734, 8811060, 9868910, 7579000, 4146615, 2148833, 117141, -5324456, -12938670, -16974050, -15075536, -11628903, -10537873, -8789128, -1797688, 7341741, 10027624, 4142087, -1693711, 907255, 8565258, 10366875, 2248402, -8273807, -12901760, -12950441, -15059386, -19793274, -20332447, -12665088, -2018438, 3283663, 1291247, -3048284, -4966577, -4388950, -3787914, -4187101, -4323554, -2801777, -165250, 1450745, 770688, -1069417, -2178019, -2476350, -3002971, -2922855, 341166, 7131945, 13980244, 17557696, 18253201, 17796003, 15267181, 8817195]
3542H817195q027652l520270L637206N779203O18307n592194n918437j145761
3534e352403K335446J598395K07747J471007K957795J130527j759873q18112K758460
3525D528989K628247k185570m708033r58235L225305J384261l319620l735244
3517c139900m1291K354961K891539M988762O986449L647267l182351n199783q20551
3508H485102J639083k788124q174138p889050m031142j074199K135251P084115
3500d613102R065916M174182k178073k244239K088919K685446j985850n620886
3492A372313m273067q6706M254140P530625P155230J628688m391364m523692j00028
3483H566139J796099n23888j864934o0501J071882M3192K42049J721106o04655
$$ y = [8817195, 789543, -2730727, 906479, 6685682, 7303989, 1711795, -4206642, -5352403, -3016957, -1418562, -1210815, 260192, 3217987, 4348514, 2588641, 1770529, 4528989, 7157236, 4971666, 263633, -694602, 2530703, 3914964, 595344, -3139900, -3181191, -826230, 2065309, 7054071, 14040520, 17687787, 14505436, 9305653, 8485102, 10124185, 7336061, -838077, -8727127, -12758269, -13832468, -11697217, -4613102, 4452814, 8626996, 6448923, 4204684, 6293603, 8979049, 6993199, 1372313, -2900754, -2987460, 1266680, 8797305, 15952535, 17581223, 13189859, 8666167, 8566139, 10362238, 9838350, 7973416, 7912915, 8984797, 9027989, 9270038, 10991144, 10386489]
3474A0386489o679380q186817j445022M776156J902159m648860l379334N893255
3466a381354J2139026Q899451J049849m468210o719611p475140o171812j904336
3458f032137K918062M349977J533871k106044k430408P52851L082714R84989l003920
3449D9955l220303P64219L182504R43186j741912q03535R00023p37330l200742
3440c863935j727825J682557J097481l117966m571549j278479J568178N14932
3432i696606j220636p8767K326492K993192K265776J787986J396734P95203J176166
3423A745540K651309K831445L70637k387990k448257l429K324134K426053K3987
3414G533429l047174l532875j63707L588668L300531J42179n36984K159810K560186
$$ y = [10386489, 3707109, -4479708, -5924730, -1148574, 753585, -3895275, -7274609, -1381354, 10757672, 19657123, 20706972, 16238762, 9519151, 2044011, -4127801, -6032137, -3114075, 1235902, 2769773, 663729, -1766679, -1013828, 2068886, 3053875, 49955, -3170348, -2406129, 776375, 1719561, -22351, -825886, 74137, -663193, -3863935, -5591760, -3909203, -2811722, -5929688, -10501237, -11779716, -10211538, -9696606, -10917242, -10996009, -8669517, -5676325, -3410549, -1622563, -225829, 569374, 1745540, 4396849, 7228294, 7598931, 5210941, 2762684, 2759255, 5083389, 7509442, 7533429, 4486255, 953380, 789673, 4378341, 7678872, 7821051, 7284067, 9443877, 12004063]
3405A2004063k679427q269144o830753J214740Q232058Q229638K086582m801497
3397I186260p543274n260268j322135N43018N65421J371846K443703L02881m562579
3388d275127n988366p33943N433481N016562p14993l914981j434427J842770J437866
3379c331158k60257J265089M801810M502093j336497o347520l773481L618901
3371h61020N951025l34236o751445m646963J967535K600769l581174p107261l570264
3362a6333034N49300J38476n51831K560391N096236K846010P60689M276537Q038469
3353G381243L714804n276853p931494k253384L273202L979143L733878M565975
3345A1186514K539357l048547o118029l691498r26434j577893j331605L433956
$$ y = [12004063, 9324636, 1055492, -5775261, -4560521, 3671537, 11901175, 13987757, 9186260, 1642986, -3617282, -4939417, -4396399, -3830978, -2459132, -15429, 287452, -4275127, -10263493, -10997436, -5563955, -547393, -1262386, -5177367, -6611794, -4769024, -3331158, -3591415, -2326326, 2475484, 6977577, 5641080, -706440, -4479921, -861020, 5090005, 4755769, -1995676, -6642639, -4675104, -2074335, -5655509, -12762770, -16333034, -15783734, -15645258, -16197089, -13636698, -8540462, -5694452, -4933763, -657226, 7381243, 11096047, 5819194, -2112300, -4365684, -1092482, 2886661, 6620539, 11186514, 13725871, 10677324, 4559295, 867797, -58637, -1636530, -2968135, 465821]
3337D65821P148489K838088o013947r085454k851990N723041Q544076M437231
3329A1205355k103991o134389n537089j795223J632530K702987K359466K301545
3321D631191K521705J970316K84692k115985m377791m985041k688872J665330
3313c094455N534674P051099N678169J415694m151359p135998n476347l087495
3305c266018n049895q758593o122886L807864J1340532R186189K693249J107452
3297D937894L672577K342219m174564p833045l550357L331415M887647O42858
3289D256644l944790n325504m009554j100500K761073N336322L878924l83949
3281A468666k125272J317357N422699M109879j482273m201820j003292L036359
$$ y = [465821, 7614310, 10452398, 4438451, -4647003, -7498993, -1775952, 6768124, 11205355, 9101364, 2966975, -2570114, -4365337, -2732807, -29820, 2329646, 4631191, 7152896, 9123212, 9407904, 7291919, 2914128, -2070913, -4759785, -3094455, 2440219, 9491318, 15169487, 16585181, 12433822, 5297824, -178523, -3266018, -8315913, -17074506, -23197392, -19389528, -8048996, 1137193, 3830442, 4937894, 8610471, 10952690, 6778126, -1054919, -4605276, -1273861, 3613786, 4256644, 311854, -5013650, -9023204, -10123704, -7362631, -2026309, 1852615, 1468666, -656606, 660751, 6083450, 10193329, 8711056, 4509236, 3505944, 6542303]
3273F542303K696613k38878j372913q93510j255076j050353K262489N336129K049662
3264A4076466o106698r917081m627586L883490P669129N879348K233290j449120
3256A1641238m874991o205227l976704k03488J788321J216658o13816k753347
3248c981356m645801n462749m824623k686365J494910O792567Q685803L475971
3240a151643m966223q235955m147748J286194L752579N428239P484900N936856
3232E387199k29608m271343j464034K632945Q56523m095534m813709j252691R24442
3223f325810O80186J340954K247669j70255l837462k466878L945353Q102970O170310
3214I687037K406332J330608J671439M26641k180079m084760m108544k189316
$$ y = [6542303, 9238916, 9000038, 7627125, 6733615, 5478539, 4428186, 6690675, 12026804, 14076466, 7969768, -1947313, -6574899, -2691409, 4977720, 10857068, 13090358, 11641238, 6766247, 561020, -3415684, -3619172, -1830851, -614193, -1228009, -3981356, -8627157, -14089906, -18914529, -21600894, -20105984, -13313417, -4627614, -1151643, -6117866, -14353821, -18501569, -17215375, -13462796, -8034557, -549657, 5387199, 5157591, 886248, -577786, 2055159, 2911682, -1183852, -5997561, -7250252, -6325810, -5645624, -4304670, -2057001, -2227256, -6064718, -8531596, -4586243, 3516727, 9687037, 12093369, 13423977, 15095416, 15522057, 13341978, 9257218, 5148674, 2959358]
3206B959358J48795R84k859645l738954O95550N985545N482591M45384k317263
3197F802345j439018j641666l776430l015705J650880M578701K734147J89666
3189F082920L12697O71099o58909n27703L059393N846100L234386k924795p359827
3180G735361p584520m230977Q96936M567060L853485K57809j705928j041564o56918
3171B090744r44665O44712K992356J958510j096054k99475L225135J322294o095490
3162C798067p835324L66719O832091K537379l284580J026891Q495155M564097
3154A6500495p576298j0944246j684884O047028L561439r12438J062030M736463
3146A0789589K679474k925310o292073p414986q160558o405481r15976M097446
$$ y = [2959358, 3108153, 3109137, 249492, -3489462, -2793912, 3191633, 8674224, 9119608, 6802345, 5363327, 3721661, -54769, -3070474, -1419594, 3159107, 5893254, 6082920, 6395617, 7066716, 6407807, 5880104, 8939497, 14785597, 18019983, 15095188, 7735361, 150841, -4080136, -3183200, 1383860, 5237345, 5495154, 3789226, 2747662, 2090744, 1146079, 1790791, 4783147, 6741657, 5645603, 5346128, 8571263, 9893557, 3798067, -4037257, -3670538, 3161553, 5698932, 2414352, 3441243, 11936398, 16500495, 8924197, -2020049, -3704933, 2342095, 5903534, 4991096, 6053126, 10789589, 13469063, 10543753, 4251680, -3163306, -11323864, -17729345, -18645321, -14547875]
3138a4547875N278295N264259O434654N855585J905648p22446R75041J717019
3130A2160180l281722q679827o528728J072587N559499M666912K683829P22010
3122H374740l481537p193469m255288L923860Q084525M143387j550358k880343
3114E165517k233684m005823o527709n806299k525339K2389J604945L749975N320914
3105e235114M045211Q72172j190238j541632k012934l338318m411687m302625
3097a7115165k814681j6249K984296M192635L343199K573602K864543K267883
3089a719937j97585j757621O8721L269289M460833L649231K416386K84291k908723
3080G564885m019159j117214J749834J58249k990211k276704J96042j812104o568582
$$ y = [-14547875, -9269580, -4005321, 2429333, 8284918, 10190566, 9468120, 10443161, 12160180, 8878458, 198631, -6330097, -5257510, 301989, 4968901, 7652730, 8374740, 4893203, -2300266, -6555554, -2631694, 5452831, 9596218, 8045860, 5165517, 2931833, -1073990, -7601699, -13407998, -15933337, -15910948, -14306003, -10556028, -5235114, -1189903, -317731, -1507969, -3049601, -5062535, -8400853, -12812540, -17115165, -19929846, -19946095, -16961799, -12769164, -9425965, -6852363, -3987820, -1719937, -1917522, -3675143, -3606422, -337133, 4123700, 7772931, 10189317, 10473608, 7564885, 3545726, 2428512, 4178346, 4336595, 1346384, -930320, -734278, -2546382, -9114964]
3071i114964n761111J315320N731630L723161K382865N814228O921294N86182
3063A1598605n307799k119074M707471M700499l26721j142940J241815k470706
3055A0881150j1345508j2654145j728204R607851R726633J971709l292418k984270
3047A82798j068918k94982n05754j056159l46782L232468O851232M750264k559506
3038I184661o398282j542108N743526O401437N16394m915691n970250l779469
3030g59782m5549L370977K911276k667153q242208p596649j730260K727519K461240
3021i570589L52672o0919J178674K077831J545370J37133n40625M43102J600621
3012b836730O97531j332950r98257K334384N164651N182433L646536J089728l932648
$$ y = [-9114964, -14876075, -13560755, -7829125, -4105964, -1723099, 4091129, 11012423, 11598605, 6290806, 4171732, 8879203, 13579702, 13252981, 12110041, 13351856, 10881150, -464358, -13118503, -14846707, -5238856, 4487777, 6459486, 3167068, 182798, -886120, -1181102, -1686856, -2743015, -3089797, 142671, 6993903, 11744167, 9184661, 2786379, 1244271, 6987797, 13389234, 13905628, 8989937, 3019687, -759782, -805331, 2565646, 5476922, 2809769, -5432439, -13029088, -14759348, -12031829, -9570589, -9217917, -9278836, -8100162, -6022331, -4476961, -4339828, -4880453, -4437351, -2836730, -2139199, -3472149, -4470406, -2136022, 3028629, 8211062, 11857598, 12947326, 9014678]
3003I014678r451690r668323l685494J616421K042597K598099P496107J0987725
2995A0950120O769770J85540K19000L789667M98480q804146j1484187k703936
2987e79692O679692N932212j848106o930198n674567p33177M545289O476698J741880
2978I610031o770050r877441l356172N124020N914481L39342k562664M38920L516687
2969B377154J829274j508579q86783L200673M695421N78533m251945l122398K742165
2960E653515N176044J053706k246937J868546P508902M104581o672100j2050252
2952D396005o851615k77600l64310k201299J341366O060055L570524l603141n234923
2943c164938M12108M362780J581255k026382n20809K476680P73921l392796k397579
$$ y = [9014678, -437012, -10105335, -13790829, -12174408, -10131811, -7533712, -37605, 10950120, 17719890, 17905430, 18124430, 21914097, 22412577, 13608431, 2124244, -579692, 6100000, 12032212, 10184106, 3253908, -2420659, -3153836, 1391453, 7868151, 9610031, 2839981, -7037460, -10393632, -5269612, 644869, 984211, -1578453, -1139533, 2377154, 4206428, 2697849, 1811066, 5011739, 9707160, 10285693, 6033748, 2911350, 5653515, 10829559, 11883265, 9636328, 11504874, 19013776, 23118357, 16446257, 4396005, -2455610, -2733210, -3097520, -5298819, -3957453, 2102602, 5673126, 2069985, -3164938, -2752830, 1609950, 3191205, 1164823, 644014, 3120694, 3894615, 501819, -1895760]
2934a895760M777635J0150019P312632k76617m152198j400183K745350K233764
2926A9494642k560882n744359k753876M376198Q271548L502631o290705j0426371
2918G868826l482334O237429O253532k504354o108807J450716P814995Q24694
2910A8354697j1144338j0369342L198852J1489008N339442l558101k710884L346857
2902A3946191M079881L21062q08942k86690l897143r176194q115317j229079K532661
2893b633570J79851j518670J463187L722920J92585n054061m974690M61637N414687
2884b746124O157514L744963P13001j346199j861467j449798j547894k418870
2876g54874k231650O08891M695566O264246K831400l859297q659094p585090k052120
$$ y = [-1895760, 2881875, 13031894, 20344526, 20067909, 15915711, 14515528, 17260878, 19494642, 16933760, 11189401, 8435525, 12811723, 21083271, 24585902, 18295197, 7868826, 4386492, 10623921, 16877453, 14373099, 8264292, 9715008, 17530003, 18354697, 7210359, -3158983, 39869, 11528877, 16868319, 13310218, 10599334, 13946191, 18026072, 18347134, 17538192, 17251502, 13354359, 4178165, -3937152, -5166231, -2633570, -2453719, -3972389, -2509202, 1213718, 1406303, -3647758, -8622448, -8160811, -2746124, 3411390, 7156353, 7869354, 6523155, 4661688, 3211890, 1663996, -754874, -2986524, -2377633, 2317933, 8582179, 11413579, 7554282, -1104812, -8689902, -10742022]
2867a0742022K405973K342789J20943L44482L804451O540074M391146k442734
2859F765102q781611q360659j38582R042366J0773237M820918p66167n64847J635547
2850A4425304N0037m005165n320929l651125l002046l800390k557650O79468J247850
2841e934646k035333l571844R69019P540711Q585239K673507m290751o539647
2833b603745m167203j214733j61747J67926J399933K122428j79465m054348m388900
2824a3079854N84748N869246O202885L075448J340492J314688o13453m741038
2816d6838o958395m976927p51687L468364O566517O128000P23837m548148j963443
2807b358720O799166R979055J696233q552143r136963k760763m21538l277028
$$ y = [-10742022, -8336049, -5993260, -5872317, -5527835, -1723384, 4816690, 9207836, 6765102, -2016509, -10377168, -10515750, -1473384, 9299853, 14120771, 13354604, 12789757, 14425304, 14475341, 10470176, 5149247, 1498122, -1503924, -5304314, -7861964, -7182496, -5934646, -7969979, -11541823, -10572804, -3032093, 5553146, 8226653, 3935902, -2603745, -6770948, -7985681, -8147428, -7979502, -6579569, -4457141, -4636606, -8690954, -13079854, -12495106, -6625860, -422975, 2652473, 3992965, 5307653, 4694200, -46838, -7005233, -11982160, -12733847, -9265483, -2698966, 3429034, 4152871, -395277, -2358720, 4440446, 14419501, 16115734, 7563591, -1573372, -4334135, -4755673, -8032701]
2799h032701k298738M595094P763672K068737l557189l45293N459948K324756
2791G978286p604248j1140399l911429M155284M517178L50515k315528l763004
2783a1733345n212311l093197L807356Q550647N728876Q88533J161831K390041
2775B488431k935076r420102m833082Q485952J3726205M368755n777268l793253
2767B310562M303809O039807J814961j6757Q05858j520825n565215m512483M45696
2758D105413P22973n145472q395860l740124K927467M139703J163667M19407M097877
2749B95051Q162541P570535J546521n216922o794967k840042N50520j163803n018868
2740b909434n836410l882175k557316j901769j69937J177689N06400J089354N796881
$$ y = [-8032701, -10331439, -5736345, 2027327, 4096064, 538875, 193582, 5653530, 7978286, 374038, -10766361, -14677790, -10522506, -6005328, -5654813, -7970341, -11733345, -16945656, -20038853, -16231497, -7680850, -1951974, -1063441, 98390, 2488431, -446645, -9866747, -14699829, -6213877, 7512328, 11881083, 6103815, 2310562, 6614371, 12654178, 14469139, 14452382, 15258240, 13737415, 8172200, 3659717, 4105413, 4828386, -317086, -8712946, -12453070, -9525603, -5385900, -4222233, -3802826, 295051, 8457592, 16028127, 17574648, 12357726, 5562759, 2722717, 3273237, 2109434, -2909434, -8745844, -12628019, -15185335, -17087104, -17257041, -16079352, -15572952, -14483598, -8686717]
2731h686717R409862M936502m055339p009376j916199K773657K580659K576432
2723F09481N719498O392502J018021m042351k304554J979876M12712o603611j0714227
2714g532653p066601P82094O248660O137404K551822N24836K509810M935006L056383
2705A2146761j317889j966234J715572L274423n83509n125792n749737m316414
2697a922819l639272k131236J453946L791346K465771L95394j5477j485270n175076
2688f262693n354693K183241J1138032J1939240M720687k411846n309133o168104
2680D474731n989950l096472R44715J712633n51470n43248L177743N013775J020038
2671F162495m267126l823850J995831O022053M056733J62969L92935L679105L049809
$$ y = [-8686717, 723145, 5659647, 1604308, -5405068, -7321267, -4547610, -1966951, 609481, 6328979, 12721481, 13739502, 9697151, 7392597, 9372473, 9785185, 3181574, -7532653, -14599254, -13817160, -7568500, -1431096, 1120726, 1645562, 4155372, 9090378, 12146761, 10828872, 8862638, 10578210, 13852633, 13269124, 8143332, 2393595, -1922819, -5562091, -7693327, -6239381, -2448035, 17736, 413130, 397653, -1087617, -6262693, -11617386, -9434145, 1703887, 13643127, 18363814, 15951968, 10642835, 4474731, -1515219, -4611691, -3666976, -1954343, -2505813, -3049061, 128682, 5142457, 6162495, 1895369, -1928481, 67350, 6089403, 10146136, 10309105, 10702040, 14381145, 17430954]
2662A7430954l500417q258902m138844L893903M762786k566427p333718k981214
2654b691879L717237L785055j243954l779341j427707K839026O968177R320836
2646A7487450O023995l431697j0863004p811826K143141P344013L743624j376827
2638A3258869k040889j512388m241243o911636l524983M064858P106503J612061
2630G811152n823370o456634p15303L306179K003208R55959M764629Q286511M316815
2621A8449146m342443q773279p132684m372214p41709P335923J4631885R719681
2613B4774306n499324j3232560m431774P305285O508898k030037m748286j908592
2605F737916k855025o467698l741414M046604O566972K463204M22160K251887
$$ y = [17430954, 13930537, 5671635, 1532791, 5426694, 10189480, 7623053, 289335, -2691879, 1025358, 4810413, 3566459, -212882, -1640589, 1198437, 8166614, 17487450, 23511445, 20079748, 9216744, 1404918, 3548059, 10892072, 14635696, 13258869, 11217980, 9705592, 5464349, -1447287, -4972270, -907412, 6199091, 7811152, 1987782, -4468852, -5184155, -1877976, 125232, 1081191, 5845820, 14132331, 18449146, 14106703, 5333424, -1799260, -6171474, -6913183, 422740, 15054625, 24774306, 19274982, 6042422, 1610648, 8915933, 15424831, 13394794, 8646508, 6737916, 3882891, -2584807, -6326221, -2279617, 4287355, 6750559, 7172719, 9424606]
2597I424606L24452o369640q594053l082947J250250j357781m034646K99161P052177
2588e088421P894397L140202p47682q53620O92639J376738M87660r53815r16627
2579E031471N35031j30369m106090n535046R30782J0040606J1463889M158451
2571B2388725l266227n504236m626324k056395K956039O435228K346180n984350
2563A2688640p865941j321649L313267p27873p266579p931771l189566J841455
2555a0460017M651790M496703J415161j093413P78135M190961L517204P30163
2547H226687K091207N114688J284775p397113q597692N41261P762440M614733
2539A3640986k101832l307308j038K722616L089074K15924m980958n286392L702741
$$ y = [9424606, 9749058, 3379418, -5214635, -8297582, -7047332, -8405113, -12439759, -12140598, -5088421, 2805976, 5946178, 5198496, 4344876, 5037515, 6414253, 6901913, 5948098, 5031471, 5566502, 5436133, 1330043, -4205003, -3274221, 6766385, 18230274, 22388725, 19122498, 13618262, 8991938, 6935543, 9891582, 16326810, 18672990, 12688640, 4822699, 3501050, 6814317, 6086444, -1180135, -9111906, -12301472, -10460017, -5808227, -1311524, 103637, -989776, -211641, 3979320, 7496524, 8226687, 10317894, 15432582, 16717357, 9320244, 722552, 1263813, 9026253, 13640986, 11539154, 8231846, 8230808, 10953424, 14042498, 14258422, 9277464, 3991072, 7693813]
2530G693813J1276215N188260m982045n28136J2050166Q748554p985803r152504
2522B2308520Q615387J3248280k428167J270788L8752571N2722825o354662q8963412
2514C9172130j01160530l4711204K6084027K6811029L005678K711376J4864661
2507b3222833Q708930o616581n106665P027475O908280k401003k047293N542744
2499a1206946L718580n153296m630275M425682N492401l987527r169633k992495
2491b3503509N682274Q786086O980155J970910m398173n504552K196347R826437
2483B035975P160813j457410m895575l068675l110015l949573l80126K822700
2475d841886k248879r630854o863445L297848O625131J502179K99430N954714
$$ y = [7693813, 18970028, 24158288, 19176243, 18648107, 30698273, 39446827, 31461024, 22308520, 30923907, 44172187, 41744020, 43014808, 81767379, 134490204, 128135542, 39172130, -61988400, -96699604, -70615577, -43804548, -40798870, -38087494, -23222833, -14513903, -21130484, -26237149, -19209674, -12301394, -14702397, -16749690, -11206946, -7488366, -12641662, -17271937, -12846255, -7353854, -11341381, -20511014, -23503509, -17821235, -9035149, -2054994, -84084, -4482257, -9986809, -7790462, 2035975, 9196788, 7739378, 2843803, -224872, -3334887, -7284460, -7664586, -4841886, -7090765, -16721619, -23585064, -20287216, -13662085, -12159906, -11860476, -5905762]
2467e905762O753845j670827p824777m347278L55543j254288k774022K536985
2459a4130581Q054016N123476j926317l647301o97197P896j449394K65199M279612
2450d120591M279571n58275m260448l661504j917631j661801j035838J550840
2442a1385677L669114K775724Q32751J690541M817325M906283r20229p709899
2434a324067p608481J63638P937333R122743N038708L23481l498773o004956m424225
2425b74599J720689O169826L240883k787385l165403K058933M598733J275617
2417A2837294k253095k294062k385119m660242m674781J93837M590983L595127
2409D949942J356963M228679R368083P994619j394875j0044530j0008894l231971
$$ y = [-5905762, 848083, -822744, -8647521, -12994799, -12639256, -13893544, -16667566, -14130581, -6076565, -953089, -2879406, -6526707, -7223904, -7216008, -8665402, -8400203, -4120591, 158980, -399295, -4659743, -8321247, -10238878, -11900679, -12936517, -11385677, -7716563, -4940839, -4108088, -2417547, 2399778, 7306061, 6385832, -1324067, -8932548, -8768910, -831577, 8291166, 13329874, 13653355, 10154582, 4149626, -274599, 1446090, 7615916, 10856799, 8069414, 4904011, 6962944, 11561677, 12837294, 10584199, 8290137, 5905018, 1244776, -3430005, -3236168, 1354815, 4949942, 6306905, 10535584, 19903667, 27898286, 26503411, 16458881, 6449987, 3218016]
2401C218016K172042J564579k406941m372792k635703j44422L11146l40482j91085
2392b825642l94983l058399o239856n377959J10271N814674Q488521Q802674P000994
2383A2320295J211496p055694j0706362n165248M191546P676670L122668k428326
2375C167045k674641N51800J250362k319244n660198l828356K609137Q045446
2367A141351P655505J977312m212475o669058n016978k213943j194045j543264
2359a0075595O2383M740810P911201M560999k119281k933352M155786R255949
2351A5558900M243003m166263l290749O334114J0563364J511933j1314467j4006791
2343E433044n732821K518192K914183j421501k819664J253528O382369P237364
$$ y = [3218016, 5390058, 6954637, 4547696, 174904, -2460799, -2605221, -2294075, -2634557, -2825642, -3220625, -6279024, -12518880, -17896839, -17786568, -11971894, -3483373, 5319301, 12320295, 13531791, 6476097, -4230265, -9395513, -5203967, 2472703, 5595371, 3167045, 492404, 1044204, 2294566, -24678, -5684876, -9513232, -6904095, 1141351, 8796856, 10774168, 6561693, -107365, -5124343, -7338286, -8532331, -10075595, -10013212, -5272402, 2638799, 7199798, 5080517, 2147165, 6302951, 15558900, 19801903, 15635640, 12344891, 18679005, 29242369, 30754302, 19439835, 5433044, -299777, 2218415, 5132598, 3711097, 891433, 2144961, 8527330, 15764694]
2335A5764694L533353o78613k463029k314884j151156J122416K541993o50735
2327A5704039p181030q965197j586568P415063P452525p22288o817332n206432
2319I2780L27699M713983O301817L931328k345607p175938m532031K845590O286848
2310A0446469L711188R76906N84496j309637n359639o627697m025820k327370
2302c931104k361165N16954N712441O582363L393686M258023Q847660N751469
2294B8770327p038549j4395627o939283L167131K174232l447692r94843N011654
2286F307350K368096m889792l065890N801418O481324k853607p222346j2015P373982
2277A0288520N435959n84599l483329m868411o493276l743236M783713J1469318
$$ y = [15764694, 19298047, 18619434, 16156405, 13841521, 12690365, 13812781, 16354774, 15704039, 8523009, -442188, -2028756, 5386307, 12838832, 12116544, 5299212, 92780, 420479, 5134462, 11436279, 15367607, 13022000, 5846062, 1314031, 4159621, 10446469, 14157657, 15134563, 15719059, 14409422, 9049783, 2422086, -1603734, -3931104, -6292269, -5775315, -62874, 6519489, 9913175, 14171198, 23018858, 28770327, 21731778, 7336151, 396868, 3563999, 5738231, 2290539, 1295696, 6307350, 8675446, 3785654, 719764, 6521182, 13002506, 10148899, 2926553, 2914538, 10288520, 15724479, 15139880, 11656551, 6788140, 294864, -3448372, 1335341, 12804659]
2269A2804659J0054187L501192k921701p771915r378999n367711L61035K51479
2261A532226m090539k721562N545457R378352L279758l426394k794986k61797
2253F440515j819827k288322K625085M652648l274513j1578770p263375M755901
2245g750658Q931072K634186l065563l145610l365784n531015l269938M476483
2237a0086827Q594997L368849m650612o245194r48966N009948O470467K194498
2229C707160m975227q739310m785086L002326O233576K605795j904943j814959
2221f670668J937437N320528N508221J487144m706846p359151l021082L064457
2213d439960K537421l935522o997416k232793L876646M308737R16378o16972M31883
$$ y = [12804659, 22858846, 26360038, 23438337, 15666422, 6287423, 919712, 1280747, 1532226, -2558313, -5279875, 265582, 9643934, 12923692, 9497298, 6702312, 6440515, 4620688, 2332366, 4957451, 9610099, 6335586, -5243184, -12506559, -7750658, 1180414, 3814600, 749037, -2396573, -5762357, -11293372, -14563310, -10086827, -1491830, 1877019, -2773593, -9018787, -9967753, -4957805, 1512662, 3707160, -1268067, -10007377, -14792463, -11790137, -5556561, -2950766, -4855709, -6670668, -4733231, 587297, 6095518, 7582662, 2875816, -4483335, -7504417, -4439960, -1902539, -5838061, -12835477, -15068270, -11191624, -6882887, -5966509, -6583481, -6151598]
2204f151598J050134N83317P36665J788563K628624K944448K613631O95068k524804
2195D364048m195817k025599K334497M765996K886139j853940n335346m328539
2187c388561m37903O42946l489443p006752k974225N478448P628583J97829o911055
2178a0260133l815760O029766J1300678P866900K035139K17402J551088J693310
2170A6618390o26453k992108k889940j94011K881814L487114N79935l841172o491852
2161F531717n990351l843439k266725j739531j179119k7309R54167J321109K049053
2152d190428L634205M297111K447085P024k02621J67126k592187n809842j544697
2143c787224J0187902J6813645R043337m592764q640640k272267J521318l009585
$$ y = [-6151598, -5101464, -4518147, -3781482, -1992919, 635705, 3580153, 6193784, 6888852, 4364048, 168231, -1857368, 477129, 5243125, 8129264, 6275324, 939978, -3388561, -3826464, -3183518, -6672961, -13679713, -16653938, -11175490, -3546907, -3349078, -10260133, -14075893, -8046127, 3254551, 11121451, 13156590, 13373992, 14925080, 16618390, 15991937, 12999829, 10109889, 9915878, 12797692, 16284806, 16864741, 13023569, 6531717, 541366, -3302073, -5568798, -7308329, -8487448, -8514757, -7560590, -6239481, -4190428, -556223, 3740888, 6187973, 6194997, 5992376, 6159502, 3567315, -2242527, -3787224, 6400678, 23214323, 32257660, 27664896, 19024256, 16751989, 18273307, 15263722]
2135A5263722p066175l596946J582506J039752k192530j728530R75464J211419
2127E488682N17988K465798L879190o1704n429292m369549J575311L269149j198200
2118F137373l964001j242778O96373k567109n144212p58833O081779O796100J990515
2109H025207m51161J703925K675505l89068k344269P69026L991657O35342o486667
2100H129497p975198j599950L693958L30308o836660p518483j063551K787199
2092a0052880j201785n524196j048467Q856779J2272539N067579l969205n609032
2084a208668j387644J374381R02207J495688M713892O360476L323074j566300
2076A4007106m030174m036434l838084l284537j137365R35545M40325q63048O70486
$$ y = [15263722, 8197547, 4600601, 6183107, 7222859, 5030329, 3301799, 4277263, 5488682, 6006670, 8472468, 12351658, 12289954, 6860662, 2491113, 4066424, 7335573, 6137373, 2173372, 930594, 1626967, -940142, -6084354, -6843187, -761408, 6034692, 8025207, 7574046, 9277971, 11953476, 11564408, 9220139, 9989165, 13980822, 14616164, 8129497, 154299, -1445651, 2248307, 2578615, -4258045, -11776528, -12840079, -10052880, -11254665, -16778861, -17827328, -8970549, 3301990, 8369569, 4400364, -1208668, -2596312, -1221931, -319724, 1175964, 5889856, 12250332, 15573406, 14007106, 9976932, 5940498, 2102414, -1182123, -2319488, -1383943, -943618, -1806666, -1136180]
2067a136180L147353M65298p070411j0308478l886381M646756M932243j272614
2059a0482414l420245J667409O007824L592533j167871j394730K456202N073516
2051B332224L942438L39899l816156o265412m512847N35768L400067K82120n189379
2042h951278o106556j102596M468900N888543M341197L822493M929536L997051
2034A1287290j201802o768878o562589q81827K795608Q8718l772331k375729J305098
2025f086442K62526l512846j326607O766457R687298K064675o686965o024221
2017d856125J167989N006042L102120L93781r70842l015689n361280m673897k10418
2008i418319N061066Q006702O854356J868006k556913q21121N171282N861167
$$ y = [-1136180, 2011173, 2476471, -4593940, -14902418, -18788799, -14142043, -9209800, -10482414, -13902659, -12235250, -6227426, -2634893, -3802764, -5197494, -2741292, 2332224, 6274662, 6614561, 2798405, -3467007, -7979854, -7444086, -4044019, -3761899, -8951278, -15057834, -16160430, -11691530, -5802987, -1461790, 2360703, 7290239, 11287290, 10085488, 3316610, -3245979, -4127806, -1332198, -1243480, -5015811, -7391540, -6086442, -5823916, -9336762, -10663369, -3896912, 5790386, 7855061, 1168096, -4856125, -3688136, 1317906, 4420026, 4813807, 3842965, 827276, -4534004, -9207901, -9418319, -4357253, 3649449, 10503805, 12371811, 9814898, 8993777, 14165059, 20026226]
2000B0026226k365656r920635p430176P8308J755825j791818j304913M318354
1992C365515O621811K555891j296594j033885q33521l198926m027146j279857
1984H73288N96132o64583n41786L136300M409020j119752p332959n670878K127786
1975d187432O528563L307148k076696k905529N87788K551531r12403o608992p351783
1966a1067805p32809P069406Q468738L369585k376136m911806m180961l74290
1958d736078N205546P457864K773962l763814l784361K237795O005622M163585
1950A5560121J239663l39730l133593o079751l748115K712663M669600K08433
1942A1089291j923174K001546L078729m140655r766692l956837N686501N615700
$$ y = [20026226, 17660570, 7739935, 309759, 388067, 2143892, 352074, -952839, 3365515, 9987326, 12543217, 11246623, 10212738, 9379217, 6180291, 2153145, 873288, 1469420, 804837, 263051, 3399351, 7808371, 6688619, -644340, -6315218, -4187432, 2341131, 5648279, 3571583, 666054, 1253842, 3805373, 2892970, -3716022, -11067805, -11800614, -4731208, 3737530, 7107115, 4730979, -180827, -4361788, -4736078, 469468, 7927332, 10701294, 6937480, 3153119, 5390914, 11396536, 15560121, 16799784, 16460054, 13326461, 7246710, 3498595, 6211258, 10880858, 11089291, 9166117, 11167663, 14246392, 10105737, 339045, -3617792, 2068709, 7684409]
1934G684409j863867l208718L779329P346595J686607m744512l953032K39990
1926F966801O29034k343427l740814k479949j182659j037278q23680O02522K976924
1917d32526M643746L536704k70273l499517l234010o78817R10567P84401N73059
1908B333334R73758J299007J061899j85124k594631l710107K3497O494703P320097
1899A3016433j040580r898632q682965N71408O635939M817314Q41181l28447n35221
1890E396430j725256j520511J128831K623552J052031J93222K741293M510954
1882A4400546R61913m060991k768774M445136Q015491K202589o259721o778401
1874A0157788Q47418O580136M317191o70999j531718p25779m343865r672920p972298
$$ y = [7684409, 5820542, 2611824, 6391153, 13737748, 15424355, 10679843, 6726811, 6966801, 7595835, 5252408, 1511594, -968355, -2151014, -3188292, -4011972, -3409450, -432526, 4211220, 7747924, 7477651, 3978134, 744124, 65307, 975874, 1760275, 2333334, 3307092, 4606099, 5667998, 5482874, 2888243, -821864, -798367, 5696336, 13016433, 11975853, 2077221, -6605744, -6034336, 601603, 5418917, 6260098, 5931651, 5396430, 3671174, 2150663, 3279494, 5903046, 6955077, 7148299, 9889592, 14400546, 15362459, 11301468, 8532694, 12977830, 20993321, 23195910, 16936189, 10157788, 11005206, 17585342, 21902533, 21231534, 19699816, 18974037, 14630172, 4957252, -3015046]
1865c015046Q79863O640326M090912M13698K237828M503208o803p281614p943912
1856E18460k140623J436420m33242j974016P93597M095299L404559K10234j085833
1847D824855P35784L010825K668763n73163l630139l119174O14246M254505O155347
1838A4941849O777668M759483j622625q039212o707215J491179N588161O9593
1830A7258881o560301n352926n26194o23548l711946k384875K080103K463416
1822B642610r13290j083886K893753M858944K408368n83724j714682k060791j549534
1813D897768K60155R08085o08453k02905L259990K588407n494853j0297349k242648
1804f931803R039436P635047k993024n537562K880986P833305L085181j288534
$$ y = [-3015046, -2135183, 4505143, 8596055, 9009753, 11247581, 15750789, 15743986, 8462372, 518460, -1622163, -185743, -618985, -2593001, -1799404, 2295895, 5700454, 5910688, 4824855, 5560639, 8571464, 11240227, 10667064, 7036925, 3917751, 4531997, 8786502, 14941849, 21719517, 26479000, 24856375, 16817163, 10109948, 11601127, 17189288, 17258881, 10698580, 5345654, 4819460, 4195912, 483966, -1900909, 179194, 2642610, 1729320, 645434, 3539187, 8398131, 10806499, 10222775, 8508093, 6447302, 4897768, 5157923, 6066008, 5457555, 5254650, 8514640, 11103047, 5608194, -4689155, -6931803, 2107633, 9742680, 6749656, 1212094, 4093080, 11926385, 15011566, 13723032]
1796A3723032O12314J488703k337528l439608O14404R39912n263866p597714j247271
1787b507622L279603j164865n533802j396654L987741J562434l637967l152727
1779h563859R7498L51509J192517N965953O659364l008777j2335795p168215P486450
1770i323355J3733832O128468l276191l801135J952085N471903K792821l221805
1762A0456623n958125j410615N857273O842418J15118o344395p112150m977366
1754b531219k551669J566749N125788K330443m159763l860543M039817P622678
1746G582281K411982q92202L667193O393389P20233m204804j504725J28729n219270
1737I082806o584761L525778J1761280N397826m704986k871611M424135K360170
$$ y = [13723032, 14335346, 15824049, 13486521, 10046913, 10661317, 11601229, 6337363, -1260351, -2507622, 771981, -392884, -5926686, -7323340, -3335599, -1773165, -5411132, -8563859, -8466361, -8114852, -6922335, -956382, 5702982, 2694205, -9641590, -16809805, -9323355, 4410477, 10538945, 7262754, 3461619, 5413704, 10885607, 13678428, 10456623, 4498498, 3087883, 8945156, 15787574, 15902692, 9558297, 2446147, -2531219, -5082888, -3516139, 1609649, 3940092, -219671, -4080214, -40397, 7582281, 9994263, 9102061, 12769254, 19162643, 19882876, 15678072, 14173347, 14302076, 9082806, 2498045, 6023823, 17785103, 23182929, 18477943, 15606332, 20030467, 22390637]
1729B2390637m721753l098712M252558N309719K911953O692531J0090378Q69858
1721D4697169j2665010j2031752R2464M602641j756051m175299K335662P005162
1713B8104986M343825l56218m650106q657791o021076N502331J2403216M960005
1705C5629172k979308K847207Q981908j937804j5245382p131486J1243162J2416205
1697D3823674K199318N980692J7162310R366655q940577p158665P196041K207440
1689G1836888j0238518Q584301M1016489L2772081L670065L3072590J02390747
1682B83104643P2403765j06326022k68409397k32440881m9979911P2729123N5213722
1675a73704958M981049J4048470M0267924K3180477p352311j396463K0811787
$$ y = [22390637, 17668884, 14570172, 18822730, 24132449, 27044402, 33736933, 43827311, 44697169, 32032159, 20000407, 20092871, 24695512, 22939461, 18764162, 21099824, 28104986, 32448811, 32092593, 27442487, 18784696, 12763620, 18265951, 30669167, 35629172, 32649864, 35497071, 44478979, 42541175, 27295793, 20164307, 31407469, 43823674, 46022992, 52003684, 69165994, 78532649, 69592072, 62433407, 69629448, 71836888, 61598370, 70182671, 111199160, 143971241, 147641306, 180713896, 283104643, 355508408, 249182386, -19227011, -251667892, -301647803, -228918680, -173704958, -168723909, -154675439, -114407515, -91227038, -98579349, -99975812, -79164025]
1668g9164025J6647341j979405j152639J0832443P134146m454072j299145Q717339
1660d4718017N460912l121266J417544J0521704N586984n478044l414586O196208
1652b7548561M915931l671039k549424O160295O876588J9440j593324J709596
1644a5680498k7759m081050l17195P130023O033554j513886m045682k292096m778173
1635a9572762p565393k27185J1921026J3201948L200883l304684j115852J16473
1627c345546m173294o526938k664289K009831L528874L875146L113830r69937
1619e152323n072341l646118N05080M7336l761871l293772J527777L414108Q85473
1610a4546651l72639J337787K308286K260092L748892M100519q31792o308093
$$ y = [-79164025, -62516684, -64496089, -65648728, -54816285, -47682139, -52136211, -53435356, -44718017, -39257105, -42378371, -40960827, -30439123, -24852139, -30330183, -33744769, -27548561, -22632630, -26303669, -28853093, -22692798, -15816210, -15796770, -17390094, -15680498, -15708257, -19789307, -20106502, -12976479, -6942925, -8456811, -12502493, -14794589, -19572762, -27138155, -27365340, -15444314, -2242366, 958517, -2346167, -3462019, -3345546, -7518840, -14045778, -16710067, -14700236, -11171362, -7296216, -4182386, -5152323, -10224664, -13870782, -13365702, -13318366, -17080237, -20374009, -18846232, -15432124, -14546651, -14919290, -13581503, -11273217, -9013125, -5264233, -1163714, -1995506, -8303599]
1602h303599l998700L278619M459548k103240o266880k653088K158057J403336
1594a2025947l018998n983371n049717K79661P470221R466579K600250n316171
1586a1577493m082464L545926O289875K360422N72398L804051M789657J98422
1578E900794l955642l913764l245956l315333n63072L434414J564915n072225
1570i165869n733862K346106P750238L131405k990998j415942K631951L93955
1562c053016m487829l321785J759076K051586k395926l844504m01184K467968
1554a1225614K247929J380053K60866k562602m278429j002269L588605K159681
1546i431780l678314m515097J635292N452470J373544l163504O4629O476748N941450
$$ y = [-8303599, -12302299, -9023680, -4564132, -6667372, -12934252, -15587340, -13429283, -12025947, -15044945, -21028316, -26078033, -25798372, -18328151, -8861572, -6261322, -11577493, -15659957, -12114031, -5824156, -3463734, -2891336, 912715, 5702372, 5900794, 1945152, -1968612, -5214568, -8529901, -9092973, -5658559, -4093644, -9165869, -14899731, -12553625, -4803387, -1671982, -4662980, -6078922, -3446971, -3053016, -7540845, -10862630, -9103554, -7051968, -9447894, -13292398, -13693582, -11225614, -8977685, -7597632, -7336766, -9899368, -14177797, -15180066, -11591461, -9431780, -13110094, -17625191, -15989899, -10537429, -9163885, -12327389, -12262760, -5786012, 155438]
1537A55438j207692m970072j015244L918569L379193K9896o67302M81813p78517
1528f73918l850615m013248m17505K277640R74518j668499j668318J048750L558725
1519d432470L590735J014952k120362k480455J005704M384241L002203j342298
1511B622250k384493P91444K095394j196975l398144j14091L724763J927011k498307
1502A568852k744818J73298k7899l350732l724347N9842K474602Q85215r28647
1493e614634p6839J820720L537456N680737N857168j26001r777892j3713259p406517
1484a9819061K597236P472570N927052K285937q4153j81826J443956K188146p9763
1475A750094k648264j021180K951830K728387j732431k776395J804607L761785
$$ y = [155438, -1052254, -6022326, -7037570, -3119001, 260192, 290088, -377214, 104599, -673918, -4524533, -8537781, -8955286, -6677646, -5703128, -7371627, -9039945, -7991195, -4432470, -841735, 173217, -1947145, -4427600, -3421896, 962345, 3964548, 2622250, 237757, 1029201, 3124595, 1927620, -1470524, -1584615, 2140148, 4067159, 1568852, -1175966, -1002668, -1030567, -4381299, -8105646, -8045804, -5571202, -4685987, -5614634, -5691473, -3870753, -333297, 5347440, 11204608, 11078607, 1300715, -12412544, -19819061, -17221825, -9749255, -3822203, -1536266, -1620419, -1802245, -358289, 1829857, 1750094, -898170, -1919350, 1032480, 3760867, 2028436, -747959, 1056648, 4818433]
1467D818433j807332o789186k617973N027671M585279l278417p184656k442526
1459i688707L873640N035297K024801k216161o863339r452170o194871R72568
1451b2508942M636957K284794m8160K250216N364560M350849J248555K69870j2484
1442b163785l005108o237212m495684R18049L293529P59629j303636P40865L553031
1433g940322K935869j29971k738936m718999o075399l823406L403529J0207231
1425h880404R773357L364193j384464j669536k634756p423829j0585160o094525
1417b5535124K454295N837468J736430k629985q95807M384418O174870K199489
1409f273946l018560l959155K79973N824263Q006974N367832M61598k941056l427850
$$ y = [4818433, 3011101, -3778085, -6396058, -1368387, 3216892, -61525, -7246181, -9688707, -5815067, -779770, 1245031, -971130, -7834469, -17286639, -23481510, -22508942, -17871985, -15587191, -15635351, -13385135, -8020575, -3669726, -2421171, -2151301, -2163785, -5168893, -11406105, -15901789, -14983740, -11690211, -10930582, -12234218, -11493353, -7940322, -5004453, -5134424, -7873360, -12592359, -18667758, -22491164, -19087635, -8880404, 892953, 4257146, 2872682, 1203146, -1431610, -8855439, -19440599, -25535124, -23080829, -17243361, -15506931, -18136916, -19032723, -14648305, -8473435, -6273946, -9292506, -13251661, -12971688, -7147425, 859549, 6227381, 6688979, 3747923, 320073]
1400C20073k622645k485631k702346j477858J386603L615217L501497K457158
1392A992068K464907J967111k153541q150947r549134m013201K414432L677036
1384a1351269J839475J726676K071871n66582k866148O36926O055478M460681
1376B007108k472470l622803K684758M669333k761410p867848j098980Q349581
1368a12731P064984j613542m949816j500175L12274r66236L73264L501142K098586
1359D207750k000315n60404N533418O422844J58001m106115k037648q2964k183503
1350E351064l242911m21973P34410l080828o387088m441894m04964J651992K374117
1341g868075K018939j319447m992867k891129L370994M624232r87240m510720
$$ y = [320073, -2302572, -4788203, -7490549, -8968407, -7581804, -3966587, -465090, 1992068, 4456975, 6424086, 4270545, -3880402, -13429536, -17442737, -15028305, -11351269, -9511794, -7785118, -5713247, -6279829, -9145977, -8509051, -2453573, 2007108, -465362, -4088165, -1403407, 3265926, 504516, -7363332, -8462312, -112731, 6952253, 5338711, 388895, -1111280, -799006, -1765242, -1391978, 2109164, 4207750, 2207435, 1647031, 7180449, 13603293, 13761294, 9655179, 7617531, 7534567, 5351064, 2108153, 1686180, 2420590, -660238, -7047326, -11489220, -11894184, -10242192, -7868075, -5849136, -7168583, -12161450, -15052579, -11681585, -7057353, -8044593, -12555313]
1333a2555313j587752R46459r60338j164772L275592M779467p4321j962183M615412
1324d687749R186308K247850p484338o924711O22517L847068L515592P339012
1316G661549J1739308O813293m328519q809168n061568l884851q177754p959564
1308a2007274J313776R748909P618065j567999p715388o474539j194424K285713
1300g993161R82538j906852m57129M568572N195787m92287l182333J956112M864336
1291C535583k324225q570173p00186J2124413J1000391j519562n769934J658960
1283I435267L781392n097100r017733N33524Q891729L645378m821592l038156
1275D312709K653694k97892p749906p258018J44548L504775J035326L62106L632647
$$ y = [-12555313, -14143065, -13196606, -14156944, -15321716, -12046124, -7266657, -7340978, -9303161, -4687749, 4498559, 6746409, -737929, -7662640, -7040123, -3193055, 322537, 7661549, 19400857, 26214150, 21885631, 13076463, 8014895, 4130044, -4047710, -12007274, -10693498, -944589, 6673476, 5105477, -2609911, -9084450, -10278874, -7993161, -7010623, -8917475, -9374604, -4806032, 389755, -102532, -3284865, -1328753, 3535583, 1211358, -7358815, -8059001, 4065412, 15065803, 13546241, 7776307, 9435267, 13216659, 8119559, -898174, -364650, 8527079, 12172457, 7350865, 4312709, 6966403, 6668511, -1081395, -8339413, -8194865, -4690090, -3654764, -3292658, 339989]
1266C39989N533756L661923K87961l567286p052950o207328n1787M416323J621385
1257a018014k922207q73671N772902Q671741N833680J433963k846085p256500
1249F795809q727230n235056j684663k550288k878479L549552J1178857R243983
1241I692485r04969o872325l440638J447611N00851l140510l216619K61654K876516
1232b795944K251641k65908j709771l14893K245556K713509J517214K427433N031712
1223A1100549L607767k752252o403581l500686j712052o857126j0287995j875106
1215a8680482J0946042J2030308J200521n614043p86398N902125N222293J100200
1207A1320566l2713k08600l350988p078651p722631o356241m523487o41827M654312
$$ y = [339989, 5873745, 9535668, 9823629, 6256343, -796607, -7003935, -7055722, -2639399, -1018014, -3940221, -4813892, 959010, 9630751, 15464431, 16898394, 14052309, 6795809, -1931421, -7166477, -8851140, -11401428, -14279907, -10730355, 448502, 9692485, 8787516, 1915191, -1525447, -77836, 423015, -2717495, -5934114, -5672460, -2795944, -544303, -810211, -2519982, -2834875, -589319, 2124190, 3641404, 6068837, 11100549, 14708316, 11956064, 5552483, 2051797, 339745, -6517381, -16805376, -18680482, -7734440, 4295868, 5496389, -117654, -904052, 4998073, 10220366, 11320566, 11287853, 11079253, 7728265, 649614, -7073017, -13429258, -17952745, -18594572, -13940260]
1198a3940260O129872J646562l489156l974959r11578K493522N624730P465496
1190A044229N115033p80337m693436l891198k004598j909084j201853J753203
1182f568041L657016K236036L54651J05714j058809m012546m282942J76570L817609
1173e574742J986012j150646L73862M414265M805083J403189r71617q46479r19833
1164C519094k497942m369647n363617m009328J319466P956084Q872905K107072
1156G534087m202521k317294L788363M801053J58046k594241m57621J777614P31912
1147I219398j267523k155770l215987m351370k522944K560260O189190M785089
1139I240343N24512k416755l025964k617556j395271J486571N107391N812133
$$ y = [-13940260, -7810388, -6163826, -9652982, -13627941, -14539519, -12045997, -6421267, 1044229, 6159262, 5378925, 685489, -3205709, -5210307, -7119391, -8321244, -6568041, -2911025, -674989, -320338, -214624, -1273433, -5285979, -9568921, -9392351, -5574742, -3588730, -4739376, -4365514, 48751, 4853834, 6257023, 5285406, 4438927, 3519094, 1021152, -3348495, -8712112, -12721440, -11401974, -3445890, 5427015, 7534087, 3331566, 1014272, 4802635, 9603688, 9761734, 7167493, 6709872, 8487486, 9219398, 7951875, 5796105, 2580118, -1771252, -4294196, -1733936, 4455254, 9240343, 9764855, 7348100, 4322136, 1704580, 309309, 1795880, 6903271, 12715404]
1131A2715404L47031r068631j4121546q571064K607231P413314K355546k424515
1123h747230J771464Q551103O025213m483025r906473m665583K269812J846178
1115g338541k836580l406981J462613O199792O761066M057327J081951N827R21923
1106F908397J779657Q01631q61010j019172l24347q78304j728215l02581J957429
1097F333485Q60241l101737m479198j443187J411232J012243L27478J696817J746594
1088D363968k393816o703859n378233Q97455O245322O675129K647900k455952
1080C897914l873882N95088N755287L364686n653563j0022343l785971M370491
1072e352293M442636J40866Q44934M952049L669185k401998m216978p05221j45259
$$ y = [12715404, 13062435, 3993804, -10127742, -18698806, -16091575, -8678261, -6322715, -8747230, -6975766, 1575337, 7600550, 3117525, -6788948, -11454531, -9184719, -7338541, -10175121, -13582102, -12119489, -5919697, 841369, 4898696, 5980647, 5986474, 6908397, 8688054, 9489685, 8628675, 7609503, 7285156, 6406852, 4678637, 4376056, 6333485, 7193726, 4091989, -387209, -1830396, -419164, 593079, 920557, 2617374, 4363968, 1970152, -4733707, -10111940, -9214485, -2969163, 3705966, 6353866, 3897914, 24032, 619120, 6374407, 9739093, 4085530, -5936813, -9722784, -5352293, -909657, -768791, 76143, 5028192, 8697377, 6295379, 2078401, 1373180, 1227921]
1063A227921m042304m114606J113257J490011o405605j0274241j357518R687129
1055a2675956Q796821M88011r19094M948284O075616J63316k065878L165891N600853
1046A3577864j140180q248769n930974J693485M557888J582742j330006k460386
1038B301664m216527n302923j734305N189374Q901836N957640l55016m836588
1030E905155n223983k715627o46520j758845m554435m379450m23495J767495j616877
1021a3646582n827314m052432K378162O574527O560632N910933N146110Q87356
1013C931392n434232o461709P5368O205929M310045k475420n716620l466819p00648
1004i732714l78791j55136K271130N496219P105915O586538M359820N08336m027513
$$ y = [1227921, -2814383, -6928989, -5815732, -4325721, -10731326, -21005567, -22363085, -12675956, -3879135, -3391124, -4310218, 638066, 6713682, 6876998, 4811120, 7977011, 13577864, 12437684, 4188915, -1742059, -48574, 4509314, 6092056, 4762050, 2301664, -1914863, -7217786, -8952091, -3762717, 5139119, 11096759, 10741743, 5905155, 681172, -2034455, -2680975, -4439820, -8994255, -13373705, -13797200, -12029705, -13646582, -19473896, -23526328, -21148166, -14573639, -8013007, -2102074, 3044036, 3931392, -1502840, -7964549, -7889181, -1683252, 2626793, 151373, -5565247, -9032066, -9732714, -10111505, -10266641, -7995511, -2499292, 4606623, 11193161, 15552981, 16061317, 12033804]
995A2033804o637310n154887m62406L987196N329230L510292L58418k695491n017523
986E251323n500855l011605J135000L250863J609020q73496m22276K420917L868996
977G727887K188732o51426k052959j213565Q25116J559888j136379n305940n372347
968c430993L64542N563927M067844m90861q9485M493956M551049k121155p148263
959E760561m995365j421400l090142o339218l562824M385080R710025Q638219
951I084936M311362O12147j322962j621469j066141r69791j068249J15942J124887
942I200662j514115n735438m118379L615326O145522l416979j4168028j1056065
934b1047494K945208J1042389O855012P85287J294688L627076J735617o70475
$$ y = [12033804, 5396494, 241607, -220799, 3766397, 9095627, 12605919, 12964337, 10268846, 5251323, -249532, -3261137, -2126137, 1124726, 2733746, 1860250, 1437974, 3858891, 7727887, 9916619, 9265193, 7212234, 5998669, 6823785, 8383673, 7247294, 1941354, -3430993, -3066451, 2497476, 6565320, 6074459, 5984974, 10478930, 15029979, 12908824, 5760561, 765196, -656204, -3746346, -10085564, -13648388, -9263308, 446717, 9084936, 13396298, 14008445, 12685483, 11064014, 9997873, 9028082, 7959833, 8075775, 9200662, 7686547, 1951109, -2167270, 1448056, 7593578, 4176599, -9991429, -21047494, -18102286, -7059897, -204885, 580402, 1875090, 5502166, 7237783, 6567308]
926F567308J600079M851504K753753k821690m961272k183013P09770J48159k691642
917C972956m450032k611572K169050N172385K287269l218658l494583K326217
909B153032N477613K96418o602085n829731R29323L928876k51272m677440k449233
900g024499M610818R094793O562947k58987m587312k854449J251773J819463j016994
891G597553k179583r58869k334164o544337n526086M167937J2153925P066296
883A3442672n945500j1054188l427710N437808M879858k295037p395928p581193
875a3939218n161856j497470K796316N372548M742617L017682K638997K750292
867G19908J768723Q22963J216446R66813k061411n251631l981601J102880L990548
$$ y = [6567308, 8167387, 13018891, 15772644, 12950954, 7989682, 5806669, 6516439, 6664598, 3972956, -477076, -3088648, -919598, 4252787, 6540056, 3321398, -173185, 2153032, 7630645, 7927063, 1324978, -4504753, -3575430, 353446, 102174, -4575266, -7024499, -2413681, 6681112, 13244059, 12985072, 8397760, 5543311, 6795084, 8614547, 7597553, 5417970, 4459101, 2124937, -4419400, -9945486, -5777549, 6376376, 13442672, 7497172, -3557016, -6984726, -1546918, 3332940, 1037903, -6358025, -13939218, -19101074, -20598544, -17802228, -12429680, -7687063, -4669381, -2030384, 719908, 2488631, 3311594, 4528040, 5494853, 3433442, -1818189, -5799790, -4696910, -706362]
858g06362J497562k283426k048427J049647J426081k234076m508029r11454N292580
849c425904P145936L131425j600797k825980j929025j873366k372816j585969
841e336496J69023J310046J798158K448439K911592K678659K611947L214377L020294
832A4826039J139229l63681N57787K173165J272305k048056m923565n822607n046572
823A764044k508634J462166M149555L026051k53638j846299j012168J2909M03173
814E197159R51075P72841j432318l086543l7006N939099P303649Q40763o768731
805I679988o805595P17143P377001O232125j125201p305624p381638l368321j40907
796b121029J491743M409903Q110452P422848Q66383n356493o328878n747075p825024
$$ y = [-706362, 791200, -1492226, -3540653, -2491006, -1064925, -3299001, -7807030, -8718484, -3425904, 3720032, 6851457, 5250660, 2424680, 495655, -1377711, -3750527, -5336496, -5167473, -3857427, -2059269, 389170, 3300762, 5979421, 8591368, 11805745, 14826039, 15965268, 15601587, 16159374, 18332539, 19604844, 17556788, 12633223, 6810616, 1764044, -744590, 717576, 4867131, 7893182, 7639544, 5793245, 4781077, 4793986, 5197159, 6148234, 6921075, 5488757, 2402214, 2365208, 8304307, 15607956, 16448719, 9679988, 2874393, 3591536, 10968537, 17200662, 16075461, 8769837, 1388199, -1980122, -2121029, -629286, 3780617, 11891069, 19313917, 20180300, 14823807, 8494929, 2747854, -5077170]
787e077170p733633L48332R937532R008698j334254p521187l557075K447540M038586
778E57369M942308P123606M436229m099562p948734j995676K577921l359113r325660
769g091312j710242J1447605J1066309k465635r543859j955573O453004L838833
761A0039130k911876l359892l35948j232372l879394k300198J440324J731037
753h09189n9840P48231K568044R27970k072409p63428L853334N334863J992146
744A1719722j902479m172241o285380p131794l202746L859927P219894M491272
736D596175Q96167K52670n58902m227765o417091k535908L358054L622951j224185
727b237834l363477p2059K401745n23292m395678l399968M72392K038835K243727
$$ y = [-5077170, -12810803, -12462471, -2524939, 6483759, 5149505, -2371682, -5928757, -3481217, 557369, 5499677, 12623283, 17059512, 12959950, 5011216, 3015540, 5593461, 2234348, -7091312, -8801554, 2646051, 13712360, 11246725, 1702866, -252707, 6200297, 10039130, 7127254, 3767362, 3431414, 2199042, -1680352, -3980550, -2540226, -809189, -869029, -120798, 2447246, 3375216, 1302807, 539379, 4392713, 9727576, 11719722, 9817243, 5645002, -640378, -7772172, -10974918, -7114991, 104903, 4596175, 5492342, 5745012, 5186110, 958345, -5458746, -7994654, -4636600, -1013649, -2237834, -5601311, -5673370, -3271625, -3794917, -8190595, -11590563, -11118171, -9079336, -6835609]
718f835609N075233P791257L586054n764140r631886l862294K751736K223759
710d665890j151308j97165K379004M40366k659488L76296O008459L934037m890013
701d25702q055804j458275M415218K424000l43920L023710O264484J702780m860488
692B686003l357639L328832M402706q47713l289588l24885R95377k172476l633556
683b212939Q5186L629386K392343o03335j620757k213897l785022l188009J148055
674f368989M649747L262305m02213k288115l166309m669760m139963O16576N582993
665f923728N730007K500255M7521k259889o384939q054240j792926P639025Q738346
656g60568k45917p548064m255735L834697O266461K856264J044536K903929L506035
$$ y = [-6835609, -1760376, 6030881, 9616935, 3852795, -5779091, -9641385, -6889649, -4665890, -5817198, -6014363, -3635359, -3194993, -5854481, -5478185, 530274, 4464311, -425702, -8481506, -9939781, -5524563, -3100563, -3444483, -420773, 5843711, 7546491, 2686003, -671636, 2657196, 7059902, 6212189, 2922601, 2597716, 3593093, 1420617, -2212939, -2127753, 1501633, 3893976, 3290641, 1669884, -544013, -4329035, -7517044, -6368989, -1719242, 1543063, 1140850, -1147265, -4313574, -8983334, -13123297, -12506721, -6923728, -1193721, 1306534, 1354055, -905834, -7290773, -15345013, -17137939, -9498914, -760568, -1006485, -8554549, -12810284, -8975587, -2709126, 147138, 1191674, 4095603, 7601638]
647G601638P56465j486499j071842j045117k806857k056874L901182R301099O275800
638A9368995l719084j0522678p583670R39810O560372N912918J721941k261577
630A0417027m024930k984040l96539O61123j278318l171911j159479L036790L370246
621D469969j699453n748303k787456L992136O254388J815591l084252l116093
613I6527m52336K04339j049569q42144J226668K397828J780663J126035O84746
604E172757j172791l418565k229947K547962N397903K839259j118494j638549
596F379535j139967m461778q831790o835063R73293N210659J659931k307768J72823
587i180125M561431K943128k889279m855957j606081R10689M74455J025231L479189
$$ y = [7601638, 8358103, 6871604, 5799762, 4754645, 1947788, -109086, 3792096, 13093195, 19368995, 15649911, 5127233, -2456437, -1516627, 5043745, 10956663, 12678604, 10417027, 6392097, 3408057, 3011518, 3672641, 2394323, -777588, -1937067, 1099723, 4469969, 2770516, -2977787, -5765243, -1773107, 4481281, 6296872, 3212620, 96527, -355809, -151470, -1201039, -2043183, -816515, 1581313, 3361976, 4488011, 5172757, 3999966, 581401, -1648546, 899416, 6297319, 9136578, 8018084, 6379535, 5239568, 777790, -8054000, -14889063, -13915770, -8705111, -7045180, -9352948, -9180125, -4618694, -1675566, -4564845, -9420802, -11026883, -10116194, -9641739, -8616508, -5137319]
578e137319L068132j488687m150040j055347K961479K533957N12064K090259M785922
569D120420K115989m926006q149688m210243P83838P61952k070272j851202K207540
560a1217672N648676N136597J673831j408720j255368K614749O975607O583723
552A4751423j98961q045541r633504m026907K463799M169848J989969K65154O74865
543B410145J784427K559200K882168J494751k771821p441788p818461l283037
535a0184416J173922J657513L87774J245832L336432L083663Q33457M81431K792956
526D808564L760349O61106l973766n900546l795422P77916N164251O242463K310924
517A0055839m036145p578818o455260l700660j705200Q20745M008500L647603
$$ y = [-5137319, -2069187, -3557874, -7707914, -8763261, -5801782, -3267825, -2755761, -665502, 4120420, 6236409, 1310403, -6839285, -11049528, -10265690, -9503738, -11574010, -13425212, -11217672, -5568996, -432399, 1241432, -167288, -1422656, 1192093, 8167700, 14751423, 14552462, 6506921, -3126583, -7153490, -4689691, -519843, 1470126, 1735280, 2410145, 4194572, 6753772, 9635940, 11130691, 8358870, 917082, -6901379, -10184416, -9010494, -7352981, -6965207, -5719375, -2382943, 700720, 1534177, 2015608, 4808564, 8568913, 9230019, 5256253, -644293, -4439715, -3661799, 1502452, 7744915, 10055839, 6019694, -1559124, -8014384, -11715044, -13420244, -12599499, -8590999, -4943396]
509d943396k482213q492779o707862J239233N932091L159712q51077N47899M782763
500g815629M928112O90923j292354K365608O706914N601806K68534l082867k380602
491E990445j805894m087689n407236j450902M696087N973812J613279j821965
483C699937m47870J838122Q67767r25153K47387K060186L3510l985576m222272
474h33962o19943J009515j265693k666695l74366J703694R8873k204041j377560
465f530178N04676k88600j922777k20041L253604L061734q84730k828738o83190
456f538240Q22797r02847r54328M310287Q503190L018955q509662j2395582l213504
447a5858934P988301Q458736N56590l265623J339226O149094M001788j697934
$$ y = [-4943396, -7425609, -15918388, -22626250, -21387017, -15454926, -12295214, -13146291, -12598392, -7815629, -2887517, -2196594, -3488948, -1123340, 5583574, 11185380, 11453914, 8371047, 5990445, 4184551, 96862, -5310374, -6761276, -2065189, 3908623, 5521902, 3699937, 3252067, 5090189, 5957956, 5032803, 5280190, 7340376, 7373886, 3388310, -833962, -1453905, -444390, -1710083, -4376778, -4751144, -3047450, -2948577, -5152618, -6530178, -6025502, -6314102, -8236879, -8456920, -5203316, -2141582, -3026312, -5855050, -6538240, -5715443, -6618290, -7572618, -3262331, 5240859, 8259814, -249848, -12645430, -15858934, -7870633, 588103, 1144693, -2120930, -781704, 5367390, 9369178, 7671244]
439G671244m165341k902991j227573N67773L456919M620593Q66984m624623n537186
430a274201j799216O63444k91419k79511L039731N447596L478667K82406l13186
421H954311n58372l910311p129764m118780L734665P840267L891436k504721l895150
412B303581n00328J537862q68511m020141k785115K396277N391855J581509n861243
403h24254q885657m154781K812890M862644J982147m50858k49130k63113j646406
394f816518q80396L815576P530679M570047l001283p526935n804319k180060q71575
385a1164784q6086L250039O621963M689298k120808o648296l768457L444157Q024954
376B241980O621716P11600o531032j1408031j0353936l761520K209000K250249
$$ y = [7671244, 3505903, 602912, -624661, -56888, 3400031, 8020624, 8887608, 4262985, -1274201, -3073417, -2409973, -2701392, -2980903, 58828, 5506424, 8985091, 9267497, 8954311, 8395939, 4485628, -2644136, -6762916, -3028251, 4812016, 8703452, 6198731, 2303581, 1803253, 3341115, 2472604, -1547537, -4332652, -1936375, 3455480, 5036989, -824254, -9709911, -13864692, -11051802, -6189158, -4207011, -4657869, -4906999, -5170112, -6816518, -7696914, -3881338, 3649341, 8219388, 5218105, -2308830, -8113149, -10293209, -11164784, -11250870, -8000831, -1378868, 3310430, 1189622, -5458674, -9227131, -5782974, 2241980, 8863696, 9575296, 3044264, -8363767, -18717703, -22479223, -20270223, -18019974]
368a8019974l90298J890396R033304J1971536N669789k895536m542514n19755
360B196948J139219j486771k715227J82220K776732J520228o88425k32978J150473
351C842419J82932j837875j287235J682401L596042K962871J265866n99469l085012
342F722940n223056m679982j450132J235295Q15310j732822l715547l554395j095293
333a2677682K874206O262149O557167L493779l35064k556055l351223l691063
325c423786l048952p27425J971140L231527L525337M437872N112577K652085l368725
316A0361650r027342r749233m725214K558090O910752N057904j087413n035549
308d736355k466948K665428K510880l616762p408826l071581M411960O690321
$$ y = [-18019974, -18410272, -16519876, -7486572, 4484964, 10154753, 7259217, 2716703, 2196948, 3336167, 1849396, -865831, -683611, 2093121, 3613349, 2924924, 2691946, 3842419, 4025351, 2187476, 900241, 2582642, 6178684, 9141555, 10407421, 9807952, 6722940, 1499884, -3180098, -4630230, -3394935, -2579625, -4312447, -8027994, -11582389, -12677682, -9803476, -3541327, 3015840, 6509619, 6174555, 3618500, 267277, -3423786, -6472738, -7200163, -5229023, -1997496, 1527841, 5965713, 11078290, 13730375, 10361650, 1334308, -8414925, -13140139, -10582049, -3671297, 1386607, 299194, -4736355, -7203303, -4537875, -2026995, -5643757, -13052583, -16124164, -11712204, -5021883]
300e021883L263377l78352k255531m258994m952978n55487O270644P016709l93513
291a266008p218674n951280l89294J580756k21848l12145K363084L655693K055094
282e704622P17206J678720L312456L865404L202489R99702k672086n117627l677479
273c395837n45109l32692k664925k386459J821236M595362K177089j491391q65738
264c088464K716629L399113k40936l343756j907784J933889L213532P12479j753322
255A641380o69600K124372J716006k538424n080191j834798L167293L267361o24806
246A168593j406858K648585M715569K61102n600567o160689k948899j471066j483971
237a0278201R51766M222695K616116k779533l184702M826389J2455828R887780
$$ y = [-5021883, -1758506, -2136858, -4392389, -8651383, -13604361, -14159848, -7889204, -872495, -1266008, -8484682, -14435962, -14825256, -13244500, -13466348, -13778493, -11415409, -7759716, -5704622, -4987416, -3308696, 3760, 3869164, 7071653, 8071355, 5399269, 281642, -3395837, -3940946, -4273638, -6938563, -9325022, -7503786, -2908424, -731335, -2222726, -3088464, -371835, 3027278, 2786342, -557414, -2465198, -531309, 2682223, 3394702, 1641380, 971780, 3096152, 4812158, 2273734, -2806457, -4641255, -1473962, 1793399, 1168593, -238265, 2410320, 7125889, 7386991, 1786424, -4374265, -7323164, -8794230, -10278201, -9326435, -5103740, -2487624, -5267157, -8451859, -3625470, 8830358, 18718138]
229A8718138m46772p608227o367779j643081M33394j21486k17149N91491P17712
220D056241L82955J283031K995945K746706n27703m044904m561403k609012j478032
211a756176k354440k608670J70376M017558M375789j35931n457961o451821k614422
202a2815698J740119K762075J160044L74087J792640L390270K974047R35736j035466
193A277854k326361k927852j923694J141430L844845K697483j877950m949729
185e043974l102438R26788J898323r29166l236120j871518J242249K530603J811353
176e773900J711545L026537L294598O34372l023583m206432k378703j77679N17377
167f375868N28436R87800J402832J387684K055504L607007L547414K40558l229076
$$ y = [18718138, 18271366, 10663139, 4295360, 2652279, 3085673, 2964187, 2747038, 3338529, 4056241, 4439196, 5722227, 8718172, 11464878, 10937175, 6892271, 2330868, -278144, -1756176, -4110616, -6719286, -6548910, -2531352, 1844437, 1708506, -3749455, -10201276, -12815698, -11075579, -8313504, -7153460, -6779373, -4986733, -1596463, 1377584, 2313320, 1277854, -1048507, -3976359, -5900053, -4758623, -913778, 1783705, -94245, -5043974, -8146412, -7219624, -5321301, -6250467, -9486587, -11358105, -10115856, -7585253, -5773900, -4062355, -1035818, 2258780, 2893152, -130431, -4336863, -6715566, -6893245, -6375868, -5847432, -4859632, -3456800, -2069116, -13612, 3593395, 7140809, 7381367, 4152291]
158D152291k470020J492459L089110L03998k490197j497497R82452J105835l362
149D665069J290799M207230M092583k03361l987334l131528N13559K232177Q10958
140A0490152p52487j63680J022864J04131k277740k405819J164440M485266K821795
131A4488922k483419n212398k909988k76423j589674l763783j470431L570175
123C52981M539777J82480l083217j339459Q97677j243033m348601k199804L300518
114b940681M038260j688972n678937j574778N670852O705884N43419n109045m888178
105d922176j524426J48592m6278N49703K184368K646424J017124j310631k748748
96d006048k631902q77940J593629K711966J342750r98164k120037j964842j605167
$$ y = [4152291, 1682271, 3174730, 6263840, 6567838, 4077641, 2580144, 3562596, 4668431, 4665069, 5955868, 10163098, 14255681, 14052320, 10064986, 6933458, 7447017, 9679194, 10490152, 9737665, 9573985, 10596849, 10700980, 8423240, 6017421, 7181861, 11667127, 14488922, 12005503, 6793105, 3883117, 3606694, 2017020, -1746763, -3217194, 352981, 4892758, 5075238, 1992021, 652562, 1550239, 307206, -4041395, -6241199, -2940681, 1097579, -591393, -6270330, -7845108, -2174256, 4531628, 5075047, -33998, -4922176, -6446602, -6298010, -6344288, -5794585, -3610217, -963793, 53331, -1257300, -4006048, -6637950, -7515890, -5922261, -3210295, -1867545, -2865709, -4985746, -6950588, -8555755]
87h555755o94880J427539L098642K170649J34597O07811L281638L422792j088942
78C804091n914067n798715j150368L404405M773853L288176P79185p54245j4590
69B417725J931217K129502m81693l350665l802768k183840o18K374692M043316
60C076868K730682j322336l474903m75814M252606N244485K691416Q09032M86780
51A4018816p29851k383123j323257J377650L45262n170726q322278m189352K515373
42c861486L794710p78206m376145k554953J917082L900472K123121m91552q51460
33a178417J164465L141693L071143J404251p6217o43610p57307m44058O90356
24F372299J945974J853165K59781j446431k310947k504051k169881j330963q11030
$$ y = [-8555755, -9250635, -7823096, -4724454, -2553805, -2419208, -1811397, 1470241, 4893033, 3804091, -2109976, -7908691, -9059059, -5654654, -880801, 2407375, 3186560, 2432315, 2417725, 4348942, 6478444, 5996751, 2646086, -1156682, -3340522, -3341140, -966448, 3076868, 5807550, 4485214, 1010311, 534497, 4787103, 10031588, 12723004, 13532036, 14018816, 13288965, 10905842, 9582585, 10960235, 11305497, 6134771, -2187507, -6376859, -3861486, -66776, -844982, -5221127, -7776080, -5858998, -1958526, 164595, -326957, -1178417, -13952, 3127741, 6198884, 7603135, 7526918, 6883308, 6126001, 5681943, 6372299, 8318273, 10171438, 10431219, 8984788, 6673841, 4169790, 1999909, 668946, -142084]
15a42084j363758k010871j212148N69836J628776J895451K498416K918462J699619
6F481699j80906j82392J317115J159241j319901l056152
0D218704
$$ y = [-142084, -1505842, -3516713, -4728861, -4159025, -2530249, -634798, 1863618, 4782080, 6481699, 6300793, 6118401, 7435516, 8594757, 7274856, 4218704]
##END NTUPLES=NMR SPECTRUM
##END=
