##TITLE=31Pdec_LR-669H-CR2
 D2O, 24 sc
 7.6.2019
##JCAMPDX= 6.0         $$ Bruker NMR JCAMP-DX V2.0
##DATA TYPE= NMR SPECTRUM
##DATA CLASS= NTUPLES
##ORIGIN= UXNMR, Bruker Analytische Messtechnik GmbH
##OWNER= root
$$ XWIN-NMR		Version 3.5
$$ Fri Jun  7 14:24:05 2019 Russian Standard Time (UT+4h)  she@DPX200
##.OBSERVE FREQUENCY= 81.013821
##.OBSERVE NUCLEUS= ^31P
##.ACQUISITION MODE= SIMULTANEOUS
##.ACQUISITION SCHEME= undefined
##.AVERAGES= 24
##.DIGITISER RES= 17
##SPECTROMETER/DATA SYSTEM= spect
##.PULSE SEQUENCE= zgpg30
##.SOLVENT NAME= CDCl3
##.SHIFT REFERENCE= (INTERNAL, CDCl3, 0, 182.463)
##AUDIT TRAIL= $$ (NUMBER, WHEN, WHO, WHERE, WHAT)
$$ ##TITLE= Audit trail, XWIN-NMR		Version 3.5
$$ ##JCAMPDX= 5.01
$$ ##ORIGIN= Bruker BioSpin GmbH
$$ ##OWNER= she
$$ F:/spectra/data/she/nmr/P31/1/pdata/1/auditp.txt
$$ ##AUDIT TRAIL=  $$ (NUMBER, WHEN, WHO, WHERE, WHAT)
(   1,<2019-06-07 14:21:34.14 +0400>,<she>,<DPX200>,
      <created by zg, POWCHK disabled, PULCHK disabled
       configuration hash MD5:
       00 E9 B6 7A A2 85 ED C7 34 08 36 98 17 FE 4E 26
       data hash MD5: 32K
       95 89 CD FC 5F 13 43 C1 6E 8E EC 21 20 91 DC E9>)
(   2,<2019-06-07 14:21:36.43 +0400>,<she>,<DPX200>,
      <Start of raw data processing
       efp BC_mod = 2 LB = 1 FT_mod = 6 PKNL = 1 PHC0 = -2434.313 PHC1 = -244.2009 SI = 64K 
       data hash MD5: 64K
       1F DF 46 2F 95 D5 BA 25 66 70 22 EC 62 7D 10 AE>)
(   3,<2019-06-07 14:22:03.79 +0400>,<she>,<DPX200>,
      <pk PHC0 = -131.6224 PHC1 = 322.4001 
       data hash MD5: 64K
       65 7B 50 9C FF 58 2C EF BC 2C 72 E3 D3 D3 CE 18>)
(   4,<2019-06-07 14:22:07.01 +0400>,<she>,<DPX200>,
      <abs ABSG = 5 
       data hash MD5: 64K
       12 30 5B 57 A6 42 34 DC 9C 76 52 89 4C 9F AF 68>)
(   5,<2019-06-07 14:22:27.73 +0400>,<she>,<DPX200>,
      <abs ABSG = 5 
       data hash MD5: 64K
       A8 B7 B3 44 1F 3B DE 15 74 D3 76 0E 55 34 6C 23>)
$$ ##END=
$$ 
$$ hash MD5
$$ 17 6E 6D 92 FA 8E D6 79 B8 4B A8 F2 D4 17 DC 86
##$RELAX= 
##$RELAX= 
##$RELAX= 
##$RELAX= 
##$RELAX= 
##$RELAX= 
##$RELAX= 
##$RELAX= 
$$ Bruker specific parameters
$$ --------------------------
##$DU= <F:/spectra>
##$EXPNO= 1
##$NAME= <P31>
##$PROCNO= 1
##$TYPE= <nmr>
##$USER= <she>
##$AMP= (0..31)
100 100 100 100 100 100 100 100 100 100 100 100 100 100 100 100 100 100 
100 100 100 100 100 100 100 100 100 100 100 100 100 100 
##$AQSEQ= 0
##$AQ_mod= 1
##$AUNM= <au_zg>
##$AUTOPOS= <>
##$BF1= 81.014009
##$BF2= 200.13
##$BF3= 200.13
##$BF4= 200.13
##$BF5= 200.13
##$BF6= 200.13
##$BF7= 200.13
##$BF8= 200.13
##$BYTORDA= 1
##$CFDGTYP= 0
##$CFRGTYP= 5
##$CHEMSTR= <none>
##$CNST= (0..31)
1 1 145 1 1 1 1 1 1 1 1 1 1 1 1 1 1 1 1 1 1 1 1 1 1 1 1 1 1 1 1 1 
##$CPDPRG= <waltz16>
##$CPDPRG1= <>
##$CPDPRG2= <waltz16>
##$CPDPRG3= <>
##$CPDPRG4= <mlev>
##$CPDPRG5= <mlev>
##$CPDPRG6= <mlev>
##$CPDPRG7= <mlev>
##$CPDPRG8= <mlev>
##$CPDPRGB= <>
##$CPDPRGT= <>
##$D= (0..31)
0 1 0 0 0 0 0 0 0 0 0 0.03 2e-05 3e-06 0 0 0 0 0 0 0 0 0 0 0 0 0 0 0 0 
0 0 
$$ [...]
##$SUBNAM3= <"">
##$SUBNAM4= <"">
##$SUBNAM5= <"">
##$SUBNAM6= <"">
##$SUBNAM7= <"">
##$SUBNAM8= <"">
##$SUBNAM9= <"">
##$SW= 369.568048894756
##$SWIBOX= (0..15)
0 1 3 0 0 0 0 0 0 0 0 0 0 0 0 0 
##$SW_h= 29940.119760479
##$TD= 32768
##$TD0= 1
##$TE= 0
##$TE2= 300
##$TE3= 300
##$TEG= 300
##$TL= (0..7)
0 120 53 12 22 120 120 120 
##$TP= (0..7)
150 150 150 150 150 150 150 150 
##$TP07= 0
##$TPNAME0= <>
##$TPNAME1= <>
##$TPNAME2= <>
##$TPNAME3= <>
##$TPNAME4= <>
##$TPNAME5= <>
##$TPNAME6= <>
##$TPNAME7= <>
##$TPOAL= (0..7)
0.5 0.5 0.5 0.5 0.5 0.5 0.5 0.5 
##$TPOFFS= (0..7)
0 0 0 0 0 0 0 0 
##$TUNHIN= 0
##$TUNHOUT= 0
##$TUNXOUT= 0
##$USERA1= <user>
##$USERA2= <user>
##$USERA3= <user>
##$USERA4= <user>
##$USERA5= <user>
##$V9= 5
##$VALIST= <valist>
##$VCLIST= <CCCCCCCCCCCCCCC>
##$VD= 0
##$VDLIST= <DDDDDDDDDDDDDDD>
##$VPLIST= <PPPPPPPPPPPPPPP>
##$VTLIST= <TTTTTTTTTTTTTTT>
##$WBST= 1024
##$WBSW= 4
##$XGAIN= (0..3)
0 0 0 0 
##$XL= 0
##$YL= 0
##$YMAX_a= 7368
##$YMIN_a= -8169
##$ZGOPTNS= <>
##$ZL1= 120
##$ZL2= 120
##$ZL3= 120
##$ZL4= 120
##$ABSF1= 182.463
##$ABSF2= -187.1042
##$ABSG= 5
##$ABSL= 3
##$ALPHA= 0
##$AQORDER= 0
##$ASSFAC= 0
##$ASSFACI= 0
##$ASSFACX= 0
##$ASSWID= 0
##$AUNMP= <proc_1d>
##$AZFE= 0.1
##$AZFW= 0.5
##$BCFW= 0
##$BC_mod= 2
##$BYTORDP= 0
##$COROFFS= 0
##$CY= -3
##$DATMOD= 1
##$DC= 0
##$DFILT= <>
##$DTYPP= 0
##$F1P= 0
##$F2P= 0
##$FCOR= 1
##$FTSIZE= 65536
##$FT_mod= 6
##$GAMMA= 0
##$GB= 0
##$INTBC= 1
##$INTSCL= 5.30512e-09
##$ISEN= 30
##$LB= 1
##$LEV0= 0
##$LPBIN= 0
##$MAXI= 10000
##$MC2= 0
##$MEAN= 0
##$ME_mod= 0
##$MI= 50
##$NCOEF= 0
##$NC_proc= -7
##$NLEV= 6
##$NOISF1= 182.463
##$NOISF2= 159.3651
##$NSP= 0
##$NTH_PI= 0
##$NZP= 0
##$OFFSET= 182.463
##$PC= 4
##$PHC0= -2565.935
##$PHC1= 78.19919
##$PH_mod= 1
##$PKNL= yes
##$PPARMOD= 0
##$PSCAL= 0
##$PSIGN= 0
##$REVERSE= no
##$SF= 81.0140089999434
##$SI= 65536
##$SIGF1= 159.3651
##$SIGF2= -187.1042
##$SINO= 113.3802
##$SIOLD= 16384
##$SREGLST= <1H.CDCl3>
##$SSB= 0
##$STSI= 65536
##$STSR= 0
##$SW_p= 29940.119760479
##$SYMM= 0
##$S_DEV= 0
##$TDeff= 32768
##$TDoff= 0
##$TI= <>
##$TILT= no
##$TM1= 0
##$TM2= 0
##$TOPLEV= 0
##$USERP1= <user>
##$USERP2= <user>
##$USERP3= <user>
##$USERP4= <user>
##$USERP5= <user>
##$WDW= 1
##$XDIM= 65536
##$YMAX_p= 270644201
##$YMIN_p= -31466059
$$ End of Bruker specific parameters
$$ ---------------------------------
##NTUPLES= NMR SPECTRUM
##VAR_NAME=  FREQUENCY,     SPECTRUM/REAL,   SPECTRUM/IMAG
##SYMBOL=    X,             R,               I
##VAR_TYPE=  INDEPENDENT,   DEPENDENT,       DEPENDENT
##VAR_FORM=  AFFN,          ASDF,            ASDF
##VAR_DIM=   65536,         65536,           65536
##UNITS=     HZ,            ARBITRARY UNITS, ARBITRARY UNITS
##FACTOR=    0.456856943014862, 1,           1
##FIRST=     14782.0589164792, 0,            0
##LAST=      -15158.0608439998, 0,           0
##MIN=       -15158.0608439998, -31466059,   0
##MAX=       14782.0589164792, 270644201,    0
$$ Real data points
##PAGE= N=1
##DATA TABLE= (X++(R..R)), XYDATA
$$ [...]
41940G32339J163358j203352k703794k705382j765799l1141K190571L355097K134992
41931A166889n30950k274689j730782P15575L491110M236047J412737l017891
41923C468046m520012j555268J906589J911073O6436N5691J042714l94535l051833
41914a071099j907571L276221O157319K893656k095855k791622O9607J369840
41906E900496m28276k089309j228223O51513Q48204j174461l406734l242524k15904
41897d385218K817526K560493l26943j870265m72693R68799Q0171j189973l27729
41888b145832J274666J030361j41703K15281J275239M12214j630353j607899N29916
41879g88110J349054k66509j396246k58061R98993M71761j71785R62605K195768
$$ plain form
41940 732339 1895697 692345 -2011449 -4716831 -6482630 -6513771 -4323200 -968103 1166889
41931 1166889 635939 -1638750 -3369532 -2653957 837153 5073200 6485937 3468046
41923 3468046 -1051966 -2607234 -700645 1210428 1276864 1332555 2375269 1980734 -1071099
41914 -1071099 -2978670 297551 6454870 9348526 7252671 4461049 4530656 5900496
41906 5900496 5472220 3382911 2154688 2806201 3654405 2479944 -926790 -4169314 -4385218
41897 -4385218 -1567692 992801 665858 -1204407 -1677100 -708301 -628130 -1818103 -2145832
41888 -2145832 -871166 159195 17492 232773 1508012 1920226 289873 -1318026 -788110
41879 -788110 560944 294435 -1101811 -1359872 -360879 110882 -60903 901702 3097470
41870C097470Q15928k326522l702520j892950Q95038K072887J669391J578958
41862B207680K695700L577033K341132l40411j486501L1699J175358j156682m801850
41853D243158m480476N64063M705339L221697j643314m234914k778267l42955
41845g45669L5910j629409l558005m089044k463206L73995J953129J024194k12383
41836i310488J304552M706487N484220J524445l370220m011144o33157J448787
41828b856518q56191m086438k983770K113458N591743M185368J011783M33023
41820B552458J756648J124278k006916m106496l015909m06100J789972L712087
41812A400022M974103L429731r30307l893355k194127J329782J456610j842124
$$ plain form
41870 3097470 3913398 1586876 -2115644 -4008594 -3113556 -1040669 628722 2207680
41862 2207680 4903380 8480413 10821545 10481134 8994633 9026332 10201690 9045008 4243158
41853 4243158 -237318 326745 5032084 8253781 6610467 2375553 -402714 -745669
41845 -745669 -709759 -2339168 -5897173 -9986217 -12449423 -12075428 -10122299 -9098105 -9310488
41836 -9310488 -8005936 -3299449 2184771 3709216 338996 -3672148 -4305305 -2856518
41828 -2856518 -3712709 -7799147 -10782917 -8669459 -3077716 1107652 2119435 2552458
41820 2552458 4309106 5433384 3426468 -680028 -3695937 -4102037 -2312065 1400022
41812 1400022 6374125 9803856 8873549 4980194 2786067 4115849 5572459 3730335
41804C730335l582620j264150J907116K251192M96597n28043l86248n63916j029443
41795A030820j52770K124069L467781K254462j92005j628055j957460k563569
41787B383273l154613j692799J770443L612024J180757k791733l360974k56141
41779b309763J989931J070224q562J450346L086911J562792j621772k484446r20042
41770A815619l14961j578301j990797k64329J364889J151570M31612P77154J564539
41761B956995J884162K092076J860518m48703m346985n884620k632100K026906
41753b491751K866339j11980k006665r3560K822565K887526K15773k152443k452744
41744e16940j399543m3098J525612K999774K936240L36762l240266m611925k587095
$$ plain form
41804 3730335 147715 -1116435 790681 3041873 3538470 3010427 2624179 2060263 1030820
41795 1030820 878050 3002119 6469900 8724362 8532357 6904302 4946842 2383273
41787 2383273 -771340 -2464139 -693696 2918328 4099085 1307352 -2053622 -2309763
41779 -2309763 -319832 750392 741830 2192176 5279087 6841879 5220107 2735661 1815619
41770 1815619 1500658 -77643 -2068440 -2332769 -967880 183690 615302 1392456 2956995
41761 2956995 4841157 6933233 8793751 8345048 3998063 -1886557 -4518657 -2491751
41753 -2491751 374588 262608 -1744057 -1837617 984948 3872474 4088247 1935804 -516940
41744 -516940 -1916483 -1959581 -433969 2565805 5502045 5838807 2598541 -2013384 -4600479
41735d600479M55779J611516J088085J212796K467987K823456J286204l08840
41727F036504k97534J1138j506013l990790m245473j128253K496377K947935O6309
41718C90200k485353j441933J959085L127428p8435m109593m140403o60095J423953
41709f015146J94962p40342J327472L371354J657808j539254j112471K462711
41701c92906L265262j141657n909358n861854k161928P05239J453451K058542
41693g985209L236712L590155K750418K105324J981639P62657k132431m385731
41685g6466l489769l02791J737733Q31880j063873q79154J592533L393936K145245
41676C889274r14147k469459j223035Q11794J274789L43349l20841m59580j273329
$$ plain form
41735 -4600479 -4144700 -2533184 -1445099 -232303 2235684 5059140 6345344 6036504
41727 6036504 5738970 5750108 4244095 253305 -3992168 -5120421 -2624044 323891 390200
41718 390200 -2095153 -3537086 -1578001 1549427 1470992 -2638601 -6779004 -7439099 -6015146
41709 -6015146 -5820184 -6560526 -5233054 -1861700 -203892 -1743146 -2855617 -392906
41701 -392906 2872356 1730699 -4178659 -10040513 -12202441 -11497202 -10043751 -7985209
41693 -7985209 -4748497 -1158342 1592076 3697400 5679039 6441696 4309265 -76466
41685 -76466 -3566235 -3869026 -2131293 -1299413 -2363286 -3242440 -1649907 1744029 3889274
41676 3889274 2975127 505668 -717367 94427 1369216 1712565 1391724 932144 -341185
41667c41185k660201k414642O05379L859584L682862J84941k550111j788186L87460
41658a034099M45015j486674k322378r46582N59174Q00996J110811K449456L015238
41649B590957J149154j305925j211627J308986L090598K306856L04761r23392
41641G310368j012954o71887n31338q88426j362790r13206N23855J025950p26159
41632B753413k426903n24062M182476O486716L546104j201562k864521j348517
41624H603144j59099q69277k034376k681541l387412l733441k005092J414776
41616d852318L145756J268371j339295o38487K743616M209589J620819j902470
41608D255581k643722j180607n80844j557861k151706j324870Q1861J761203M136826
$$ plain form
41667 -341185 -3001386 -5416028 -4810649 -951065 2731797 2916738 366627 -1421559 -1034099
41658 -1034099 -589084 -2075758 -4398136 -5344718 -4785544 -3984548 -2873737 -424281 2590957
41649 2590957 3740111 2434186 1222559 2531545 5622143 7928999 8233760 7310368
41641 7310368 6297414 5625527 5094189 4205763 2842973 1929767 2453622 3479572 2753413
41632 2753413 326510 -197552 3984924 10471640 14017744 12816182 9951661 8603144
41624 8603144 8444045 7574768 5540392 2858851 -528561 -4262002 -6267094 -4852318
41616 -4852318 -1706562 -438191 -1777486 -2415973 327643 4537232 6158051 4255581
41608 4255581 1611859 431252 -149592 -1707453 -3859159 -5184029 -5102168 -3340965 795861
41599G95861N706525L671826j274627m125544k021069J288456O62948k982363
41591A722013m332906j412543K501265M222652L807173K167049m44995k676589
41583E553119k436915l56937K45157j750276l365654k050080P00505K015805J462711
41574A7435L64609n25094r67005p55989o13177j589203k710496j728116J005390
41565g501646K548354K163831K191125K811512Q82568l460719m568129N1639M055438
41556h26027J239376m171675l649150K149446M557145O54677k988219j561851
41548d596278J267847R32051q47785p02324J83120o52097j714546n74507J001739
41539e702780j34589k654579k440002R62702L837795L901890K714893K276504
$$ plain form
41599 795861 6502386 10174212 8899585 4774041 2752972 4041428 4704376 1722013
41591 1722013 -2610893 -4023436 -1522171 2700481 6507654 8674703 8229708 5553119
41583 5553119 3116204 2759267 3004424 1254148 -2111506 -4161586 -3461081 -1445276 17435
41574 17435 382044 -143050 -1110055 -1866044 -2479221 -4068424 -6778920 -8507036 -7501646
41565 -7501646 -4953292 -2789461 -598336 2213176 3095744 -364975 -4933104 -4881465 -826027
41556 -826027 413349 -3758326 -7407476 -5258030 -700885 -46208 -3034427 -4596278
41548 -4596278 -3328431 -2396380 -3244165 -3946489 -3763369 -4415466 -6130012 -6704519 -5702780
41539 -5702780 -5837369 -8491948 -10931950 -9969248 -6131453 -2229563 485330 2761834
41531B761834K328520J813791P69015j76359q18255j205848j252029q72972r3335
41522C254362R55518J850596K016562J397946O60971M58594P48205Q77093J87582
41513A2407429j071127j305760P87572L562511L257542r55283m804195m275593
41505G603096j137587K39202l45362J31984J521186P33572j720913j666896J077206
41496F435488J383753k426680m898413k214730J383448Q96345j131600K49418
41488c22971L320002K842957o13737j908369l64880k63813k598042l344464q26680
41479d079997J482049J126427K20071R04128J939090J824851J238920N88932r66471
41470D278000k460917j226003K049912K654640j183734m676740l045177J671222
$$ plain form
41531 2761834 5090354 6904145 7673160 7496801 6678546 5472698 4220669 3347697 3254362
41522 3254362 4209880 6060476 8077038 9474984 10135955 10594549 11342754 12219847 12407429
41513 12407429 11336302 10030542 10818114 14380625 17638167 16682884 11878689 7603096
41505 7603096 6465509 6704711 6359349 6491333 8012519 8746091 7025178 5358282 6435488
41496 6435488 7819241 5392561 494148 -1720582 -337134 559211 -572389 -322971
41488 -322971 2997031 5839988 5226251 3317882 2953002 2689189 91147 -3253317 -4079997
41479 -4079997 -2597948 -1471521 -1251450 -347322 1591768 3416619 4655539 5244471 4278000
41470 4278000 1817083 591080 2640992 5295632 4111898 -564842 -3610019 -1938797
41462a938797L955989K270411n64964k353294k994068k266521N7908K299857K268226
41453G34747N24687m10453k5934k75016j746270k129152K29224L234771L381332
41444C517936L58058k427595k045993N72993K210541J439784j73962p33951k40779
41435B477032L79650Q75243J135165M08618j410320k755706k267602p82898J41321
41426a799497N59685J124648J077495l08286j476303o67708P50486L28411r28498
41417a339567L7113K710129L168387L99797j941031j302655M27183R86711J070526
41408D216593J537311J181180k91398p54176K48300l15505l536960n103451j365372
41399d183478M182797N150743R97730k999322l248425j065613Q35195J179673
$$ plain form
41462 -1938797 2017192 4287603 3722639 1369345 -1624723 -3891244 -3833336 -1533479 734747
41453 734747 1259434 848981 823047 548031 -1198239 -3327391 -3098167 136604 3517936
41444 3517936 3875994 1448399 -597594 -24601 2185940 3625724 3451762 2717811 2477032
41435 2477032 2856682 3731925 4867090 5275708 3865388 1109682 -1157920 -1940818 -1799497
41426 -1799497 -1239812 -115164 962331 654045 -822258 -1489966 -739480 -411069 -1339567
41417 -1339567 -1302454 1407675 4576062 4975859 3034828 1732173 2159356 3146067 4216593
41408 4216593 5753904 6935084 6643686 5889510 6137810 5822305 2285345 -2818106 -4183478
41399 -4183478 -681 5150062 6147792 3148470 -99955 -1165568 -330373 849300
41391H49300j78539k125248k280996N4838J926483O65508j555723p46277K508670
41382h81984L878144J919323n09233j419895j790097j924889k48997K824272L844686
41373E691330J232832j941141k255451m58044M23081n79740j993830k402188j583251
41364c866402j39071Q83720Q56962N39104J052557J824911J196873q19224k351225
41355h21795k448739j909741j077815O86628K727501K916696Q35096j224016j564413
41346a880598j105666r43774m07095Q40283J132512o40521k583562k058074P89438
41337f857057L511161M342419L292445J337707k02374m80896j94124o39433j296038
41328B813810l63325J670234J782380q23256k687379j112392J549475J585116
$$ plain form
41391 849300 670761 -1454487 -3735483 -3680645 -1754162 -1088654 -2644377 -3390654 -881984
41382 -881984 2996160 4915483 4406250 2986355 1196258 -728631 -977628 1846644 5691330
41373 5691330 6924162 4983021 2727570 2269526 2692607 2112867 119037 -2283151 -3866402
41364 -3866402 -4005473 -3121753 -2264791 -1725687 -673130 1151781 2348654 1529430 -821795
41355 -821795 -3270534 -5180275 -6258090 -5571462 -2843961 72735 907831 -316185 -1880598
41346 -1880598 -2986264 -3930038 -4337133 -3496850 -2364338 -3004859 -5588421 -7646495 -6857057
41337 -6857057 -3345896 996523 4288968 5626675 5424301 4943405 4749281 4109848 2813810
41328 2813810 2450485 4120719 5903099 5079843 2392464 1280072 2829547 4414663
41320D414663m92162j588494j380268j903844k840330j620345J695514L701838
41312a3428K628651N73159l09550o35532j363809j470673o3087J388876J078869
41303A813476l76101j099229o98002j03275L57559R95851J514851J306106O24584
41294D335820J72067j56066r20580j831391j963657j162069k34058J71105L6753
41285a552076m48293q90678n47185P26322J576379N40502j582905k255636n93992
41276e027562J281109J295344M36607J074857L080464L672391J284979k155412
41268D942777l570352k242481j80240L79463q42095k173999j851185K8978J649238
41259c859896J872845J598244J684920Q77204j809958l614243q02715M617436
$$ plain form
41320 4414663 3922501 2334007 953739 -950105 -3790435 -5410780 -3715266 -13428
41312 -13428 2615223 3188382 2878832 2243300 879491 -591182 -654269 734607 1813476
41303 1813476 1437375 338146 -359856 -463131 -105572 890279 2405130 3711236 4335820
41294 4335820 4507887 4351821 3431241 1599850 -363807 -1525876 -1759934 -1588829 -1552076
41285 -1552076 -2000369 -2891047 -3438232 -2711910 -1135531 -595029 -2177934 -4433570 -5027562
41276 -5027562 -3746453 -2451109 -2014502 -939645 2140819 5813210 7098189 4942777
41268 4942777 1372425 -870056 -1050296 -670833 -1512928 -3686927 -5538112 -5509134 -3859896
41259 -3859896 -1987051 -388807 1296113 2173317 363359 -3250884 -4053599 563837
41251E63837N551771m61032o493730n171753J153734M436643K599187N88452P23912
41242C491021l66366l599231l745260J891983P004399M338064l471469p328322
41234a785181m027366Q89456K130918O85609j93765o5477o9660j09435J53083
41225b391818k79399j951957l047502j404721K312070N155179N228203L221858
41217F841913R32471n43691j089737j056199r72752j307366j940908j982258p46455
41208a864982Q89344R83363q07507j935796O8398L734523M882895K025340j726503
41199F249075l004483k055121q07652M62438K137077K876174J296356j035511
41191F118353j348296J22617O32263o27751j654452j335112q45191o99747L98700
$$ plain form
41251 563837 6115608 5654576 -839154 -6010907 -4857173 -420530 2178657 2767109 3491021
41242 3491021 3124655 -474576 -4219836 -2327853 4676546 9014610 5543141 -1785181
41234 -1785181 -5812547 -4923091 -2792173 -2106564 -2300329 -2365806 -2435466 -2544901 -2391818
41225 -2391818 -2671217 -4623174 -7670676 -9075397 -6763327 -1608148 3620055 6841913
41217 6841913 7774384 7230693 6140956 5084757 4112005 2804639 863731 -1118527 -1864982
41208 -1864982 -975638 7725 -799782 -2735578 -2667180 1067343 5950238 7975578 6249075
41199 6249075 3244592 1189471 381819 844257 2981334 5857508 7153864 6118353
41191 6118353 4770057 4892674 5524937 4897186 3242734 1907622 1062431 362684 761384
41182G61384K465649K972990O79488j703090j128258J240471J784019l05753k279792
41173D487108k108338q79495l40604k16199O69189J869066J591005o93570l207734
41164A170428l850938k443957m36888J012531J809280K117875J933700J552919
41156B864950J370443R78589l05764j681393j268458Q60649J863031q1519k749855
41147A850673k803181n40918Q71006K70120l06159O17215J817165J754192P07340
41138D237453m66890j634517k326616j305826J403003L550686L157157Q74752
41130G489202j239403k152000k006923j161421l85125q58022k469214l047874
41122e830780r23215K349465L462058J337903j767863l094943k034340J20187
$$ plain form
41182 761384 3227033 6200023 6879511 5176421 4048163 5288634 7072653 6766900 4487108
41173 4487108 2378770 1499275 1158671 942472 1611661 3480727 5071732 4378162 1170428
41164 1170428 -2680510 -5124467 -5561355 -4548824 -2739544 -621669 1312031 2864950
41156 2864950 4235393 5213982 4908218 3226825 1958367 2819016 4682047 4600528 1850673
41147 1850673 -952508 -1493426 -622420 -352300 -658459 -41244 1775921 3530113 4237453
41138 4237453 3770563 2136046 -190570 -1496396 -93393 3457293 6614450 7489202
41130 7489202 6249799 4097799 2090876 929455 544330 -313692 -2782906 -5830780
41122 -5830780 -6753995 -4404530 -942472 395431 -1372432 -4467375 -6501715 -6381528
41114f381528J849525K395945J916246J205007Q78528N66553o33988k553983l320288
41105d077983j216981K708539M893166L019194j029014l283710k578717j523360
41097c088866k171023k938208j424049J530371K984776K069336N05176m61304
41089b993791j022199r24130N56660K383055K214842m2002j529242l30579K069104
41080C81718L314197L057601K002561J02676k549497m495035m231225j898451
41072d315455J227127L712135L953905J239299k191073k500070O79388K845489
41064D650745N21646l581743m256601j146419J140991p5080k075974j172646K012639
41055c982442L571353J517797j775964k568452k19104K308091K429276J027904
$$ plain form
41114 -6381528 -4532003 -2136058 -219812 985195 1863723 2430276 1796288 -757695 -4077983
41105 -4077983 -5294964 -2586425 2306741 5325935 4296921 1013211 -1565506 -3088866
41097 -3088866 -5259889 -8198097 -9622146 -8091775 -5106999 -3037663 -2532487 -2993791
41089 -2993791 -4015990 -4940120 -4383460 -2000405 214437 172435 -1356807 -1687386 381718
41080 381718 3695915 6753516 8756077 8858753 6309256 1814221 -2417004 -4315455
41072 -4315455 -3088328 623807 4577712 5817011 3625938 1125868 1805256 4650745
41064 4650745 5172391 1590648 -2665953 -3812372 -2671381 -2746461 -4822435 -5995081 -3982442
41055 -3982442 -411089 1106708 -669256 -3237708 -3456812 -1148721 1280555 2308459
41047B308459L76260L66133o85693k124930j284719J692121K920999L18787l106757
41038G80660l700326j983173n06414K54002P91918R5212j986031k247750J601659
41029f900243N876977M961507m40827m064523k954925n36856j64316o61308o5071
41020d949585O25732M6480n57438L10031J507834J196309j97094r88610o20012
41011c626353N60113K214462L317166K396434n2491j288047p667J595740J146731
41002F256088m63034r08756j4027O73981N70552J95860l48803j155048j687370
40993C119443j808148k450935l641227l395441p34655J777698J321117n44277
40985f356425O8235L137199M416717K078157j49516J371758M347597L604746j387930
$$ plain form
41047 2308459 2684719 3050852 2365159 240229 -1044490 647631 3568630 3887417 780660
41038 780660 -2919666 -4902839 -5409253 -5155251 -4363333 -4268121 -6254152 -8501902 -6900243
41029 -6900243 -1023266 3938241 3497414 -567109 -3522034 -4058890 -4223206 -4884514 -4949585
41020 -4949585 -4323853 -4277373 -4834811 -4524780 -3016946 -1820637 -2017731 -3006341 -3626353
41011 -3626353 -3066240 -851778 2465388 4861822 4809331 3521284 3513617 5109357 6256088
41002 6256088 5793054 4884298 4870271 5544252 6114804 6310664 5961861 4806813 3119443
40993 3119443 1311295 -1139640 -4780867 -8176308 -8910963 -7133265 -5812148 -6356425
40985 -6356425 -6288190 -3150991 1265726 3343883 3194367 4566125 8913722 12518468 11130538
40976A1130538n491209m576129m00329K361871J857071o6512j461619k302779
40968A050903k872709k412625n07724J609538K458680K098449J316523k2898k272866
40959D45271m304992m335738k349022j39871J030567J357507J192571N54079J05600
40950f444028Q55314K378736K891075J683317J21677l39277J23563M52381j5532
40941A707226j347200k853407l012055j036090J425536J921121N93738j68943
40933b770074L76609M47633o29411r00375O89522K065483J263390n19299j190528
40924a167050q23855k95042P94504K350201K334453N5979j407923L62615K436720
40915D640602O80207k973374k735864J839436M571548J825509k371968k999339
$$ plain form
40976 11130538 5639329 1063200 662871 3024742 4881813 4815301 3353682 1050903
40968 1050903 -1821806 -4234431 -4742155 -3132617 -673937 1424512 2741035 2718137 445271
40959 445271 -3859721 -8195459 -10544481 -10684352 -9653785 -8296278 -7103707 -6549628 -6444028
40950 -6444028 -5588714 -3209978 -318903 1364414 1486091 1146814 1270377 1722758 1707226
40941 1707226 360026 -2493381 -5505436 -6541526 -5115990 -3194869 -2601131 -2770074
40933 -2770074 -2393465 -1945832 -2575243 -3475618 -2786096 -720613 542777 23478 -1167050
40924 -1167050 -1990905 -2285947 -1491443 858758 3193211 3249190 1841267 2203882 4640602
40915 4640602 5320809 2347435 -388429 1451007 6022555 7848064 5476096 2476757
40907B476757j243107j278464l206270l671949j724336L64581J532275L051146
40899c699367M834223M397784J005004k103180j814599M85107J125664m65747
40891C764889j410436k02860J019567M5356j939213k298915q02322O80536J386614
40882B43216K061688K413549Q62349k461069m718051l622805k08980K709874L542017
40873H21788K509219O56811o97571p63659l98766j143543k543819k289732Q7960
40864c761312J935834J367585P6113K01838P01570m08174k090105j830557R9148
40855c708060J261138J145305J312138J894147J359363k02969q00561P6678O98200
40846C035379J51365n62211q40326j143852j026537N73563K603702K516883L15459
$$ plain form
40907 2476757 1233650 -44814 -3251084 -6923033 -8647369 -8282788 -6750513 -3699367
40899 -3699367 1134856 5532640 6537644 4434464 2619865 3104972 4230636 3764889
40891 3764889 2354453 2151593 3171160 3216516 1277303 -1021612 -1823934 -1143398 243216
40882 243216 2304904 4718453 5580802 3119733 -1598318 -5221123 -5430103 -2720229 821788
40873 821788 3331007 3987818 3290247 2526588 2127822 984279 -1559540 -3849272 -3761312
40864 -3761312 -1825478 -457893 -381780 -179942 521628 113454 -1976651 -3807208 -3708060
40855 -3708060 -2446922 -1301617 10521 1904668 3264031 3061062 2260501 2337179 3035379
40846 3035379 3186744 2624533 1784207 640355 -386182 187381 2791083 5307966 5623425
40837E623425j128994o14862j42541p87661o63473J158447K191823N59004j492408
40828D702760j056282P68192P64322j497401l500163l357833j216719J712027
40820b681097L507268K419454n98066j998717l81098J082426m45135k684969k008709
40811c788643L13618L71901j278957l29139L441694M773324J040492l320664l336287
40802b112661l86578R15290l36257j482736j455033j667989k429092k142288l62587
40793a1459931J286833J828741K102961K492032J811110k93244j787884q30773
40785d850155J349590J994345N46202r75638j051893k40312N39667J425158K443594
40776A180558K476784P91300j294781j707902j65483J705565K363810J408457
$$ plain form
40837 5623425 4494431 3879569 3737028 2949367 2285894 3444341 5636164 6195168 4702760
40828 4702760 3646478 4414670 5178992 3681591 181428 -3176405 -4393124 -2681097
40820 -2681097 826171 3245625 2647559 648842 267744 1350170 905035 -1779934 -3788643
40811 -3788643 -3475025 -3103124 -4382081 -4711220 -1269526 3503798 4544290 1223626 -2112661
40802 -2112661 -2499239 -1583949 -1920206 -3402942 -4857975 -6525964 -8955056 -11097344 -11459931
40793 -11459931 -10173098 -8344357 -6241396 -3749364 -1938254 -2231498 -4019382 -4850155
40785 -4850155 -3500565 -1506220 -960018 -1935656 -2987549 -3227861 -2688194 -1263036 1180558
40776 1180558 3657342 4448642 3153861 1445959 1280476 2986041 5349851 6758308
40768F758308p31508k812699l062623j087064R19118O69714r03985j044445L91069
40759i04115P34104q45541j727411k45292J398773Q35637n13640l463J754888
40750D83940K131034P95277l95615q73709j509450j900801p76341J119399J710730
40741G84464J091876J107085J416458l06630l598965m548983j464690K342826
40733c176559L445871K661141K123610J306072p46691j965920j03540K730657
40725F274641K631602Q291j250491l67732o50991l060788l665574L0037M149816
40716D098811L444409j188161m029842k308273R39359J679135m56040k844462
40708f65064k943764j29456L659865M793950J463328l335419m593441j607761
$$ plain form
40768 6758308 6026800 3214101 151478 -935586 -16468 653246 -250739 -1295184 -904115
40759 -904115 -170011 -1015552 -2742963 -2988255 -1589482 -753845 -1267485 -1270948 483940
40750 483940 2614974 3410251 3014636 2140927 631477 -1269324 -2045665 -926266 784464
40741 784464 1876340 2983425 4399883 4093253 494288 -4054695 -5519385 -3176559
40733 -3176559 269312 2930453 5054063 6360135 5613444 3647524 3543984 6274641
40725 6274641 8906243 8914534 7664043 7296311 6645320 3584532 -81042 -51005 4098811
40716 4098811 7543220 6355059 2325217 16944 956303 2635438 2179398 -665064
40708 -665064 -3608828 -3738284 -78419 4715531 6178859 2843440 -1750001 -3357762
40700c357762J218258R58477J75648J856547L609743J279066l444145m359285
40692b063453R9013M221274L267136k48672j481802o04283j005114k641235k152598
40683b609734J005322L158567J919456n93122j460079r73364j064749j807683
40675b425386j625513P084J786313K193543R46000r03500j887032j518109p84183
40666d210783o18366l03418J250448K967884K464462j58209j686960j44147K327164
40657A888075K638579J016555j45865l30607r96261k157635j855430M07194K264940
40648B729545J782587J84613l43896r3828r18989k579783k495077L04876L057065
40639A627113K612485k78861j941224o98198J232344J312499J96514J30602J135379
$$ plain form
40700 -3357762 -2139504 -1181027 -1005379 851168 4460911 5739977 2295832 -2063453
40692 -2063453 -1964440 2256834 5523970 5275298 3793496 3189213 2184099 -457136 -2609734
40683 -2609734 -1604412 1554155 3473611 2880489 1420410 447046 -617703 -2425386
40675 -2425386 -4050899 -4043815 -2257502 -63959 882041 -21459 -1908491 -3426600 -4210783
40666 -4210783 -4829149 -5132567 -3882119 -914235 1550227 1392018 -294942 -439089 1888075
40657 1888075 4526654 5543209 5397344 5066737 4070476 1912841 57411 464605 2729545
40648 2729545 4512132 4696745 4352849 4259021 3340032 760249 -1734828 -1429952 1627113
40639 1627113 4239598 3960737 2019513 1321315 2553659 3866158 4062672 4193274 5328653
40630E328653J006951j057052k999671k798042j163664j51839j95290m5185P96478
40621a278661J216184M16209n38777n8144J619255K511581J462671l80232j302996
40612C667090j382321j853964k544430j725116J009076L426473L362365J466788
40604E425961n1939l15496Q7471P98629J659043J712182K33764j701188k584195
40595E264232k782421l279286k917444K418L597067L620471l23512l427831k192690
40586b438996J053463K291957J277101Q9749q51988j885267j598095Q03387K424383
40577A165694L67963k718342j738144K496375L480561j170908n458024l463566
40569g038391K195260M467323J633283j617565j666423M1743Q69049R57455J609597
$$ plain form
40630 5328653 6335604 5278552 2278881 -519161 -1682825 -1834664 -2029954 -2075139 -1278661
40621 -1278661 -62477 353732 -185045 -243189 1376066 3887647 5350318 4970086 3667090
40612 3667090 2284769 430805 -2113625 -3838741 -2829665 596808 3959173 5425961
40604 5425961 5374022 5058526 5145997 5944626 7603669 9315851 9549615 7848427 5264232
40595 5264232 2481811 -797475 -3714919 -3712501 -115434 3505037 3181525 -246306 -2438996
40586 -2438996 -1385533 906424 2183525 2273274 1421286 -463981 -2062076 -1258689 1165694
40577 1165694 1533657 -1184685 -2922829 -426454 3054107 1883199 -3574825 -7038391
40569 -7038391 -4843131 -375808 1257475 -360090 -2026513 -1984770 -1115721 -158266 1451331
40560A451331K248285J274258j088112k721375k251890m88456R02474J215861
40552E42376Q41340K87194k24862l97821J54022J239714J826432R28640j241549
40543C955486l263030l712818k386783m44566O39996M42037j10383K3022O56546
40534d200493P58366K2404o51457l37368Q89442K142699K306064O54033k095699
40525e12009l637003k473522l01162p290j255760p99749K088718L853109K185863
40516h58805r1920K60571J423702n7245k792927k676357q9637Q24282k41964P40292
40506c560008M042308M310695m03587m058094j551475K993599K586262j877648
40498B482052l759841j337425N06849j218424l705225l719850j561853J535612
$$ plain form
40560 1451331 3699616 4973874 3885762 1164387 -1087503 -1575959 -673485 542376
40552 542376 1383716 1670910 1446048 1048227 1202249 2441963 4268395 5197035 3955486
40543 3955486 692456 -3020362 -5407145 -5851711 -5211715 -4769678 -4880061 -4857039 -4200493
40534 -4200493 -3442127 -3419723 -4071180 -4408548 -3519106 -1376407 929657 1583690 -512009
40525 -512009 -4149012 -6622534 -6923696 -6930986 -8186746 -8986495 -6897777 -3044668 -858805
40516 -858805 -950725 -690154 733548 676303 -2116624 -4792981 -4882618 -4058336 -4300300 -3560008
40506 -3560008 482300 4792995 4389408 331314 -1220161 1773438 4359700 2482052
40498 2482052 -1277789 -2615214 -2108365 -3326789 -7032014 -10751864 -12313717 -10778105
40490a0778105N097128O973116M009384k473549o077418l188245K009265L558536
40482h69888J635101N84353J498462J415344q78513k688761j759244M90848J327565
40473G55267K02017j179187q96269J639768M874273N546902J580236m782454q263233
40464e22680o120551j410872N65111j536352l828833k143856K979456P014900
40456e003677O600812K889139m70992j587907j438300j317526j012560m8788Q45534
40447e44265P69982J55602o4863k7209k97550l55468O07484J754111J319810o92870
40437B624764k286827k161874r31657N95378K352805L591759K672498m06611l023455
40428C026780k983433j100108O51708J788620K321095J133047j855204l503869
$$ plain form
40490 -10778105 -5680977 1292139 5301523 2827974 -3249444 -6437689 -4428424 -869888
40482 -869888 765213 1349566 2848028 4263372 3384859 696098 -1063146 -572298 755267
40473 755267 957284 -221903 -1118172 521596 5395869 10942771 12523007 7740553 -522680
40464 -522680 -6643231 -8054103 -7488992 -9025344 -12854177 -14998033 -12018577 -5003677
40456 -5003677 1597135 4486274 4015282 2427375 989075 -328451 -1341011 -1389799 -544265
40447 -544265 225717 381319 316456 289247 -8303 -363771 243713 1997824 3317634 2624764
40437 2624764 337937 -1823937 -2755594 -2160216 192589 3784348 6456846 6050235 3026780
40428 3026780 43347 -1056761 -405053 1383567 3704662 4837709 2982505 -521364
40420e21364j062981K769769K527220j997575m774528k122541J950259J899498
40412a332243j288719k210517P89865L943566L993984J839701j72417j261317
40404D301903j538379r50760q0782m2457o62176n51507L12272J35771j559592
40395f35707k445903n68438K589863L904187K367607l73852k235891k112022j11792
40386C78052K142222K307423q8714k515597k323198j32356J184189M56661n32287
40377H76395J47761J872137K126437n36299m371075n521943k044954L224066N320549
40368A093074K989544j48931j078118j284553l079308m722084k877072J475386
40360g632062L725281K149709l9650J85445J849220K353508Q39289j955399m596845
$$ plain form
40420 -521364 -1584345 1185424 3712644 1715069 -3059459 -5182000 -3231741 -1332243
40412 -1332243 -2620962 -4831479 -4041614 -98048 3895936 5735637 5563220 4301903
40404 4301903 2763524 1812764 1731982 1689525 1027349 475842 788114 923885 -635707
40395 -635707 -3081610 -3650048 -1060185 2844002 5211609 4837757 2601866 489844 378052
40386 378052 2520274 4827697 4738983 2223386 -99812 -232168 952021 1408682 876395
40377 876395 1024156 2896293 5022730 4486431 115356 -5406587 -7451541 -4227475 1093074
40368 1093074 4082618 3933687 2855569 1571016 -1508292 -6230376 -9107448 -7632062
40360 -7632062 -3906781 -1757072 -1796722 -1611277 237943 2591451 3430740 1475341 -3121504
40351c121504m730097q28835M487086N876621J931538k387302k296488M81219
40343e87762R28058j854483m040784k865538L96146L027783L638627K248876q2067
40334H08856j556388j369088r73150j960489l304838k787147n49960J230938J843990
40325h617276K457337L057443K019235n64513k012902q47600R28326R22135k67584
40316b925399n61289K55087O89336J86781k25201K53707J008263P65997r46096
40307a498814l043727l631651k010479L04675J399013J306568J217157J004738
40299d952520k23183j348540j7331L066143L801508M34699l183701k608343J179199
40290c852069L680739L032259R60986j045920k674008k426467J364326O371914
$$ plain form
40351 -3121504 -7851601 -8680436 -4193350 1683271 3614809 1227507 -1068981 -587762
40343 -587762 340296 -1514187 -5554971 -8420509 -8024363 -4996580 -1357953 890923 808856
40334 808856 -747532 -2116620 -3089770 -5050259 -8355097 -11142244 -11692204 -10461266 -8617276
40325 -8617276 -6159939 -3102496 -1083261 -1647774 -3660676 -4508276 -3579950 -2657815 -2925399
40316 -2925399 -3486688 -3231601 -2542265 -2355484 -2580685 -2326978 -1318715 -552718 -1498814
40307 -1498814 -4542541 -8174192 -10184671 -9879996 -8480983 -7174415 -5957258 -4952520
40299 -4952520 -5175703 -6524243 -6541574 -3475431 326077 760776 -2422925 -5031268 -3852069
40290 -3852069 -171330 2860929 3821915 2775995 101987 -2324480 -960154 5411760
40282E411760P121381K012586l583976l872264n5368J818567q72436m600635n216615
40273a837000k983656p62887M37640J737501L199164L032176N72128j898997j752388
40264b56319N70770K281511J879017M49002n23363q47757p56875n4859J018893
40255C760020J449893R26642N40428J201540K500212L740757M525365L639273
40247B2284130k93669n517185p134554l102521J910228K136698j372854k623721
40239F286552K68995K719257J056891k370439l471065k008470l43566M96628P31648
40230C366431P0284j214342j229740Q73096K654496J392743j860040l715619k925189
40221b587880j028255N07778J351876J315093O90606Q57093K239306K640978K55417
$$ plain form
40282 5411760 12533141 14545727 10961751 7089487 7034119 8852686 7980250 3379615 -1837000
40273 -1837000 -4820656 -5583543 -5145903 -3408402 -209238 2822938 3395066 1496069 -256319
40264 -256319 314451 2595962 4474979 4923981 4400618 3552861 2795986 2741127 3760020
40255 3760020 5209913 6136555 6676983 7878523 10378735 14119492 18644857 22284130
40247 22284130 21990461 16473276 9338722 6236201 8146429 10283127 8910273 6286552
40239 6286552 6555547 9274804 10331695 7961256 4490191 2481721 2138155 2634783 3366431
40230 3366431 3436715 2222373 992633 1865729 4520225 5912968 4052928 337309 -2587880
40221 -2587880 -3616135 -3108357 -1756481 -441388 249218 1106311 3345617 5986595 6242012
40212F242012k717919k735255m47113K92126j169765j290298J304182L039940
40204B517910J272871j137274n64002J261264K08976l064745l770777n72105K164457
40195a683425J009204j502279j007360K107306L522697J407876j197560r68795
40187A687664J221518J974239J22417k134294k494406j097118N59930J606839
40179A446789J796307Q56069q07544j673220q70916K60910j3152j015561o16028
40170f36346J249083K318916J553341N16796M25181L08325m80304m18107J319928
40161F156813K324134K96766k555808k140457J049016K166422n82767k955932
40153C758187j298189J534636O82167k630168k491169K395238N908230L099155
$$ plain form
40212 6242012 3524093 788838 341725 633851 -535914 -1826212 -522030 2517910
40204 2517910 3790781 2653507 2089505 3350769 3559745 495000 -3275777 -3847882 -1683425
40195 -1683425 -674221 -2176500 -3183860 -1076554 2446143 3854019 2656459 1687664
40187 1687664 2909182 4883421 5005838 2871544 377138 -719980 -160050 1446789
40179 1446789 3243096 4099165 3291621 1618401 747485 1008395 995243 -20318 -636346
40170 -636346 612737 2931653 4484994 5001790 5426971 5735296 5254992 4836885 6156813
40161 6156813 8480947 8777713 6221905 4081448 5130464 7296886 6714119 3758187
40153 3758187 2459998 3994634 4676801 2046633 -444536 1950702 7858932 10958087
40145A0958087k455279l630953K18604K764619p7889m832349n817687k403866
40137e276713J534212L130396K637713J239176m06961j621707j850641j452815
40129b067340r72854j08879J178866J553708L38874m25477J298652L638970L070442
40120G504962K07168p82367J016419J675954p95496k880775j603332L36481n02070
40111D176944k097257p77750J730839J053099j778657j585818J877603K825518
40103E424521j158186m809610l124106J481164L562777K244703M36542n96539
40095C461266j724695k784729k644930j479510j42652J662067M083337N332443
40087E762597L865409J115371o26791j721143l627054n207159m125356j133836
$$ plain form
40145 10958087 8502808 4871855 5090459 7855078 7777189 2944840 -2872847 -5276713
40137 -5276713 -3742501 -612105 2025608 3264784 2857823 1236116 -614525 -2067340
40129 -2067340 -3040194 -3149073 -1970207 -416499 -77625 -503102 795550 4434520 7504962
40120 7504962 7712130 6929763 7946182 9622136 8826640 5945865 4342533 4679014 4176944
40111 4176944 2079687 1301937 3032776 4085875 2307218 721400 2599003 5424521
40103 5424521 4266335 -543275 -3667381 -2186217 1376560 3621263 4057805 3461266
40095 3461266 1736571 -1048158 -3693088 -5172598 -5315250 -3653183 430154 5762597
40087 5762597 9628006 10743377 10116586 8395443 4768389 -438770 -4564126 -5697962
40079e697962P52454J021559J798238L207880K732751k5132k006772j603176j085930
40070i06090k120227k543937m51390J763719J101484p21176J64497L277751M307186
40061C871817J892674m65630j51976Q58578p2694j850364j901016o27949m65883
40052A087557j611856j927470r21366o08026j539263r93592K767552O581127N737929
40043H572592M87314l924177m011370j835139q08067o71964O99520K500394J716750
40034B725853j602409l406650j209227K131653K200982j095018l676656k596256
40026f527728Q27093L175286K681385M20969j233319q47494Q66061J738203L17120
40017A417576k472991m061222k803945K31519K271802J814414L85145P01552L045606
$$ plain form
40079 -5697962 -4945508 -3923949 -2125711 1082169 3814920 3789788 1783016 179840 -906090
40070 -906090 -3026317 -5570254 -6021644 -4257925 -3156441 -3877617 -3713120 -435369 3871817
40061 3871817 5764491 5298861 5146885 6005463 5932769 4082405 2181389 1553440 1087557
40052 1087557 -524299 -2451769 -3373135 -3981161 -5520424 -6514016 -3746464 2834663 8572592
40043 8572592 9059906 5135729 1124359 -710780 -1518847 -2190811 -1491291 1009103 2725853
40034 2725853 1123444 -2283206 -3492433 -1360780 840202 -254816 -3931472 -6527728
40026 -6527728 -5700635 -2525349 156036 577005 -656314 -1503808 -637747 1100456 1417576
40017 1417576 -1055415 -5116637 -7920582 -7689063 -5417261 -3602847 -3217702 -2516150 529456
40008E29456M552304K818512q95836l367115l349486k038513m09866J407719K310278
39999A557453P70173k036945k542966L39392L230820K943667O40051q34402j249753
39990B817490j696239j197550J572057M427215L647451l46152l059648k068142
39982D096482L46032J370683J109431O61441j64898j512536k237402j695125r11011
39973A063097o70611k76297O99472J393320J435821J629094J796353M19225k239519
39964E249955l349321j680891Q8476n30617j980741j474443P34025K759573M369384
39955D185400N520864M019585j119928n740599m873028k49494J515529j678294
39947A580035m851307l657427K02383K995910L897261L463684J140601k567233
$$ plain form
40008 529456 5081760 7900272 7004436 3637321 287835 -1750678 -2160544 -752825 1557453
39999 1557453 2327626 290681 -2252285 -1912893 1317927 4261594 4901645 4067243 2817490
39990 2817490 1121251 -76299 1495758 5922973 9570424 9224272 6164624 4096482
39982 4096482 4442514 5813197 6922628 7584069 7419171 5906635 3669233 1974108 1063097
39973 1063097 392486 116189 815661 2208981 3644802 5273896 7070249 7489474 5249955
39964 5249955 1900634 219743 308219 -222398 -2203139 -3677582 -2943557 -183984 4185400
39955 4185400 9706264 13725849 12605921 6865322 1992294 1742800 3258329 1580035
39947 1580035 -3271272 -6928699 -6726316 -3730406 166855 3630539 4771140 2203907
39939B203907m464090k508874Q82292K305540K071108K382181K740797Q34056
39931F446917k921006n221095m209380j249917J587394L371470L631869K242029
39923C678281L98324j85397N30090J006655M80321l36372q79672j353685j572859
39914A765686q76326M32442J037499M21046n17821r30373r09489p29401l94587
39905g01324r8952j6979K88407J020607J086119m13904j994329j385351O97013
39896a518693J184942l58898o43584J871212L689040J361778k692904l283406
39888c90513J9358K572396J624835n23982j070087n02584j37831P10371K492056
39879D794019L002513M05219l000116l383585q81040Q28080J16380q35064k66336
$$ plain form
39939 2203907 -2260183 -4769057 -3886765 -1581225 489883 2872064 5612861 6446917
39931 6446917 3525911 -1695184 -5904564 -7154481 -5567087 -2195617 1436252 3678281
39923 3678281 4076605 3891208 4421298 5427953 5908274 5571902 4692230 3338545 1765686
39914 1765686 889360 1321802 2359301 2780347 2262526 1332153 422664 -306737 -701324
39905 -701324 -800276 -817255 -528848 491759 1577878 1163974 -830355 -2215706 -1518693
39896 -1518693 -333751 -692649 -1336233 534979 4224019 5585797 2892893 -390513
39888 -390513 -371155 2201241 3826076 3302094 2232007 1729423 1591592 2301963 4794019
39879 4794019 7796532 8201751 5201635 1818050 937010 1765090 1881470 1046406 780070
39870G80070N76163L47901J22365J087769K057675J456829K6703o12755o00888
39861E241832q65543r88388m81231p84844l005589m672788k319031K845603N489642
39852D59663L125748p69534j839649q3944J651444J821226P71182q14240j973721
39843B348175j488213L31322J235952M9887j377387r57677L70962J54180j929974
39834a262773l837481l742911j403839J989558M082647K984678j6442j236272
39826b442835M38100J840850P63182k57830J454155L527436K419695j98762m26984
39817G117007N05094j587429n236306m436215Q39092L109646r55040m877353k674833
39808h196337K017708K915678J277758J890812L339496Q04742l778894l382901
$$ plain form
39870 780070 1356233 1704134 1826499 2914268 4971943 6428772 6455475 5842720 5241832
39861 5241832 4376289 3387901 2906670 2121826 -883763 -5556551 -7875582 -5029979 459663
39852 459663 3585411 2815877 976228 892284 2543728 4364954 5136136 4321896 2348175
39843 2348175 859962 1191284 2427236 2477123 1099736 142059 513021 667201 -1262773
39834 -1262773 -5100254 -8843165 -10247004 -8257446 -4174799 -1190121 -1206563 -2442835
39826 -2442835 -2004735 -163885 599297 341467 1795622 5323058 7742753 7543991 7117007
39817 7117007 7622101 6034672 798366 -3637849 -2798757 310889 -644151 -5521504 -8196337
39808 -8196337 -6178629 -3262951 -1985193 -94381 3245115 4049857 270963 -3111938
39800c111938K309198N295464J383944l616499l210142O20640K061286L91082
39792B123035r15194p39284p06498q62688J29008J295907L13878j979266k155794
39783c496896K40177J628128J25817j308242K90507K875783K407059q40628k623957
39774g02252j045860J052490R37384J737P44714K114075J115272j925830l314264
39765a022534j560482M44853K92926q1901J924452M481175L655832j67245k295859
39756E671217n75084J588963O49014j836909j991030M47798K054837P99243j581364
39747E226685k387175j029192J095817K213734J280504j181568l052811k674651
39739e08657j092567p28798j593769r24564K346805M960858L373304r80032l286258
$$ plain form
39800 -3111938 -802740 4492724 5876668 2260169 -949973 -329333 1731953 2123035
39792 2123035 1207841 468557 -237941 -1100629 -971621 324286 638164 -1341102 -3496896
39783 -3496896 -3256719 -1628591 -1502774 -2811016 -2520509 355274 2762333 1921705 -702252
39774 -702252 -1748112 -695622 241762 243499 988213 3102288 4217560 2291730 -1022534
39765 -1022534 -2583016 -2138163 -1845237 -1927138 -2686 4478489 8134321 7967076 5671217
39756 5671217 5096133 6685096 7334110 5497201 3506171 3953969 6008806 6808049 5226685
39747 5226685 2839510 1810318 2906135 5119869 6400373 5218805 2165994 -508657
39739 -508657 -1601224 -2330022 -3923791 -4848355 -2501550 2459308 5832612 4852580 1566322
39730A566322j797148L45452K25372r64147p99741J82332j49327j473781j400966
39721d265632M95701J922615J509212O60683R22093J711784J882745J640371J452188
39712G931760O68241j097313k515008k248582j044529k91714M30675K118726L465643
39703G417899K041887j588121l760191k569922l25269K22901k00212O50242K361107
39694D250321K398709K61997j599854j400381k89801q7046o04694o75357m75097
39685A778797r30862j466704m39365J981246L244861J594402j558608l518162
39677F85605l496629k614555j541832J13691K166053L263318K521520P52103m79131
39668A370143m00584N96827J469614J197459l77607k150754k709550j757303j47887
$$ plain form
39730 1566322 -230826 114626 339998 -624149 -1423890 -1241558 -1390885 -2864666 -4265632
39721 -4265632 -3769931 -1847316 -338104 322579 1244672 2956456 4839201 6479572 7931760
39712 7931760 8600001 7502688 4987680 2739098 1694569 1402855 1833530 3952256 7417899
39703 7417899 9459786 7871665 4111474 1541552 1216283 1439184 1238972 1889214 4250321
39694 4250321 6649030 6911027 5311173 3910792 3620991 3533945 2929251 2253894 1778797
39685 1778797 847935 -618769 -1058134 923112 4167973 5762375 4203767 685605
39677 685605 -2811024 -5425579 -6967411 -6853720 -4687667 -1424349 1097171 1849274 1370143
39668 1370143 969559 1566386 3036000 4233459 3855852 1705098 -1004452 -2761755 -2909642
39659b909642J203249J759331J227547O9021l29127O70118J597374Q34440o54092
39650C468219p49156J32948k66147j616125r27659K029452L195109L99579k592193
39641C074027j570780J601030K098226m18052k098370j377804k50614N24772K366020
39632C948455M319524K689858k670271o026327k933340L171748N018480N58480
39624H076607n139184o382983k689200J877702L341463J346748j096620j098246
39616a763713R60574K275753J355349m32406j228461r21844k32261Q46852K312940
39607C172783K913519J262820j992082m280597l693580j079429P29810L9707j460827
39598d387876n11503L207825N837453M050954l33504k683652j552341M37173J204936
$$ plain form
39659 -2909642 -1706393 52938 1280485 1349506 1020379 1690497 3287871 4122311 3468219
39650 3468219 2719063 2852011 2585864 969739 42080 2071532 5266641 5666220 3074027
39641 3074027 1503247 3104277 5202503 4784451 2686081 1308277 1057663 1582435 3948455
39632 3948455 8267979 10957837 8287566 2261239 -672101 2499647 7518127 8076607
39624 8076607 2937423 -3445560 -6134760 -4257058 -915595 431153 -665467 -1763713
39616 -1763713 -803139 1472614 2827963 2395557 1167096 245252 12991 859843 3172783
39607 3172783 6086302 7349122 5357040 1076443 -2617137 -3696566 -2966756 -2927049 -4387876
39598 -4387876 -4899379 -1691554 4145899 8196853 7863349 5179697 3627356 4064529 5269465
39589E269465J317071J108760o39135l611067m684005k026383J786327L091633
39581A612666J863491Q28197J213904J759426J235454j27212j470269k071095
39573D844562j494719q5854R10608M41901j352254l322023l869099j770347K071452
39564c625773M131338J853674k221405k792225J111052M567142L612807K82607
39556F919217j363936j062890j143797j974907k084376j289208m80903O02755
39548a878045K452863L614774K301731n49508k434435k735412k555945k052282
39540c836259o69835O90110N75162l35657n7134J504566K596549K505607K053850
39531E026959J589959P81892L2254p1627j91716j013095j425607k82748J010324
$$ plain form
39589 5269465 6586536 7695296 7056161 3445094 -1238911 -3265294 -1478967 1612666
39581 1612666 3476157 4304354 5518258 7277684 8513138 8385926 6915657 4844562
39573 4844562 3349843 3263989 4174597 4616498 3264244 -57779 -3926878 -5697225 -3625773
39564 -3625773 505565 2359239 137834 -2654391 -1543339 3023803 6636610 6919217
39556 6919217 5555281 4492391 3348594 1373687 -710689 -1999897 -2480800 -1878045
39548 -1878045 574818 4189592 6491323 5941815 3507380 771968 -1783977 -3836259
39540 -3836259 -4506094 -3815984 -3240822 -3576479 -3633613 -2129047 467502 2973109 5026959
39531 5026959 6616918 7398810 7431064 7359437 7167721 6154626 4729019 4446271 5456595
39522E456595L73354j397166j913753j232622j385593k478292k664227j671279
39514f912983q60197M1011K511872N348869N073743J100776k873543l615166j545925
39505a731543J393959L855523M331297J734200k017691l034662m19919K414729
39497F525893K397112J00974k363603l786520l261159k88300L262898M181540
39489F768835K120241O5229k26203j29933o37709n61631L55322J62234j668813
39480F247572k701911j475087K60531R44938J401529J894779Q28533j519374j981262
39471C900248K83899J659430k4041j808805j223073r30644l297976m709321j031154
39462g181437M543037N418750J368724j790370j149745O18346J116267J026858
$$ plain form
39522 5456595 5829949 4432783 2519030 1286408 -99185 -2577477 -5241704 -6912983
39514 -6912983 -7773180 -7732169 -5220297 128572 5202315 6303091 3429548 -185618 -1731543
39505 -1731543 -337584 3517939 7849236 9583436 7565745 4531083 4111164 6525893
39497 6525893 8923005 9023979 6660376 2873856 -387303 -675603 2587295 6768835
39489 6768835 8889076 8954305 8728102 8598169 7960460 7398829 7754151 7916385 6247572
39480 6247572 3545661 2070574 2331105 3276043 4677572 6572351 7400884 5881510 3900248
39471 3900248 4184147 5843577 5819536 4010731 2787658 1857014 -1440962 -6150283 -7181437
39462 -7181437 -2638400 2780350 4149074 2358704 1208959 1827305 2943572 3970430
39454C970430O90133r81984l235071l405509j068893J333408K471404L144328
39446B918246L120243R82093k160902k764615N8829K898647K825434Q51258o43069
39437H086164j123310j101173n52875K80883L14239p94569j718740j082219P80486
39428C088886K033429Q93198k420823m794301k905391K071622M765516K552839
39420E284975n76333n8249K331103J911104j028598k164649n21878Q02566P04130
39411F684171J064178J682816J13602k844425l343292j177325l88058j865979
39403g4312j570173J872782M204964L012859J807745K957318K841600j073693
39395A3979090m073736j162091M243976N050841P48154l320771m404340l763768
$$ plain form
39454 3970430 4660563 3678579 443508 -2962001 -4030894 -2697486 -226082 2918246
39446 2918246 6038489 7020582 4859680 2095065 2153894 5052541 7877975 8729233 8086164
39437 8086164 6962854 5861681 5308806 5589689 5903928 5109359 3390619 2308400 3088886
39428 3088886 5122315 6015513 3594690 -1199611 -4105002 -2033380 2732136 5284975
39420 5284975 4708642 4650393 6981496 8892600 7864002 5699353 5177475 5980041 6684171
39411 6684171 7748349 9431165 9544767 6700342 3357050 2179725 1791667 -74312
39403 -74312 -1644485 228297 4433261 7446120 9253865 12211183 15052783 13979090
39395 13979090 9905354 8743263 12987239 18038080 18786234 15465463 11061123 7297355
39387G297355j619708K678750O269058N030980N32156j007058K450537O087116
39379B7719186N612202K548596L19850p29049j831250k412211j110446J376776
39371C1493654K761614J977456L11908p4550J600650L881482M889069N109050
39363E1950333P003133J1273199J5683329J9008393K3351924K9597354L3001402
39356A90869067K7838222J5847658N716484L352091N830630N814010p20972j1971193
39348B42575997k2997250k9589912l0825875k8688422k5032848k0036953j4528380
39341G0876357j1372846j1705801j1789439p600362j410357P17141k312563n172678
39333B0229452m015432j034233L23191J42929k31106j246709l020189l368235
$$ plain form
39387 7297355 5677647 8356397 14625455 19656435 20188591 19181533 21632070 27719186
39379 27719186 33331388 35879984 36199834 35470785 33639535 31227324 30116878 31493654
39371 31493654 34255268 36232724 36544632 36470082 38070732 41952214 46841283 51950333
39363 51950333 58953466 70226665 85909994 104918387 128270311 157867665 190869067
39356 190869067 218707289 234554947 240271431 243623522 249454152 255268162 254547190 242575997
39348 242575997 219578747 189988835 159162960 130474538 105441690 85404737 70876357
39341 70876357 59503511 47797710 36008271 28407909 26997552 27714693 25402130 20229452
39333 20229452 16214020 15179787 15502978 15645907 15414801 14168092 11147903 7779668
39325G779668j029802J630379K022648J247036J725391K868238K224942l37564
39317A8130936k534489k974902k185160j069381m29070j114682k593389k385938
39309B843925P89398M213440M027820L98761k656662k401527N4092K322597L412657
39300A3004501L313145K145512P99917Q09733K405793L758695L262705J853758
39292C1353759J885879L841746N170710L010651k141623o265737n999149k615241
39284B8240995o55947k390034n037030m486924o37604K623064K397301k3667j418786
39275A8611368o73773O85482J411452K305559M307249O016831M996865J550880
39267C9211913r36198n26275M47228q46347k948597k409788J2311k48570m198516
$$ plain form
39325 7779668 6749866 8380245 10402893 11649929 13375320 16243558 18468500 18130936
39317 18130936 15596447 12621545 10436385 9367004 8937934 7823252 5229863 2843925
39309 2843925 3633323 7846763 11874583 12273344 9616682 7215155 7269247 9591844 13004501
39300 13004501 16317646 18463158 19263075 20072808 22478601 26237296 29500001 31353759
39292 31353759 33239638 37081384 42252094 45262745 43121122 36855385 30856236 28240995
39284 28240995 27585048 25195014 20157984 15671060 15033456 17656520 20053821 20030154 18611368
39275 18611368 17937595 18623077 20034529 22340088 26647337 32664168 37661033 39211913
39267 39211913 38275715 37749440 38196668 37350321 34401724 31991936 32004247 31755677 27557161
39258B7557161o687053l635767J704149L302891P19085j303634l93576Q44354
39250B2107610O9504j146711n90709P79267O34770r98632k196980k323841k510763
39241A3823515l171930l050950j348888N95451R00157j50370l10190J415129K921312
39232A1623236J548180j988260l827537j653652K214492L617323J625583p30262
39224A2429103o90890Q93440J277848j85367j308192m24865J002537L93381k102082
39215A1284913l695168l056815k077417k391455k453787l65618K265742K532068
39207B042463J157489J333480K929338K361897q90753k420046J31314K570113
39199I215295K81569m474987n826841k781826J55522K3934j258437q43130J202259
$$ plain form
39258 27557161 20870108 17234341 18938490 22241381 22960466 21656832 21263256 22107610
39250 22107610 22177114 21030403 20439694 21218961 21853731 20855099 18658119 16334278 13823515
39241 13823515 10651585 7600635 6251747 6847198 7747355 7596985 7286795 8701924 11623236
39232 11623236 13171416 11183156 7355619 5701967 7916459 11533782 13159365 12429103
39224 12429103 11738213 12631653 13909501 13724134 12415942 11991077 12993614 13386995 11284913
39215 11284913 7589745 4532930 2455513 64058 -2389729 -2755347 -489605 2042463
39207 2042463 3199952 4533432 7462770 9824667 8933914 6513868 6645182 9215295
39199 9215295 9496864 5021877 -804964 -3586790 -3431268 -3407334 -4665771 -5508901 -4306642
39190d306642K774562K247936k43598k562118k147646P09255K515037J312184
39182B98970k48342Q18770K854904K517511N27852j04256K07134r37419k106271
39173C828853K3514L369733K223710k861642m540403k70616L253592J046400k274066
39164C799075r87087K077450J442176q80739N43563L970762K856518k709510n609957
39155D502251k898268M70088L31744j344368j804177j822632k030918n30485K715027
39146b411738L888322J055300k129375j781095O31498J365309Q713j315097j764290
39137b452453j597843m20080J396396J656166l65703j683514K95000L442907L979141
39128D250017K060207P56094Q68367N58063o96832j497423j512112j580217r98256
$$ plain form
39190 -4306642 -1532080 715856 472258 -2089860 -4237506 -3528251 -1013214 298970
39182 298970 50628 869398 3724302 6241813 6769665 6665409 6872543 5935124 3828853
39173 3828853 3852367 7222100 9445810 6584168 2043765 1773149 5026741 6073141 3799075
39164 3799075 2811988 4889438 6331614 5450875 5994438 9965200 12821718 10112208 4502251
39155 4502251 1603983 2074071 2405815 1061447 -742730 -2565362 -4596280 -5126765 -2411738
39146 -2411738 1476584 2531884 402509 -1378586 -747088 618221 626934 -688163 -2452453
39137 -2452453 -4050296 -4470376 -3073980 -1417814 -1783517 -3467031 -3172031 270876 4250017
39128 4250017 6310224 7066318 7934685 8492748 7795916 6298493 4786381 3206164 2207908
39119B207908J775194N451252O364289L341384q35872l546163m892094n214889
39111D651009l362113N78724L465393K643409k23676j302921L30588K039341J669350
39102A0489104O5483q40999p40798o94024j023679p57354O73919K153017K132789
39093A1457458P75434k45265o3387N27304Q31403J322344K174073K339089J347511
39084B0465964M78161N74795L33842j217983k291500j135978K95294r43863l445850
39075A3112882l097493J41347J876306M22511q09391O8027k33226l719568n881818
39066A879577k115624M032646N146372P56863k410028p79686J716194R88374j168836
39057H045852j233915K36832O24421J01186O08220J698605J152805p89489j054569
$$ plain form
39119 2207908 3983102 9434354 15798643 19140027 18304155 14757992 9865898 4651009
39111 4651009 1288896 1867620 5333013 7976422 7752746 6449825 6780413 8819754 10489104
39102 10489104 10554587 9713588 8972790 8278766 7255087 6497733 7171652 9324669 11457458
39093 11457458 12232892 11987627 11924240 12451544 13282947 14605291 16779364 19118453 20465964
39084 20465964 20944125 21518920 21852762 20634779 18343279 17207301 17502595 16558732 13112882
39075 13112882 10015389 10156736 12033042 12455553 11646162 11714189 11480963 7761395 1879577
39066 1879577 -236047 3796599 8942971 9699834 7289806 6510120 8226314 9214688 8045852
39057 8045852 6811937 7048769 7673190 7774376 8382596 10081201 11234006 10444517 9389948
39048I389948J944595N838005O997451M592677J400169R54194L899232P258947
39040D2275218Q183916Q248907J1754275J8553999K1260606J2912632l552751
39033A19636802j7072589j9995805j4678231p945507k860710J560625N707255
39026F4351840Q675565J1014842J3773413J4391820P792784o186396j9463719
39019I4350149k3140411j7128791r528521o946342q350240q792889o191386k628149
39011A1643420o65537n55909q53233m37469L18490L4853j872556l924855l917942
39002b30738j729927K68496J58988j190321j478219K52749K961643M825213M366964
38993H204848J474518j785975k606910q38556M55282o69376j851212K8382L491639
$$ plain form
39048 9389948 11334543 17172548 24169999 28762676 30162845 31117039 35016271 42275218
39040 42275218 50459134 58708041 70462316 89016315 110276921 123189553 119636802
39033 119636802 102564213 82568408 67890177 59944670 57083960 58644585 64351840
39026 64351840 73027405 84042247 97815660 112207480 120000264 113813868 94350149
39019 94350149 71209738 54080947 44552426 37606084 29255844 20462955 14271569 11643420
39011 11643420 10977883 10421974 9568741 9131272 9449762 9484615 7612059 3687204 -230738
39002 -230738 -1960665 -1692169 -1533181 -2723502 -4201721 -3948972 -987329 3837884 8204848
38993 8204848 9679366 7893391 5286481 4447925 4903207 4233831 2382619 2411001 5902640
38984E902640L977517M00777l242735l443787j196079P21426J525651J725178
38976F370588J193756K08651M24547K330701L269923O99930l552320n087204k592427
38967C266145R27582K534465K302163J429380J14937j338094j453354L83174K060321
38958A0226719J076973j657674k459095K48893L450559L193735l07905k957283
38950A0814922k022640P25664J902357R44781L6788M94036J298021J219395M73232
38941A5886556k50794p88574r04281k65331K34871j151985m174812n767743l727091
38932i09184J17685K242289J833853P83536J51080q37573k405992l332678l002796
38923e359780k357338k011057j108358R53786L012476L524185K608450J602856
$$ plain form
38984 5902640 9880157 10280934 7038199 3594412 2398333 3119759 4645410 6370588
38976 6370588 7564344 7772995 8197542 10528243 13798166 14498096 10945776 5858572 3266145
38967 3266145 4193727 6728192 9030355 10459735 10574672 9236578 7783224 8166398 10226719
38958 10226719 11303692 9646018 7186923 7435816 10886375 14080110 13772205 10814922
38950 10814922 8792282 9517946 11420303 12365084 12401872 12895908 14193929 15413324 15886556
38941 15886556 15635762 14847188 13942907 13677576 13912447 12760462 8585650 2817907 -909184
38932 -909184 -791499 1450790 3284643 4068179 4219259 3381686 975694 -2356984 -5359780
38923 -5359780 -7717118 -9728175 -10836533 -9882747 -6870271 -3346086 -737636 865220
38915H65220J054130J91097j548608l152231k778674j06949K497978K211411o20783
38906a387409k425281q96209J858460K314879M83026n65771L92195J216622L58459
38897A348971m64846P84492K763033K216259j465045m988176m775828r80837K615527
38888b946450K692077j8546j974090j543358p04927j104693q61318J981239M755759
38879B75693L172627j520996l274303n6788L029700J753597r09055k03348K591602
38870D858729K747251n0689j818509j081094k90599o05714k76554J038624R34777
38861E456222j342404l107675k558744j417735j429995j507304m75149L95886
38853e986898N7386J07846J784059L006639J593799o21035m33803J437183J590677
$$ plain form
38915 865220 1919350 2110447 561839 -2590392 -5369066 -5476015 -2978037 -766626 -1387409
38906 -1387409 -3812690 -4708899 -2850439 -535560 -52534 -618305 -226110 990512 1348971
38897 1348971 884125 1668617 4431650 6647909 5182864 194688 -4581140 -5561977 -2946450
38888 -2946450 -254373 -272919 -2247009 -3790367 -4495294 -5599987 -6461305 -4480066 275693
38879 275693 3448320 1927324 -1346979 -1403767 1625933 3379530 2470475 2267127 4858729
38870 4858729 7605980 7555291 5736782 4655688 4365089 3759375 3482821 4521445 5456222
38861 5456222 4113818 1006143 -1552601 -2970336 -4400331 -5907635 -6382784 -5986898
38853 -5986898 -5929512 -5821666 -4037607 -1030968 562831 -58204 -492007 945176 2535853
38844B535853k13830n65682J807545L573526J674519k182101m001901k701012
38836g3083p40417m38613j470658j973943r78918O11301J145307J33447j206221
38827d991798j484389o74509M84687J875231L522403M208865K417397j012832
38819D345055k931240j542091J233994K181689O37764j307164j807795j068503
38811b58291k33676K85393Q60447J588290J788626P72251r40625j668678m95310
38802A698427J139609R64123q33062j423558N75559K477067J015455k534962l580239
38793e01581p32732J945861P39358k391123l021592r74537m6103j452761j804975
38784h240185J009756L757169K566927r94705k260728l17148J528627J539317
$$ plain form
38844 2535853 2322023 1756341 3563886 7137412 8811931 6629830 2627929 -73083
38836 -73083 -813500 -1252113 -2722771 -4696714 -5675632 -5064331 -3919024 -3785577 -4991798
38827 -4991798 -6476187 -7150696 -6666009 -4790778 -1268375 2940490 5357887 4345055
38819 4345055 1413815 -128276 1105718 3287407 3925171 2618007 810212 -258291
38811 -258291 -491967 -206574 653873 2242163 4030789 4803040 3862415 2193737 1698427
38802 1698427 2838036 3802159 2969097 1545539 2121098 4598165 5613620 3078658 -501581
38793 -501581 -1234313 711548 1450906 -940217 -3961809 -4936346 -4982449 -6435210 -8240185
38784 -8240185 -7230429 -3473260 -906333 -1901038 -4161766 -4478914 -2950287 -1410970
38776a410970J453594K099318J524614p71619j788822J09656J781415K05916k162574
38767A040528j230204J695372J741406j558462l416005j283679J828578K832148
38759A649682K626907K540031J096993k445008m823522k863558J422516L465794
38751B669835K248310L87963m97142r82532j266671q65943n24901j346555k287759
38742b465395j460881L81541P42095m52235q65448M4771L73745l04719j43268
38733d149794R47827M50142j948709k658409J82313K989825J955752j035658j644201
38724d910912R0165O81894l74919r3775K068021K615974j94942l039153k419610
38715e577257P1666L70298j916723l081716o15959L616590N996898N235690K940055
$$ plain form
38776 -1410970 42624 2141942 3666556 2894937 1106115 1215771 2997186 3203102 1040528
38767 1040528 -189676 1505696 3247102 1688640 -1727365 -3011044 -1182466 1649682
38759 1649682 4276589 6816620 7913613 5468605 645083 -2218475 -795959 2669835
38751 2669835 4918145 5306108 4808966 3826434 2559763 1693820 1168919 -177636 -2465395
38742 -2465395 -3926276 -3544735 -2802640 -3254875 -4120323 -4075552 -3701807 -4006526 -4149794
38733 -4149794 -3201967 -2751825 -4700534 -7358943 -7176630 -4186805 -2231053 -3266711 -4910912
38724 -4910912 -4820747 -4138853 -4513772 -4607547 -2539526 76448 -118494 -3157647 -5577257
38715 -5577257 -5505591 -5135293 -7052016 -10133732 -10749691 -7133101 -1136203 4099487 7039542
38706G039542J014370l21744j717601k716729j869877P23760K336826P92751j886559
38697C394739j491940K237272M280893J010596m197247n197734j605173R74372
38689e94222n76573k577479p65675L005222L932673J641391r1122R6480l05799
38680C764896k258647l112642j611942n99273k050935l179759j003219K283086
38672g768435K708127J035289J133139L148733L345122N49596k083375k342578
38664b74382j520451p33036R20179L011311K857496N1953j931296j066037n1705
38655A264032j493030l302417k304563M72924J767243J078647J88453l44069q04355
38646c477135l55534J128425J229761j353745l337775j223479K649442L166432
$$ plain form
38706 7039542 8053912 7732168 6014567 3297838 1427961 2151721 4488547 5281298 3394739
38697 3394739 1902799 4140071 8420964 9431560 5234313 36579 -1568594 -594222
38689 -594222 -1170795 -3748274 -4513949 -1508727 2423946 4065337 3974215 4070695 3764896
38680 3764896 1506249 -1606393 -3218335 -3817608 -5868543 -9048302 -10051521 -7768435
38672 -7768435 -5060308 -4025019 -2891880 256853 3601975 4151571 2068196 -274382
38664 -274382 -1794833 -2527869 -1607690 1403621 4261117 4313070 2381774 1315737 1264032
38655 1264032 -228998 -3531415 -5835978 -5363054 -3595811 -2517164 -2328711 -2672780 -3477135
38646 -3477135 -3832669 -2704244 -1474483 -2828228 -6166003 -7389482 -4740040 -1573608
38638a573608K68489j466411m38449L29697n65977o82642R03145J302576q09249
38629b732429k113572R4986L237166L271271M69063j758429j830809r16020k49489
38620b528262n9341l47714q04022m80261J117781L076442L932371K957434N42805
38611G407233j775045k107734m92560L83431j190289k656779o15728L272084L898629
38602F123242L15204k746824j963052L72724Q96027j93129j137277j521198j046135
38593i00418R57931K798462J201971k918873l905324N32141N168109M806020J458057
38584I198076k92369o55490k078333l161632j223276J774934J922404q2216q71442
38575D530656q34965k430667l953597j883385J647311J040829l227147m610082
$$ plain form
38638 -1573608 -1305119 -2771530 -3209979 -2880282 -3446259 -4128901 -3225756 -1923180 -2732429
38629 -2732429 -4846001 -4751015 -1513849 1757422 2226485 468056 -1362753 -2278773 -2528262
38620 -2528262 -2587603 -2935317 -3739339 -4219600 -3101819 -25377 3906994 6864428 7407233
38611 7407233 5632188 3524454 3031894 3415325 2225036 -431743 -1047471 2224613 6123242
38602 6123242 6438446 3691622 1728570 2101294 2997321 2804192 1666915 145717 -900418
38593 -900418 57513 2855975 4057946 1139073 -2766251 -2234110 2933999 7740019 9198076
38584 9198076 8905707 8250217 6171884 3010252 1786976 3561910 5484314 5402098 4530656
38575 4530656 3695691 1265024 -2688573 -4571958 -2924647 -1883818 -5110965 -9721047
38567i721047q33419K955168K977139J779597J970167J646370n25173j491650
38559a242848R48291L834738L802619J964330M79082j523576m652738n859569
38551b249671k818377J428114K593207J277251P83565J352748J039732K17779
38543C624348N19143P85030j247856m135673m164082j239503R70681Q50266O04728
38534c432918J606002J974831K93371j519101j071498R27762J928395J014822
38526A721666n83635j686337k329785k785055k494716o87594K036056L529371
38518c280029K350857j70356j377340p33891j92215p96807r64845P21964K845210
38509a597452K984245J020489j088194k008083j935313j367495m07156Q46568
$$ plain form
38567 -9721047 -10554466 -7599298 -4622159 -2842562 -872395 773975 248802 -1242848
38559 -1242848 -294557 3540181 7342800 9307130 9786212 8262636 3609898 -2249671
38551 -2249671 -5068048 -3639934 -1046727 230524 1014089 2366837 3406569 3624348
38543 3624348 4143491 4928521 3680665 -455008 -4619090 -5858593 -4887912 -4037646 -3432918
38534 -3432918 -1826916 147915 441286 -1077815 -2149313 -1221551 706844 1721666
38526 1721666 1138031 -548306 -2878091 -5663146 -8157862 -8845456 -6809400 -3280029
38518 -3280029 -929172 -1099528 -2476868 -3210759 -3402974 -4199781 -5164626 -4442662 -1597452
38509 -1597452 1386793 2407282 1319088 -688995 -2624308 -3991803 -4398959 -3552391
38501c552391K015880K395940J188773j264837k645210q92471K369017K939912
38493B554613l91735l694053k889826J079700L937756L277944K70569k367993
38485A776975k401478M90190L688420L538671k58338l883755m383587l110108
38477d543010k458483j966010k83514J550377J978689J884106K412750K065037
38469F39942m07234k480015j506135K50954p33868k404072p6442M600698M752141
38460B635969p16283m413212j571960K697484J733415k469080l249966J5958J829239
38451c508436l9045j478227O10377L165265J963961j571147k198233J649737N565768
38442D160020M976467P46193k716525l302476k551936j779801k38162J873244
$$ plain form
38501 -3552391 -1536511 859429 2048202 783365 -1861845 -2754316 -385299 2554613
38493 2554613 2162878 -1531175 -4421001 -3341301 596455 3874399 4144968 1776975
38485 1776975 -624503 -134313 3554107 7092778 6834440 2950685 -1432902 -4543010
38477 -4543010 -7001493 -8967503 -9251017 -7700640 -5721951 -3837845 -1425095 639942
38469 639942 232708 -2247307 -3753442 -3502488 -4236356 -6640428 -6716870 -2116172 2635969
38460 2635969 1919686 -2493526 -4065486 -1368002 365413 -2103667 -5353633 -5337675 -3508436
38451 -3508436 -3547481 -5025708 -4415331 -1250066 713895 -857252 -3055485 -1405748 4160020
38442 4160020 9136487 9882680 7166155 3863679 1311743 -468058 -706220 1167024
38434A167024J918866j157284l846786k366571J702761L559455J863927m52712
38426B388680j433841k063626k828653k367804m90537R56067J260242J650393
38418b929079K118656J027641j070105j188281R39712J665391l52291j144442
38410i32798J964824M917432K796824j984184l003247L12214K117045n73864l771116
38401A843130l282093p51026k3339r36980m34049J891051L101210J623499m94899
38392B536504r94683o32656j157781j733964j76684K638541K921172k88544k657838
38383D54067n06138L226561K827691j643368m295916k115454J039938R16927r05517
38374a001209m06727K209824L037948M15472k928586l598107j278102J434384
$$ plain form
38434 1167024 3085890 1928606 -1918180 -4284751 -2581990 977465 2841392 2388680
38426 2388680 954839 -1108787 -3937440 -6305244 -6795781 -5839714 -4579472 -2929079
38418 -2929079 -810423 217218 -852887 -2041168 -1101456 563935 211644 -932798
38410 -932798 1032026 5949458 8746282 6762098 3758851 4071065 6188110 5614246 1843130
38401 1843130 -1438963 -2189989 -2213328 -3150308 -3584357 -1693306 1407904 3031403 2536504
38392 2536504 1541821 909165 -248616 -1982580 -2159264 479277 3400449 3111905 454067
38383 454067 -52071 3174490 6002181 4358813 62897 -2052557 -1012619 -95692 -1001209
38374 -1001209 -1407936 801888 3839836 4255308 1326722 -2271385 -3549487 -2115103
38366b115103J888403J43184r54301O97728L142746K574596j105201l752835k790906
38357b271689m27375M26448K37125N95180Q54224q8814j012699l57875R17019
38348a128456J205066J012285J149064M25918j745397k796227p09578J838891
38340g48434J157840j445555j818766L02723J579299J128659J101679J549807
38332B807252K13698k065904j275740K917873N354530K733944j590389k903759
38324F191505j509969p34722j420118j663228l57836J622692K816185K227897
38316G172406J24580j445112o08082J314876J019898j855591l722859k117421
38308a17305R37216K182240J233668k70341j366505j828474j437161p11833o58872
$$ plain form
38366 -2115103 -226700 -83516 -1037817 -340089 2802657 5377253 4272052 519217 -2271689
38357 -2271689 -2699064 -2272616 -2035491 -1440311 -586087 -674901 -1687600 -2045475 -1128456
38348 -1128456 76610 1088895 2237959 2663877 918480 -1877747 -2587325 -748434
38340 -748434 409406 -1036149 -2854915 -2552192 -972893 155766 1257445 2807252
38332 2807252 3020950 955046 -320694 2597179 7951709 10685653 9095264 6191505
38324 6191505 4681536 3946814 2526696 863468 505632 2128324 4944509 7172406
38316 7172406 7296986 5851874 5243792 6558668 7578566 5722975 2000116 -117305
38308 -117305 819911 3002151 4235819 3965478 2598973 770499 -666662 -1378495 -2037367
38299b037367q34979K34970K013503K060690N7802j462872j498431j954525l095696
38290f516905j963980K056782M447452J942068k130540l016920j495375r63469
38282g640887q88171J186845L555121K557904l88983l11686L050585M642249K306579
38273H069556k99718l52228Q4215j226956k688067k181616n63454O21159J616411
38264C079302K469749J776854l85940j352530M5914J236162P2998j667592j545153
38255C729764m70677o39998j826855k565226k857439k934227j563296J402457
38247g725497L073348J598582P9751K274940N944113N275495m28751n304235m967334
38238a79588j741210j67696q44331j218977k09008P25933L27880o72732o84401
$$ plain form
38299 -2037367 -2872346 -2637376 -623873 1436817 1494619 31747 -1466684 -3421209 -6516905
38290 -6516905 -8480885 -6424103 -1976651 -34583 -2165123 -5182043 -6677418 -7640887
38282 -7640887 -8529058 -7342213 -3787092 -1229188 -1618171 -1929857 1120728 5762977 8069556
38273 8069556 7769838 7417610 7501825 6274869 3586802 1405186 841732 1462891 3079302
38264 3079302 5549051 7325905 6939965 5587435 5633349 6869511 6942509 5274917 3729764
38255 3729764 3259087 2619089 792234 -1772992 -4630431 -7564658 -9127954 -7725497
38247 -7725497 -4652149 -3053567 -2973816 -698876 5245237 10520732 10091981 4787746 -179588
38238 -179588 -1920798 -2088494 -2932825 -4151802 -4360810 -3634877 -3306997 -3979729 -4664130
38229d664130O59354J873384J329902l77281q20434P75565J886662J65291k769060
38220a940747l371446j128368J206611J813707J325060L73315j135755k041295
38212d898918n82287K237401L230095J844249Q56745J157271J07678k792105l265577
38203b105448R62266M785262K253507m191582o782903l396764N37290J059611
38195f878761N34695J862916L224922J716068j521757l209800k601345j246872
38187h119934J72487J950091L343154K949500P55779j780751l284302l104791
38179g118767j295002J010242K091116J434470J42167q98908j748288j837276
38171h220246P6856L193286M325361K135206n40791q24083N6980l97635j234191
$$ plain form
38229 -4664130 -4004776 -2131392 -801490 -1178771 -1999205 -1223640 663022 828313 -1940747
38220 -1940747 -5312193 -6440561 -5233950 -3420243 -2095183 -1721868 -2857623 -4898918
38212 -4898918 -5481205 -3243804 -13709 1830540 2687285 3844556 3952234 1160129 -2105448
38203 -2105448 -1143182 3642080 5895587 1704005 -5078898 -8475662 -7938372 -6878761
38195 -6878761 -6344066 -4481150 -1256228 459840 -1061917 -4271717 -6873062 -8119934
38187 -8119934 -7947447 -5997356 -2654202 295298 1051077 -729674 -4013976 -7118767
38179 -7118767 -8413769 -7403527 -5312411 -3877941 -3735774 -4634682 -6382970 -8220246
38171 -8220246 -8143390 -4950104 -624743 1510463 969672 145589 202569 -195066 -1429257
38162a429257l0187J905930R46385k506512l770847q73173K496584K685490R05136
38153C29549P5948K24884l4716j45115Q69431J468503j54246k123554j070723
38144e60039K179977L197939P77790q97403J271204M286535L589798K3153j732514
38135A2136440n10549j3339k355592m526913l375107p02282j97127j569042j569551
38126b683062K58056J001534l13201q32367J423790M263911M562755K224945q84671
38117I021690l563889m885689l573885j36145K349675J928011L82250k5495l2384
38108A464139q23763p33607J612876L215090O49402l421816l273297Q34849K626563
38099B150436m00962l185351j290174K501542L091999L40083k252405k947328
$$ plain form
38162 -1429257 -1459444 446486 1392871 -1113641 -4884488 -5757661 -3261077 -575587 329549
38153 329549 405497 630381 595665 450550 1319981 2788484 2634238 510684 -560039
38144 -560039 1619938 4817877 5595667 4698264 5969468 10256003 13845801 13868954 12136440
38135 12136440 11625891 11612552 9256960 4730047 1354940 652658 455531 -1113511 -2683062
38126 -2683062 -2425006 -1423472 -1736673 -2569040 -1145250 3118661 7681416 9906361 9021690
38117 9021690 5457801 572112 -3001773 -3137918 -788243 1139768 1522018 1496523 1464139
38108 1464139 640376 -93231 1519645 4734735 5384137 1962321 -1310976 -476127 2150436
38099 2150436 1749474 -1435877 -2726051 -224509 2867490 3207573 955168 -1992160
38091a992160k266333n15172J806254K908659J877952L96924J03340J28272o77455
38082A770281j381912j136520j215779k321473k428566k28790J880027J523328
38074c539404M67842J263600K295047O38955k161241k163492L66987J493941J46042
38065a191723r16173n42722n52662j230003m65214J546677J511140j407789l514236
38056f762705k094642P21768J755774J111737N11087K46538N4344N20692J565058
38047b370349J755366Q18472M67717J200844J002452r30222k046149l98845J852758
38038A352044J665665k54504r25035L54264J643521J444847k07076k671869m577576
38029b175719l895413l62375L061568L241177O69475j544164j656001m88515N74318
$$ plain form
38091 -1992160 -4258493 -4773665 -2967411 -58752 1819200 2216124 2319464 2447736 1770281
38082 1770281 388369 -748151 -1963930 -4285403 -6713969 -6942759 -5062732 -3539404
38074 -3539404 -3071562 -1807962 487085 1126040 -1035201 -3198693 -2831706 -1337765 -1191723
38065 -1191723 -2107896 -2650618 -3203280 -4433283 -4898497 -3351820 -1840680 -3248469 -6762705
38056 -6762705 -8857347 -8135579 -6379805 -5268068 -4756981 -4510443 -4456099 -3935407 -2370349
38047 -2370349 -614983 203489 671206 1872050 2874502 1944280 -101869 -500714 1352044
38038 1352044 3017709 2763205 1838170 2192434 3835955 5280802 5073726 2401857 -2175719
38029 -2175719 -6071132 -6433507 -3371939 -130762 538713 -1005451 -2661452 -3149967 -2575649
38020b575649R98611R16674Q38184J161816J361124O36087k91186J81506J548888
38011D776055J293591r64259k257915r23838N50848k98781j890074j735679p40851
38002b190903p54975n27393J550913K974075N44876l219855k817506J520762L711236
37993G91230J091484j957852j465370L90168p0576j953992j995475R6597J963158
37984c110628K339810J606663J31624j460070j684019m6532J668328J782579J060390
37975B288145Q55722M48298j490512l843076l956807j385852J293479J693846
37967d096757L62221j39253J557055L674698L126789k36749k489905n87106K700931
37958C871924K042640k539332n207608k875472K93938l38148k708694j804581
$$ plain form
38020 -2575649 -1577038 -660364 177820 1339636 2700760 3336847 3045661 3227167 4776055
38011 4776055 6069646 5105387 2847472 1923634 2474482 2175701 285627 -1450052 -2190903
38002 -2190903 -2945878 -3473271 -1922358 1051717 1596593 -1623262 -4440768 -2920006 791230
37993 791230 1882714 -75138 -1540508 -1150340 -1220916 -3174908 -5170383 -5073786 -3110628
37984 -3110628 -770818 835845 967469 -492601 -2176620 -2223152 -554824 1227755 2288145
37975 2288145 3143867 3592165 2101653 -1741423 -5698230 -7084082 -5790603 -4096757
37967 -4096757 -3734536 -3873789 -2316734 1357964 4484753 4248004 1758099 1170993 3871924
37958 3871924 5914564 3375232 -1832376 -4707848 -4413910 -4752058 -7460752 -9265333
37950i265333K276607M832449L631052Q42553j356864k587827j907874J635273
37942a899964N388140M560241r94969n285474l678556J212167L550797J570736
37934D423118j843561l801697l683116k029256N487O51574o68793j874808o33182
37925i454234K111197L154635J480678n49764p72958K06191Q03928P87921N70583
37916a661823m2968p24431J86924L049606M613307J495222m116618n844516j518539
37907d563836L317514K962444n05648j064055J574061J858947j986671m496116
37899b903360j590562K730306K630119o16483j280542J616412L587859K374848
37891F548597O36734L92620n377j724769k719209j411600M02993O71313J29369
$$ plain form
37950 -9265333 -6988726 -2156277 1474775 2317328 960464 -1627363 -3535237 -1899964
37942 -1899964 3488176 8048417 7053448 1767974 -1910582 -698415 2852382 4423118
37934 4423118 2579557 -1222140 -4905256 -6934512 -6929025 -6277451 -6946244 -8821052 -9454234
37925 -9454234 -7343037 -4188402 -2707724 -3257488 -4030446 -3824255 -3020327 -2232406 -1661823
37916 -1661823 -1704791 -2429222 -2242298 807308 5420615 6915837 2799219 -3045297 -4563836
37907 -4563836 -1246322 1716122 1210474 146419 1720480 3579427 1592756 -2903360
37899 -2903360 -4493922 -1763616 866503 250020 -1030522 585890 4173749 6548597
37891 6548597 7185331 7577951 7572574 5847805 3128596 1716996 2119989 2791302 2920671
37882B920671k3729o63896k412554l271867j406248J626218L065958K675134J768265
37873D277952L46411j914076l337782k124481L31443J008173l84966j364120n81308
37864c742754Q19015J472891J064118l25238j933224k042829l01491P18182q79494
37855e150824k385865k4487M286021M492038o57962n098359l745219J021636L861876
37846c401145L660137K699384J619170n40249k753373k610028l42632R98474k09864
37837h80126k176630k487149j008711O58258J375060J429483J781207K588348
37829A279740K625680Q27599j690493k583476j620736j237137k776649m158676
37821i334148k909620K05125K565111L249108K994898J910199j50636j746580
$$ plain form
37882 2920671 2896942 2233046 -179508 -3451375 -4857623 -3231405 -165447 2509687 4277952
37873 4277952 4624363 2710287 -627495 -2751976 -2420533 -1412360 -1797326 -3161446 -3742754
37864 -3742754 -2923739 -1450848 -386730 -711968 -2645192 -4688021 -4989512 -4271330 -5150824
37855 -5150824 -7536689 -7561176 -3275155 1216883 558921 -4539438 -8284657 -7263021 -3401145
37846 -3401145 258992 2958376 4577546 4037297 1283924 -1326104 -1668736 -670262 -880126
37837 -880126 -3056756 -5543905 -6552616 -5894358 -4519298 -3089815 -1308608 1279740
37829 1279740 3905420 4733019 3042526 459050 -1161686 -2398823 -5175472 -9334148
37821 -9334148 -12243768 -12038643 -9473532 -6224424 -3229526 -1319327 -1469963 -3216543
37813c216543j206465L92087K78491j769182k737629n99029K845905M275871K566695
37804H30201n39298k409988j701805N67256J929314J121080n21027j170390j141870
37795c036527j858805k970069k658413o41297J286189J883106J684608J338657
37787d972551O34090l81640j017538j085838r63809m41520Q46799J984317J791307
37778c606383J143353J794210K823897J315801k641287m854894k642094J202364
37770e465033K270045K47712j618051j169253R57932L185590M261263L286629
37762E956834M80638k272967l029530j753153R4616J247647J179612k470j214954
37753F86273r23637R65924K593629K326422N42548j291723k089154j269135Q86774
$$ plain form
37813 -3216543 -4423008 -4030921 -3752430 -5521612 -8259241 -8858270 -6012365 -1736494 830201
37804 830201 290903 -2119085 -3820890 -3253634 -1324320 -203240 -724267 -1894657 -3036527
37795 -3036527 -4895332 -7865401 -10523814 -11165111 -9878922 -7995816 -6311208 -4972551
37787 -4972551 -4338461 -4720101 -5737639 -6823477 -7787286 -8228806 -7382007 -5397690 -3606383
37778 -3606383 -2463030 -668820 2155077 3470878 829591 -4025303 -6667397 -5465033
37770 -5465033 -3194988 -2947276 -4565327 -5734580 -4776648 -1591058 2670205 5956834
37762 5956834 6437472 4164505 1134975 -618178 -523562 724085 1903697 1901227 686273
37753 686273 -237364 728560 3322189 5648611 6191159 4899436 2810282 1541147 2427921
37744B427921K426466J294116j479679k398054l07318J950772J937428P34952
37736F586604j9903q89314j999913j190346J836498K911229p01151m743262l550721
37727a760279J042285K422128m34705k033874P361J343931j073969l540251j637245
37718e664618K820866M728771K521981j232900l734907l655035r57592K544247
37710b629187M040938K820394Q18712p62602k661238m386277l498832J7001K379498
37701c861593J525374K76682J020530J299713j178623l016384p6321M848535N527693
37692F365606J882014m11952N72506O82760k148104l977165j710606J575559J710626
37683D541244l40637j106770k85850P8604k07618Q9927N47709p5583r27088k19702
$$ plain form
37744 2427921 4854387 6148503 4668824 2270770 1963452 3914224 5851652 6586604
37736 6586604 6566701 5677387 3677474 2487128 4323626 7234855 6533704 1790442 -1760279
37727 -1760279 -717994 1704134 1269429 -764445 -757084 586847 -487122 -4027373 -5664618
37718 -5664618 -2843752 1885019 4407000 3174100 -560807 -4215842 -5173434 -2629187
37710 -2629187 1411751 4232145 5050857 4288255 1627017 -2759260 -6258092 -6241091 -3861593
37701 -3861593 -2336219 -2059537 -1039007 260706 -917917 -3934301 -4010622 837913 6365606
37692 6365606 8247620 7835668 8408174 9090934 6942830 2965665 1255059 2830618 4541244
37683 4541244 4200607 3093837 2807987 2886591 2678973 2768900 3316609 3241026 2313938 2094236
37673B094236J378898J594162L90105p8852O42113N20603j257150k620938j882009
37664G81168l32404M7418l34074J51468J326318J560118O92916L85565J200843
37655E479336J292338q78500l860111m808798l169224j119565l75435k33771N88406
37646g085324J686771J805288R87048M15047N52177Q44032J037541J362945J490870
37637C096395Q72623K26073Q87321K197750J563284j696121m458229l679558p68407
37628a758869L76506r99765j658108N63431L561176M138365K258972K46621r06070
37619E822259k179295l868546m401882k390120J352399M437232M943583K707907
37611F423537o17056k574131j827899M29448J526091J36017k355604l495173k233484
$$ plain form
37673 2094236 3473134 5067296 5457401 5378549 6020662 6541265 5284115 2663177 781168
37664 781168 448764 496182 162108 313576 1639894 3200012 3892928 4278493 5479336
37655 5479336 6771674 5893174 2033063 -2775735 -5944959 -7064524 -7439959 -7673730 -7085324
37646 -7085324 -5398553 -3593265 -2606217 -2191170 -1638993 -794961 242580 1605525 3096395
37637 3096395 3969018 4195091 5082412 7280162 8843446 7147325 2689096 -990462 -1758869
37628 -1758869 -1382363 -2382128 -4040236 -3476805 84371 4222736 6481708 6728329 5822259
37619 5822259 3642964 -225582 -4627464 -7017584 -5665185 -1227953 3715630 6423537
37611 6423537 5806481 3232350 1404451 1833899 3359990 3496007 1140403 -2354770 -4588254
37602d588254M21274K556380K829192J401055k15397p19588n80710j289330k925844
37593c111222l674372k356417j90422R89291J119699J196171J221640N71973l30147
37584d563806o04440o75639j385451j729778m028K721295L186914Q41629q52603
37575c065907L43244J846316N25327j948662j755347N50050O49525k357529l952128
37566i165111j025040L204642L977579J787129O54604J381006R42964j538466
37558B19307k700276l57469K611742K411625k32523j873341j720426j587478j491821
37549d720660M58671L490571L759903J86220l000274k099186P01537J001119j165574
37540a387673k173214q26601N80904P42080Q52465J359006R25414m68379p13431
$$ plain form
37602 -4588254 -4166980 -1610600 1218592 2619647 2404250 1684662 1103952 -185378 -3111222
37593 -3111222 -6785594 -9142011 -9332433 -8343142 -7223443 -6027272 -4805632 -4233659 -4563806
37584 -4563806 -5168246 -5843885 -7229336 -8959114 -8963142 -6241847 -3054933 -2213304 -3065907
37575 -3065907 -2722663 -876347 -351020 -2299682 -4055029 -3504979 -2855454 -5212983 -9165111
37566 -9165111 -10190151 -6985509 -3007930 -1220801 -566197 814809 1757773 219307
37558 219307 -2480969 -2838438 -226696 2184929 1952406 79065 -1641361 -3228839 -4720660
37549 -4720660 -4261989 -771418 2988485 3174705 174431 -1924755 -1223218 -222099 -1387673
37540 -1387673 -3560887 -4387488 -3806584 -3064504 -2212039 -853033 72381 -395998 -1109429
37531a109429R30135K439430K385073J870702J764453Q90102j231436k531982
37523E407048j447944M11408P63301k09276j193906k060687k714590j905729L74928
37514b575447J517719k6807j919921j710985r80457k029169k809680K8731M485317
37505f020699N057867J124281j868254n12530K204352K369914N48913o76942r36505
37496A290397j118549r65921j88054K09155j56048P9102J321194J596475l3435
37487B034316j152278K54619K039803J092420j500892k078969j05294J472254
37479B055979J228314R47262J787786K098551M20695j863740k617241j963698
37471B093908j445911j269868k73894J598851K452788P52465k276815l554279
$$ plain form
37531 -1109429 -179294 2260136 4645209 6515911 8280364 9170466 7939030 5407048
37523 5407048 3959104 4370512 5133813 4924537 3730631 1669944 -1044646 -2950375 -2575447
37514 -2575447 -1057728 -1084535 -3004456 -4715441 -5695898 -7725067 -10534747 -10506016 -6020699
37505 -6020699 -962832 161449 -1706805 -2219335 -14983 2354931 2903844 2226902 1290397
37496 1290397 171848 -794073 -982127 -772972 -929020 -849918 471276 2067751 2034316
37487 2034316 882038 1136657 3176460 4268880 2767988 689019 583725 2055979
37479 2055979 3284293 4231555 6019341 8117892 8538587 6674847 4057606 2093908
37471 2093908 647997 -621871 -895765 703086 3155874 3908339 1631524 -1922755
37463a922755j640531J399129K400495R97722j44803P65390K040580J027029j780610
37454C141646l000257p89472K644376L797091K061240r7959p49158o78865j369864
37445D958778k246539j672796j56740k48977k620721m460525l298605n61823Q37202
37436i470746R44215J968072L894118M208155K166142J74196J410L52415m84664
37427C753313j876289k245150j441132l11889O48052J136306R22027O56662J265644
37418B507544K036271J267901o98145j542910p82561o87593k251274l277153k107708
37409e535628k40327O58335J240741J894179J089891j121692j624017O08680J753074
37400a276764n73723k431019n2261K874815J071933k545377j118157M015726M691260
$$ plain form
37463 -1922755 -3563286 -2164157 236338 1234060 1089257 1854647 3895227 4922256 3141646
37454 3141646 141389 -648083 1996293 5793384 7854624 7756665 7007507 6328642 4958778
37445 4958778 2712239 1039443 882703 633726 -1986995 -6447520 -9746125 -10307948 -9470746
37436 -9470746 -8526531 -6558459 -2664341 1543814 3709956 3884152 3885562 4237977 3753313
37427 3753313 1877024 -368126 -1809258 -2121147 -1473095 -336789 585238 1241900 2507544
37418 2507544 4543815 5811716 5113571 3570661 2788100 2100507 -150767 -3427920 -5535628
37409 -5535628 -5775955 -5117620 -3876879 -1982700 -892809 -2014501 -3638518 -3029838 -1276764
37400 -1276764 -1850487 -4281506 -4333767 -1458952 -387019 -2932396 -4050553 -34827 4656433
37391D656433m90056l571758m15853K891911R11063k470667k023608l92025k055723
37382b960283m003008q52784M643534N053421K36367k738397j185057O2995j764575
37373c507787k593990O69720M099037K885286j063164k312206J97563K794991
37365A169450K972448J714352N34657n06884j518458j839478j139130j91649M4562
37356A239870m50798q66633n92845P838R0939l20826j90898P12460Q34681r80669
37346e16881l182875l339166j717681o00524k15244J514028M455282N033364J591749
37337C022052k042121j518190J569119J928468j671163m850073m040550p68165
37329h370623J641177K407044K411518J566481l15364j623557p22668J084340
$$ plain form
37391 4656433 4166377 594619 178766 3070677 3981740 1511073 -512535 -904560 -2960283
37382 -2960283 -6963291 -7816075 -3172541 1880880 2117247 -621150 -1806207 -1743212 -3507787
37373 -3507787 -6101777 -5432057 -1333020 1552266 489102 -1823104 -1625541 1169450
37365 1169450 4141898 5856250 6390907 5884023 4365565 2526087 1386957 1195308 1239870
37356 1239870 789072 -77561 -670406 -662568 -571629 -892455 -1083353 -370893 463788 -516881
37346 -516881 -3699756 -7038922 -8756603 -9357127 -9572371 -8058343 -3603061 1430303 3022052
37337 3022052 979931 -538259 1030860 2959328 1288165 -3561908 -7602458 -8370623
37329 -8370623 -6729446 -4322402 -1910884 -344403 -659767 -2283324 -3005992 -1921652
37321a921652R95289j015239j917392j75142J752513P97477k409466m289632k701177
37312a0884421Q14520L007297K218211k64322j629865m10331J995154L148301
37304b005456K745387K607240L210605K340507j222578m560267l878860J1457
37296g51965K602771J958678O55088O75880J21311k642036m705621k313288K701508
37287a697674M418557R26703k916365k243164J383589K721949J28868k857795
37279a35332k696702J42501K910297M087710L770239K075324p76663l220951l238152
37270B918271r75818J025212Q84478o90128k199098l317339l756681k113191J754869
37261f469425M577616L019571j307306l404696j509207J193160J835846J044925
$$ plain form
37321 -1921652 -926363 -1941602 -3858994 -4034136 -2281623 -1484146 -3893612 -8183244 -10884421
37312 -10884421 -10069901 -7062604 -4844393 -5108715 -6738580 -7148911 -5153757 -2005456
37304 -2005456 739931 3347171 6557776 8898283 7675705 3115438 -763422 -751965
37296 -751965 1850806 3809484 4464572 5140452 5261763 2619727 -2085894 -4399182 -1697674
37287 -1697674 2720883 3647586 731221 -1511943 -128354 2593595 2722463 -135332
37279 -135332 -2832034 -2689533 220764 4308474 8078713 10154037 9377374 6156423 2918271
37270 2918271 1942453 2967665 3852143 3162015 962917 -2354422 -6111103 -8224294 -6469425
37261 -6469425 -1891809 1127762 -179544 -3584240 -5093447 -3900287 -2064441 -1019516
37253a019516j41529k203735l948829j932204L562913O255505K241668l056819
37245b42546k227943K683210L360183j389770l769074L01808M847909L762869
37237G326646k9519n96312J323568J011919j461830j865460N01612J922858O88549
37228H822031r32184j379530j715683k164659j070391J446648K484707N99662
37220F090601j870035k238705q52009K79437J43693j083904k599569k786720l53565
37211e270776L437673N391194L981532Q07449j820662k864649k057499J52534
37203A756796J798571J114051n31589k77876J279997M79706l031307m612380j608866
37194c632897K151687K182269n5721n70108K81723n22999k190979j085314K404023
$$ plain form
37253 -1019516 -1161045 -3364780 -7313609 -9245813 -5682900 572605 2814273 -242546
37245 -242546 -2470489 212721 3572904 2183134 -1585940 -1284132 3563777 7326646
37237 7326646 7297127 6700815 8024383 9036302 7574472 5709012 6210624 8133482 8822031
37228 8822031 7889847 6510317 4794634 2629975 1559584 3006232 5490939 6090601
37220 6090601 4220566 1981861 1129852 1409289 1552982 469078 -2130491 -4917211 -5270776
37211 -5270776 -1833103 3558091 7539623 8347072 6526410 3661761 1604262 1756796
37203 1756796 3555367 4669418 4137829 3859953 5139950 5619656 2588349 -2024031 -3632897
37194 -3632897 -1481210 701059 645338 75230 356953 -166046 -2357025 -3442339 -1038316
37185a038316L533653L96112l368898m162780k426245K29750L554334O330709
37177C048319N564028Q55498l471338l585305j112639o8843j027434j544331p92179
37168b134224l01877p06164q51441k23255K07893j01515l73113J27233J149430
37159c207033J984637J969386Q42089m46234j56354J657194K183561m28405l435745
37150I63096k536847J711580L939246J319793k411856k294107J178951L501662
37142E371518K512906J07046j554200k188406j750485k669J440087j18080l973124
37133a55407n331768j609509L236205L997866J583150P04971J732357N04259l617889
37124A044235n747685l464215p21129l96631R65504N712523Q066634K219525o432705
$$ plain form
37185 -1038316 2495337 2891449 -477449 -4640229 -7066474 -6836724 -3282390 3048319
37177 3048319 8612347 9467845 5996507 2411202 1298563 1229720 202286 -1342045 -2134224
37168 -2134224 -2436101 -3142265 -3993706 -4216961 -4009068 -4110583 -4483696 -4356463 -3207033
37159 -3207033 -1222396 746990 1589079 1142845 986491 2643685 4827246 4398841 963096
37150 963096 -1573751 137829 4077075 5396868 2985012 690905 1869856 5371518
37142 5371518 7884424 7991470 6437270 4248864 2498379 2495710 3935797 3817717 -155407
37133 -155407 -5487175 -7096684 -3860479 137387 1720537 2425508 4157865 4662124 1044235
37124 1044235 -4703450 -8167665 -8888794 -9285425 -8319921 -2607398 5459236 7678761 1246056
37115A246056p347061m91287L892237J460979q56832J544975K785969j998658
37107B36378o394488k720430M517647N253343l48027l260331p19635P55431k082723
37098d762835l769076j16696M703592N219782K399020M2646j373281k848305k979906
37089c485059m36219K485921K595965J04624k551187l961199l551572q08020K887801
37080f718945M329798K790250J424332K066071K113946l80945k355908o86446
37072B582153J882126R52084j910359j708832J249612J605445j943799m126850
37064a418420j434096K504189K786933K71749q25250M34307J150461o35401l582374
37055g47902n075952l666239J32104L992703N134542K835583n62098j985554p03660
$$ plain form
37115 1246056 -6101005 -6592292 -2700055 -1239076 -2095908 -550933 2235036 236378
37107 236378 -6158110 -8878540 -4360893 892450 544423 -2715908 -3435543 -2680112 -4762835
37098 -4762835 -8531911 -8648607 -3945015 1274767 3673787 3716433 2343152 -505153 -3485059
37089 -3485059 -3921278 -1435357 1160608 1265232 -1285955 -5247154 -8798726 -9606746 -6718945
37080 -6718945 -2389147 401103 1825435 3891506 6005452 5624507 3268599 2582153
37072 2582153 4464279 5416363 3506004 1797172 3046784 4652229 2708430 -1418420
37064 -1418420 -2852516 -348327 2438606 2710355 1885105 2319412 3469873 2834472 -747902
37055 -747902 -5823854 -9490093 -9357989 -5365286 -230744 2604839 2042741 57187 -646473
37046f46473J472554K503545J903650N71860m56015j037376j788666k778942k799985
37037c055848q56753J792560K484999N33607j538575j158729Q51009J413929n53513
37028h7314k659305k356481m14908L48860p22742j191179N31238K304044J371900
37019b875887r16257o01464K623416M140209R61176l536006m163353r31375J912169
37010c387372K340914J995199J631705l77181l893057n358903k592382J640272
37002h000805L348120K343627R36634k68285j919157k682077m72271L190837L981939
36993D58562R04425j877054j071206J098989R70235n65855Q335K382326K445113
36984D753870r63358l632914k025765J702247L180112J685887l23917j521949
$$ plain form
37046 -646473 826081 3329626 5233276 5805136 5349121 4311745 2523079 -255863 -3055848
37037 -3055848 -3912601 -2120041 364958 898565 -640010 -1798739 -947730 466199 -87314
37028 -87314 -2746619 -5103100 -5518008 -5169148 -5891890 -7083069 -6551831 -4247787 -2875887
37019 -2875887 -3792144 -4393608 -1770192 2370017 3331193 -204813 -4368166 -5299541 -3387372
37010 -3387372 -1046458 948741 2580446 2203265 -1689792 -7048695 -9641077 -8000805
37002 -8000805 -4652685 -2309058 -1372424 -1640709 -3559866 -6241943 -6714214 -3523377 458562
36993 458562 1362987 -514067 -1585273 -486284 483951 -81904 -73569 2308757 4753870
36984 4753870 3790512 157598 -1868167 -165920 3014192 4700079 4376162 2854213
36976B854213k271981k166083m99340J234500O51523j588820k203019o4999K274903
36967a779103K461393R89681p25963k133836k419568m48284K777899M194562K702163
36958E618944O73647N5551k26757j196340j252020O81190K105766K98921l185255
36949C573647m563215k944271m21752J569410K848672K605365K62289k378781
36941E51364k910538j828503j486011k052895j425572J059974L580256M472270
36933c9655L611525J436996j139806k360147j476703l37922p94384j575161m98188
36924c173445J440971J604046L69442L87755J701167J724794O6017q24394k18681
36915C077672k07336j484741k033971j022050k01569l58082r1931Q61699J047700
$$ plain form
36976 2854213 582232 -1583851 -2083191 -848691 -197168 -1785988 -3989007 -4054006 -1779103
36967 -1779103 682290 1671971 946008 -1187828 -3607396 -4055680 -1277781 2916781 5618944
36958 5618944 6292591 6348142 6121385 4925045 3673025 4354215 6459981 6758902 3573647
36949 3573647 -989568 -3933839 -4355591 -2786181 62491 2667856 2930145 551364
36941 551364 -2359174 -4187677 -5673688 -7726583 -9152155 -8092181 -4511925 -39655
36933 -39655 3571870 5008866 3869060 1508913 32210 -305712 -1100096 -2675257 -3173445
36924 -3173445 -1732474 -128428 241014 628769 2329936 4054730 4120747 3296353 3077672
36915 3077672 2870336 1385595 -648376 -1670426 -1871995 -2230077 -2322008 -1460309 -412609
36906d12609J029355L183263O193290M783046k222890q198371o925220q87893
36898c458029K774173J737776m94882j099536q56518j061966j195298j67169K068169
36889a753280M238002M301755J332390k479752l545145j467094M15874J00200
36881A142950m75320M56283J149015k53608k010189j698172l62357l21118q71988
36872c244504K13040K372332K918644J106699j390492l182915l809944k814356
36864g831496o38269P48420L96848J02906J381690K646692J960175M44292o0483
36855h49225n36265k434352l792746j848153J792735K803586L15738k308868k387898
36846i245448k48123K663513M748926M238146J457430o6419J790433L633272J168799
$$ plain form
36906 -412609 616746 3800009 9993299 14776345 12553455 4355084 -2570136 -3458029
36898 -3458029 -683856 1053920 559038 -540498 -1397016 -2458982 -3654280 -3821449 -1753280
36889 -1753280 2484722 6786477 8118867 5639115 2093970 626876 1042750 1142950
36881 1142950 667630 1123913 2272928 2019320 9131 -1689041 -2051398 -2372516 -3244504
36872 -3244504 -3031464 -659132 2259512 3366211 1975719 -1207196 -5017140 -7831496
36864 -7831496 -8469765 -7721345 -7324497 -7221591 -5839901 -3193209 -1233034 -788742 -849225
36855 -849225 -1385490 -3819842 -7612588 -9460741 -7668006 -4864420 -4548682 -6857550 -9245448
36846 -9245448 -9493571 -6830058 -2081132 2157014 3614444 3548025 5338458 8971730 10140529
36837A0140529l629892m959764j854912R80355Q00324k50535l50522o76106j574161
36828a374684j066023J061608K025360O35659q49344r34612r27340j335383m92152
36819c256911J491350J738860l15946j142554J090756L060856J581281j429387
36811B818305k529981j924922j595787j292544p4436O88542l59798j269641M37249
36802e103013L284081L794769J764716K3088k99404p33176j836200j911102j13527
36793a129768J594269Q63104j861514l646040k378208P60247K652624K091965
36785a053321R66913P09051l51792l454743n163924j203424N865625Q133887K852146
36776G300418l604610m679613j742084J79686L74670J401311L081192K806285
$$ plain form
36837 10140529 6510637 1550873 -304039 676316 1476640 1226105 875583 199477 -1374684
36828 -1374684 -2440707 -1379099 646261 1281920 432576 -502036 -1429376 -2764759 -3256911
36819 -3256911 -1765561 -26701 -342647 -1485201 -394445 2666411 4247692 2818305
36811 2818305 288324 -1636598 -3232385 -4524929 -4599365 -3910823 -4270621 -5540262 -5103013
36802 -5103013 -1818932 1975837 3740553 3763641 3464237 2731061 894861 -1016241 -1129768
36793 -1129768 464501 1327605 -533909 -4179949 -6558157 -5797910 -3145286 -1053321
36785 -1053321 -86408 622643 270851 -3183892 -8347816 -9551240 -3685615 4448272 7300418
36776 7300418 3695808 -983805 -2725889 -2546203 -2171533 -770222 2310970 5117255
36768E117255N23554j185618j501794j973796k924826k701089p78100J099642
36760d324772J289972r6438j894898k772440j873381R0926J132346M97310k68916
36751h220291J48626R12589R84296J014849J575887J547906K53325p94673l35064
$$ plain form
36768 5117255 5640809 4455191 2953397 979601 -1945225 -4646314 -5424414 -4324772
36760 -4324772 -3034800 -3131238 -5026136 -7798576 -9671957 -9581031 -8448685 -7951375 -8220291
36751 -8220291 -8071665 -7159076 -6174780 -5159931 -3584044 -2036138 -1782813 -2577486 -2912550
$$ [...]
##END NTUPLES=NMR SPECTRUM
##END=
