##TITLE=31Pdec_LR-669-RM2
 CDCl3, 124 sc
 9.4.2019
##JCAMPDX= 6.0         $$ Bruker NMR JCAMP-DX V2.0
##DATA TYPE= NMR SPECTRUM
##DATA CLASS= NTUPLES
##ORIGIN= UXNMR, Bruker Analytische Messtechnik GmbH
##OWNER= root
$$ XWIN-NMR		Version 3.5
$$ Tue Apr  9 16:19:45 2019 Russian Standard Time (UT+4h)  she@DPX200
##.OBSERVE FREQUENCY= 81.013821
##.OBSERVE NUCLEUS= ^31P
##.ACQUISITION MODE= SIMULTANEOUS
##.ACQUISITION SCHEME= undefined
##.AVERAGES= 124
##.DIGITISER RES= 17
##SPECTROMETER/DATA SYSTEM= spect
##.PULSE SEQUENCE= zgpg30
##.SOLVENT NAME= CDCl3
##.SHIFT REFERENCE= (INTERNAL, CDCl3, 0, 182.463)
##AUDIT TRAIL= $$ (NUMBER, WHEN, WHO, WHERE, WHAT)
$$ ##TITLE= Audit trail, XWIN-NMR		Version 3.5
$$ ##JCAMPDX= 5.01
$$ ##ORIGIN= Bruker BioSpin GmbH
$$ ##OWNER= she
$$ F:/spectra/data/she/nmr/P31/1/pdata/1/auditp.txt
$$ ##AUDIT TRAIL=  $$ (NUMBER, WHEN, WHO, WHERE, WHAT)
(   1,<2019-04-09 16:19:00.51 +0400>,<she>,<DPX200>,
      <continue with go, POWCHK disabled, PULCHK disabled
       configuration hash MD5:
       00 E9 B6 7A A2 85 ED C7 34 08 36 98 17 FE 4E 26
       data hash MD5: 32K
       6F 72 ED 57 BF 1A 14 05 4E EC 26 8A E6 AA 3F C5>)
(   2,<2019-04-09 16:19:02.21 +0400>,<she>,<DPX200>,
      <Start of raw data processing
       efp BC_mod = 2 LB = 1 FT_mod = 6 PKNL = 1 PHC0 = -1799.478 PHC1 = 71.19899 SI = 64K 
       data hash MD5: 64K
       D0 86 60 6F 6A 85 9C 8F 08 13 B0 CB 87 C5 E3 53>)
(   3,<2019-04-09 16:19:19.71 +0400>,<she>,<DPX200>,
      <pk PHC0 = 1.936336 PHC1 = 0 
       data hash MD5: 64K
       D3 B5 C9 E8 E5 B4 9C 52 BC B0 4F 72 1B E9 4B 17>)
(   4,<2019-04-09 16:19:22.92 +0400>,<she>,<DPX200>,
      <abs ABSG = 5 
       data hash MD5: 64K
       63 84 3E EE B9 BB E4 DE B5 28 2E 7E 1C D7 29 AE>)
$$ ##END=
$$ 
$$ hash MD5
$$ 08 19 4E 2C 30 F6 35 7B 29 79 7E 53 1D 07 76 D7
##$RELAX= 
##$RELAX= 
##$RELAX= 
##$RELAX= 
##$RELAX= 
##$RELAX= 
##$RELAX= 
##$RELAX= 
$$ Bruker specific parameters
$$ --------------------------
##$DU= <F:/spectra>
##$EXPNO= 1
##$NAME= <P31>
##$PROCNO= 1
##$TYPE= <nmr>
##$USER= <she>
##$AMP= (0..31)
100 100 100 100 100 100 100 100 100 100 100 100 100 100 100 100 100 100 
100 100 100 100 100 100 100 100 100 100 100 100 100 100 
##$AQSEQ= 0
##$AQ_mod= 1
##$AUNM= <au_zg>
##$AUTOPOS= <>
##$BF1= 81.014009
##$BF2= 200.13
##$BF3= 200.13
##$BF4= 200.13
##$BF5= 200.13
##$BF6= 200.13
##$BF7= 200.13
##$BF8= 200.13
##$BYTORDA= 1
##$CFDGTYP= 0
##$CFRGTYP= 5
##$CHEMSTR= <none>
##$CNST= (0..31)
1 1 145 1 1 1 1 1 1 1 1 1 1 1 1 1 1 1 1 1 1 1 1 1 1 1 1 1 1 1 1 1 
##$CPDPRG= <waltz16>
##$CPDPRG1= <>
##$CPDPRG2= <waltz16>
##$CPDPRG3= <>
##$CPDPRG4= <mlev>
##$CPDPRG5= <mlev>
##$CPDPRG6= <mlev>
##$CPDPRG7= <mlev>
##$CPDPRG8= <mlev>
##$CPDPRGB= <>
##$CPDPRGT= <>
##$D= (0..31)
0 1 0 0 0 0 0 0 0 0 0 0.03 2e-05 3e-06 0 0 0 0 0 0 0 0 0 0 0 0 0 0 0 0 
0 0 
##$DATE= 1554812115
##$DBL= (0..7)
120 120 120 11 120 120 24 19 
##$DBP= (0..7)
150 150 150 150 150 150 150 150 
##$DBP07= 0
##$DBPNAM0= <>
##$DBPNAM1= <>
##$DBPNAM2= <>
$$ [...]
##$SUBNAM3= <"">
##$SUBNAM4= <"">
##$SUBNAM5= <"">
##$SUBNAM6= <"">
##$SUBNAM7= <"">
##$SUBNAM8= <"">
##$SUBNAM9= <"">
##$SW= 369.568048894756
##$SWIBOX= (0..15)
0 1 3 0 0 0 0 0 0 0 0 0 0 0 0 0 
##$SW_h= 29940.119760479
##$TD= 32768
##$TD0= 1
##$TE= 0
##$TE2= 300
##$TE3= 300
##$TEG= 300
##$TL= (0..7)
0 120 53 12 22 120 120 120 
##$TP= (0..7)
150 150 150 150 150 150 150 150 
##$TP07= 0
##$TPNAME0= <>
##$TPNAME1= <>
##$TPNAME2= <>
##$TPNAME3= <>
##$TPNAME4= <>
##$TPNAME5= <>
##$TPNAME6= <>
##$TPNAME7= <>
##$TPOAL= (0..7)
0.5 0.5 0.5 0.5 0.5 0.5 0.5 0.5 
##$TPOFFS= (0..7)
0 0 0 0 0 0 0 0 
##$TUNHIN= 0
##$TUNHOUT= 0
##$TUNXOUT= 0
##$USERA1= <user>
##$USERA2= <user>
##$USERA3= <user>
##$USERA4= <user>
##$USERA5= <user>
##$V9= 5
##$VALIST= <valist>
##$VCLIST= <CCCCCCCCCCCCCCC>
##$VD= 0
##$VDLIST= <DDDDDDDDDDDDDDD>
##$VPLIST= <PPPPPPPPPPPPPPP>
##$VTLIST= <TTTTTTTTTTTTTTT>
##$WBST= 1024
##$WBSW= 4
##$XGAIN= (0..3)
0 0 0 0 
##$XL= 0
##$YL= 0
##$YMAX_a= 57268
##$YMIN_a= -38366
##$ZGOPTNS= <>
##$ZL1= 120
##$ZL2= 120
##$ZL3= 120
##$ZL4= 120
##$ABSF1= 182.463
##$ABSF2= -187.1042
##$ABSG= 5
##$ABSL= 3
##$ALPHA= 0
##$AQORDER= 0
##$ASSFAC= 0
##$ASSFACI= 0
##$ASSFACX= 0
##$ASSWID= 0
##$AUNMP= <proc_1d>
##$AZFE= 0.1
##$AZFW= 0.5
##$BCFW= 0
##$BC_mod= 2
##$BYTORDP= 0
##$COROFFS= 0
##$CY= -3
##$DATMOD= 1
##$DC= 0
##$DFILT= <>
##$DTYPP= 0
##$F1P= 0
##$F2P= 0
##$FCOR= 1
##$FTSIZE= 65536
##$FT_mod= 6
##$GAMMA= 0
##$GB= 0
##$INTBC= 1
##$INTSCL= 5.30512e-09
##$ISEN= 30
##$LB= 1
##$LEV0= 0
##$LPBIN= 0
##$MAXI= 10000
##$MC2= 0
##$MEAN= 0
##$ME_mod= 0
##$MI= 50
##$NCOEF= 0
##$NC_proc= -7
##$NLEV= 6
##$NOISF1= 182.463
##$NOISF2= 159.3651
##$NSP= 0
##$NTH_PI= 0
##$NZP= 0
##$OFFSET= 182.463
##$PC= 4
##$PHC0= -1797.542
##$PHC1= 71.19899
##$PH_mod= 1
##$PKNL= yes
##$PPARMOD= 0
##$PSCAL= 0
##$PSIGN= 0
##$REVERSE= no
##$SF= 81.0140089999434
##$SI= 65536
##$SIGF1= 159.3651
##$SIGF2= -187.1042
##$SINO= 113.3802
##$SIOLD= 16384
##$SREGLST= <1H.CDCl3>
##$SSB= 0
##$STSI= 65536
##$STSR= 0
##$SW_p= 29940.119760479
##$SYMM= 0
##$S_DEV= 0
##$TDeff= 32768
##$TDoff= 0
##$TI= <>
##$TILT= no
##$TM1= 0
##$TM2= 0
##$TOPLEV= 0
##$USERP1= <user>
##$USERP2= <user>
##$USERP3= <user>
##$USERP4= <user>
##$USERP5= <user>
##$WDW= 1
##$XDIM= 65536
##$YMAX_p= 265705088
##$YMIN_p= -39999446
$$ End of Bruker specific parameters
$$ ---------------------------------
##NTUPLES= NMR SPECTRUM
##VAR_NAME=  FREQUENCY,     SPECTRUM/REAL,   SPECTRUM/IMAG
##SYMBOL=    X,             R,               I
##VAR_TYPE=  INDEPENDENT,   DEPENDENT,       DEPENDENT
##VAR_FORM=  AFFN,          ASDF,            ASDF
##VAR_DIM=   65536,         65536,           65536
##UNITS=     HZ,            ARBITRARY UNITS, ARBITRARY UNITS
##FACTOR=    0.456856943014862, 1,           1
##FIRST=     14782.0589164792, 0,            0
##LAST=      -15158.0608439998, 0,           0
##MIN=       -15158.0608439998, -39999446,   0
##MAX=       14782.0589164792, 265705088,    0
$$ Real data points
##PAGE= N=1
##DATA TABLE= (X++(R..R)), XYDATA
$$ [...]
$$ plain form
40410 25354593 13908325 5320817 6164729 9222275 4649518 -3466066 -2683287 8002248
40402 8002248 15620898 12056391 5046300 5635529 12274839 13963713 5308928 -7512178
40394 -7512178 -14632973 -12338224 -5170703 -468845 -1189528 -4072465 -5226575 -5567869
40386 -5567869 -7957431 -10960879 -10462900 -6947085 -5373627 -7114155 -8110882 -6693840
40378 -6693840 -6694707 -9854977 -11650100 -8854085 -5162979 -4202221 -2732700 3082332 9938914
40369 9938914 12906612 13884989 16601191 17465390 10947547 1380182 -1023193 4701724
40361 4701724 9222720 7472529 4167260 3216935 2006180 -455076 343382 5119796
40353 5119796 6418704 -504964 -9855630 -14278291 -14549605 -14129831 -11548656 -5909142
$$ packed form
40410B5354593j1446268q587508Q43912L057546m572757q115584P82779J0685535
40402H002248P618650l564507p010091N89229O639310J688874q654785j2821106
40394g512178p120795K294749P167521M701858p20683k882937j154110l41294
40386e567869k389562l003448M97979L515815J573458j740528r96727J417042
40378f693840q67l160270j795123K796015L691106R60758J469521N815032O856582
40369I938914K967698R78377K716202Q64199o517843r567365k403375N724917
40361D701724M520996j750191l305269r50325j210755k461256P98458M776414
40353E119796J298908o923668r350666m422661k71314M19774K581175N639514
$$ plain form
40345 -5909142 -2989254 -6485607 -8731646 -627730 12958166 18698001 13653152 7530935
40337 7530935 6639009 6917924 4510358 2320826 2201186 -30181 -6520367 -11653465 -9838481
40328 -9838481 -3331856 2550651 6677528 9632836 9273101 4789533 1340818 4324185
40320 4324185 11332229 15394354 14348009 11429633 7940302 1671529 -6640618 -10930246
40312 -10930246 -6807030 2031221 7420993 5893160 2000289 2163074 6831843 10631608
40304 10631608 10038709 7892998 8344917 10391035 10662888 10623907 14834459 21840084 23519831
40295 23519831 16162061 6438461 2470688 3683921 4054052 1427591 -1667285 -3636851
40287 -3636851 -4664853 -3409641 2001287 9909446 15829173 17097620 14450197 10216020
$$ packed form
40345e909142K919888l496353k246039Q103916J3585896N739835n044849o122217
40337G530935q91926K78915k407566k189532j19640k231367o490186n133098J814984
40328i838481O506625N882507M126877K955308l59735m483568l448715K983367
40320D324185P008044M062125j046345k918376l489331o268773q312147m289628
40312a0930246M123216Q838251N389772j527833l892871J62785M668769L799765
40304A0631608n92899k145711M51919K046118K71853l8981M210552P005625J679747
40295B3519831p357770r723600l967773J213233L70131k626461l094876j969566
40287c636851j028002J255212N410928P908159N919727J268447k647423m234177
$$ plain form
40279 10216020 7211369 7350165 8819411 7265849 2462751 46227 2857571 5074758
40271 5074758 660827 -6409751 -7704738 -3223641 -367707 -1569198 -2094547 -356259
40263 -356259 -924546 -4930303 -6176804 -871324 5799846 7329820 4435684 1573921
40255 1573921 -151771 -2157847 -4362036 -5897759 -6685292 -5653936 -1158570 4652483
40247 4652483 6538668 3669748 1185222 1512642 313461 -4951223 -8959347 -6657198
40239 -6657198 -1627854 317251 884012 4981542 10382413 9958951 2567082 -5519400
40231 -5519400 -9132585 -8141791 -4157907 843250 3854610 4208260 5956455 11711250
40223 11711250 16754280 15252074 9211645 4287787 264104 -5570738 -8910403 -3404308
$$ packed form
40279A0216020l004651J38796J469246j553562m803098k416524K811344K217187
40271E074758m413931p070578j294987M481097K855934j201491n25349J738288
40263c56259n68287m005757j246501N305480O671170J529974k894136k861763
40255A573921j725692k006076k204189j535723p87533J031356M495366N811053
40247D652483J886185k868920k484526L27420j199181n264684m008124K302149
40239f657198N029344J945105N66761M097530N400871m23462p391869q086482
40231e519400l613185R90794L983884N001157L011360L53650J748195N754795
40223A1711250N043030j502206o040429m923858m023683n834842l339665N506095
$$ plain form
40215 -3404308 6189909 8080321 1693721 -552206 7154566 14812461 12263959 3059988
40207 3059988 -3813256 -5978219 -4053221 4193286 16679093 22108932 12965085 -2070445
40199 -2070445 -8673961 -5319608 -1493297 -1790930 -2369800 -505767 2717342 7686859
40191 7686859 14663697 18713506 16245870 14868004 25364068 44435377 57963201 62665948
40183 62665948 70733539 88416523 103627516 103468848 93383158 87954582 89597502 87609452
40175 87609452 74895330 55692563 38096069 27078907 24111925 26321387 25988437 17245076
40167 17245076 3829735 -4880622 -5521598 -3325867 -3022046 -2671956 1915126 10808993
40159 10808993 19746283 23688297 20215224 12175715 6684001 8013976 11773625 10283989
$$ packed form
40215c404308R594217J890412o386600k245927P706772P657895k548502r203971
40207C059988o873244k164963J924998Q246507J2485807N429839r143847j5035530
40199b070445o603516L354353L826311k97633n78870J864033L223109M969517
40191G686859O976838M049809k467636j377866J0496064J9071309J3527824M702747
40183F2665948Q067591J7682984J5210993j58668j0085690n428576J642920j988050
40175H7609452j2714122j9202767j7596494j1017162k966982K209462l32950q743361
40167A7245076j3415341q710357o40976K195731L03821L50090M587082Q893867
40159A0808993Q937290L942014l473073q039509n491714J329975L759649j489636
$$ plain form
40151 10283989 3777104 1078321 7535561 17316484 21112089 17891523 14704208 16461220
40143 16461220 20105594 19419044 13109204 6709543 6570612 12278637 16062807 11247936
40135 11247936 863542 -4650274 741333 11181152 15018639 7608822 -3502780 -6574665
40127 -6574665 1432027 10827273 9743763 -1298656 -8847853 -2875886 10152693 15609926
40119 15609926 9386681 1031148 -1125340 805932 2327580 4834674 9911983 12594357
40111 12594357 8672392 4271688 8939259 20974674 28614828 26058551 19979057 18310437
40103 18310437 20325933 21594657 22637232 27395329 36166148 44343875 47184879 44118431
40095 44118431 39838532 41256874 50238940 59360814 59578214 52869658 51151799 60073870
$$ packed form
40151A0283989o506885k698783O457240R780923L795605l220566l187315J757012
40143A6461220L644374o86550o309840o399661j38931N708025L784170m814871
40135A1247936j0384394n513816N391607J0439819L837487p409817j1111602l071885
40127f574665Q006692R395246j083510j1042419p549197N971967J3028579N457233
40119A5609926o223245q355533k156488J931272J521648K507094N077309K682374
40111A2594357l921965m400704M667571J2035415P640154k556277o079494j668620
40103A8310437K015496J268724J042575M758097Q770819Q177727K841004l066448
40095D4118431m279899J418342Q982066R121874K17400o708556j717859Q922071
$$ plain form
40087 60073870 70619913 71933199 66589423 65628140 72084819 78319976 79056678 78274926
40079 78274926 80630807 83100450 80126125 73326612 70865630 77738217 90217356 100804371
40071 100804371 106767495 112131606 121527183 134160288 145582049 153899792 160869604 167292654
40063 167292654 172173215 177898075 190658789 211533878 231480240 240790709 240898344 241276770
40055 241276770 246862752 254571179 260383899 262712524 259215864 247820934 232013259 218379213
40047 218379213 207653346 195146872 181378858 173647494 173317867 170370138 157404951
40040 157404951 142182680 137552085 143129891 146339867 140366574 132441693 133134901 144103962
40032 144103962 158576617 168916121 171131041 165456138 155461663 145461588 137349651
$$ packed form
40087F0073870J0546043J313286n343776r61283O456679O235157P36702p81752
40079G8274926K355881K469643k974325o799513k460982O872587J2479139J0587015
40071A00804371N963124N364111R395577J2633105J1421761Q317743O969812O423050
40063A67292654M880561N724860J2760714K0875089J9946362R310469J07635L78426
40055B41276770N585982P708427N812720K328625l496660j1394930j5807675j3634046
40047B18379213j0725867j2506474j3768014p731364l29627k947729j2965187
40040A57404951j5222271m630595N577806L209976n973293p924881O93208J0969061
40032A44103962J4472655J0339504K214920n674903r994475j0000075q111937
$$ plain form
40025 137349651 129976807 120903542 108145542 92104488 77339071 69908614 70278531 71335863
40017 71335863 66879931 59578164 56149002 57180551 57723788 56545145 57361641 60143678
40009 60143678 59008664 52200428 47468198 51888709 60653625 62278113 52914248 39667020
40001 39667020 30597333 27419859 28801738 34659404 43435220 49193993 46964039 40302366
39993 40302366 38816741 46951558 58826026 66153269 67897288 68621436 69740719 67481423
39985 67481423 59378036 48037528 37226502 28288614 22161771 20930393 24610799 29493209
39977 29493209 32499278 34561992 37230361 39116895 38857689 38422274 39642584 40250789
39969 40250789 37593042 33830302 33008067 35184653 37942995 41185018 45324732 47484184
$$ packed form
40025A37349651p372844r073265j2758000j6041054j4765417p430457L69917J057332
40017G1335863m455932p301767l429162J031549N43237j178643Q16496K782037
40009F0143678j135014o808236m732230M420511Q764916J624488r363865j3247228
40001C9667020r069687l177474J381879N857666Q775816N758773k229954o661673
39993D0302366j485625Q134817J1874468P327243J744019P24148J119283k259296
39985F7481423q103387j1340508j0811026q937888o126843j231378L680406M882410
39977B9493209L006069K062714K668369J886534k59206m35415J220310O08205
39969D0250789k657747l762740q22235K176586K758342L242023M139714K159452
$$ plain form
39961 47484184 45737146 44769785 50027944 57969802 60542062 58566557 60948952 69492186
39953 69492186 75028383 72354965 68809296 71519294 74617059 67685348 51470156 36723916
39945 36723916 30693259 32113072 36825808 40866211 39623609 31425782 22080809 19850316
39937 19850316 25336823 31057718 31031670 26063574 19469881 12723355 6824551 4002303
39929 4002303 5809142 11304915 17906258 22675230 23281564 19908305 16031058 15301720
39921 15301720 17626131 19379360 16662257 7803434 -4792045 -13651535 -10543783 4627192
39913 4627192 21431729 28955534 26433845 20917688 17460299 16335224 17477618 21464451
39905 21464451 26254602 27985004 25431969 20216155 13618443 7241673 5073196 9399562
$$ packed form
39961D7484184j747038r67361N258159P941858K572260j975505K382395Q543234
39953F9492186N536197k673418l545669K709998L097765o931711j6215192j4746240
39945C6723916o030657J419813M712736M040403j242602q197827r344973k230493
39937A9850316N486507N720895k6048m968096o593693o746526n898804k822248
39929D002303J806839N495773O601343M768972O06334l373259l877247p29338
39921A5301720K324411J753229k717103q858823j2595479q859490L107752J5170975
39913D627192J6804537P523805k521689n516157l457389j125075J142394L986833
39905B1464451M790151J730402k553035n215814o597712o376770k168477M326366
$$ plain form
39897 9399562 15687045 17404655 15145984 14284262 14034723 7308597 -6623437 -17807234
39889 -17807234 -18279569 -12196492 -8157727 -7418115 -6008433 -3780299 -3684227 -4344720 -1008570
39880 -1008570 5848630 9216628 4936153 -1853544 -2486930 4932415 13335151 14450542
39872 14450542 7346301 -1404782 -5365796 -4267937 -1855609 -415495 -156940 -1675506
39864 -1675506 -4468317 -4216292 2659071 11493365 12935268 5873141 145029 2938406
39856 2938406 9133495 10358522 7405840 6298701 6719136 3416198 -3002415 -6127455
39848 -6127455 -4940551 -6139912 -12939930 -19211689 -18610526 -13335965 -9142273 -6519012
39840 -6519012 -2222816 3642656 7540337 7861990 5748857 1779447 -3615309 -7241677
$$ packed form
39897I399562O287483J717610k258671q61722k49539o726126j3932034j1183797
39889a7807234m72335O083077M038765P39612J409682K228134R6072o60493L336150
39880a008570O857200L367998m280475o789697o33386P419345Q402736J115391
39872A4450542p104241q751083l961014J097859K412328J440114K58555j518566
39864a675506k792811K52025O875363Q834294J441903p062127n728112K793377
39856B938406O195089J225027k952682j107139M20435l302938o418613l125040
39848f127455J186904j199361o800018o271759O01163N274561M193692K623261
39840f519012M296196N865472L897681L21653k113133l969410n394756l626368
$$ plain form
39832 -7241677 -5690664 -1174605 245121 -2132574 -1277142 7364812 17746586 20881532
39824 20881532 18205490 20322734 31906631 44727366 48919608 45397244 41744717 39997211
39816 39997211 35780769 28141410 22337548 21060107 19296405 11597417 221968 -7810856
39808 -7810856 -9025151 -5423185 -246267 4795090 9046184 12120239 13163882 10343859
39800 10343859 3176116 -4036809 -4774613 1603509 7980672 8560260 6070965 6136121 8333576
39791 8333576 8332113 6184888 5907361 7707712 7260403 3462050 984286 3220345 7624639
39782 7624639 10582903 12873332 17085197 22178167 23901886 20083193 13842195 11475026
39774 11475026 16976126 28081114 38717253 46218564 53764797 63642324 71566187 72044722
$$ packed form
39832g241677J551013M516059J419726k377695Q55432Q641954J0381774L134946
39824B0881532k676042K117244J1583897J2820735M192242l522364l652527j747506
39816C9997211m216442p639359n803862j277441j763702p698988j1375449q032824
39808g810856j214295L601966N176918N041357M251094L074055J043643k820023
39800A0343859p167743p212925p37804O378122O377163N79588k489295O5156K197455
39791H333576j463k147225k77527J800351m47309l798353k477764K236059M404294
39782G624639K958264K290429M211865N092970J723719l818693o240998k367169
39774A1475026N501100J1104988J0636139P501311P546233R877527P923863M78535
$$ plain form
39766 72044722 66348821 59078922 49248878 33128330 15641335 9090775 17226134 28967127
39758 28967127 32628647 28865840 24164290 19685746 14935289 15731671 27115030 41039520
39750 41039520 42661038 29677022 15617231 11694636 14414710 15069393 13157980 13726042
39742 13726042 16805784 17302323 13721801 10592306 11619379 14755643 15410268 11991968
39734 11991968 6933252 3500698 2623042 2604815 1553911 -300435 -1160850 -138286 1821770
39725 1821770 3315358 3605726 2496434 470830 -967778 -371356 2270074 6221055
39717 6221055 11000966 14639699 12479783 1900813 -11612334 -17868416 -13404691 -5474812
39709 -5474812 -2001510 -1731807 1357126 7246309 9629416 5856759 1315781 2129513
$$ packed form
39766G2044722n695901p269899r830044j6120548j7486995o550560Q135359J1740993
39758B8967127L661520l762807m701550m478544m750457P96382J1383359J3924490
39750D1039520J621518j2984016j4059791l922595K720074O54683j911413N68062
39742A3726042L079742M96539l580522l129495J027073L136264O54625l418300
39734A1991968n058716l432554q77656j8227j050904j854346q60415J022564J960056
39725A821770J493588K90368j109292k025604j438608N96422K641430L950981
39717F221055M779911L638733k159916j0578970j3513147o256082M463725P929879
39709e474812L473302K69703L088933N889183K383107l772657m540978Q13732
$$ plain form
39701 2129513 7222330 9787012 4663158 -6854990 -17774208 -20435164 -13036133 -2070230
39693 -2070230 3534094 1308573 -3451847 -5194626 -3980160 -3106912 -4256901 -7032564
39685 -7032564 -10568555 -13032394 -11711763 -6488764 -1551392 -570811 -1490839 440644
39677 440644 5257843 7897524 5659876 2251906 2739819 7308988 12172596 14709698
39669 14709698 15338465 15342548 15149731 14771809 14412401 14151963 13546697 11699738 7749451
39660 7749451 1728945 -4921252 -10142940 -12517892 -11218890 -5365015 4832247 16057022
39652 16057022 23079328 23459831 20183591 18412258 20144099 22846699 22530735 17175957
39644 17175957 7950117 -1508921 -7197415 -7480508 -4389397 -2033924 -3483357 -8599281
$$ packed form
39701B129513N092817K564682n123854j1518148j0919218k660956P399031J0965903
39693b070230N604324k225521m760420j742779J214466Q73248j149989k775663
39685g032564l535991k463839J320631N222999M937372R80581r20028J931483
39677D40644M817199K639681k237648l407970M87913M569169M863608K537102
39669A4709698O28767M083j92817l77922l59408k60438o05266j846959l950287
39660G749451o020506o650197n221688k374952J299002N853875J0197262J1224775
39652A6057022P022306L80503l276240j771333J731841K702600l15964n354778
39644A7175957r225840r459038n688494k83093L091111K355473j449433n115924
$$ plain form
39636 -8599281 -13951763 -14896453 -9141739 853715 9631032 13343721 12209184 8780894
39628 8780894 5324097 2969522 1534411 -355506 -3080687 -3712966 1202245 9556289
39620 9556289 14060899 11191448 6220786 5677699 8006811 6801498 1075982 -3954874
39612 -3954874 -5720523 -7228633 -10112623 -11302474 -9238349 -7407035 -7775015 -5979228
39604 -5979228 1673942 10429255 12580598 8563890 6148965 9123023 12938906 12613959
39596 12613959 9456316 7398062 6605736 4117935 -943494 -5534210 -5913692 -1833003
39588 -1833003 2336055 1204866 -5791191 -13191359 -16035118 -16010422 -17710547 -20161933
39580 -20161933 -17564128 -9156443 -2221954 -2116861 -4631694 -3146872 837255 900694
$$ packed form
39636h599281n352482r44690N754714R995454Q777317L712689j134537l428290
39628H780894l456797k354575j435111j889917k725181o32279M915211Q354044
39620I556289M504610k869451m970662n43087K329112j205313n725516n030856
39612c954874j765649j508110k883990j189851K064125J831314l67980J795787
39604e979228P653170Q755313K151343m016708k414925K974058L815883l24947
39596A2613959l157643k058254p92326k487801n061429m590716l79482M080689
39588a833003M169058j131189o996057p400168k843759K4696j700125k451386
39580b0161933K597805Q407685O934489J05093k514833J484822L984127O3439
$$ plain form
39572 900694 -2709396 -2254153 5719110 14158383 14272727 6588518 -185978 663594 7465333
39563 7465333 12969172 11946063 6467009 3726572 7510955 12939717 12640886 7190105
39555 7190105 4437952 7746650 10891902 7750097 1437042 -1264153 -107974 406023
39547 406023 5154 2434628 7351372 9755852 8026967 5976956 5951776 6338037 7185880
39538 7185880 11144691 16313803 15718138 8209810 2745148 5755263 10463812 6463012
39530 6463012 -4669801 -12072642 -11268987 -8039700 -7361283 -7511353 -6535271 -6435533 -7913318
39521 -7913318 -7380876 -2699836 3008739 6225869 7265370 7128991 4853380 988050
39513 988050 -786023 1046710 2883036 1615306 -946426 -2814720 -6340929 -13074586
$$ packed form
39572I00694l610090M55243P973263Q439273J14344p684209o774496Q49572O801739
39563G465333N503839j023109n479054k740437L784383N428762k98831n450781
39555G190105k752153L308698L145252l141805o313055k701195J156179N13997
39547D06023m00869K429474M916744K404480j728885k050011k5180L86261Q47843
39538G185880L958811N169112n95665p508328n464662L010115M708549m000800
39530F463012j1132813p402841Q03655L229287O78417j50070R76082R9738j477785
39521g913318N32442M681040N708575L217130J039501j36379k275611l865330
39513I88050j774073J832733J836326j267730k561732j868294l526209o733657
$$ plain form
39505 -13074586 -18110910 -15600163 -7407589 -473626 2516189 4028152 5117523 4592331
39497 4592331 3720902 4542555 3471360 -5417633 -19003981 -25410953 -19781963 -12062070
39489 -12062070 -12691159 -17047227 -13058934 -524044 7744902 4197370 -4083501 -7470440
39481 -7470440 -6321507 -5464233 -3430791 3772870 11698344 10361138 -1196801 -11737255
39473 -11737255 -11888887 -4277655 3892174 11129255 18507739 22151515 17440896 8303157
39465 8303157 4025494 7091604 11421433 12827194 13529737 14878902 13578970 8565617
39457 8565617 4587663 4416083 3670631 -1309502 -6108441 -5131642 -1096066 -206958 -1422392
39448 -1422392 1022216 6144213 6305324 -500899 -6681554 -6062695 -2298315 -2555221 -7557357
$$ packed form
39505a3074586n036324K510747Q192574O933963K989815J511963J089371n25192
39497D592331q71429Q21653j071195q888993j3586348o406972N628990P719893
39489a2062070o29089m356068L988293J2534890Q268946l547532q280871l386939
39481g470440J148933Q57274K033442P203661P925474j337206j1557939j0540454
39473a1737255j51632P611232Q169829P237081P378484L643776m710619r137739
39465H303157m277663L066110M329829J405761P02543J349165j299932n013353
39457H565617l977954j71580p45452m980133m798939R76799M035576Q89108j215434
39448a422392K444608N121997J61111o806223o180655O18859L764380k56906n002136
$$ plain form
39439 -7557357 -11881704 -11227900 -6139996 -320373 2516817 1398023 -1169667 -2397995
39431 -2397995 -2839200 -4480730 -6095139 -4545009 -898890 -552775 -5706025 -11810645
39423 -11810645 -13421208 -9893692 -3530277 3759188 9426176 9978171 5130279 -600249
39415 -600249 -3134934 -2587435 398531 7381139 17233443 23178306 20588375 14594559
39407 14594559 13498675 16845541 17182563 12428978 8159584 6663337 2496187 -7169220
39399 -7169220 -15296946 -14395232 -8000419 -5292218 -7128347 -5745931 1787571 8338504
39391 8338504 8090679 6017021 9815084 16718815 16330456 6068514 -3938627 -4021858
39383 -4021858 3222529 8945297 10988106 13874734 18002275 17134646 8706487 -68711
$$ packed form
39439g557357m324347O53804N087904N819623K837190j118794k567690j228328
39431b397995m41205j641530j614409J550130L646119L46115n153250o104620
39423a1810645j610563L527516O363415P289465N666988N51995m847892n730528
39415f00249k534685N47499K985966O982608R852304N944863k589931n993816
39407A4594559j095884L346866L37022m753585m269394j496247m167150r665407
39399g169220q127726R01714O394813K708201j836129J382416P533502O550933
39391H338504k47825k073658L798063O903731l88359j0261942j0007141q3231
39383d021858P244387N722768K042809K886628M127541q67629q428159q775198
$$ plain form
39375 -68711 -1048142 3697774 4753958 -2069972 -10694497 -12696896 -6952414 8819 1625739
39366 1625739 -1999934 -4831251 -1973277 4538237 8119650 5597036 648370 -1493940
39358 -1493940 -307839 1055883 1098310 1327659 3003935 5323232 7121742 8308951 8872240
39349 8872240 7690171 3296726 -3939933 -10229976 -9904636 -779892 11641165 18039029
39341 18039029 14852477 7504144 2350298 -1154774 -6687841 -12573042 -12971023 -7090755
39333 -7090755 -1346609 -660300 -2288477 -891681 3977140 8699057 11171349 11807609
39325 11807609 10489988 6544900 1812970 317130 3628185 8792710 12186620 13428947
39317 13428947 13550811 11205150 4450231 -3597918 -5298717 2396165 12265458 14469401
$$ packed form
39375f8711r79431M745916J056184o823930q624525k002399N744482O961233J616920
39366A625739l625673k831317K857974O511514L581413k522614m948666k142310
39358a493940J186101J363722M2427K29349J676276K319297J798510J187209N63289
39349H872240j182069m393445p236659o290043L25340R124744J2421057O397864
39341A8039029l186552p348333n153846l505072n533067n885201l97981N880268
39333g090755N744146O86309j628177J396796M868821M721917K472292O36260
39325A1807609j317621l945088m731930j495840L311055N164525L393910J242327
39317A3428947J21864k345661o754919q048149j700799P694882R869293K203943
$$ plain form
39309 14469401 8399188 2040190 77341 -1181927 -5404615 -9274842 -8215018 -3993769
39301 -3993769 -1130482 509080 3431847 5879880 4532463 1963410 3612288 7881677
39293 7881677 7633042 2454624 432707 4624094 6733506 25071 -9078815 -10262257
39285 -10262257 -4926978 -3287048 -8093987 -10565594 -3637983 8056293 14326237 10904804
39277 10904804 2091002 -5119808 -7305469 -6535379 -7104389 -9786649 -10532649 -6729597
39269 -6729597 -2582739 -4240715 -10638424 -14133949 -10625427 -4136461 78941 2282464
39261 2282464 5488084 9752452 12613231 13023193 12164531 12032972 14963201 22070177 29956232
39252 29956232 31703077 24207141 12477096 3676445 -896345 -4486876 -8097844 -10002034
$$ packed form
39309A4469401o070213o358998j962849j259268m222688l870227J059824M221249
39301c993769K863287J639562K922767K448033j347417k569053J648878M269389
39293G881677k48635n178418k021917M191387K109412o708435r103886j183442
39285a0262257N335279J639930m806939k471607O927611J1694276O269944l421433
39277A0904804q813802p210810k185661P70090n69010k682260p46000L803052
39269f729597M146858j657976o397709l495525L508522O488966M215402K203523
39261B282464L205620M264368K860779M09962q58662j31559K930229P106976P886055
39252B9956232J746845p495936j1730045q800651m572790l590531l610968j904190
$$ plain form
39244 -10002034 -10705490 -12574189 -14128954 -10574533 -2125736 3412934 73220 -7900369
39236 -7900369 -11204782 -6625568 1090569 6913370 10538750 13715858 16432205 17068081
39228 17068081 14388147 8838883 3227681 1521958 4760525 8630075 7844438 2910480
39220 2910480 -395882 1367115 5425330 7433472 6666996 4762636 2290807 -683141
39212 -683141 -2565611 -1578860 1792730 5730548 9491410 13147362 16016455 17057281
39204 17057281 15776692 11482224 3565453 -5508704 -9803046 -5854455 2057628 5858574
39196 5858574 2514820 -3797002 -7761244 -8126094 -6983893 -6804124 -8554570 -10586450
39188 -10586450 -9447052 -3756491 3478965 8674506 12253718 16035706 17713856 13131781
$$ packed form
39244a0002034p03456j868699j554765L554421Q448797N538670l339714p973589
39236g900369l304413M579214P716137N822801L625380L177108K716347O35876
39228A7068081k679934n549264n611202j705723L238567L869550p85637m933958
39220B910480l306362J762997M058215K008142p66476j904360k471829k973948
39212f83141j882470R86751L371590L937818L760862L655952K869093J040826
39204A7057281j280589m294468p916771r074157m294342L948591P912083L800946
39196E858574l343754o311822l964242l64850J142201J79769j750446k031880
39188a0586450J139398N690561P235456N195541L579212L781988J678150m582075
$$ plain form
39180 13131781 4006116 -2113458 -1025844 3666309 6840320 7754972 7506970 5603839
39172 5603839 2457208 1078299 2462998 2960130 393830 -627921 5334020 15452510
39164 15452510 20884954 17579901 10404627 6379725 7312582 9561111 8606055 3564357
39156 3564357 -1523463 -1692908 2801502 6631331 7050628 7709034 11785199 15373491 12860892
39147 12860892 6080807 2022886 2835835 4334136 4029981 4273325 6558176 8591289
39139 8591289 8823268 8951822 9865514 9309514 5661529 590542 -3525641 -5622382 -4851677
39130 -4851677 -1518944 575031 -1985679 -5090590 -399562 11512962 18175483 10462516
39122 10462516 -4616427 -12632131 -9431552 -3430717 -2637698 -6475471 -10143242 -10759488
$$ packed form
39180A3131781r125665o119574J087614M692153L174011R14652k48002j903131
39172E603839l146631j378909J384699M97132k566300j021751N961941J0118490
39164A5452510N432444l305053p175274m024902R32857K248529r55056n041698
39156C564357n087820j69445M494410L829829M19297O58406M076165L588292k512599
39147A2860892o780085m057921Q12949J498301l04155K43344K284851K033113
39139H591289K31979J28554R13692n56000l647985n070987m116183k096741P70705
39130d851677L332733K093975k560710l104911M691028J1912524O662521p712967
39122A0462516j5078943q015704L200579O000835P93019l837773l667771o16246
$$ plain form
39114 -10759488 -8014319 -3554310 -1237464 -4245220 -10357368 -12982302 -8342659 503880
39106 503880 7756507 10873166 11410144 11635008 11707793 9609576 3308195 -6562185 -16122821
39097 -16122821 -20801872 -18494260 -10574530 -1127273 4675514 3671863 -2241868 -7450829
39089 -7450829 -8168726 -5321589 -1403542 2836586 7095403 10091178 12213186 16902508
39081 16902508 25877801 34862289 37569495 32530469 23051647 12771791 5109770 4316109
39073 4316109 11237468 19231085 20435967 16044601 14287803 17805210 19830194 14887744
39065 14887744 6495856 520169 -3191951 -7407463 -10274173 -7688021 -701631 5020220
39057 5020220 6397911 5185385 3622528 2021107 657218 230209 -215270 -2707253
$$ packed form
39114a0759488K745169M460009K316846l007756o112148k624934M639643Q846539
39106E03880P252627L116659N36978K24864P2785k098217o301381r870380r560636
39097a6122821m679051K307612P919730R447257N802787j003651n913731n208961
39089g450829p17897K847137L918047M240128M258817K995775K122008M689322
39081A6902508Q975293Q984488K707206n039026r478822j0279856p662021p93661
39073D316109O921359P993617J204882m391366j756798L517407K024984m942450
39065A4887744q391888n975687l712120m215512k866710K586152O986390N721851
39057E020220J377691j212526j562857j601421j363889m27009m45479k491983
$$ plain form
39049 -2707253 -6716132 -8456326 -4864608 3141045 11704747 16997304 17416194 14823174
39041 14823174 13675795 16753098 21231746 21256165 15488244 9781057 10067479 14132271
39033 14132271 13960484 6680178 -569595 362984 7100601 9056610 1664611 -6951333
39025 -6951333 -6730644 1042360 6493829 4935972 1334936 848283 1663589 73867 -2801129
39016 -2801129 -3883154 -4293303 -7774934 -14411262 -19795939 -19779197 -13375178 -2392343
39008 -2392343 8701368 13866452 10269225 1989593 -3887320 -4851092 -4228326 -5303023
39000 -5303023 -7122118 -6621434 -2693826 2577114 5679582 4983545 3188967 4992731
38992 4992731 10657795 14056074 10098227 2182197 -1936891 -595453 506955 -2359480
$$ packed form
39049b707253m008879j740194L591718Q005653Q563702N292557M18890k593020
39041A4823174j147379L077303M478648K4419n767921n707187K86422M064792
39033A4132271j71787p280306p249773R32579O737617J956009p391999q615944
39025f951333K20689P773004N451469j557857l601036m86653Q15306j589722k874996
39016b801129j082025m10149l481631o636328n384677J6742O404019J0982835
39008b392343J1093711N165084l597227q279632n876913r63772O22766j074697
39000e303023j819095N00684L927608N270940L102468o96037j794578J803764
38992D992731N665064L398279l957847p916030m119088J341438J102408k866435
$$ plain form
38984 -2359480 -5901641 -6106073 -4523954 -4354705 -3694478 2200816 12709358 20455368
38976 20455368 19546243 12576548 7357327 7760439 10196934 9700313 7019079 6760562 9350099
38967 9350099 9213369 2777419 -5555378 -8865287 -6278393 -1899502 2276262 6755166
38959 6755166 9137224 5149621 -3761908 -9986012 -9359753 -6153695 -5705983 -7102962
38951 -7102962 -7029072 -6506397 -8739999 -12902676 -14996160 -13551810 -10351763 -6517906 -1822485
38942 -1822485 2472463 3481309 -247796 -7324719 -14483037 -17581670 -13708277 -4818349
38934 -4818349 2555072 4054210 2212487 1662002 2279242 1338621 108767 2304778 6484266
38925 6484266 6374801 293561 -5302338 -4393386 934679 4801378 6009404 7970202
$$ packed form
38984b359480l542161k04432J582119J69249O60227N895294J0508542P746010
38976B0455368r09125o969695n219221M03112K436495m96621k681234k58517K589537
38967I350099j36730o435950q332797l309909K586894M378891M175764M478904
38959F755166K382058l987603q911529o224104O26259L206058M47712j396979
38951g102962P3890N22675k233602m162677k093484J444350L200047L833857M695421
38942a822485M294948J008846l729105p076923p158318l098633L873393Q889928
38934d818349P373421J499138j841723n50485O17240r40621j229854K196011M179488
38925F484266j09465o081240n595899R08952N328065L866699J208026J960798
$$ plain form
38917 7970202 11881806 14135795 10813101 2332286 -6931277 -12442798 -12764330 -9828595
38909 -9828595 -6269973 -2810465 1006838 4174196 4571762 2625599 2171988 5474368
38901 5474368 8708372 5421118 -4883295 -13927794 -12638795 -1612091 8588599 8818506
38893 8818506 1472408 -3120853 334207 6291964 6549316 462148 -6028423 -8719421
38885 -8719421 -8088471 -5312069 -592048 3841141 3921473 -488671 -3366337 636772 8807599
38876 8807599 12914424 8650102 23021 -5925242 -6745470 -5800772 -6943545 -9795591
38868 -9795591 -11037224 -9208212 -6320242 -4579919 -3597055 -2013115 -176306 534072
38860 534072 -147789 -1627310 -3812807 -6554263 -8736714 -9484436 -9113380 -7714235 -4914641
$$ packed form
38917G970202L911604K253989l322694q480815r263563n511521l21532K935735
38909i828595L558622L459508L817303L167358L97566j946163m53611L302380
38901E474368L234004l287254j0304413r044499J288999J1026704J0200690K29907
38893H818506p346098m593261L455060N957757K57352o087168o490571k690998
38885h719421O30950K776402M720021M433189Q0332m410144k877666M003109Q170827
38876H807599M106825m264322q627081n948263q20228R44698j142773k852046
38868i795591j241633J829012K887970J740323R82864J583940J836809P10378
38860E34072o81861j479521k185497k741456k182451p47722L71056J399145K799594
$$ plain form
38851 -4914641 -2568731 -4345969 -9713153 -12147636 -8000216 -3398663 -5645730 -10633620
38843 -10633620 -7793331 2895623 8935543 2997594 -6848336 -9558347 -5563181 -2096844
38835 -2096844 -885023 1088402 2872504 492115 -5196742 -9394344 -11324538 -14099016
38827 -14099016 -16692801 -13363940 -2803518 8138641 12506747 10741886 7936695 7380009
38819 7380009 9203938 12277648 14687291 14279847 11072226 8052846 8017919 10333685 11746230
38810 11746230 9766021 4879319 135687 -1440356 99069 1345277 -689097 -4799912
38802 -4799912 -6736734 -3961445 1668413 5773229 5408564 1672660 -1177110 53048
38794 53048 4019948 6718655 6405816 4440153 1737155 -1873082 -4446566 -3020613 424463
$$ packed form
38851d914641K345910j777238n367184k434483M147420M601553k247067m987890
38843a0633620K840289J0688954O039920n937949r845930k710011L995166L466337
38835b096844J211821J973425J784102k380389n688857m197602j930194k774478
38827a4099016k593785L328861J0560422J0942159M368106j764861k805191n56686
38819G380009J823929L073710K409643m07444l207621l019380l4927K315766J412545
38810A1746230j980209m886702m743632j576043J539425J246208k034374m110815
38802d799912j936822K775289N629858M104816l64665l735904k849770J230158
38794E3048L966900K698707l12839j965663k702998l610237k573484J425953L445076
$$ plain form
38785 424463 -252970 -5304394 -5839252 3830167 15811890 18052093 10664230 4583577
38777 4583577 5757173 9349563 9551318 6560413 2262292 -3264401 -8292700 -9087241
38769 -9087241 -5852396 -3339854 -3168602 -1633749 2124062 2541833 -3390541 -9590643
38761 -9590643 -8983215 -3659502 -920941 -2333989 -2972911 -89861 3234748 3280459 218406
38752 218406 -3474505 -6380628 -8754541 -10813482 -11129537 -7449238 -125772 6362193
38744 6362193 7757231 5096524 2366031 252406 -3171075 -6278913 -4676067 1015329
38736 1015329 4843725 4982956 6399867 10915137 12336012 6872376 1265269 3097324
38728 3097324 8412506 7480288 -504682 -7033938 -6889012 -3197229 -491498 75914 -1529356
$$ packed form
38785D24463o77433n051424n34858R669419J1981723K240203p387863o080653
38777D583577J173596L592390K01755k990905m298121n526693n028299p94541
38769i087241L234845K512542J71252J534853L757811M17771n932374o200102
38761i590643O07428N323713K738561j413048o38922K883050L324609M5711l062053
38752B18406l692911k906123k373913k058941l16055L680299P323466O487965
38744F362193J395038k660707k730493k113625l423481l107838J602846N691396
38736A015329L828396J39231J416911M515270J420875n463636n607107J832055
38728C097324N315182r32218p984970o529256J44926L691783K705731N67412j605270
$$ plain form
38719 -1529356 -4846200 -6773400 -4341574 87003 1449624 -537391 -2032822 -2655851
38711 -2655851 -5765484 -10508128 -10596520 -3565388 4490427 6700199 3655518 783153
38703 783153 952946 2789682 3996700 3788925 3303633 4758212 8827096 12756207 13238793
38694 13238793 11119733 10649580 13941953 18641895 20961176 18613105 11529255 2747795
38686 2747795 -2194389 -230682 5397422 9305757 10437260 10682951 9614663 6305343
38678 6305343 4398432 8067893 13510254 12351395 4154842 -2599294 -3465342 -3156652
38670 -3156652 -4869487 -3836366 3124145 9779545 9021086 2814004 -3209585 -9037144
38662 -9037144 -16390750 -20875979 -17125468 -8467006 -2396280 1437845 9315038 20131010
$$ packed form
38719a529356l316844j927200K431826M428577J362621j987015j495431o23029
38711b655851l109633m742644q8392P031132Q055815K209772l044681k872365
38703G83153J69793J836736J207018k07775m85292J454579M068884L929111M82586
38694A3238793k119060m70153L292373M699942K319281k348071p083850q781460
38686B747795m942184J963707N628104L908335J131503K45691j068288l309320
38678F305343j906911L669461N442361j158859q196553o754136q66048L08690
38670c156652j712835J033121O960511O655400p58459o207082o023589n827559
38662i037144p353606m485229L750511Q658462O070726L834125P877193J0815972
$$ plain form
38654 20131010 23721531 14637808 -150983 -10343915 -13016788 -11330823 -8234741 -5580450
38646 -5580450 -5611410 -8869607 -12143698 -11437490 -6320480 -2333 3873631 3781233 1007712
38637 1007712 -1575566 -2469768 -3122251 -5196663 -7080854 -5523300 -522039 3953177
38629 3953177 4339347 470276 -5657898 -11631528 -15028555 -14612022 -11638504 -8189126
38621 -8189126 -4546774 -531832 1388026 -1969877 -9098248 -14070614 -13464482 -9742678
38613 -9742678 -6332788 -2965579 1491303 4628313 2784736 -3420795 -9299650 -11826948
38605 -11826948 -12501222 -14013801 -16394663 -17874176 -18306398 -19854959 -23989209 -28929189
38597 -28929189 -31019411 -28401085 -22622294 -16838201 -13216112 -11676817 -9836707 -4637771
$$ packed form
38654B0131010L590521r083723j4788791j0192932k672873J685965L096082K654291
38646e580450l0960l258197l274091P06208N117010O318147L875964r2398k773521
38637A007712k583278q94202o52483k074412j884191J557554N001261M475216
38629C953177L86170l869071o128174n973630l397027M16533K973518L449378
38621h189126L642352M014942J919858l357903p128371m972366O06132L721804
38613i742678L409890L367209M456882L137010j843577o205531n878855k527298
38605a1826948o74274j512579k380862j479513m32222j548561m134250m939980
38597b8929189k090222K618326N778791N784093L622089J539295J840110N198936
$$ plain form
38589 -4637771 3740324 9602505 6605797 -3743839 -11703297 -9768414 -603736 8246458
38581 8246458 13861819 17386255 17159504 9795126 -1928559 -9544669 -9641530 -8222159
38573 -8222159 -11097773 -15254970 -14303269 -8330618 -2915471 -1097611 -2031705 -5735983
38565 -5735983 -12485321 -17407359 -12772236 1281415 13540122 13599705 3681303 -5887879
38557 -5887879 -10323979 -13573469 -18432615 -20322128 -14045838 -2238457 7218206 9875764
38549 9875764 7186753 2597078 -402930 1967127 10377476 18687464 19051386 11814330
38541 11814330 5279078 4368466 5471958 5107568 6889275 14478782 23055797 25029458
38533 25029458 21068964 18056860 17869734 15857724 10195515 5162139 3737339 3565917
$$ packed form
38589d637771Q378095N862181k996708j0349636p959458J934883R164678Q850194
38581H246458N615361L524436k26751p364378j1723685p616110r6861J419371
38573h222159k875614m157197R51701N972651N415147J817860r34094l704278
38565e735983o749338m922038M635123J4053651J2258707N9583r918402r569182
38557e887879m436100l249490m859146j889513O276290J1807381R456663K657558
38549I875764k689011m589675l000008K370057Q410349Q309988L63922p237056
38541A1814330o535252r10612J103492l64390J781707P589507Q577015J973661
38533B5029458l960494l012104j87126k012010n662209n033376j424800j71422
$$ plain form
38525 3565917 2541088 2648485 5375616 8061116 7981040 6378401 5489777 4466819 793352
38516 793352 -6274248 -14880320 -20846969 -18852258 -7407824 6750739 13966586 12628881
38508 12628881 10061925 11332849 13305200 12349663 11139128 12866945 14268861 10514765
38500 10514765 3243131 -2270201 -5045276 -7521555 -8836064 -5109899 3924961 13222053
38492 13222053 17437670 14987846 8394711 2857107 2021949 2911110 -1170187 -9926630
38484 -9926630 -13823196 -7397878 1150729 946087 -6107924 -9862508 -8052150 -7330684
38476 -7330684 -10004823 -10838596 -7381055 -2945843 1858017 9927708 17889572 16635861
38468 16635861 5644927 -3634630 -3693203 -157895 716279 3020265 11207384 18693295
$$ packed form
38525C565917j024829J07397K727131K685500q0076j602639q88624j022958l673467
38516G93352p067600q606072n966649J994711J1444434J4158563P215847j337705
38508A2628881k566956J270924J972351r55537j210535J727817J401916l754096
38500A0514765p271634n513332k775075k476279j314509L726165R034860R297092
38492A3222053M215617k449824o593135n537604q35158Q89161m081297q756443
38484i926630l896566O425318Q548607k04642p054011l754584J810358P21466
38476g330684k674139q33773L457541M435212M803860Q069691P961864j253711
38468A6635861j0990934r279557n8573L535308Q74174K303986Q187119P485911
$$ plain form
38460 18693295 17229042 10877167 9614576 14038610 17325135 18116630 19747396 19599264
38452 19599264 11987180 1177878 -1081906 6909739 12915146 7803215 -3159991 -9972718
38444 -9972718 -10038187 -6176544 -698431 3117760 562075 -7829610 -14900624 -17087569
38436 -17087569 -19615766 -25809664 -28312813 -19520873 -5787558 -1131918 -8497302 -16671852
38428 -16671852 -16182544 -9712384 -4701740 -3158972 -2750113 -2581450 -3148079 -3512868 -2616448
38419 -2616448 -1730316 -2306399 -2611754 150411 4769427 6660000 4719088 4322266 10340197
38410 10340197 18916427 20947662 14485257 8357449 9853657 13633288 9535956 -1428658
38402 -1428658 -7907363 -5365521 -2512199 -6580091 -11451365 -7953147 780167 3545672
$$ packed form
38460A8693295j464253o351875j262591M424034L286525P91495J630766j48132
38452A9599264p612084j0809302k259784P991645O005407n111931j0963206o812727
38444i972718o5469L861643N478113L816191k555685q391685p071014k186945
38436a7087569k528197o193898k503149Q791940J3733315M655640p365384q174550
38428a6671852M89308O470160N010644J542768M08859J68663n66629l64789Q96420
38419b616448Q86132n76083l05355K762165M619016J890573j940912l96822O017931
38410A0340197Q576230K031235o462405o127808J496208L779631m097332j0964614
38402a428658o478705K541842K853322m067892m871274L498218Q733314K765505
$$ plain form
38394 3545672 -3063114 -12017092 -16720683 -15599951 -7584657 6794432 19346709 19666426
38386 19666426 9631546 3386004 8757510 17095765 16970644 10172461 6742003 9895351
38378 9895351 14260993 15785077 15201121 12822852 7133896 -841508 -7021476 -8950654
38370 -8950654 -7489063 -4190970 -683835 -56760 -4562294 -11375344 -14058020 -9267328
38362 -9267328 -69020 7481761 9488230 6758058 4001325 5404410 9472153 10201943
38354 10201943 5058308 -1358101 -4361274 -6024685 -10405840 -15394003 -15508851 -10745640
38346 -10745640 -5933503 -2390968 2614703 8199029 9357819 5666811 3252822 5452974
38338 5452974 8088829 7228491 5195974 4649204 2753283 -3170482 -8969838 -8890372 -4210838
$$ packed form
38394C545672o608786q953978m703591J120732Q015294J4379089J2552277L19717
38386A9666426j0034880o245542N371506Q338255j25121o798183l430458L153348
38378I895351M365642J524084n83956k378269n688956p975404o179968j929178
38370h950654J461591L298093L507135O27075m505534o813050k682676M790692
38362i267328R198308P550781K006469k730172k756733J403085M067743P29790
38354A0201943n143635o416409l003173j663411m381155m988163j14848M763211
38346a0745640M812137L542535N005671N584326J158790l691008k413989K200152
38338E452974K635855q60338k032517n46770j895921n923765n799356P9466M679534
$$ plain form
38329 -4210838 -537618 1073739 3893362 7728549 8035052 3502995 -976655 -774919
38321 -774919 2931800 6029555 7083760 8103052 11276502 16416578 20972561 22176229
38313 22176229 19980417 17906076 19972443 26476894 33167202 34546472 28310103 17657334
38305 17657334 9214160 7013790 8304828 7346999 3433376 1802510 5357173 9480091
38297 9480091 8232401 2615957 -1520007 -2057473 -2735795 -7151664 -14341355 -20538859
38289 -20538859 -22484674 -18977519 -11918536 -6127307 -5642024 -9445424 -12420498 -11011080
38281 -11011080 -7009549 -5698420 -10472094 -18427216 -21544104 -14757396 -3243864 2053400
38273 2053400 -2330328 -8206694 -7719409 -4066220 -4656232 -8154880 -6540017 1520655
$$ packed form
38329d210838L673220J611357K819623L835187L06503m532057m479650K01736
38321g74919L706719L097755J054205J019292L173450N140076M555983J203668
38313B2176229k195812k074341K066367O504451O690308J379270o236369j0652769
38305A7657334q443174k200370J291038r57829l913623j630866L554663M122918
38297I480091j247690n616444m135964n37466o78322m415869p189691o197504
38289b0538859j945815L507155P058983N791229M85283l803400k975074J409418
38281a1011080M001531J311129m773674p955122l116888O786708J1513532N297264
38273B053400m383728n876366M87285L653189n90012l498648J614863Q060672
$$ plain form
38265 1520655 7576332 4419932 -6422860 -19054128 -28651876 -31494008 -26266557 -17616208
38257 -17616208 -12631297 -11686056 -8500845 -1090598 4316011 3483684 1108011 2555394
38249 2555394 4910594 2462755 -3659302 -7831963 -8383003 -7574054 -6237302 -4511657
38241 -4511657 -5094287 -9339144 -12406086 -8974887 -2193112 -270036 -5252151 -11706777
38233 -11706777 -15397952 -15996370 -11865742 -768207 12729377 18710440 14014785 6391129
38225 6391129 3477392 4028102 3667972 2681249 2763502 1509075 -3454569 -8405984 -7790551
38216 -7790551 -2288356 2790454 5198497 6480410 6579246 3411071 -2406084 -7189624
38208 -7189624 -8818515 -8204659 -6873956 -6818152 -11299103 -20675036 -28088860 -25225362 -13160639
$$ packed form
38265A520655O055677l156400j0842792j2631268r597748k842132N227451Q650349
38257a7616208M984911R45241L185211P410247N406609q32327k375673J447383
38249B555394K355200k447839o122057m172661n51040Q08949J336752J725645
38241d511657n82630m244857l066942L431199O781775J923076m982115o454626
38233a1706777l691175n98418M130628J1097535J3497584N981063m695655p623656
38225F391129k913737N50710l60130r86723Q2253j254427m963644m951415O15433
38216g790551N502195N078810K408043J281913R8836l168175n817155m783540
38208g189624j628891O13856J330703N5804m480951r375933p413824K863498J2064723
$$ plain form
38199 -13160639 -2003373 1537066 590260 201812 -691747 -5058194 -10519478 -12171942
38191 -12171942 -10235739 -9536923 -12316732 -16005832 -17776800 -17347927 -15013139 -10281527
38183 -10281527 -3550480 2724845 5227523 1812517 -6204903 -12715088 -10584812 42044
38175 42044 9189993 6837417 -5619706 -17377639 -20509742 -15706546 -6853220 3574226
38167 3574226 12219653 14333915 9539216 3987566 2717777 2916116 -1236639 -9610911
38159 -9610911 -16517346 -18598393 -17961426 -17754440 -18223269 -17446317 -13534811 -6377276 669073
38150 669073 1970736 -4441403 -12956769 -16000009 -13224909 -11020985 -12467339 -12667998
38142 -12667998 -6594659 2450763 6408490 2604754 -3894585 -7552889 -7707805 -5654081
$$ packed form
38199a3160639J1157266L540439r46806l88448q93559m366447n461284j652464
38191a2171942J936203O98816k779809l689100j770968M28873K334788M731612
38183a0281527O731047O275325K502678l415006q017420o510185K130276J0626856
38175D2044R147949k352576j2457123j1757933l132103M803196Q853326J0427446
38167C574226Q645427K114262m794699n551650j269789J98339m152755q374272
38159i610911o906435k081047O36967K06986m68829P76952L911506P157535P046349
38150F69073J301663o412139q515366l043240K775100K203924j446354k00659
38142a2667998O073339R045422L957727l803736o499339l658304j54916K053724
$$ plain form
38134 -5654081 -625550 7841981 15780184 17570158 13047553 7892396 5788326 4259549
38126 4259549 644057 -2336196 -1671390 -1052241 -5895768 -13111941 -13982491 -7751936 -3577967
38117 -3577967 -6144362 -8362058 -3906923 1407115 -857199 -7362720 -8417378 -3797746
38109 -3797746 -1747094 -3407510 -80942 11866757 23728967 26285770 20736068 13194956
38101 13194956 5392541 -3635160 -12057177 -17175315 -19267157 -19127962 -15312436 -7914208
38093 -7914208 -1648324 -902136 -4274585 -7289043 -7654170 -5207673 -622398 2642055
38085 2642055 -294990 -8209463 -12158297 -6436287 3162765 7765458 7649273 8673407
38077 8673407 10117718 5615880 -4363890 -10514255 -7610124 -1859800 -1538747 -5905439
$$ packed form
38134e654081N028531Q467531P938203J789974m522605n155157k104070j528777
38126D259549l615492k980253O64806O19149m843527p216173q70550O230555M173969
38117c577967k566395k217696M455135N314038k264314o505521j054658M619632
38109c797746K050652j660416L326568J1947699J1862210K556803n549702p541112
38101A3194956p802415r027701q422017n118138k091842J39195L815526P398228
38093g914208O265884P46188l372449l014458l65127K446497M585275L264453
38085B642055k937045p914473l948834N722010R599052M602693j16185J024134
38077H673407J444311m501838r979770o150365K904131N750324L21053m366692
$$ plain form
38069 -5905439 -7946273 -4681029 -399622 -927357 -7451767 -15632649 -19639737 -17519219
38061 -17519219 -12657585 -9334434 -8113768 -7475214 -8151735 -12051632 -17310034 -18588108
38053 -18588108 -13484169 -5805790 -1386916 -2699187 -7866591 -12619109 -13021490 -8835378
38045 -8835378 -4460319 -4079938 -6023743 -5117005 -749282 1430047 -2526866 -8644586
38037 -8644586 -9478261 -3024486 5162451 8100679 4216884 -1643107 -3362298 297107
38029 297107 4991450 6198609 3678590 -230037 -4029251 -6328647 -4465057 1990542
38021 1990542 8058955 8599333 5979320 7071267 12396980 14477544 9205247 2987141
38013 2987141 4018784 10140977 10923605 1194189 -11805189 -16039529 -7495139 5949864
$$ packed form
38069e905439k040834L265244M281407n27735o524410q180882m007088K120518
38061a7519219M861634L323151J220666O38554o76521l899897n258402j278074
38053a8588108N103939P678379M418874j312271n167404m752518m02381M186112
38045h835378M375059L80381j943805R06738M367723K179329l956913o117720
38037h644586q33675O453775Q186937K938228l883795n859991j719191L659405
38029B97107M694343J207159k520019l908627l799214k299396J863590O455599
38021A990542O068413N40378k620013J091947N325713K080564n272297o218106
38013B987141J031643O122193P82628r729416j2999378m234340Q544390J3445003
$$ plain form
38005 5949864 12933887 9545058 931215 -6641119 -11784719 -15106413 -14909414 -9935934
37997 -9935934 -3524984 43958 1696066 4836963 7897039 5816484 -1208851 -6819462
37989 -6819462 -7076464 -3923590 678214 7215257 13421467 13871015 8179054 3184147
37981 3184147 3021399 3159367 -1136846 -6529774 -7643919 -6178422 -7165954 -9772084 -8777083
37972 -8777083 -3064953 3725496 9750830 16566939 24987484 34230887 44844732 58842339
37964 58842339 77794390 103384792 137207649 176366968 212154354 237199776 250769362
37957 250769362 252796815 237943790 203690190 161384394 129473085 114849011 108391533
37950 108391533 99764553 88748876 79717131 72738478 65189182 57448675 51947284 48607198
$$ packed form
38005E949864O984023l388829q613843p572334n143600l321694J96999M973480
37997i935934O410950L568942J652108L140897L060076k080555p025335n610611
37989f819462k57002L152874M601804O537043O206210M49548n691961m994907
37981C184147j62748J37968m296213n392928j114145J465497r87532k606130R95001
37972h777083N712130O790449O025334O816109Q420545R243403J0613845J3997607
37964E8842339J8952051K5590402L3822857L9159319L5787386K5045422J3569586
37957B50769362K027453j4853025l4253600m2305796l1911309j4624074o457478
37950A08391533q626980j1015677r031745o978653p549296p740507n501391l340086
$$ plain form
37942 48607198 44621481 37955612 29676404 23534265 22714221 25118611 23339802 12840739
37934 12840739 -894788 -7640488 -4293784 2898809 7138035 6823985 3157901 -1529270
37926 -1529270 -2528466 3329776 10993359 11311980 3932771 -1348037 871101 4133736
37918 4133736 2483383 1698197 9434055 20317326 21732261 12021054 2377711 532919
37910 532919 2389672 2026362 891706 2407125 4505616 3724053 2235755 4429069 8964516
37901 8964516 10445548 8211370 7632744 11831992 17143197 18826115 17178724 15115993
37893 15115993 13047397 9986722 7501544 8099047 10605532 11530697 10717059 10982976 12030934
37884 12030934 10429150 7236721 9179338 18196807 25574123 22555226 12719244 6793284
$$ packed form
37942D8607198l985717o665869q279208o142139q20044K404390j778809j0499063
37934A2840739j3735527o745700L346704P192593M239226l14050l666084m687171
37926a529270r99196N858242P663583L18621p379209n280808K219138L262635
37918D133736j650353p85186P735858J0883271J414935r711207r643343j844792
37910E32919J856753l63310j134656J515419K098491p81563j488298K193314M535447
37901H964516J481032k234178n78626M199248N311205J682918j647391k062731
37893A5115993k068596l060675k485178N97503K506485R25165q13638K65917J047958
37884A2030934j601784l192429J942617R017469P377316l018897r835982n925960
$$ plain form
37876 6793284 7787385 8963775 5548225 540639 -1794473 -859726 3439468 11673950
37868 11673950 19968670 20626401 11614605 465775 -4945036 -5065332 -4764379 -5599583
37860 -5599583 -6337134 -7227743 -8983711 -10151960 -9531204 -8917154 -10195894 -12274750 -13671530
37851 -13671530 -14847619 -15133063 -11609807 -4833381 -948191 -3000440 -4647522 1019178
37843 1019178 10050935 12617403 7212727 1959340 2450237 6053016 8810542 10527842
37835 10527842 11119879 8409163 2475006 -2517929 -3372602 -1318902 730684 823826 -2204086
37826 -2204086 -6819455 -6747297 2901168 16252605 20373405 11238969 -652418 -4655594
37818 -4655594 -3273154 -5050633 -9956127 -10432666 -4675797 -145290 -2759294 -9104714
$$ packed form
37876F793284R94101J176390l415550n007586k335112R34747M299194Q234482
37868A1673950Q294720O57731r011796j1148830n410811j20296L00953q35204
37860e599583p37551q90609j755968j168249O20756O14050j278740k078856j396780
37851a3671530j176089k85444L523256O776426L885190k052249j647082N666700
37843A019178R031757K566468n404676n253387M90897L602779K757526J717300
37835A0527842N92037k710716n934157m992935q54673K053700K049586R3142l027912
37826b204086m615369P2158R648465J3351437M120800r134436j1891387m003176
37818d655594J382440j777479m905494m76539N756869M530507k614004o345420
$$ plain form
37810 -9104714 -11890416 -8946848 -4293634 -2715187 -4982168 -6887350 -2488166 9688043
37802 9688043 23355863 30115637 29741986 32595806 49742339 81905845 120012041 155184001
37794 155184001 184759249 207870454 219198962 211818112 186227330 152377023 120697370
37787 120697370 94375164 73187338 60587604 60143281 66008437 65245885 52939316 38790393
37779 38790393 33951910 36451585 36089499 30077407 25437641 26444800 28190215 25262599
37771 25262599 20054078 18048467 19486250 20483279 19265469 16523717 11932513 5490060
37763 5490060 978711 2472444 7251196 7622239 1202161 -5617805 -6778874 -4194828
37755 -4194828 -2506706 -688509 5119689 12684516 14548477 8402263 676574 -2090067
$$ packed form
37810i104714k785702K943568M653214J578447k266981j905182M399184J2176209
37802I688043J3667820O759774l73651K853820J7146533L2163506L8106196L5171960
37794A55184001K9575248K3111205J1328508p380850k5590782l3850307l1679653
37787A20697370k6322206k1187826j2599734m44323N865156p62552j2306569j4148923
37779C8790393m838483K499675l62086o012092m639766J007159J745415k927616
37771B5262599n208521k005611J437783R97029j217810k741752m591204o442453
37763E490060m511349J493733M778752L71043o420078o819966j161069K584046
37755d194828J688122J818197N808198P564827J863961o146214p725689k766641
$$ plain form
37747 -2090067 -321104 2800477 7424530 14179930 18759872 15485953 5706212 -2344921
37739 -2344921 -2714087 2927244 9567001 14597492 17859455 19405227 19841621 21072697
37731 21072697 24229344 27540944 28133874 25906246 24283578 26437000 31027028 32666314
37723 32666314 27710215 19163132 13690250 13274689 12818870 7937700 1860618 816194
37715 816194 4930798 8624299 8889855 7812380 7050084 5515329 3321759 2234832 757522
37706 757522 -4886603 -12272122 -12180454 -1249456 10883242 13471257 8847782 7146819
37698 7146819 10328199 10458831 3157576 -6018239 -10265937 -9411565 -6514943 -2682473
37690 -2682473 1388012 3477327 3151685 3668365 7457595 12354251 14856682 14615482 13395323
$$ packed form
37747b090067J768963L121581M624053O755400M579942l273919r779741q051133
37739b344921l69166N641331O639757N030491L261963J545772M36394J231076
37731B1072697L156647L311600N92930k227628j622668K153422M590028J639286
37723C2666314m956099q547083n472882m15561m55819m881170o077082j044424
37715H16194M114604L693501K65556j077475p62296j534755k193570j086927j477310
37706G57522n644125p385519R1668J0930998J2132698K588015m623475j700963
37698G146819L181380J30632p301255r175815m247698Q54372K896622L832470
37690b682473M070485K089315l25642N16680L789230M896656K502431k41200j220159
$$ plain form
37681 13395323 12030449 10711739 10201689 10735509 11463918 12191170 13414507 13865255 11169625
37672 11169625 5915369 1161087 -3266748 -10710499 -19367627 -20284146 -8991240 5712869
37664 5712869 11227789 6056620 -1569196 -6902256 -12042489 -17337951 -18949289 -16763650
37656 -16763650 -16330009 -19490990 -20216924 -14065314 -5601402 -1313185 -461260 1048948
37648 1048948 2016475 -1602048 -7677023 -8576527 -1211863 9045141 15397918 16275261
37640 16275261 14057870 11118274 8667004 6711817 3875732 -600148 -4107024 -2512754
37632 -2512754 4221224 10533170 10681252 4208819 -4609054 -10988663 -12613089 -10352121
37624 -10352121 -7366153 -6513582 -7929759 -9863194 -11471703 -12853513 -12464564 -7578882
$$ packed form
37681A3395323j364874j318710n10050N33820P28409P27252J223337M50748k695630
37672A1169625n254256m754282m427835p443751q657128r16519J1292906J4704109
37664E712869N514920n171169p625816n333060n140233n295462j611338K185639
37656a6763650M33641l160981p25934O151610Q463912M288217Q51925J510208
37648A048948R67527l618523o074975q99504P364664J0257004O352777Q77343
37640A6275261k217391k939596k451270j955187k836085m475880l506876J594270
37632b512754O733978O311946J48082o472433q817873o379609j624426K260968
37624a0352121K985968Q52571j416177j933435j608509j381810L88949M885682
$$ plain form
37616 -7578882 1173627 8198028 8370116 2992124 -1900914 -2624593 -962577 47778
37608 47778 1166548 5749737 13752160 19148645 15618246 4871958 -3172683 -598500
37600 -598500 9342886 15915412 13532199 7652496 6841589 11656975 14395176 9259624
37592 9259624 -194033 -5147889 -1550106 6123922 11162819 12159877 12273536 12771367 11274739
37583 11274739 6984477 3638204 4708888 8319740 9728154 6767231 248860 -8246651
37575 -8246651 -15294522 -15237317 -6339111 4075634 6495917 910923 -4198259 -4416534
37567 -4416534 -3860904 -5604633 -5533056 -380466 4208958 73159 -12010436 -22778949
37559 -22778949 -24972327 -19312611 -11326294 -5765221 -3473588 -1448389 3157897 8322982
$$ packed form
37616g578882Q752509P024401J72088n377992m893038p23679J662016J010355
37608D7778J118770M583189Q002423N396485l530399j0746288q044641K574183
37600e98500R941386O572526k383213n879703q10907M815386K738201n135552
37592I259624r453657m953856L597783P674028N038897R97058J13659M97831j496628
37583A1274739m290262l346273J070684L610852J408414k960923o518371q495511
37575h246651p047871N7205Q898206J0414745K420283n584994n109182k18275
37567d416534N55630j743729P1577N152590M589424m135799j2083595j0768513
37559b2778949k193378N659716P986317N561073K291633K025199M606286N165085
$$ plain form
37551 8322982 9069173 4994631 1774024 3111064 5815812 5895941 4679941 4929288 5778465
37542 5778465 6371287 9483147 15424360 17114194 8894987 -3238417 -8575908 -6552833
37534 -6552833 -5942357 -10447183 -14407034 -13498585 -10942648 -10857255 -12606438 -14068724 -14458859
37525 -14458859 -12218178 -6022256 760229 2601332 -101459 -1584819 147950 1897424
37517 1897424 3439575 8304108 14403052 13377641 3241636 -7084059 -10442352 -9952119
37509 -9952119 -9693083 -6436828 1748741 7325983 3424770 -4234689 -5547695 -1108784
37501 -1108784 1245400 992803 4637437 12322139 15704762 10371927 1823219 -2428560
37493 -2428560 -12069 7543451 16551969 21187256 18156521 11976649 9868895 11580721
$$ packed form
37551H322982P46191m074542l220607J337040K704748Q0129j216000K49347Q49177
37542E778465N92822L111860N941213J689834q219207j2133404n337491K023075
37534f552833O10476m504826l959851R08449K555937Q5393j749183j462286l90135
37525a4458859K240681O195922O782485J841103k702791j483360J732769J749474
37517A897424J542151M864533O098944j025411j0136005j0325695l358293M90233
37509i952119K59036L256255Q185569N577242l901213p659459j313006M438911
37501a108784K354184k52597L644634P684702L382623n332835q548708m251779
37493b428560K416491P555520R008518M635287l030735o179872k107754J711826
$$ plain form
37485 11580721 10438482 3958022 -3775284 -10182769 -16451573 -20591424 -17066205 -6861848
37477 -6861848 -340571 -5034492 -15825717 -21771151 -18539423 -10222259 -2775937 140712
37469 140712 -2278033 -7474655 -10721784 -9051235 -3243700 3891915 8756586 7577718
37461 7577718 462892 -5435369 -2620417 6095541 9923996 4609099 -2375388 -3806686
37453 -3806686 -2268445 -3082049 -4938917 -4317177 -3614807 -7003345 -11739718 -11513256 -6592880
37444 -6592880 -3372423 -4616736 -6738147 -6662038 -5461393 -4688127 -4080869 -3341238 -1956165
37435 -1956165 2330901 10130433 16090639 13765803 5298494 309484 3535201 9192419
37427 9192419 10139913 7371586 6693181 10070366 14619435 17593930 18328554 16881265 14283217
$$ packed form
37485A1580721j142239o480460p733306o407485o268804m139851L525219J0204357
37477f861848O521277m693921j0791225n945434L231728Q317164P446322K916649
37469A40712k418745n196622l247129J670549N807535P135615M864671j178868
37461G577718p114826n898261K814952Q715958L828455n314897o984487j431298
37453c806686J538241q13604j856868O21740P02370l388538m736373K26462M920376
37444f592880L220457j244313k121411P6109J200645P73266O07258P39631J385073
37435a956165M287066P799532N960206k324836q467309m989010L225717N657218
37427I192419R47494k768327o78405L377185M549069K974495P34624j447289k598048
$$ plain form
37418 14283217 12959735 13768855 13647463 9292941 2409764 -1965328 -2214282 -2075237 -5276260
37409 -5276260 -10807708 -14398916 -12709408 -5417099 4739407 13030676 15840692 14029297
37401 14029297 11681140 10562133 7977174 1793760 -4776049 -6352491 -2016269 4276195
37393 4276195 8912721 10867385 9576234 5139271 1135782 2219145 6685673 5962412
37385 5962412 -4887599 -19454714 -26742213 -23185541 -14045489 -5334479 694207 3441575
37377 3441575 2792469 391147 -1844529 -4355147 -7507598 -7784837 -1613369 7398422
37369 7398422 11051694 7247858 2144002 221821 -1146929 -4327887 -5559310 -1741447
37361 -1741447 2380824 542107 -4917641 -6226274 -1841026 1883297 694531 -2110819
$$ packed form
37418A4283217j323482Q09120j21392m354522o883177m375092k48954J39045l201023
37409e276260n531448l591208J689508P292309J0156506Q291269K810016j811395
37401A4029297k348157j119007k584959o183414o569809j576442M336222O292464
37393D276195M636526J954664j291151m436963m003489J083363M466528p23261
37385E962412j0850011j4567115p287499L556672R140052Q711010O028686K747368
37377C441575o49106k401322k235676k510618l152451k77239O171468R011791
37369G398422L653272l803836n103856j922181j368750l180958j231423L817863
37361a741447M122271j838717n459748j308633M385248L724323j188766k805350
$$ plain form
37353 -2110819 -1807634 1120523 2983190 2229853 134217 -2012702 -4086632 -6208755
37345 -6208755 -8205819 -9968996 -11594405 -12908765 -12976998 -10491182 -5136787 1638148
37337 1638148 7660706 11232924 10924170 6207834 116027 -1588136 2000117 2678746
37329 2678746 -6872998 -19724303 -20216920 -5331566 8758217 7363522 -3718896 -8587845
37321 -8587845 -4238373 -1712884 -6931748 -12755626 -12001330 -7964988 -7468678 -10808592
37313 -10808592 -13586091 -13418782 -10440966 -5098733 667376 3247894 1673484 -720383
37305 -720383 -1536051 -2892947 -6783764 -10265542 -9250869 -4841935 -1998842 -3234971
37297 -3234971 -6887259 -10431774 -12336797 -11500985 -7992609 -4117807 -2207942 -1467160
$$ packed form
37353b110819L03185K928157J862667p53337k095636k146919k073930k122123
37345f208755j997064j763177j625409j314360o8233K485816N354395O774935
37337A638148O022558L572218l08754m716336o091807j704163L588253O78629
37329B678746r551744j2851305m92617J4885354J4089783j394695j1082418m868949
37321h587845M349472K525489n218864n823878P54296M036342M96310l339914
37313a0808592k777499J67309K977816N342233N766109K580518j574410k393867
37305g20383q15668j356896l890817l481778J014673M408934K843093j236129
37297c234971l652288l544515j905023Q35812L508376L874802J909865P40782
$$ plain form
37289 -1467160 828534 5212027 9206035 10516218 9040337 5790113 2074415 30200
37281 30200 1288701 3692215 1771128 -6644056 -15498820 -16120619 -8558916 -3258496 -8318767
37272 -8318767 -18254666 -20548922 -11988614 -2053246 764442 -1179889 -2086561 -3061228
37264 -3061228 -8161625 -14560484 -15309576 -10772118 -9056946 -13935153 -19452556 -19121352
37256 -19121352 -14691928 -12369284 -14346510 -17253600 -16343191 -9380516 799523 6576250
37248 6576250 2167136 -8597439 -15195965 -12834346 -7441977 -5930429 -6575680 -3337875
37240 -3337875 4145488 10155605 10749043 7649157 4929953 4849578 6477573 6639333 3312521
37231 3312521 -928805 -1191582 2888962 5994172 4841966 3252910 6385197 13295235
$$ packed form
37289a467160K295694M383493L994008J310183j475881l250224l715698k044215
37281C0200J258501K403514j921087q415184q854764o21799P561703N300420n060271
37272h318767r935899k294256Q560308R935368K817688j944331r06672r74667
37264c061228n100397o398859p49092M537458J715172m878207n517403L31204
37256a9121352M429424K322644j977226k907090R10409O962675J0180039N776727
37248F576250m409114j0764575o598526K361619N392369J511548o45251L237805
37240c337875P483363O010117N93438l099886k719204q0375J627995J61760l326812
37231C312521m241326k62777M080544L105210j152206j589056L132287O910038
$$ plain form
37223 13295235 18820426 19903457 16505783 9509578 1918210 -1047644 1957269 4803537
37215 4803537 1558332 -4743609 -6806675 -4196974 -2588704 -2929200 458579 9389176
37207 9389176 16672886 14934624 5709455 -3402962 -6953022 -4590938 553090 3885250
37199 3885250 2770452 103093 1660322 8272929 13957740 13695369 9412031 5832335
37191 5832335 4208927 3513734 4363498 7197195 8542107 3788167 -6697052 -17683141
37183 -17683141 -24928511 -27867111 -27076716 -22813133 -16652987 -11359519 -7732889 -3897416
37175 -3897416 876416 3702603 1478285 -4395062 -8996955 -9584983 -8295044 -8309624 -9044393
37166 -9044393 -7140783 -1616467 4491560 8155745 9423583 8939384 5290264 -1749248
$$ packed form
37223A3295235N525191J083031l397674o996205p591368k965854L004913K846268
37215D803537l245205o301941k063066K609701J608270l40496L387779Q930597
37207I389176P283710j738262r225169r112417l550060K362084N144028L332160
37199C885250j114798k667359J557229O612607N684811k62371m283338l579696
37191E832335j623408o95193Q49764K833697J344912m753940j0485219j0986089
37183a7683141p245370k938600P90395M263583O160146N293468L626630L835473
37175c897416M773832K826187k224318n873347m601893n88028J289939j4580p34769
37166i044393J903610N524316O108027L664185J267838m84199l649120p039512
$$ plain form
37158 -1749248 -7174935 -4968943 3061736 7314800 1551569 -9380437 -15632325 -13236271
37150 -13236271 -5813183 1781207 7075444 8698391 6536894 3688984 4150531 7413535
37142 7413535 8811044 6330814 3235051 1994192 -196511 -6220294 -12704060 -13894551
37134 -13894551 -10167581 -7227904 -7236375 -6688641 -4347618 -4897610 -10755254 -15312494 -10451975
37125 -10451975 1452821 9174383 6026244 -3709184 -12293302 -16970334 -18615346 -16901421
37117 -16901421 -11492770 -5995077 -5843354 -11303038 -15405620 -10982876 752121 10549210
37109 10549210 11292535 6627358 6542231 14155025 21120793 18700715 8959016 66471
37101 66471 -5586271 -11101523 -15227782 -12733373 -5803328 -4787954 -13011366 -19794300
$$ packed form
37158a749248n425687K205992Q030679M253064n763231j0932006o251888K396054
37150a3236271P423088P594390N294237J622947k161497k847910M61547L263004
37142G413535J397509k480230l095763j240859k190703o023783o483766j190491
37134a3894551L726970K939677q471N47734K341023n49992n857644m557240M860519
37125a0451975J1904796P721562l148139r735428q584118m677032j645012J713925
37117a6901421N408651N497693J51723n459684m102582M422744J1734997R797089
37109A0549210P43325m665177q5127P612794O965768k420078r741699q892545
37101F6471n652742n515252m126259K494409O930045J015374q223412o782934
$$ plain form
37093 -19794300 -15267302 -4631077 443102 -1511866 -3093137 -1500028 -94341 1205133
37085 1205133 6152398 12794429 14175857 9942667 7594341 9663210 9321117 3002507
37077 3002507 -1866156 1630844 7976494 6873590 -1774171 -8549103 -7699745 -2225178
37069 -2225178 3255006 7802779 11392394 12240261 9228908 4243896 543837 215111
37061 215111 3449600 8558597 12324489 11894018 7213927 1352610 -1646918 510843
37053 510843 6683188 12713895 14255125 9858931 1555716 -6700730 -10704232 -8106488
37045 -8106488 -995835 4973099 6374103 5521407 5783805 5933914 3239913 -338487 -875385
37036 -875385 145658 -1996339 -6359518 -7317842 -4689013 -4098379 -5686138 -2485455 6079831
$$ packed form
37093a9794300M526998J0636225N074179j954968j581271J593109J405687J299474
37085A205133M947265O642031J381428m233190k348326K068869l42093o318610
37077C002507m868663L497000O345650j102904q647761o774932Q49358N474567
37069b225178N480184M547773L589615Q47867l011353m985012l700059l28726
37061B15111L234489N108997L765892m30471m680091n861317k999528K157761
37053E10843O172345O030707J541230m396194q303215q256446m003502K597744
37045h106488P110653N968934J401004q52696K62398J50109k694001l578400n36898
37036h75385J021043k141997m363179r58324K628829N90634j587759L200683Q565286
$$ plain form
37027 6079831 9551232 1937088 -7735351 -9186253 -6704950 -10087130 -16341626 -13876661
37019 -13876661 -2112927 6649818 5680176 2244722 4739608 11155472 14396379 11867148
37011 11867148 6177450 1795418 3150029 10728264 17805819 16709948 8992958 3136045
37003 3136045 2172682 1597507 96851 2250674 7520380 7128349 -2166029 -10528822 -8974081
36994 -8974081 -2864667 -2403689 -6187415 -5207245 411861 385780 -9801368 -21751140
36986 -21751140 -25432108 -20563252 -13870233 -10128894 -8921438 -7226452 -3150476 1438653
36978 1438653 1997677 -3152532 -9457814 -10810770 -6147961 1362485 9221752 15456885
36970 15456885 16102364 8964327 -863410 -5546397 -4957772 -6438964 -13062865 -18639026
$$ packed form
37027F079831L471401p614144r672439j450902K481303l382180o254496K464965
37019a3876661J1763734Q762745r69642l435454K494886O415864L240907k529231
37011A1867148n689698m382032J354611P578235P077555j095871p716990n856913
37003C136045r63363n75175j500656K153823N269706l92031r294378q362793J554741
36994h974081O109414M60978l783726R80170N619106k6081j0187148j1949772
36986b1751140l680968M868856O693019L741339J207456J694986M075976M589129
36978A438653N59024n150209o305282j352956M662809P510446P859267O235133
36970A5456885O45479p138037r827737m682987N88625j481192o623901n576161
$$ plain form
36962 -18639026 -17009923 -10399433 -4714561 -1471534 1025832 2337763 1023283 -1019931
36954 -1019931 -317770 2847123 4738780 3256106 -629569 -5912619 -12429032 -18513152
36946 -18513152 -21062900 -19026110 -14709667 -10744313 -7385041 -3581431 682276 4173659
36938 4173659 6034369 7039296 9143745 13430266 18446283 21512632 22047685 22169898
36930 22169898 23094188 22724536 18746746 12725691 8517737 7216570 6450774 4716484
36922 4716484 3480116 4073211 5154643 5090722 5111387 7848209 13244013 17718116 17650033
36913 17650033 12666935 5135539 -2738425 -10119055 -15593004 -15716110 -8277777 2555345
36905 2555345 7731472 2888514 -5446531 -6834520 785867 9599953 12185870 8559568
$$ packed form
36962a8639026J629103O610490N684872L243027K497366J311931j314480k043214
36954a019931P02161L164893J891657j482674l885675n283050o516413o084120
36946a8513152k549748K036790M316443L965354L359272L803610M263707L491383
36938D173659J860710J004927K104449M286521N016017L066349N35053J22213
36930B2169898R24290l69652l977790o021055m207954j301167p65796j734290
36922D716484j236368N93095J081432o3921K0665K736822N395804M474103o8083
36913A7650033m983098p531396p873964p380630n473949j23106P438333J0833122
36905B555345N176127m842958q335045j387989P620387Q814086K585917l626302
$$ plain form
36897 8559568 2404760 -4174549 -9356032 -9724730 -3954211 4230599 10086449 12360379
36889 12360379 11222602 5808007 -1945357 -5209540 -125696 7290795 8948170 6822522
36881 6822522 9027636 15223009 16129784 8990684 3000028 4881455 8384919 4794228
36873 4794228 -3638320 -8729475 -9252551 -10177619 -12591574 -12869715 -10137377 -7103285 -4639911
36864 -4639911 -2200220 -2153909 -6671288 -11428507 -9791088 -2638384 3489185 7348100
36856 7348100 13272430 20092622 19998498 11700861 5100807 7419390 12932504 13243739 10557817
36847 10557817 12157606 16634277 15301373 5725312 -4612045 -8496124 -6178408 -1657533
36839 -1657533 2372138 4368664 3604546 2082133 3339422 7502119 10218420 8193187
$$ packed form
36897H559568o154808o579309n181483l68698N770519Q184810N855850K273930
36889A2360379j137777n414595p753364l264183N083844P416491J657375k125648
36881F822522K205114O195373R06775p139100n990656J881427L503464l590691
36873D794228q432548n091155n23076r25068k413955k78141K732338L034092K463374
36864d639911K439691M6311m517379m757219J637419P152704O127569L858915
36856G348100N924330O820192r4124q297637o600054K318583N513114L11235k685922
36847A0557817J599789M476671j332904r576061j0337357l884079K317716M520875
36839a657533M029671J996526p64118j522413J257289M162697K716301k025233
$$ plain form
36831 8193187 3629883 1425412 3241401 5839508 4842595 -734552 -7765856 -12444197
36823 -12444197 -13634184 -12209240 -8585733 -3600308 -1110121 -5309462 -13932169 -18258573
36815 -18258573 -12874610 -2403363 4397374 4140120 -844303 -7932998 -14843544 -17287191
36807 -17287191 -12103597 -2551323 4343395 5843380 5000050 4718468 4839225 4875543 4917820
36798 4917820 3638467 54507 -2684640 -749430 2397544 -2171701 -16338599 -29809440
36790 -29809440 -31505087 -22059046 -11040273 -5349490 -4961253 -7428462 -11089800 -14249159
36782 -14249159 -15599255 -16226549 -18412011 -21856779 -23251770 -20373502 -15291777 -12627273
36774 -12627273 -14620378 -17961832 -16365684 -7734176 1884645 4128311 -1683440 -7593316
$$ packed form
36831H193187m563304k204471J815989K598107r96913n577147p031304m678341
36823a2444197j189987J424944L623507M985425K490187m199341q622707m326404
36815a8258573N383963J0471247O800737k57254m984423p088695o910546k443647
36807a7287191N183594R552274O894718J499985q43330k81582J20757L6318M2277
36798D917820j279353l583960k739147J935210L146974m569245j4166898j3470841
36790b9809440j695647R446041J1018773N690783L88237k467209l661338l159359
36782a4249159j350096o27294k185462l444768j394991K878268N081725K664504
36774a2627273j993105l341454J596148Q631508R618821K243666n811751n909876
$$ plain form
36766 -7593316 -7132398 -2746291 -721941 -2291458 -3906812 -4116903 -4971573 -6581494 -5069639
36757 -5069639 2012575 11161911 16324753 15460095 11484805 7227639 1992590 -5587963
36749 -5587963 -12949602 -14711211 -8967380 65794 7377888 12697973 17792612 20492468
36741 20492468 16352447 6180652 -2946492 -5420492 -1846544 4819196 12953540 20259683
36733 20259683 23469596 23301348 24777930 28797425 28668366 20234490 10256938 7680737
36725 7680737 10732249 11211912 8731585 10493237 17299543 20656086 16507469 11991521
36717 11991521 13605312 16998864 15008824 9294980 6570102 7780907 8516499 7260273
36709 7260273 6121894 5171725 2744096 387327 1300300 4383160 5662651 5019281 5272035
$$ packed form
36766g593316M60918M386107K024350j569517j615354k10091q54670j609921J511855
36757e069639P082214R149336N162842q64658l975290m257166n235049p580553
36749e587963p361639j761609N743831R033174P312094N320085N094639K699856
36741B0492468m140021j0171795r127144k474000L573948O665740Q134344P306143
36733B0259683L209913j68248J476582M019495j29059q433876r977552k576201
36725G680737L051512M79663k480327J761652O806306L356543m148617m515948
36717A1991521J613791L393552j990040n713844k724878J210805P35592j256226
36709G260273j138379r50169k427629k356769R12973L082860J279491o43370K52754
$$ plain form
36700 5272035 5029825 -58268 -7812963 -9374351 -2069779 4775860 2277092 -5473754
36692 -5473754 -7854156 -2569138 3346143 5032908 4397942 3496297 1142283 -2103028
36684 -2103028 -2504351 102489 199547 -4429652 -6957277 -660797 10176788 15768741
36676 15768741 15082676 16304254 22752030 27080941 23057004 15578418 12944498 14571241
36668 14571241 13908140 10374834 9830459 13508682 14871795 9914906 3849343 3666371
36660 3666371 9012781 14601199 17717885 18815852 17592810 13169653 6490718 -1134017
36652 -1134017 -9853712 -18086178 -20453766 -14073375 -4785089 -1169057 -3641217 -5957874
36644 -5957874 -6639296 -10642088 -18260422 -21191249 -14267229 -4089760 18574 -1689694
$$ packed form
36700E272035k42210n088093p754695j561388P304572O845639k498768p750846
36692e473754k380402N285018N915281J686765o34966r01645k354014l245311
36684b103028m01323K606840R7058m629199k527625O296480J0837585N591953
36676A5768741o86065J221578O447776M328911m023937p478586k633920J626743
36668A4571241o63101l533306n44375L678223J363113m956889o065563j82972
36660C666371N346410N588418L116686J097967j223042m423157o678935p624735
36652a134017q719695q232466k367588O380391R288286L616032k472160k316657
36644e957874o81422m002792p618334k930827O924020J0177469M108334j708268
$$ plain form
36636 -1689694 -2660769 -1237482 -1037228 -2744591 -3312088 -2469158 -2775941 -3207390 191375
36627 191375 6336997 8834760 5732418 2937673 4798943 7326184 4966134 -960750
36619 -960750 -5459123 -7495125 -9299713 -11084201 -11672427 -12200356 -14062459 -14833317 -11431804
36610 -11431804 -6265560 -4864072 -7619124 -9057524 -5836221 -669539 2585245 3059389
36602 3059389 692968 -5330825 -13391850 -18507389 -17832746 -14569164 -13456023 -14291159
36594 -14291159 -12821065 -6971925 301746 4165517 2663772 -1311630 -2609540 600628
36586 600628 4408253 4480606 2728571 4460877 9126356 10131279 6088489 5240661 13211448
36577 13211448 22130187 19950503 7379560 -3257378 -4807104 -1675159 1141469 5188344
$$ packed form
36636a689694r71075J423287K00254j707363n67497Q42930l06783m31449L398765
36627A91375O145622K497763l102342k794745J861270K527241k360050n926884
36619i60750m498373k036002j804588j784488n88226n27929j862103p70858L401513
36610a1431804N166244J401488k755052j438400L221303N166682L254784M74144
36602C059389k366421o023793q061025n115539O74643L263582J113141q35136
36594a4291159J470094N849140P273671L863771j501745l975402j297910L210168
36586F00628L807625P2353j752035J732306M665479J004923m042790q47828P970787
36577A3211448Q918739k179684j2570943j0636938j549726L131945K816628M046875
$$ plain form
36569 5188344 10696095 10758476 686973 -12498960 -17504458 -12354818 -4009345 2414979
36561 2414979 6701516 8093785 5290376 1997618 4612783 12818941 19466639 21652971
36553 21652971 24405998 30067889 31907420 24315945 12993856 7148788 5877347 1287106
36545 1287106 -6983540 -10372732 -5581185 -648595 -2597917 -6465038 -3049643 6983310
36537 6983310 13868756 11906013 5325251 535060 -1878980 -4793364 -7779234 -6750899
36529 -6750899 -235530 6736529 6888272 -1315161 -11388656 -15547823 -12809392 -8775741
36521 -8775741 -7965153 -8973947 -7885777 -3782983 1052808 4626518 6519572 6412158
36513 6412158 3510428 -2107681 -8375882 -11840799 -10138463 -5204944 -3312107 -8993420
$$ packed form
36569E188344N507751O2381j0071503j3185933n005498N149640Q345473O424324
36561B414979M286537J392269k803409l292758K615165Q206158O647698K186332
36553B1652971K753027N661891J839531p591475j1322089n845068j271441m590241
36545A287106q270646l389192M791547M932590j949322l867121L415395J0032953
36537F983310O885446j962743o580762m790191k414040k914384k985870J028335
36529f750899O515369O972059J51743q203433j0073495m159167K738431M033651
36521h775741Q10588j008794J088170M102794M835791L573710J893054j07414
36513F412158k901730n618109o268201l464917J702336M933519J892837n681313
$$ plain form
36505 -8993420 -18337106 -21559744 -13926892 -1211078 7572138 9475656 7100196 2841532
36497 2841532 -1744834 -3826027 -2221935 -1032271 -4894317 -11582059 -14959831 -14547914
36489 -14547914 -15597053 -19461691 -21309603 -19270080 -18255396 -20863116 -21472651 -15065250
36481 -15065250 -6398589 -3593153 -6290177 -7312972 -3968883 -562729 -274392 -1283447
36473 -1283447 -1801049 -3094731 -5597562 -6584492 -4115137 -142011 2380780 3261221 4429330
36464 4429330 7193310 10965589 13378937 11853113 6914903 3187909 4227221 7058847
36456 7058847 5730905 325043 -2266470 1946439 8134880 9395919 5817933 2995414
36448 2995414 3804240 5762427 5658445 3076410 -796439 -4834831 -7649269 -7727209 -4977163
$$ packed form
36505h993420r343686l222638P632852J2715814Q783216J903518k375460m258664
36497B841532m586366k081193J604092J189664l862046o687742l377772M11917
36489a4547914j049139l864638j847912K039523J014684k607720o09535O407401
36481a5065250Q666661K805436k697024j022795L344089L406154K88337j009055
36473a283447n17602j293682k502831r86930K469355L973126K522791Q80441J168109
36464D429330K763980L772279K413348j525824m938210l726994J039312K831626
36456G058847j327942n405862k591513M212909O188441J261039l577986k822519
36448B995414Q08826J958187j03982k582035l872849m038392k814438p7940K750046
$$ plain form
36439 -4977163 -1047876 2468923 5328926 7810890 9436164 9101364 6356156 2521010
36431 2521010 559640 3122298 9685280 15654129 15557052 8222773 -1491934 -7289468
36423 -7289468 -7930999 -7575205 -8602881 -6549666 3899960 18474019 24615964 16237347
36415 16237347 2523735 -3114296 280395 2177441 -3321184 -10488889 -12631455 -11663643
36407 -11663643 -12377001 -13368887 -10299046 -4667572 -2476132 -5336127 -8738482 -8868320
36399 -8868320 -6047863 -1494861 4116271 8091454 6733005 727745 -4465124 -5373539
36391 -5373539 -3945525 -2513340 407248 6272984 12061038 13580626 10986661 7372988
36383 7372988 3832780 -198514 -3322790 -3478306 -2194618 -2739021 -3769847 -39933
$$ packed form
36439d977163L929287L516799K860003K481964J625274l34800k745208l835146
36431B521010j961370K562658O562982N968849r7077p334279r714707n797534
36423g289468o41531L55794j027676K053215J0449626J4574059O141945q378617
36415A6237347j3713612n638031L394691J897046n498625p167705k142566R67812
36407a1663643p13358r91886L069841N631474K191440k859995l402355j29838
36399h868320K820457M553002N611132L975183j358449o005260n192869r08415
36391e373539J428014J432185K920588N865736N788054J519588k593965l613673
36383G372988l540208m031294l124276j55516J283688n44403j030826L729914
$$ plain form
36375 -39933 8886076 15844447 15593208 12722980 14509357 18491980 14493476 -255129
36367 -255129 -15152569 -19276523 -14926742 -12191632 -13809128 -13828950 -10717095 -11744407
36359 -11744407 -20004362 -25937046 -20491858 -11088331 -12890050 -25531965 -31357565 -20385860
36351 -20385860 -5061529 -2249514 -10156586 -14395939 -10680023 -7857288 -10359471 -11820320
36343 -11820320 -8606037 -6973168 -11292050 -15697667 -14427798 -11501965 -12040427 -11857783
36335 -11857783 -5344502 2509803 2757347 -3065795 -6234606 -5689302 -7776491 -12396705
36327 -12396705 -12108711 -6443345 -4822999 -11611966 -19329770 -21359360 -20802519 -20972119
36319 -20972119 -17758705 -9465213 -4710372 -10422550 -19133329 -18975231 -10969268 -5319145
$$ packed form
36375c9933Q926009O958371k51239k870228J786377L982623l998504j4748605
36367b55129j4897440m123954M349781K735110j617496j9822L111855j027312
36359a1744407q259955n932684N445188R403527j801719j2641915n825600J0971705
36351b0385860J5324331K812015p907072m239353L715916K822735k502183j460849
36343a1820320L214283J632869m318882m405617J269869K925833n38462J82644
36335a1857783O513281P854305K47544n823142l168811N45304k087189m620214
36327a2396705K87994N665366J620346o788967p717804k029590N56841j69600
36319b0972119L213414Q293492M754841n712178q710779J58098Q005963N650123
$$ plain form
36311 -5319145 -4591354 -2548240 2173145 3447098 -472421 -3408567 -2088654 -1160910
36303 -1160910 -4070865 -7054508 -6256870 -3983934 -3341469 -2178313 2622575 8303943
36295 8303943 8179878 -696080 -13638594 -21146524 -16324495 -2241384 9350330 10359450
36287 10359450 5470077 3923232 5236419 1530465 -7144857 -10592419 -4075763 3888644
36279 3888644 4181084 -865763 -3629145 -1965278 2292890 8718305 15209310 15522566
36271 15522566 7561886 -609223 -745902 3640545 3318970 -2065701 -4222250 563398
36263 563398 6919757 9090191 6730250 1266595 -6775348 -14680541 -16703417 -9253881
36255 -9253881 4547187 16041866 16706838 5556101 -7544869 -10271851 -2561453 2138309
$$ packed form
36311e319145P27791K043114M721385J273953l919519k936146J319913R27744
36303a160910k909955k983643P97638K272936O42465J163156M800888N681368
36295H303943j24065q875958j2942514p507930M822029J4083111J1591714J009120
36287A0359450m889373j546845J313187l705954q675322l447562O516656P964407
36279C888644K92440n046847k763382J663867M258168O425415O491005L13256
36271A5522566p960680q171109j36679M386447l21575n384671k156549M785648
36263E63398O356359K170434k359941n463655q041943p905193k022876P449536
36255i253881J3801068J1494679O64972j1150737j3100970k726982P710398M699762
$$ plain form
36247 2138309 -5480656 -17965127 -22689438 -19483768 -16848967 -15435342 -7888353 5804237
36239 5804237 15271226 14302406 8311512 4680910 4819297 8219322 14685269 18977389
36231 18977389 12989637 -1676165 -12195683 -11307266 -6995845 -8574422 -11735881 -7090186
36223 -7090186 2709071 5797080 -1244354 -8991905 -8999255 -3540703 789925 2942978 7066736
36214 7066736 14996015 22190599 21792636 12751496 2665933 -86667 3624775 5994109
36206 5994109 4673835 6087472 13699159 20447539 18638676 11358470 6828413 6125364
36198 6125364 4725957 2731282 4138260 7340236 5883341 -660546 -5209486 -4233314
36190 -4233314 -2260700 -2735834 -2075005 3022548 8725122 9625242 6676294 4833094 6053607
$$ packed form
36247B138309p618965j2484471m724311L205670K634801J413625P546989J3692590
36239E804237R466989r68820n990894l630602J38387L400025O465947M292120
36231A8977389n987752j4665802j0519518Q88417M311421j578577l161459M645695
36223g090186R799257L088009p041434p747551p350N458552M330628K153053M123758
36214G066736P929279P194584l97963r041140j0085563k752600L711442K369334
36206E994109j320274J413637P611687O748380j808863p280206m530057p03049
36198F125364j399407j994675J406978L201976j456895o543887m548940R76172
36190d233314J972614m75134O60829N097553N702574R00120k948948j843200J220513
$$ plain form
36181 6053607 8626622 10476926 9635618 4613006 -2152543 -4749519 -1765141 127124
36173 127124 -4036872 -8052813 -2812251 7926256 10009599 -972067 -11976846 -10882200
36165 -10882200 -4374125 -7728699 -21055527 -27796486 -18124270 -2659773 2901723 -1570754
36157 -1570754 -4001358 897373 6241364 5775989 2378999 1237720 2199344 3137272 5297952
36148 5297952 10391990 16089560 18882570 18615769 16341145 10763086 1338827 -7594509
36140 -7594509 -10824640 -9055190 -7298149 -7866703 -9499722 -11942856 -15691442 -17384614
36132 -17384614 -11558376 1222794 12721361 15876378 11897808 6714033 3880595 3502268
36124 3502268 5178495 8495418 11502706 11321497 6838136 451813 -2832522 744731
$$ packed form
36181F053607K573015J850304q41308n022612o765549k596976K984378J892265
36173A27124m163996m015941N240562J0738507K083343j0981666j1004779J094646
36165a0882200O508075l354574j3326828o740959R672216J5464497N561496m472477
36157a570754k430604M898731N343991m65375l396990j141279R61624R37928K160680
36148E297952N094038N697570K793010k66801k274624n578059r424259q933336
36140g594509l230131J769450J757041n68554j633019k443134l748586j693172
36132a7384614N826238J2781170J1498567L155017l978570n183775k833438l78327
36124C502268J676227L316923L007288j81209m483361o386323l284335L577253
$$ plain form
36116 744731 8896353 13250918 7103058 -6615937 -17831513 -20001139 -15376755 -9493590
36108 -9493590 -4499541 233574 4360284 6407752 5791506 3162736 99325 -925971
36100 -925971 1095064 2442106 -2516415 -12874300 -19236425 -14106513 -1766606 6550209
36092 6550209 5895220 1558826 494166 3611818 7381399 8784548 6704892 1589586
36084 1589586 -3799034 -5361580 -1885242 2718458 3319245 -835587 -5658488 -6516407
36076 -6516407 -1829915 6328240 13261288 14165408 8362254 1399755 471059 6529026
36068 6529026 12891233 13286073 9497716 8484980 12857572 17489134 16297926 9618256
36060 9618256 2891878 -435135 -2300108 -6175227 -11419155 -12911285 -7044142 2469384
$$ packed form
36116G44731Q151622M354565o147860j3718995j1215576k169626M624384N883165
36108i493590M994049M733115M126710K047468o16246k628770l063411j025296
36100i25971K021035J347042m958521j0357885o362125N129912J2339907Q316815
36092F550209o54989m336394j064660L117652L769581J403149k079656n115306
36084A589586n388620j562546L476338M603700O00787m154832m822901q57919
36076f516407M686492Q158155O933048R04120n803154o962499r28696O057967
36068F529026O362207L94840l788357j012736M372592M631562j191208o679670
36060I618256o726378l327013j864973l875119n243928j492130N867143R513526
$$ plain form
36052 2469384 6994642 2673451 -4404003 -5789973 -1707243 410072 -2097479 -3430463
36044 -3430463 -56502 2143108 -2551520 -8509587 -5742153 4364723 9788937 5035180
36036 5035180 -1489991 -676879 4487880 5135177 188700 -3315657 -1468775 1566180
36028 1566180 395641 -4511539 -8344744 -8001984 -4832613 -2230827 -1753144 -2102918 -1776157
36019 -1776157 -1283064 -1241199 319479 5474612 11450836 12331684 7167480 2413360 3617699
36010 3617699 8082244 9379470 6561979 4450357 5916816 8342878 8192757 5730131
36002 5730131 3985995 4938604 7587501 8929952 6931333 3273836 2245792 5669507
35994 5669507 10049947 10375213 5694863 -743263 -5534548 -7085789 -4878799 246122
$$ packed form
36052B469384M525258m321191p077454j385970M082730K117315k507551j332984
36044c430463L373961K199610m694628n958067K767434J0106876N424214m753757
36036E035180o525171Q13112N164759O47297m946477l504357J846882L034955
36028A566180j170539m907180l833205L42760L169371K601786M77683l49774L26761
36019a776157M93093M1865J560678N155133N976224Q80848n164204m754120J204339
36010C617699M464545J297226k817491k111622J466459K426062j50121k462626
36002E730131j744136R52609K648897J342451j998619l657497j028044L423715
35994E669507M380440L25266m680350o438126m791285j551241K206990N124921
$$ plain form
35986 246122 5404193 7830026 7672868 6714881 5199519 2610862 635675 1478081 3087878
35977 3087878 427551 -6752191 -11248723 -6749482 3456921 9821996 7940016 3190791
35969 3190791 3258603 8773318 13544814 12890349 8877852 6449349 6757085 7064039 6241651
35960 6241651 6389001 7759699 6036466 -1765126 -11014861 -13645380 -8055620 -388544
35952 -388544 4495773 8496509 14603301 20229787 20502031 15862868 11524679 9607439
35944 9607439 6422022 -794138 -8106412 -9272047 -4451634 -685903 -2777469 -6716320
35936 -6716320 -4880581 3555013 11010469 11139842 6825274 5776729 10040128 13796266
35928 13796266 11676144 5384331 332708 -1034016 429293 4257307 9605327 11377666
$$ packed form
35986B46122N158071K425833j57158r57987j515362k588657j975187Q42406J609797
35977C087878k660327p179742m496532M499241J0206403O365075j881980m749225
35969C190791O7812N514715M771496o54465m012497k428503L07736L06954q22388
35960F241651J47350J370698j723233p801592r249735k630519N589760P667076
35952c88544M884317M000736O106792N626486K72244m639163m338189j917240
35944I607439l185417p216160p312274j165635M820413L765731k091566l938851
35936f716320J835739Q435594P455456J29373m314568j048545M263399L756138
35928A3796266k120122o291813n051623j366724J463309L828014N348020J772339
$$ plain form
35920 11377666 2972919 -14217459 -28240861 -28279999 -17107041 -7025532 -4274991 -3429862
35912 -3429862 1616499 7966785 9599471 7660991 7826423 9817646 7457198 -398659
35904 -398659 -6495864 -5618665 -2346167 -4078212 -10588244 -15353318 -14685424 -10942253 -7959253
35895 -7959253 -7038391 -6770297 -4258550 2241866 9803891 12212669 7570876 1807292
35887 1807292 1164758 4250782 6048432 6419077 7963996 7688803 -526775 -14442585
35879 -14442585 -22960640 -20280044 -13497651 -12010672 -15686345 -18678970 -19236714 -19020546
35871 -19020546 -16945288 -11496679 -6919467 -8966538 -14710337 -14452194 -5448941 3364389
35863 3364389 3669652 -1120432 -1736986 4080267 9982953 10268332 5869738 1757380 2191268
$$ packed form
35920A1377666q404747j7190378j4023402l9138J1172958J0081509K750541Q45129
35912c429862N046361O350286J632686j938480J65432J991223k360448p855857
35904c98659o097205Q77199L272498j732045o510032m765074O67894L743171K983000
35895g959253R20862K68094K511747O500416P562025K408778m641793n763584
35887A807292o42534L086024J797650L70645J544919k75193q215578j3915810
35879a4442585q518055K680596O782393J486979l675673k992625n57744K16168
35871a9020546K075258N448609M577212k047071n743799K58143R003253Q813330
35863C364389L05263m790084o16554N817253N902686K85379m398594m112358M33888
$$ plain form
35854 2191268 8099821 15674785 17995136 11784285 2489298 -1410104 482996 -123470
35846 -123470 -8000281 -16747395 -17183401 -9327783 -887292 3492449 5474252 6827092
35838 6827092 6652163 5539556 6252780 8158374 6621993 1007105 -2074321 2171029
35830 2171029 8974895 10746590 7987196 7090352 9574958 10884619 9546328 9786393
35822 9786393 12956548 13333235 6803143 -1251155 -2236483 4085483 9651907 8804677 3989881
35813 3989881 222580 -1633815 -3718019 -6330393 -7667759 -7373572 -7033824 -6812656 -4718821
35804 -4718821 -730126 1222258 -1773094 -6750395 -8727122 -7969153 -8551380 -10177952
35796 -10177952 -7693694 -349068 5038286 3966893 1311793 3085276 6390244 4652014
$$ packed form
35854B191268N908553P574964K320351o210851r294987l899402J893100o06466
35846a23470p876811q747114m36006P855618Q440491M379741J981803J352840
35838F827092j74929j112607P13224J905594j536381n614888l081426M245350
35830B171029O803866J771695k759394q96844K484606J309661j338291K40065
35822I786393L170155L76687o530092q054298r85328O321966N566424q47230m814796
35813C989881l767301j856395k084204k612374j337366K94187L39748K21168K093835
35804d718821L988695J952384k995352m977301j976727P57969n82227j626572
35796a0177952K484258P344626N387354j071393k655100J773483L304968j738230
$$ plain form
35788 4652014 -1135658 -4712348 -5508413 -7917680 -10530702 -6608537 2841953 6850205
35780 6850205 9067 -8622708 -8511627 -2283060 306411 -2552808 -4674387 -3910953
35772 -3910953 -4837776 -9276112 -12277265 -10081856 -6266068 -6395817 -9971886 -11315764
35764 -11315764 -7298957 -1361138 874507 -1199993 -2129181 2480431 9396119 11196253
35756 11196253 5815379 -1168880 -4489980 -5013264 -5584786 -5740359 -4311447 -3422222 -4982166
35747 -4982166 -5906123 -2305753 3050228 3180225 -3210163 -9318594 -8649150 -1829191 5814622
35738 5814622 9682300 7720020 542025 -7954966 -12343762 -10289563 -4747103 -792913
35730 -792913 -1048445 -4138654 -6229411 -4111565 1605049 6207527 5272708 -493955 -6063146
$$ packed form
35788D652014n787672l576690p96065k409267k613022L922165R450490M008252
35780F850205o841138q631775J11081O228567K589471k859219k121579P63434
35772c910953r26823m438336l001153K195409L815788j29749l576069j343878
35764a1315764M016807N937819K235645k074500r29188M609612O915688J800134
35756A1196253n380874o984259l321100n23284n71522j55573J428912Q89225j559944
35747d982166r23957L600370N355981J29997o390388o108431O69444O819959P643813
35738E814622L867678j962280p177995q496991m388796K054199N542460L954190
35730g92913k55532l090209k090757K117846N716614M602478r34819n766663n569191
$$ plain form
35721 -6063146 -7660369 -6364946 -6397312 -10865089 -18557646 -23880619 -21280761 -11589792
35713 -11589792 -2712635 -1535990 -6033230 -8248315 -4652483 -199321 -1452125 -8708346
35705 -8708346 -16705963 -21357879 -23614805 -26651227 -30538513 -31188874 -25525357 -16605802
35697 -16605802 -10927089 -10273802 -9476746 -3973711 3668141 7814800 7748173 7586125 9493544
35688 9493544 10923201 8579828 2393873 -4192299 -6010336 167302 10925422 16831480
35680 16831480 11386675 -1500928 -12041158 -15091312 -12708917 -8281019 -3256136 906646
35672 906646 2620149 2406991 1461566 -1235148 -5870619 -7366448 -574288 10046806
35664 10046806 13247531 5381329 -4807658 -8610507 -7831898 -8512519 -10257638 -8158636
$$ packed form
35721f063146j597223J295423l2366m467777p692557n322973K599858R690969
35713a1589792Q877157J176645m497240k215085L595832M453162j252804p256221
35705h708346p997617m651916k256926l036422l887286o50361N663517Q919555
35697a6605802N678713O53287P97056N503035P641852M146659o6627j62048J907419
35688I493544J429657k343373o185955o586172j818037O177638J0758120N906058
35680A6831480n444805j2887603j0540230l050154K382395M427898N024883M162782
35672I06646J713503k13158r45425k696714m635471j495829O792160J0621094
35664A0046806L200725p866202j0188987l802849P78609o80621j745119K099002
$$ plain form
35656 -8158636 -1900827 3365637 4252522 2703575 2658251 6076839 11681980 15634374 14504910
35647 14504910 8991030 3163689 -618091 -3143209 -3862890 470424 9699430 16778468
35639 16778468 14750340 5041843 -4772585 -9481852 -9248602 -6435429 -3383460 -1959784
35631 -1959784 -1771695 206701 5520888 11274014 13857072 13423629 11505437 6796034
35623 6796034 -2228916 -12122804 -16722271 -14297601 -8836578 -5042173 -5670650 -12252103
35615 -12252103 -23250927 -31758006 -30520532 -20739417 -11746018 -10522340 -15084321 -19186895
35607 -19186895 -19347351 -15420114 -8595902 -2163789 -1109907 -6852567 -13676066 -13929590
35599 -13929590 -6567725 2034204 5678653 4433113 2830848 4159599 7640305 9940953
$$ packed form
35656h158636O257809N266464Q86885j548947m5324L418588N605141L952394j129464
35647A4504910n513880n827341l781780k525118p19681M333314R229006P079038
35639A6778468k028128r708497r814428m709267K33250K813173L051969J423676
35631a959784J88089J978396N314187N753126K583058m33443j918192m709403
35623F796034r024950r893888m599467K424670N461023L794405o28477o581453
35615a2252103j0998824q507079J237474R781115Q993399J223678m561981m102574
35607a9186895j60456L927237O824212O432113J053882n742660o823499k53524
35599a3929590P361865Q601929L644449j245540j602265J328751L480706K300648
$$ plain form
35591 9940953 8185542 2207875 -4773793 -8091388 -6055407 -2894501 -5300326 -14539877
35583 -14539877 -23598704 -24545208 -17930481 -12124455 -13439394 -19909495 -25484412 -27191047
35575 -27191047 -26244495 -24410442 -21916793 -18354206 -13995953 -10202989 -8745583 -10108414
35567 -10108414 -12730130 -14842501 -16041316 -15527254 -11010350 -2852691 2867998 1009578
35559 1009578 -3883008 -2376413 5921658 11350344 9329922 7378289 11992160 17418260
35551 17418260 15368918 8516520 4440205 1846496 -5371207 -13449332 -11253227 1771927
35543 1771927 12118506 10139189 1622896 -2983616 -2401849 -1915253 -3551801 -5151609
35535 -5151609 -5192758 -3460595 297961 4870438 7547959 8056777 9119885 11174110 10946178
$$ packed form
35591I940953j755411n977667o981668l317595K035981L160906k405825r239551
35583a4539877r058827r46504O614727N806026j314939o470101n574917j706635
35575b7191047R46552J834053K493649L562587M358253L792964J457406j362831
35567a0108414k621716k112371j198815N14062M516904Q157659N720689j858420
35559A009578m892586J506595Q298071N428686k020422j951633M613871N426100
35551A7418260k049342o852398m076315k593709p217703q078125K196105J3025154
35543A771927J0346579j979317q516293m606512N81767M86596j636548j599808
35535e151609m1149J732163L758556M572477K677521N08818J063108K054225k27932
$$ plain form
35526 10946178 7565620 4951604 5089795 4559683 1845966 2146466 8962093 16010186
35518 16010186 14986430 7962183 3965330 5127054 4943571 531075 -2115070 1971512
35510 1971512 8540295 10353590 6954117 3521915 2989642 3891318 4379087 3972166 1725977
35501 1725977 -3385831 -9566628 -12833356 -11892434 -9933543 -9931314 -10446835 -8627897 -5669983
35492 -5669983 -5647074 -9069294 -11339259 -8847042 -3536888 304377 1035431 -599433 -3864584
35483 -3864584 -7355231 -8397098 -6402838 -4694037 -5428309 -4954254 1239690 10511653
$$ packed form
35526A0946178l380558k614016J38191n30112k713717L00500O815627P048093
35518A6010186j023756p024247l996853J161724j83483m412496k646145M086582
35510A971512O568783J813295l399473l432202n32273R01676M87769m06921k246189
35501A725977n111808o180797l266728R40922J958891K229n15521J818938K957914
35492e669983K2909l422220k269965K492217N310154L841265P31054j634864l265151
35483c864584l490647j041867J994260J708801p34272M74055O193944R271963
$$ [...]
##END NTUPLES=NMR SPECTRUM
##END=
