##TITLE=31Pdec_LR-669-M1
 , 24 sc
 10.4.2019
##JCAMPDX= 6.0         $$ Bruker NMR JCAMP-DX V2.0
##DATA TYPE= NMR SPECTRUM
##DATA CLASS= NTUPLES
##ORIGIN= UXNMR, Bruker Analytische Messtechnik GmbH
##OWNER= root
$$ XWIN-NMR		Version 3.5
$$ Wed Apr 10 15:35:06 2019 Russian Standard Time (UT+4h)  she@DPX200
##.OBSERVE FREQUENCY= 81.013821
##.OBSERVE NUCLEUS= ^31P
##.ACQUISITION MODE= SIMULTANEOUS
##.ACQUISITION SCHEME= undefined
##.AVERAGES= 24
##.DIGITISER RES= 17
##SPECTROMETER/DATA SYSTEM= spect
##.PULSE SEQUENCE= zgpg30
##.SOLVENT NAME= CDCl3
##.SHIFT REFERENCE= (INTERNAL, CDCl3, 0, 182.463)
##AUDIT TRAIL= $$ (NUMBER, WHEN, WHO, WHERE, WHAT)
$$ ##TITLE= Audit trail, XWIN-NMR		Version 3.5
$$ ##JCAMPDX= 5.01
$$ ##ORIGIN= Bruker BioSpin GmbH
$$ ##OWNER= she
$$ F:/spectra/data/she/nmr/P31/1/pdata/1/auditp.txt
$$ ##AUDIT TRAIL=  $$ (NUMBER, WHEN, WHO, WHERE, WHAT)
(   1,<2019-04-10 15:34:05.59 +0400>,<she>,<DPX200>,
      <created by zg, POWCHK disabled, PULCHK disabled
       configuration hash MD5:
       00 E9 B6 7A A2 85 ED C7 34 08 36 98 17 FE 4E 26
       data hash MD5: 32K
       3F 88 93 E9 C2 A6 C2 78 2A 69 99 F8 6E 83 C3 C8>)
(   2,<2019-04-10 15:34:07.95 +0400>,<she>,<DPX200>,
      <Start of raw data processing
       efp BC_mod = 2 LB = 1 FT_mod = 6 PKNL = 1 PHC0 = -1877.297 PHC1 = 71.19899 SI = 64K 
       data hash MD5: 64K
       C3 91 65 ED E4 67 3E CB 61 11 42 A3 E7 B7 60 A6>)
(   3,<2019-04-10 15:34:29.14 +0400>,<she>,<DPX200>,
      <pk PHC0 = 47.4137 PHC1 = 25.4 
       data hash MD5: 64K
       8F F7 EE 8D 31 34 73 E4 0D 85 AD E7 19 33 F1 A6>)
(   4,<2019-04-10 15:34:33.21 +0400>,<she>,<DPX200>,
      <abs ABSG = 5 
       data hash MD5: 64K
       35 AC F8 07 67 BB FD 7B EE 86 AE 52 03 AE F4 A5>)
$$ ##END=
$$ 
$$ hash MD5
$$ 10 71 E7 55 8B 16 E0 D3 60 35 B2 44 5A 2F F9 53
##$RELAX= 
##$RELAX= 
##$RELAX= 
##$RELAX= 
##$RELAX= 
##$RELAX= 
##$RELAX= 
##$RELAX= 
$$ Bruker specific parameters
$$ --------------------------
##$DU= <F:/spectra>
##$EXPNO= 1
##$NAME= <P31>
##$PROCNO= 1
##$TYPE= <nmr>
##$USER= <she>
##$AMP= (0..31)
100 100 100 100 100 100 100 100 100 100 100 100 100 100 100 100 100 100 
100 100 100 100 100 100 100 100 100 100 100 100 100 100 
##$AQSEQ= 0
##$AQ_mod= 1
##$AUNM= <au_zg>
##$AUTOPOS= <>
##$BF1= 81.014009
##$BF2= 200.13
##$BF3= 200.13
##$BF4= 200.13
##$BF5= 200.13
##$BF6= 200.13
##$BF7= 200.13
##$BF8= 200.13
##$BYTORDA= 1
##$CFDGTYP= 0
##$CFRGTYP= 5
##$CHEMSTR= <none>
##$CNST= (0..31)
1 1 145 1 1 1 1 1 1 1 1 1 1 1 1 1 1 1 1 1 1 1 1 1 1 1 1 1 1 1 1 1 
##$CPDPRG= <waltz16>
##$CPDPRG1= <>
##$CPDPRG2= <waltz16>
##$CPDPRG3= <>
##$CPDPRG4= <mlev>
##$CPDPRG5= <mlev>
##$CPDPRG6= <mlev>
##$CPDPRG7= <mlev>
##$CPDPRG8= <mlev>
##$CPDPRGB= <>
##$CPDPRGT= <>
##$D= (0..31)
0 1 0 0 0 0 0 0 0 0 0 0.03 2e-05 3e-06 0 0 0 0 0 0 0 0 0 0 0 0 0 0 0 0 
0 0 
##$DATE= 1554896044
##$DBL= (0..7)
120 120 120 11 120 120 24 19 
##$DBP= (0..7)
150 150 150 150 150 150 150 150 
##$DBP07= 0
##$DBPNAM0= <>
##$DBPNAM1= <>
##$DBPNAM2= <>
$$ [...]
##$SUBNAM3= <"">
##$SUBNAM4= <"">
##$SUBNAM5= <"">
##$SUBNAM6= <"">
##$SUBNAM7= <"">
##$SUBNAM8= <"">
##$SUBNAM9= <"">
##$SW= 369.568048894756
##$SWIBOX= (0..15)
0 1 3 0 0 0 0 0 0 0 0 0 0 0 0 0 
##$SW_h= 29940.119760479
##$TD= 32768
##$TD0= 1
##$TE= 0
##$TE2= 300
##$TE3= 300
##$TEG= 300
##$TL= (0..7)
0 120 53 12 22 120 120 120 
##$TP= (0..7)
150 150 150 150 150 150 150 150 
##$TP07= 0
##$TPNAME0= <>
##$TPNAME1= <>
##$TPNAME2= <>
##$TPNAME3= <>
##$TPNAME4= <>
##$TPNAME5= <>
##$TPNAME6= <>
##$TPNAME7= <>
##$TPOAL= (0..7)
0.5 0.5 0.5 0.5 0.5 0.5 0.5 0.5 
##$TPOFFS= (0..7)
0 0 0 0 0 0 0 0 
##$TUNHIN= 0
##$TUNHOUT= 0
##$TUNXOUT= 0
##$USERA1= <user>
##$USERA2= <user>
##$USERA3= <user>
##$USERA4= <user>
##$USERA5= <user>
##$V9= 5
##$VALIST= <valist>
##$VCLIST= <CCCCCCCCCCCCCCC>
##$VD= 0
##$VDLIST= <DDDDDDDDDDDDDDD>
##$VPLIST= <PPPPPPPPPPPPPPP>
##$VTLIST= <TTTTTTTTTTTTTTT>
##$WBST= 1024
##$WBSW= 4
##$XGAIN= (0..3)
0 0 0 0 
##$XL= 0
##$YL= 0
##$YMAX_a= 52952
##$YMIN_a= -85252
##$ZGOPTNS= <>
##$ZL1= 120
##$ZL2= 120
##$ZL3= 120
##$ZL4= 120
##$ABSF1= 182.463
##$ABSF2= -187.1042
##$ABSG= 5
##$ABSL= 3
##$ALPHA= 0
##$AQORDER= 0
##$ASSFAC= 0
##$ASSFACI= 0
##$ASSFACX= 0
##$ASSWID= 0
##$AUNMP= <proc_1d>
##$AZFE= 0.1
##$AZFW= 0.5
##$BCFW= 0
##$BC_mod= 2
##$BYTORDP= 0
##$COROFFS= 0
##$CY= -3
##$DATMOD= 1
##$DC= 0
##$DFILT= <>
##$DTYPP= 0
##$F1P= 0
##$F2P= 0
##$FCOR= 1
##$FTSIZE= 65536
##$FT_mod= 6
##$GAMMA= 0
##$GB= 0
##$INTBC= 1
##$INTSCL= 5.30512e-09
##$ISEN= 30
##$LB= 1
##$LEV0= 0
##$LPBIN= 0
##$MAXI= 10000
##$MC2= 0
##$MEAN= 0
##$ME_mod= 0
##$MI= 50
##$NCOEF= 0
##$NC_proc= -5
##$NLEV= 6
##$NOISF1= 182.463
##$NOISF2= 159.3651
##$NSP= 0
##$NTH_PI= 0
##$NZP= 0
##$OFFSET= 182.463
##$PC= 4
##$PHC0= -1829.883
##$PHC1= 96.59899
##$PH_mod= 1
##$PKNL= yes
##$PPARMOD= 0
##$PSCAL= 0
##$PSIGN= 0
##$REVERSE= no
##$SF= 81.0140089999434
##$SI= 65536
##$SIGF1= 159.3651
##$SIGF2= -187.1042
##$SINO= 113.3802
##$SIOLD= 16384
##$SREGLST= <1H.CDCl3>
##$SSB= 0
##$STSI= 65536
##$STSR= 0
##$SW_p= 29940.119760479
##$SYMM= 0
##$S_DEV= 0
##$TDeff= 32768
##$TDoff= 0
##$TI= <>
##$TILT= no
##$TM1= 0
##$TM2= 0
##$TOPLEV= 0
##$USERP1= <user>
##$USERP2= <user>
##$USERP3= <user>
##$USERP4= <user>
##$USERP5= <user>
##$WDW= 1
##$XDIM= 65536
##$YMAX_p= 580732558
##$YMIN_p= -9113910
$$ End of Bruker specific parameters
$$ ---------------------------------
##NTUPLES= NMR SPECTRUM
##VAR_NAME=  FREQUENCY,     SPECTRUM/REAL,   SPECTRUM/IMAG
##SYMBOL=    X,             R,               I
##VAR_TYPE=  INDEPENDENT,   DEPENDENT,       DEPENDENT
##VAR_FORM=  AFFN,          ASDF,            ASDF
##VAR_DIM=   65536,         65536,           65536
##UNITS=     HZ,            ARBITRARY UNITS, ARBITRARY UNITS
##FACTOR=    0.456856943014862, 1,           1
##FIRST=     14782.0589164792, 0,            0
##LAST=      -15158.0608439998, 0,           0
##MIN=       -15158.0608439998, -9113910,    0
##MAX=       14782.0589164792, 580732558,    0
$$ Real data points
##PAGE= N=1
##DATA TABLE= (X++(R..R)), XYDATA
$$ [...]
$$ plain form
41474 4399326 3699086 3378561 3437765 3340293 3056420 3163586 3760027 4117482 3789170 3307051
41464 3307051 3238677 3220435 2666327 1957233 2025421 2918550 3656890 3634477 3404972 3739645
41454 3739645 4463030 4707848 4059205 3009563 2357930 2492325 3270424 4306007 5202809
41445 5202809 5639355 5465542 4838818 4194353 3912532 3951461 3917742 3576309 3147188 2935175
41435 2935175 2805776 2346592 1576371 1146541 1605978 2677744 3566673 3883659 3926398
41426 3926398 4043596 4115706 3865377 3382598 3028822 2982106 3188950 3640416 4310747 4853268
41416 4853268 4799345 4191256 3642826 3575981 3736802 3711964 3567877 3588621 3643012 3320525
41406 3320525 2640665 2167164 2330177 2956936 3558420 3820257 3744888 3551082 3502556 3633299
$$ packed form
41474D399326p00240l20525N9204r7472k83873J07166N96441L57455l28312m82119
41464C307051o8374j8242n54108p09094O8188Q93129P38340k2413k29505L34673
41454C739645P23385K44818o48643j049642o51633J34395P78099J035583Q96802
41445E202809M36546j73813o26724o44465k81821L8929l3719l41433m29121k12013
41435B935175j29399m59184p70221m29830M59437J071766Q88929L16986M2739
41426C926398J17198P2110k50329m82779l53776m6716K06844M51466O70331N42521
41416D853268n3923o08089n48430o6845J60821k4838j44087K0744N4391l22487
41406C320525o79860m73501J63013O26759O01484K61837p5369j93806m8526J30743
$$ plain form
41396 3633299 3623142 3183213 2571943 2413616 2906355 3515172 3630497 3283831 2980200 2992829
41386 2992829 3095127 2958493 2605041 2396103 2650018 3336710 4143331 4752247 4949186
41377 4949186 4551956 3543640 2378209 1807280 2113438 2757499 3086366 3110958 3192091
41368 3192091 3289149 3135059 2940316 3152919 3543016 3353813 2532441 2000035 2366814 3130147
41358 3130147 3585397 3806191 4141734 4410230 4345563 4343205 4919048 5733157 5990423 5662384
41348 5662384 5521014 5999833 6763155 7454011 8156129 8906987 9305368 8894777 7678598
41339 7678598 6179413 5178348 5208158 5923726 6200267 5374311 4162620 3694617 3851521
41330 3851521 3479224 2279585 1470528 2169610 3939188 5471301 6095614 6058656 5818485
$$ packed form
41396C633299j0157m39929o11270j58327M92739O08817J15325l46666l03631J2629
41386B992829J02298j36634l53452k08938K53915O86692Q06621O08916J96939
41377D949186l97230j008316j165431n70929L06158O44061L28867K4592Q1133
41368C192091R7058j54090j94743K12603L90097j89203q21372n32406L66779P63333
41358C130147M55250K20794L35543K68496o4667k358N75843Q14109K57266l28039
41348E662384j41370M78819P63322O90856P02118P50858L98381m10591j216179
41339G678598j499185j001065K9810P15568K76541q25956j211691m68003J56904
41330C851521l72297j199639q09057O99082J769578J532113O24313l6958k40171
$$ plain form
41321 5818485 5654625 5646775 5553528 4983433 4039514 3414376 3457137 3595973 3208391 2661779
41311 2661779 2853778 3980914 5389709 6452589 6955280 6774871 5910942 4879617 4410931
41302 4410931 4575320 4720178 4418634 3969595 3762033 3677725 3496131 3497106 4167331 5428494
41292 5428494 6554778 6908505 6549458 6066826 5940292 6144857 6343257 6355118 6307861 6328869
41282 6328869 6303859 6105026 5894309 5934944 6171938 6307468 6341306 6752881 7965753 9745640
41272 9745640 11259292 11701744 10865285 9229196 7589640 6522394 6045264 5699363 4968720
41263 4968720 3744426 2496215 1923740 2266867 2971092 3216315 2773932 2139580 1857864
41254 1857864 2027181 2470215 2967438 3213584 3026142 2815728 3327559 4575767 5577653
$$ packed form
41321E818485j63860p850r3247n70095r43919o25138M2761J38836l87582n46612
41311B661779J91999J127136J408795J062880N02691j80409q63929j031325m68686
41302D410931J64389J44858l01544m49039k07562q4308j81594R75O70225J261163
41292E428494J126284L53727l59047m82632j26534K04565J98400J1861m7257K1008
41282F328869k5010j98833k10717M0635K36994J35530L3838M11575J212872J779887
41272I745640J513652M42452q36459j636089j639556j067246m77130l45901p30643
41263D968720j224294j248211n72475L43127P04225K45223m42383o34352k81716
41254A857864J69317M43034M97223K46146j87442k10414N11831J248208J001886
$$ plain form
41245 5577653 5618114 5217225 5198664 5351932 4921748 4041545 3607747 3874580 4273741 4611142
41235 4611142 5231764 5822333 5403339 4060060 3396288 4380320 5814422 6033258 5238769
41226 5238769 4868643 5301702 5658079 5570098 5624335 5959682 5823891 4896218 3886481 3350446
41216 3350446 2949297 2448580 2476825 3521154 4911451 5648035 5754860 6057423 6998844
41207 6998844 8359596 9774783 10796545 10756408 9389151 7490360 6241082 5917101 5858568
41198 5858568 5564785 5104714 4563196 3949964 3717916 4448893 5752982 6360817 5754563
41189 5754563 4904400 4814835 5110616 4842883 4046991 3503847 3357041 3066647 2599569 2548221
41179 2548221 2960018 3136838 2926585 3174746 4316427 5430841 5490806 4848237 4557432
$$ packed form
41245E577653M0461m00889j8561J53268m30184q80203m33798K66833L99161L37401
41235D611142O20622N90569m18994j343279o63772R84032J434102K18836p94489
41226E238769l70126M33059L56377q7981N4237L35347j35791r27673j009737n36035
41216C350446m01149n00717K8245J044329J390297P36584J06825L02563R41421
41207F998844J360752J415187J021762m0137j367257j898791j249278l23981n8533
41198E858568k93783m60071n41518o13232k32048P30977J304089O07835o06254
41189E754563q50163q9565K95781k67733p95892n43144j46806k90394m67078n1348
41179B548221M11797J76820k10253K48161J141681J114414N9965o42569k90805
$$ plain form
41170 4557432 4740765 4672329 4205564 3996640 4288013 4530757 4480408 4725808 5658417 6663816
41160 6663816 6923047 6503935 6097595 6033041 6043053 5741374 4963434 3925575 3331304 3882459
41150 3882459 5297226 6286611 6009558 5114628 4795352 5309719 6125096 6983917 7819095
41141 7819095 7965680 6717262 4731268 3699031 4300412 5518746 6375481 7268382 8926576
41132 8926576 10970102 12382976 12772106 12330120 11144164 9469234 8202344 8015271 8241791
41123 8241791 7652354 6244681 5240778 5262507 5589238 5535332 5552291 6347231 7646001
41114 7646001 8602218 9041961 9562162 10483089 11275111 11145776 9923856 8280718 7185239
41105 7185239 7140924 7920037 9057511 10458389 12257331 14148847 15285337 15039174 13631517
$$ packed form
41170D557432J83333o8436m66765k08924K91373K42744n0349K45400R32609J005399
41160F663816K59231m19112m06340o4554J0012l01679p77940j037859n94271N51155
41150C882459J414767R89385k77053q94930l19276N14367Q15377Q58821Q35178
41141G819095J46585j248418j985994j032237O01381J218334Q56735Q92901J658194
41132H926576K043526J412874L89130m41986j185956j674930j266890j87073K26520
41123H241791n89437j407673j003903K1729L26731n3906J6959P94940J298770
41114G646001R56217M39743N20201R20927P92022j29335j221920j643138j095479
41105G185239m4315P79113J137474J400878J798942J891516J136490k46163j407657
$$ plain form
41096 13631517 11862385 10427970 9602773 9314959 9315968 9415734 9692550 10368410 11438068
41087 11438068 12582802 13465860 13927538 13941763 13690432 13679682 14400281 15752167 17089745
41078 17089745 17884000 18025290 17522441 16450302 15338472 15038788 15851265 17134828 18024423
41069 18024423 18167614 17606526 16495580 15261951 14499656 14267635 13951238 13232243 12696541
41060 12696541 13020700 14092885 15451904 16951135 18272275 18449141 16918106 14667950
41052 14667950 13285521 13068404 13085671 12844118 12659856 12458630 11639522 10451561 10168477
41043 10168477 11280096 12614951 12947192 12468245 11903354 11200588 10161507 9544788 10198806
41034 10198806 11461068 11712297 10521981 9175688 8926324 9653874 10552379 11353011 12371751
$$ packed form
41096A3631517j769132j434415q25197k87814J009R9766K76816O75860J069658
41087A1438068J144734Q83058M61678J4225k51331j0750P20599J351886J337578
41078A7089745P94255J41290n02849j072139j111830k99684Q12477J283563Q89595
41069A8024423J43191n61088j110946j233629p62295k32021l16397p18995n35702
41060A2696541L24159J072185J359019J499231J321140J76866j531035k250156
41052A4667950j382429k17117J7267k41553j84262k01226q19108j187961k83084
41043A0168477J111619J334855L32241m78947n64891p02766j039081o16719O54018
41034A0198806J262262K51229j190316j346293k49364P27550Q98505Q00632J018740
$$ plain form
41025 12371751 13796921 15375124 16614819 17084448 16729158 16103894 16118986 17286628 19159156
41016 19159156 20581258 20594118 19194461 17211419 15403832 13846619 12393969 11410195
41008 11410195 11390489 11901294 11733064 10438709 8987836 8403810 8463395 8437445 8448642 9086836
40998 9086836 10046344 10282208 9548438 8803298 8849893 9346008 9474301 9002772 8361198 8082950
40988 8082950 8398034 9058797 9477219 9354362 9146899 9522152 10450739 11328876 11861824
40979 11861824 12187671 12221416 11677491 10831119 10455311 10781556 11240603 11430739 11561403
40970 11561403 11691252 11415928 10741786 10403937 10745082 11084957 10866637 10628791 11001564
40961 11001564 11457241 11100740 10204813 9843795 10280070 10822926 11165087 11710531 12460601
$$ packed form
41025A2371751J425170J578203J239695M69629l55290o25264J5092J167642J872528
41016A9159156J422102J2860j399657j983042j807587j557213j452650r83774
41008A1410195j9706N10805j68230j294355j450873n84026N9585k5950J1197O38194
40998I086836R59508K35864p33770p45140M6595M96115J28293m71529o41574k78248
40988H082950L15084O60763M18422j22857k07463L75253R28587Q78137N32948
40979A1861824L25847L3745n43925q46372l75808L26245M59047J90136J30664
40970A1561403J29849k75324o74142l37849L41145L39875k18320k37846L72773
40961A1001564M55677l56501q95927l61018M36275N42856L42161N45444P50070
$$ plain form
40952 12460601 12682419 12092894 11502705 11732996 12479775 12796904 12339599 11649844 11379519
40943 11379519 11574559 11714851 11355832 10714253 10449724 10736591 10930387 10595742 10479545
40934 10479545 11666597 13873651 15491271 15516464 14627779 14029543 14060913 14480114 15342586
40925 15342586 16729577 18028404 18423220 18073291 18053394 18947488 20019601 20030524 18587662
40916 18587662 16492245 14922588 14431055 14677192 15003975 15138459 15262485 15604000 16297300
40907 16297300 17552513 19422250 21242917 21872828 20889196 19151405 17779940 17011960
40899 17011960 16560839 16560829 17273799 18158907 18356153 18206994 19158262 21622925 23889573 24030579
40889 24030579 22305503 20699104 20375802 20620189 20289198 19254067 18015950 16764157
$$ packed form
40952A2460601K21818n89525n90189K30291P46779L17129m57305o89755k70325
40943A1379519J95040J40292l59019o41579k64529K86867J93796l34645j16197
40934A0479545J187052K207054J617620K5193q88685n98236L1370M19201Q62472
40925A5342586J386991J298827L94816l49929j9897Q94094J072113J0923j442862
40916A8587662k095417j569657m91533K46137L26783J34484J24026L41515O93300
40907A6297300J255213J869737J820667O29911r83632j737791j371465p67980
40899A7011960m51121j0P12970Q85108J97246j49159R51268K464663K266648J41006
40889B4030579j725076j606399l23302K44387l30991j035131j238117j251793
$$ plain form
40881 16764157 15506625 14600019 14358989 14349667 13803797 12729867 11969269 12039879 12527297
40872 12527297 12844785 12998866 13194715 13202662 12731129 12119608 11958058 12111602 11846284 11031153
40862 11031153 10495763 10829151 11412482 11233236 10342137 9832510 10357890 11202036 11065850
40853 11065850 9537246 7555787 6473119 6790213 7875203 8842012 9442308 9885466 10068829
40844 10068829 9593156 8604828 7955935 8165530 8781200 9244065 9787173 10731908 11404860
40835 11404860 10820194 9262366 8048358 7640403 7200253 6362954 6168901 7428972 9216519
40826 9216519 10075312 9999225 10044810 10510616 10799316 10822396 11178565 11878995 12156372 11800057
40816 11800057 11548887 11809251 12062944 11969858 11942463 12035381 11410880 9797133 8479034
$$ packed form
40881A6764157j257532r06606k41030r322n45870j073930p60598P0610M87418
40872A2527297L17488J54081J95849P947m71533o11521j61550J53544k65318q15131
40862A1031153n35390L33388N83331j79246q91099n09627N25380Q44146j36186
40853A1065850j528604j981459j082668L17094J084990R66809O00296M43158J83363
40844A0068829m75673r88328o48893K09595O15670M62865N43108R44735O72952
40835A1404860n84666j557828j214008m07955m40150q37299j94053J260071J787547
40826I216519Q58793p6087M5585M65806K88700K3080L56169P00430K77377l56315
40816A1800057k51170K60364K53693r3086k7395R2918o24501j613747j318099
$$ plain form
40807 8479034 8701643 9810038 10188720 9533832 8925551 8982468 9294346 9595838 10136648
40798 10136648 10700992 10533458 9641410 9045486 9212899 9281441 8525612 7668105 7830952
40789 7830952 8833237 9515117 9403246 9110370 9172007 9338643 9218770 9034367 9371178
40780 9371178 10385506 11563194 12374060 13039405 14259027 15930971 16633828 15127248 12150960
40771 12150960 9758875 8814731 8275484 7281145 6610350 7147374 8052344 7861497 6789448
40762 6789448 6448139 7450601 8664401 8952974 8447500 7801908 7243232 6807196 6685019
40753 6685019 6847837 6920164 6794066 6867758 7438870 8372573 9493576 10660778 11302916
40744 11302916 10663799 8867636 7077437 6224149 6171518 6403234 6754658 7026693 6704146
$$ packed form
40807H479034K22609J108395L78682o54888o08281N6917L11878L01492N40810
40798A0136648N64344j67534q92048n95924J67413O8542p55829q57507J62847
40789G830952J002285O81880j11871k92876O1637J66636j19873j84403L36811
40780I371178J014328J177688Q10866O65345J219622J671944P02857j506580k976288
40771A2150960k392085r44144n39247r94339o70795N37024R04970j90847j072049
40762F789448l41309J002462J213800K88573n05474o45592n58676m36036j22177
40753F685019J62818P2327j26098P3692N71112R33703J121003J167202O42138
40744A1302916o39117j796163j790199q53288n2631K31716L51424K72035l22547
$$ plain form
40735 6704146 5762896 5144251 5694755 7088734 8422895 9339704 9844378 9591848 8352662
40726 8352662 6880799 6291410 6620441 6878208 6541649 6136116 6200151 6463279 6344182
40717 6344182 5697782 4829162 4225310 4400351 5484163 6772452 7163790 6298254 4953406
40708 4953406 4208476 4534136 5664767 6867191 7315409 6795162 6165748 6530813 7800294
40699 7800294 8741128 8666467 8254724 8233175 8117135 7118490 5712000 5203142 5894511 6687247
40689 6687247 6615991 5921396 5338956 5085409 4989632 5036764 5204612 5100145 4344609 3218368
40679 3218368 2461970 2435641 2829330 3231919 3655017 4368758 5455323 6697942 7793273
40670 7793273 8518105 8719254 8265225 7094675 5369727 3587155 2413765 2237561 2845643
$$ packed form
40735F704146r41250o18645N50504J393979J334161R16809N04674k52530j239186
40726H352662j471863n89389L29031K57767l36559m05533O4035K63128j19097
40717F344182o46400q68620o03852J75041J083812J288289L91338q65536j344848
40708D953406p44930L25660J130631J202424M48218n20247o29414L65065J269481
40699G800294R40834p4661m11743k1549j16040r98645j406490n08858O91369P92736
40689F687247p1256o94595n82440k53547r5777M7132J67848j04467p55536j126241
40679C218368p56398k6329L93689M02589M23098P13741J086565J242619J095331
40670G793273P24832K01149m54029j170550j724948j782572j173390j76204O08082
$$ plain form
40661 2845643 3627611 4096993 4140626 3849349 3357645 2909962 2820272 3154734 3596688 3841038
40651 3841038 4026344 4536081 5399344 6126783 6203985 5612592 4836589 4449500 4648015 5044732
40641 5044732 4976680 4209906 3293450 2991305 3404406 3936257 4122183 4143453 4417129 5005628
40631 5005628 5625534 6017535 6155847 6279591 6770815 7712770 8524087 8456953 7594844 6830809
40621 6830809 6585106 6168557 4941320 3499722 2889638 3040804 2994083 2538007 2468835
40612 2468835 3023067 3229437 2461571 1683378 2180118 3609167 4388484 3852908 3004204
40603 3004204 2972217 3611245 4036946 3915317 3634951 3513076 3395665 3014772 2364446 1661718
40593 1661718 1149614 974384 1114223 1422116 1828731 2417260 3139838 3581817 3324404
$$ packed form
40661B845643P81968M69382M3633k91277m91704m47683q9690L34462M41954K44350
40651C841038J85306N09737Q63263P27439P7202n91393p76003l87089J98515L96717
40641E044732o8052p66774r16456l02145M13101N31851J85926K1270K73676N88499
40631E005628O19906L92001J38312J23744M91224R41955Q11317o7134q62109p64035
40621F830809k45703m16549j227237j441598o10084J51166m6721m56076o9172
40612B468835N54232K06370p67866p78193M96740J429049P79317n35576q48704
40603C004204l1987O39028M25701j21629k80366j21875j17411l80893o50326p02728
40593A661718n12104j75230J39839L07893M06615N88529P22578M41979k57413
$$ plain form
40584 3324404 2571214 2081194 2304406 2848752 3052984 2876167 2880955 3438259 4308415 4999340
40574 4999340 5199654 4845543 4152839 3676786 3898182 4509610 4525073 3483613 2227795
40565 2227795 1990555 2868109 3720140 3567742 2589469 1633224 1224133 1324356 1723725
40556 1723725 2278973 2872790 3450399 4135627 5123852 6362516 7405290 7701395 7102409
40547 7102409 6040184 5090600 4387360 3655889 2824812 2259080 2194181 2292389 2144329 1949245
40537 1949245 2178025 2688055 2797158 2324609 1945161 2205636 2676333 2532440 1709632
40528 1709632 1019138 1177146 2060151 2947590 3287786 3175553 3163508 3614588 4262877 4525644
40518 4525644 4221384 3764814 3628444 3876630 4292069 4625732 4580639 3955947 3114657 2926569
$$ packed form
40584C324404p53190m90020K23212N44346K04232j76817M788N57304Q70156O90925
40574D999340K00314l54111o92704m76053K21396O11428J5463j041460j255818
40565B227795k37240Q77554Q52031j52398r78273r56245m09091J00223L99369
40556A723725N55248N93817N77609O85228R88225J238664J042774K96105n98986
40547G102409j062225r49584p03240p31471q31077n65732o4899R8208j48060j95084
40537A949245K28780N10030J09103m72549l79448K60475M70697j43893q22808
40528A709632o90494J58008Q83005Q87439L40196j12233j2045M51080O48289K62767
40518D525644l04260m56570j36370K48186M15439L33663m5093o24692q41290j88088
$$ plain form
40508 2926569 3758364 4757267 4726202 3662365 2827002 3161068 4200473 4865149 4822403
40499 4822403 4544068 4299451 3765649 2720859 1588598 997656 1108650 1663135 2433535
40490 2433535 3238221 3690102 3461438 2862938 2664551 3103312 3476048 3054864 2062952
40481 2062952 1296650 1049076 992867 1016626 1474336 2423725 3229949 3325362 2962534 2766043
40471 2766043 2793601 2536335 1791909 1099871 1178052 2133398 3310697 3820322 3253300 2052612
40461 2052612 1204107 1424757 2589162 3950964 4826764 4992646 4611444 4063561 3806321
40452 3806321 4058481 4495274 4522440 4054497 3790476 4400908 5574530 6283792 6014308
40443 6014308 5284895 4795195 4568658 4340623 4325472 4882668 5605931 5572852 4630338 3691778
$$ packed form
40508B926569Q31795R98903l1065j063837q35363L34066J039405O64676m2746
40499D822403k78335k44617n33802j044790j132261n90942J10994N54485P70400
40490B433535Q04686M51881k28664n98500j98387M38761L72736m21184r91912
40481B062952p66302k47574n6209K3759M57710R49389Q06224R5413l62828j96491
40471B766043K7558k57266p44426o92038P8181R55346J177299N09625n67022j200688
40461B052612q48505K20650J164405J361802Q75800J65882l81202n47883k57240
40452C806321K52160M36793K7166m67943k64021O10432J173622P09262k69484
40443F014308p29413m89700k26537k28035j5151N57196P23263l3079r42514r38560
$$ plain form
40433 3691778 3475279 3624937 3464659 2953601 2378016 1744766 1154977 1169475 1919621 2342323
40423 2342323 1407415 -110290 -296725 1342398 3119657 3337312 2235660 1220668 976825
40414 976825 1096603 1068086 859432 691018 753767 1095564 1515014 1706653 1672241 1756144
40404 1756144 2149751 2668354 3142636 3664375 4282699 4825084 5186855 5440468 5535422 5307784
40394 5307784 4927015 4880009 5326924 5883723 6177047 6187580 5985111 5649784 5501549 5778457
40384 5778457 6027643 5556451 4592733 4135236 4446906 4645263 4120761 3375968 3018901
40375 3018901 2941314 3026634 3592491 4458955 4702339 4187707 4221760 5616760 7146190 7182158
40365 7182158 5997084 5094973 4983409 5010533 4840710 4697431 4579524 4518242 5139085 6703106
$$ packed form
40433C691778k16499J49658j60278n11058n75585o33250n89789J4498P50146M22702
40423B342323r34908j517705j86435J639123J777259K17655j101652j014992k43843
40414I76825J19778k8517k08654j68414O2749L41797M19450J91639l4412Q3903
40404A756144L93607N18603M74282N21739O18324N42385L61771K53613R4954k27638
40394E307784l80769m7006M46915N56799K93324J0533k02469l35327j48235K76908
40384E778457K49186m71192r63718m57497L11670J98357n24502p44793l57067
40375C018901p7587Q5320N65857Q66464K43384n14632L4053J395000J529430L5968
40365G182158j185074r02111j11564K7124j69823j43279j17907o1282O20843J564021
$$ plain form
40355 6703106 8127310 8267282 7582803 7198120 7109156 6924010 7485898 9749396 12774448
40346 12774448 15062863 17231965 20948944 26129236 32441447 42716411 59840714 79024658
40338 79024658 88267880 80205100 60654486 42054880 30758652 24312067 18945902 14555018
40330 14555018 12123344 10704576 8876579 6816718 5395609 4686468 4394293 4571085
40322 4571085 5117855 5513069 5552282 5551264 5592869 5459510 5407811 6018459 7200017 8374456
40312 8374456 9648223 11556379 13512165 13908823 12239560 9903644 8326769 7379458
40304 7379458 6323395 5283575 4875462 5064394 5260173 5144837 4791224 4345410 4095935
40295 4095935 4446141 5311676 5895355 5528345 4459751 3450481 2889776 2659329 2570430
$$ packed form
40355F703106J424204J39972o84479l84683q8964j85146N61888K263498L025052
40346A2774448K288415K169102L716979N180292O312211J0274964J7124303J9183944
40338G9024658R243222q062780j9550614j8599606j1296228o446585n366165m390884
40330A4555018k431674j418768j827997k059861j421109p09141k92175J76792
40322D571085N46770L95214L9213j018M1605j33359n1699O10648J181558J174439
40312H374456J273767J908156J955786L96658j669263k335916j576875r47311
40304G379458j056063j039820m08113J88932J95779j15336l53613m45814k49475
40295D095935L50206Q65535N83679l67010j068594j009270n60705k30447q8899
$$ plain form
40286 2570430 2570880 2713090 3148069 3928429 4690739 4888683 4525533 4274818 4645365 5391379
40276 5391379 5970896 6171756 5994492 5363388 4404062 3692002 3716085 4231714 4566873 4473231
40266 4473231 4271119 4207403 4124088 3877295 3697381 3857532 4201390 4341246 4282648 4486613
40256 4486613 5142029 5658853 5242513 3930105 2741867 2704579 3876696 5366231 6188473
40247 6188473 6143993 5964437 6473504 7525816 8129599 7857026 7578182 8237087 9497264
40238 9497264 10513006 11545460 13623424 17001678 21453722 27766739 36840868 47009821
40230 47009821 54532637 57608737 57671478 55595256 49431133 38322282 26361806 19102151
40222 19102151 17205900 16787696 15463724 14552349 15121888 15497109 14040905 11670533 9965901
$$ packed form
40286B570430M50J42210M34979P80360P62310J97944l63150k50715L70547P46014
40276E391379N79517K00860j77264o31104r59326p12060K4083N15629L35159r3642
40266D473231k02112o3716q3315k46793j79914J60151L43858J39856n8598K03965
40256D486613O55416N16824m16340j312408j188238l7288J172117J489535Q22242
40247F188473m4480j79556N09067J052312O03783k72573k78844O58905J260177
40238I497264J015742J032454K077964L378254M452044O313017R074129J0168953
40230D7009821P522816L076100O2741k076222o164123j1108851j1960476p259655
40222A9102151j896251m18204j323972r11375N69539L75221j456204k370372j704632
$$ plain form
40213 9965901 8791383 7345851 5958427 5360879 5388302 5585908 6043525 6756440 7304739
40204 7304739 7875670 9329639 11650606 13783083 15526125 17895829 21272821 25585433
40196 25585433 32855319 45906593 62205683 72312551 68514674 53678838 38103741
40189 38103741 28651039 24458914 22279207 21190415 21020428 20231032 17803136 14957863
40181 14957863 13068540 11551902 9432274 7426027 6740747 6941817 6655041 5629340
40173 5629340 4694462 4247254 4013187 3863673 3791565 3443744 2632523 1978715 2154195 2764485
40163 2764485 2841474 2251716 1788876 1933637 2275164 2246472 1830520 1345852 933348 488101
40153 488101 -61125 -558967 -733813 -511127 -126338 217184 679665 1488818 2397658 2845076
$$ packed form
40213I965901j174518j445532j387424n97548K7423J97606M57617P12915N48299
40204G304739N70931J453969K320967K132477J743042K369704L376992M312612
40196B5585433P269886J3051274J6299090J0106868l797877j4835836j5575097
40189C8103741r452702m192125k179707j088792j69987p89396k427896k845273
40181A4957863j889323j516638k119628k006247o85280K01070k86776j025701
40173E629340r34878m47208k34067j49514p2108l47821q11221o53808J75480O10290
40163B764485P6989n89758m62840J44761L41527k8692m15952m84668m12504m45247
40153D88101n49226m97842j74846K22686L84789L43522M62481Q09153R08840M47418
$$ plain form
40143 2845076 2704044 2473076 2592930 2913241 3006614 2744713 2377501 2184465 2156238 1987671
40133 1987671 1463381 901598 958050 1802483 2808248 3343872 3504654 3682108 3843075
40124 3843075 3775926 3652056 3718332 3833506 4018216 4980149 7092647 9165495 9413706
40115 9413706 7662920 5567459 4618211 4962637 6176362 7912459 9447312 9760358 8651621
40106 8651621 6981717 5472351 4130868 3068319 2751614 3010383 2943515 2402000 2430693
40097 2430693 3512330 4520445 4382468 3758474 3889529 4579654 4651873 3932184 3431527
40088 3431527 3663497 3964667 3690791 3231662 3462022 4605460 5976076 6843686 7424824
40079 7424824 8631489 10604679 12281146 13390441 15989922 21898151 28681675 30929601
$$ packed form
40143B845076j41032k30968J19854L20311R3373k61901l67212j93036k8227j68567
40133A987671n24290n61783N6452Q44433J005765N35624J60782J77454J60967
40124C843075o7149j23870O6276J15174J84710R61933K112498K072848K48211
40115I413706j750786k095461r49248L44426J213725J736097J534853L13046j108737
40106H651621j669904j509366j341483j062549l16705K58769o6868n41515K8693
40097B430693J081637J008115j37977o23994J31055O90125P2219p19689n00657
40088C431527K31970L01170k73876m59129K30360J143438J370616Q67610N81138
40079G424824J206665J973190J676467J109295K599481N908229O783524K247926
$$ plain form
40071 30929601 26702553 20333969 17069869 17215436 18112517 19757899 24454729 31345894
40063 31345894 35398388 33082022 26270303 19171540 13770615 9863061 7406343 6528934
40055 6528934 6278881 5427894 4191610 3768251 4489405 5544937 6206430 6326296 5938726
40046 5938726 5285257 4970171 5267536 5521714 4960190 3800901 2843929 2321834 1951265
40037 1951265 1800770 2179021 2774745 2802598 2101575 1388413 1270378 1535083 1548030 966271
40027 966271 5046 -715962 -664671 6184 566577 707184 1046972 2148578 3433060
40018 3433060 3821742 3237675 2635948 2579702 2639386 2356984 1992160 1945423 2066837 1984200
40008 1984200 1702177 1490174 1484254 1702396 2154559 2633091 2649118 1908474 747164 -101927
$$ packed form
40071C0929601m227048o368584l264100J45567Q97081J645382M696830O891165
40063C1345894M052494k316366o811719p098763n400925l907554k456718q77409
40055F528934k50053q50987j236284m23359P21154J055532O61493J19866l87570
40046E938726o53469l15086K97365K54178n61524j159289r56972n22095l70569
40037A951265j50495L78251N95724K7853p01023p13162j18035K64705J2947n81759
40027I66271r61225p21008N1291O70855N60393J40607L39788J101606J284482
40018C433060L88682n84067o01727n6246N9684k82402l64824m6737J21414q2637
40008A984200k82023k12003n920K18142M52163M78532J6027p40644j161310q49091
$$ plain form
39998 -101927 -122534 593753 1374809 1472854 910163 753392 2001288 4155704 5576825
39989 5576825 5464871 4704725 4323176 4022220 3115942 2167532 2363880 3482866 3871895
39980 3871895 2709317 1096683 406296 593342 848376 1003042 1344021 1698055 1766687
39971 1766687 1962047 2827775 3864717 4059280 3514913 3356696 3848845 3883414 2871311
39962 2871311 1954565 2419932 3773152 4489898 4135972 3565390 3262752 2732034 1707733
39953 1707733 907331 1064108 1881523 2481975 2488243 2198390 1951272 1752073 1453502 1019632
39943 1019632 586854 361109 431236 678605 940740 1194229 1428544 1448926 1072793 491126
39933 491126 152632 260968 622274 987156 1269297 1391383 1190469 586995 -286750 -1120488
$$ packed form
39998a01927k0607P16287P81056R8045n62691j56771J247896K154416J421121
39989E576825j11954p60146l81549l00956r06278r48410J96348J118986L89029
39980C871895j162578j612634o90387J87046K55034J54666L40979L54034O8632
39971A766687J95360Q65728J036942J94563n44367j58217M92149L4569j012103
39962B871311r16746M65367J353220P16746l53926n70582l02638n30718j024301
39953A707733q00402J56777Q17415O00452O268k89853k47118j99199k98571m33870
39943A019632m32778k25745P0127K47369K62135K53489K34315K0382l76133n81667
39933D91126l38494J08336L61306L64882K82141J22086k00914o03474q73745q33738
$$ plain form
39923 -1120488 -1484119 -1046158 -17434 813125 889242 596083 704068 1256174 1610135
39914 1610135 1517934 1420061 1546391 1493411 999999 444492 173459 -8455 -219303 -49204
39904 -49204 649963 1141625 767199 78759 126363 898342 1402280 1189092 844359 870192
39894 870192 989452 874437 805403 1130257 1582475 1611720 1098100 399901 -78342 -139223
39884 -139223 141242 426246 443641 390026 670665 1162646 1236994 741681 414100 876350
39874 876350 1662779 1813401 1142086 303944 -213612 -476021 -489536 47685 1075275 1802623
39864 1802623 1486247 319388 -833730 -1393338 -1362890 -841069 198656 1495354 2341439
39855 2341439 2233002 1485948 833750 520967 227099 -121410 -48157 659212 1342791 1271656
$$ packed form
39923a120488l63631M37961J028724Q30559P6117k93159J07985N52106L53961
39914A610135r2201r7873J26330n2980m93412n55507k71033j81914k10848J70099
39904d9204O99167M91662l74426o88440M7604P71979N03938k13188l44733K5833
39894H70192J19260j15015o9034L24854M52218K9245n13620o98199m78243o0881
39884a39223K80465K85004J7395n3615K80639M91981P4348m95313l27581M62250
39874H76350P86429J50622o71315q38142n17556k62409j3515N37221J027590P27348
39864A802623l16376j166859j153118n59608L0448N21821J039725J296698Q46085
39855B341439j08437p47054o52198l12783k93868l48509P3253P07369O83579p1135
$$ plain form
39845 1271656 762499 766169 1377167 1601157 888936 66741 99668 596644 508001 -34390
39835 -34390 235278 1670237 2840448 2338460 661257 -541475 -604121 -298949 -370490
39826 -370490 -625980 -658441 -604450 -722521 -822723 -673400 -580825 -960688 -1526047 -1496323
39816 -1496323 -616923 521951 1269058 1565393 1626350 1393200 708880 -140400 -528647
39807 -528647 -249525 144504 11475 -544294 -843319 -612743 -368164 -597524 -972535 -855609
39797 -855609 -344522 -138448 -371879 -363399 181635 490102 -143582 -1140833 -1400280 -922481
39787 -922481 -693137 -1000033 -887331 405065 2278990 3530979 3681788 3097372 2309079
39778 2309079 1748252 1748065 2213831 2511655 2175650 1534662 1199744 1172411 993073 594945
$$ packed form
39845A271656n09157L670O10998K23990p12221q22195L2927M96976q8643n42391
39835c4390K69668J434959J170211n01988j677203j202732o2646L05172p1541
39826c70490k55490l2461N3991j18071j00202J49323R2575l79863n65359K9724
39816a496323Q79400J138874P47107K96335O0957k33150o84320q49280l88247
39807e28647K79122L94029j33029n55769k99025K30576K44579k29360l75011J16926
39797h55609N11087K06074k33431Q480N45034L08467o33684r97251k59447M77799
39787i22481K29344l06896J12702J292396J873925J251989J50809n84416p88293
39778B309079n60827j87M65766K97824l36005o40988l34918k7333j79338l98128
$$ plain form
39768 594945 385919 485079 469347 37180 -525222 -737969 -461688 124521 796606 1370263
39758 1370263 1724070 1866383 1819169 1414355 475274 -710364 -1390390 -1032023 133284
39749 133284 1365828 2056041 2012792 1369775 482582 -166929 -250310 120078 490316 531951
39739 531951 368940 377079 685417 1000601 1013808 875248 1048916 1676220 2309554 2390546
39729 2390546 1813404 898416 25761 -510961 -507180 -22421 529139 758344 772219 1046743
39719 1046743 1827571 2833984 3546430 3641021 3181358 2529359 2038157 1753148 1502826
39710 1502826 1284697 1281646 1413870 1305072 951383 924801 1442301 1733205 1061727 12999
39700 12999 -178522 550361 990257 507552 -87766 43762 487838 443768 117846 319297
$$ packed form
39768E94945k09026R9160j5732m32167n62402k12747K76281N86209O72085N73657
39758A370263L53807J42313m7214m04814r39081j185638o80026L58367J165307
39749A33284J232544O90213m3249o43017q87193o49511q3381L70388L70238M1635
39739E31951j63011Q139L08338L15184J3207j38560J73668O27304O33334Q0992
39729B390546n77142r14988q72655n36722L781M84759N51560K29205J3875K74524
39719A046743P80828J006413P12446R4591m59663o51999m91202k85009k50322
39710A502826k18129l051J32224j08798l53689k6582N17500K90904o71478j048728
39700A2999j91521P28883M39896m82705n95318J31528M44076m4070l25922K01451
$$ plain form
39690 319297 1067617 1520333 1199403 554462 240122 364913 574730 551758 352101 376926
39680 376926 892506 1508859 1500947 862737 552667 1268422 2457505 3131294 3214210 3297441
39670 3297441 3371991 2797691 1530117 416566 22864 -24732 -191914 -283856 -23616 249770
39660 249770 96886 -201902 17392 834516 1672096 2114153 2288617 2388768 2267951 1731186
39650 1731186 957683 330774 -94101 -652003 -1448308 -1914595 -1382916 -103216 799365
39641 799365 627985 -79183 -441725 -454395 -644730 -884325 -500610 448320 1010798 734726
39631 734726 325742 447215 673666 310689 -363098 -458627 282378 1309255 2066418 2359374
39621 2359374 2180168 1801354 1821969 2480144 3112093 2936662 2166497 1623815 1472849 1225757
$$ packed form
39690C19297P48320M52716l20930o44941l14340J24791K09817k2972j99657K4825
39680C76926N15580O16353p912o38210l10070P15755J189083O73789Q2916Q3231
39670C297441P4550n74300j267574j113551l93702m7596j67182r1942K60240K73386
39660B49770j52884k98788K19294Q17124Q37580M42057J74464J00151j20817n36765
39650A731186p73503o26909m24875n57902p96305m66287N31679J279700R02581
39641G99365j71380p07168l62542j2670j90335k39595L83715R48930N62478k76072
39631G34726m08984J21473K26451l62977o73787r5529P41005J026877P57163K92956
39621B359374j79206l78814K0615O58175O31949j75431p70165n42682j50966k47092
$$ plain form
39611 1225757 902408 1101272 1726903 1759729 813367 -58393 114980 670817 287562 -954142
39601 -954142 -1603108 -873450 379730 994977 978115 1092209 1503115 1564349 892116 48874
39591 48874 -134335 378035 833457 726131 411820 482973 883712 1082066 941413 860029
39581 860029 1029763 1160271 1134728 1327506 1890004 2306060 2245172 2351988 3339798 4563230
39571 4563230 4534437 3013407 1610687 1800648 3073454 3772036 3275162 2494654 2393520
39562 2393520 2947417 3809845 5205106 7484133 10068115 11506487 10780771 8290210 5423696
39553 5423696 3351788 2362107 2136356 2280323 2464959 2342692 1710562 827410 310685
39544 310685 504362 1045471 1261557 943942 470950 152262 -184831 -717742 -1055805 -637258
$$ packed form
39611A225757l23349J98864O25631L2826r46362q71760J73373N55837l83255j241704
39601i54142o48966P29658J253180O15247j6862J14094M10906O1234o72233q43242
39591D8874j83209N12370M55422j07326l14311P1153M00739J98354j40653q1384
39581H60029J69734J30508k5543J92778N62498M16056o0888J06816R87810J223432
39571D563230k8793j521030j402720J89961J272806O98582m96874p80508j01134
39562B393520N53897Q62428J395261K279027K583982J438372p25716k490561k866514
39553E423696k071908r89681k25751J43967J84636j22267o32130q83152n16725
39544C10685J93677N41109K16086l17615m72992l18688l37093n32911l38063M18547
$$ plain form
39534 -637258 351030 985908 743040 182264 160109 723305 1273990 1575114 1913775 2268043
39524 2268043 2068253 1148272 349469 578708 1551414 2095356 1633066 761696 255767
39515 255767 79952 -245795 -714845 -831199 -453058 -100589 -230027 -583014 -606211 -307070
39505 -307070 -239244 -631288 -991222 -791035 -164066 431200 949130 1670762 2519173 3018598
39495 3018598 2986722 2756948 2572029 2261279 1768878 1516740 1845838 2460941 2876579 3141434
39485 3141434 3626878 4252028 4424497 3765813 2550215 1427480 962788 1333882 2154565
39476 2154565 2692941 2608108 2378680 2642381 3238602 3388679 2810586 2141926 2131503 2842123
39466 2842123 3828637 4726411 5412955 5835442 5939291 5722120 5303263 4978138 5068640 5551554
$$ packed form
39534f37258R88288O34878k42868n60776k2155N63196N50685L01124L38661L54268
39524B268043j99790r19981p98803K29239R72706N43942m62290q71370n05929
39515B55767j75815l25747m69050j16354L78141L52469j29438l52987k3197K99141
39505c07070O7826l92044l59934K00187O26969N95266N17930P21632Q48411M99425
39495C018598l1876k29774j84919l10750m92401k52138L29098O15103M15638K64855
39485C141434M85444O25150J72469o58684j215598j122735m64692L71094Q20683
39476B154565N38376q4833k29428K63701N96221J50077n78093o68660j0423P10620
39466B842123R86514Q97774O86544M22487J03849k17171m18857l25125R0502M82914
$$ plain form
39456 5551554 6031736 6335252 6827088 7704077 8324509 7982406 7173486 7145728 8070052 8646970
39446 8646970 7957336 6801487 6496512 7016459 7189644 6383258 5159842 4362636 4214804
39437 4214804 4341932 4207725 3508940 2473403 1723379 1616671 1898267 2200712 2522328
39428 2522328 2870823 2890429 2418612 2065880 2537651 3547513 4090897 3723406 2910684
39419 2910684 2162674 1550803 1174001 1375801 2198385 3124405 3629701 3629866 3272889 2748375
39409 2748375 2413741 2560615 2835432 2445092 1279621 339085 597101 1796471 2830558
39400 2830558 3047487 2701165 2310951 2132121 2274116 2837271 3671654 4232381 3961146
39391 3961146 2850835 1538511 772384 776947 1161002 1411356 1362746 1172827 1024552 969024
$$ packed form
39456E551554M80182L03516M91836Q76989O20432l42103q08920k7758R24324N76918
39446H646970o89634j155849l04975N19947J73185q06386j223416p97206j47832
39437D214804J27128j34207o98785j035537p50024j06708K81596L02445L21616
39428B522328L48495J9606m71817l52732M71771J009862N43384l67491q12722
39419B910684p48010o11871l76802K01800Q22584R26020N05296J65l56977n24514
39409B748375l34634J46874K74817l90340j165471r40536K58016J199370J034087
39400B830558K16929l46322l90214j78830J41995N63155Q34383N60727k71235
39391C961146j110311j312324p66127M563L84055K50354m8610j89919j48275n5528
$$ plain form
39381 969024 898480 559013 -178082 -882745 -727955 550972 2107253 2842318 2634127
39372 2634127 2210526 1969436 1588506 832145 69110 -243867 -93327 278440 651308
39363 651308 791622 653337 756046 1754498 3394463 4560765 4729035 4670188 5166762
39354 5166762 5725878 5398097 4389531 3843576 4172467 4615564 4582210 4484338 4801348 5071209
39344 5071209 4525451 3377994 2731364 3147720 3891584 3920261 3307102 3188477 4276988
39335 4276988 5896107 6794100 6594198 5974044 5588340 5423799 5266915 5173296 5200450 5195784
39325 5195784 5190174 5527094 6203575 6565080 6189499 5659215 5795050 6424324 6673711 6342673
39315 6342673 6144208 6488124 6825725 6521806 5742144 5054481 4631804 4321579 4149988
$$ packed form
39381I69024p0544l39467p37095p04663J54790J278927J556281P35065k08191
39372B634127m23601k41090l80930p56361p63035l12977J50540L71767L72868
39363F51308J40314j38285J02709R98452J639965J166302J68270n8847M96574
39354E166762N59116l27781j008566n45955L28891M43097l3354r7872L17010K69861
39344E071209n45758j147457o46630M16356P43864K8677o13159j18625J088511
39335D276988J619119Q97993j99902o20154l85704j64541j56884r3619K7154m666
39325E195784n610L36920O76481L61505l75581n30284J35835O29274K49387l31038
39315F342673j98465L43916L37601l03919p79662o87663m22677l10225j71591
$$ plain form
39306 4149988 4240076 4420762 4411014 4332635 4601791 5285766 5971273 6388080 6787409 7449052
39296 7449052 8092945 8152595 7528664 6697075 6075637 5691406 5576517 6001281 6950035 7739346
39286 7739346 7680679 6930002 6155503 5539646 4784465 4043672 3987215 4683264 5233311 5017069
39276 5017069 4610377 4814863 5353962 5361626 4798362 4457752 4677446 4944658 4888867 4846314
39266 4846314 5136930 5446775 5361818 5047667 4923333 4952171 4767216 4449307 4730606 6171447
39256 6171447 8247774 9547678 9100531 7437401 6031583 5655592 5692881 5248262 4424170
39247 4424170 4012004 4274536 4664350 4614092 4029941 3090516 2164318 1905981 2756717 4179765
39237 4179765 4971993 4586744 3684455 3153879 3087847 3065393 3012512 3284765 4043508 4934339
$$ packed form
39306D149988R0088J80686r748p8379K69156O83975O85507M16807L99329O61643
39296G449052O43893N9650o23931q31589o21438l84231j14889M24764R48754P89311
39286G739346n8667p50677p74499o15857p55181p40793n6457O96049N50047k16242
39276E017069m06692K04486N39099P664n63264l40610K19694K67212n5791m2553
39266D846314K90616L09845q4957l14151j24334K8838j84955l17909K81299J440841
39256F171447K076327J299904m47147j663130j405818l75991L7289m44619q24092
39247D424170m12166K62532L89814n0258n84151r39425r26198k58337Q50736J423048
39237D179765P92228l85249r02289n30576o6032k2454n2881K72253P58743Q90831
$$ plain form
39227 4934339 5414739 5256278 4722587 4254610 3934374 3407993 2525446 1815156 1900021 2586281
39217 2586281 3080624 3089809 3088320 3389230 3614763 3386329 2953155 2715375 2588879 2318756
39207 2318756 2074955 2235821 2773195 3265167 3399279 3181589 2829447 2721824 3224720
39198 3224720 4242646 5115043 5254032 4751046 4141598 3780133 3674598 3683814 3589929 3194926
39188 3194926 2623898 2320951 2505887 2905300 3252606 3661314 4160222 4327135 3930375
39179 3930375 3530574 3741159 4173680 3944717 3108552 2652988 2942933 3106313 2389550
39170 2389550 1344671 1040160 1614874 2293912 2524588 2423960 2239913 2011549 1813955
39161 1813955 1832656 2057887 2258073 2357739 2538417 2893658 3285987 3596639 3769268 3553516
$$ packed form
39227D934339M80400j58461n33691m67977l20236n26381q82547p10290Q4865O86260
39217B586281M94343R185j489L00910K25533k28434m33174k37780j26496k70123
39207B318756k43801J60866N37374M91972J34112k17690l52142j07623N02896
39198C224720J017926Q72397J38989n02986o09448l61465j05535R216r3885l95003
39188C194926n71028l02947J84936L99413L47306M08708M98908J66913l96760
39179C930375l99801K10585M32521k28963q36165m55564K89945J63380p16763
39170B389550j044879l04511N74714O79038K30676j00628j84047k28364j97594
39161A813955J8701K25231K00186R9666J80678L55241L92329L10652J72629k15752
$$ plain form
39151 3553516 2680240 1491950 877761 1180355 1626248 1383718 756559 558750 623799
39142 623799 27946 -1126745 -1353781 208246 2388754 3441459 3211057 2863851 2962083
39133 2962083 2965302 2473483 1804792 1221491 611344 179869 477687 1344765 1732360 1111005
39123 1111005 261739 54217 203726 47003 -93862 616959 1974630 2738468 2317036
39114 2317036 1593454 1725301 2685881 3403646 3061026 1918586 948578 865437 1539550
39105 1539550 2290124 2646722 2694940 2732439 2863672 3016473 3072435 2830589 2133882 1241231
39095 1241231 788287 1098573 1741663 2027096 1750650 1252692 971443 1126275 1550527
39086 1550527 1652504 945041 -131861 -442662 355186 1126883 751724 -200340 -251686
$$ packed form
39151C553516q73276j188290o14189L02594M45893k42530o27159j97809O5049
39142F23799n95853j154691k27036J562027K180508J052705k30402l47206R8232
39133B962083L219m91819o68691n83301o10147m31475K97818Q67078L87595o21355
39123A111005q49266k07522J49509j56723j40865P10821J357671P63838m21432
39114B317036p23582J31847R60580P17765l42620j142440r70008q3141O74113
39105A539550P50574L56598M8218L7499J31233J52801N5962k41846o96707q92651
39095A241231m52944L10286O43090K85433k76446m97958k81249J54832M24252
39086A550527J01977p07463j076902l10801P97848P71697l75159r52064n1346
$$ plain form
39077 -251686 777027 1522961 1214782 878796 1755736 3369439 4137598 3531942 2644492
39068 2644492 2556259 2998133 3038161 2497501 2003136 1847963 1580592 949785 582383 1131963
39058 1131963 2138802 2493536 1939473 1332235 1303967 1491824 1433696 1430431 1898485 2469163
39048 2469163 2484364 2015352 1669610 1657817 1742739 1861924 2058071 1994819 1378316 784920
39038 784920 1181599 2521544 3662049 3898793 3764139 3939878 4150901 3722580 2705567
39029 2705567 1817143 1549571 1836946 2376456 2809626 2748524 2096504 1326955 1083948 1463215
39019 1463215 1933068 1999037 1742500 1633351 1952869 2526868 3014053 3329099 3626858 3888224
39009 3888224 3796710 3219920 2586927 2440283 2700167 2757317 2327937 1833822 1770980 2013988
$$ packed form
39077b51686J028713P45934l08179l35986Q76940J613703P68159o05656q87450
39068B644492q8233M41874M0028n40660m94365j55173k67371o30807l67402N49580
39058A131963J006839L54734n54063o07238k8268J87857n8128l265M68054N70678
39048B469163J5201m69012l45742j1793Q4922J19185J96147o3252o16503n93396
39038G84920L96679J339945J140505K36744j34654J75739K11023m28321j017013
39029B705567q88424k67572K87375N39510M33170o1102o52020p69549k43007L79267
39019A463215M69853O5969k56537j09149L19518N73999M87185L15046K97759K61366
39009C888224r1514n76790o32993j46644K59884N7150m29380m94115o2842K43008
$$ plain form
38999 2013988 2035387 1684846 1456431 1905772 2940144 3833363 3966769 3443977 2890509
38990 2890509 2783098 3155535 3795920 4370225 4428065 3779010 2938964 2688771 3030832 3146609
38980 3146609 2638042 2162879 2401112 3024358 3304200 3192386 3058790 2818686 2186383
38971 2186383 1491739 1325333 1506936 1296567 614847 217095 580003 1358445 2033862
38962 2033862 2418379 2458827 2226783 2158806 2618590 3178256 3054123 2296129 1758228 1800597
38952 1800597 1869379 1551207 1182594 1106999 1132041 1108104 1332642 1974662 2706493 3238204
38942 3238204 3625905 3813567 3566976 3114025 3044819 3228136 2709186 1218833 -40071
38933 -40071 201268 1729213 3344179 4279118 4452283 3939095 3034333 2423578 2486743 2705824
$$ packed form
38999B013988K1399l50541k28415M49341J034372Q93219J33406n22792n53468
38990B890509j07411L72437O40385N74305N7840o49055q40046k50193L42061J15777
38980C146609n08567m75163K38233O23246K79842j11814j33596k40104o32303
38971B186383o94644j66406J81603k10369o81720l97752L62908P78442O75417
38962B033862L84517M0448k32044o7977M59784N59666j24133p57994n37901M2369
38952A800597O8782l18172l68613p5595K5042k3937K24538O42020P31831N31711
38942C238204L87701J87662k46591m52951o9206J83317n18950j490353j258904
38933d0071K41339J527945J614966R34939J73165n13188r04762o10755O3165K19081
$$ plain form
38923 2705824 2450974 2045157 2293690 3168918 3781635 3698942 3608241 4426406 6113811 7590718
38913 7590718 7732857 6421759 4644954 3511551 3246549 3308633 3260759 3078115 2761183
38904 2761183 2282187 1923794 2037942 2425515 2596519 2626840 2970609 3428345 3288077 2637092
38894 2637092 2441319 3014347 3562308 3713793 4267536 5682390 6965714 7003254 6057100
38885 6057100 4998706 3938807 2641873 1513944 1089976 1137693 1205276 1413001 1831227
38876 1831227 1885784 1391768 1303038 2235999 3113230 2702454 1760738 2003048 3420377 4347917
38866 4347917 4000152 3266940 2980988 2975491 3041707 3367443 3714478 3438162 2667974 2348258
38856 2348258 2812848 3373826 3571925 3761429 4147022 4270064 3842570 3218157 2699866
$$ packed form
38923B705824k54850m05817K48533Q75228O12717q2693r0701Q18165J687405J476907
38913G590718J42139j311098j776805j133403k65002O2084m7874j82644l16932
38904B761183m78996l58393J14148L87573J71004L0321L43769M57736j40268o50985
38894B637092j95773N73028N47961J51485N53743J414854J283324L7540r46154
38885F057100j058394j059899j296934j127929m23968M7717O7583K07725M18226
38876A831227N4557m94016q8730R32961Q77231m10776r41716K42310J417329R27540
38866D347917l47765p33212k85952n497O6216L25736L47035k76316p70188l19716
38856B348258M64590N60978J98099J89504L85593J23042m27494o24413n18291
$$ plain form
38847 2699866 2180183 1739161 1804410 2410743 2965195 2974487 2467016 1697149 1056646 1146380
38837 1146380 2153977 3271239 3543570 3135948 2878459 2815641 2306265 1401734 899406
38828 899406 1018693 1215754 1355953 1844584 2490105 2505530 1860741 1425976 1529094 1565135
38818 1565135 1297304 1319669 1875646 2370240 2417707 2297769 2112837 1645805 1299624 1915767
38808 1915767 3312752 4253439 4236137 4066244 4293424 4432543 4187912 4063468 4186148
38799 4186148 3868097 2969088 2392972 2572851 2734671 2330465 1935127 2041614 2233804
38790 2233804 2240634 2531584 3179654 3443381 3162741 3203179 3823906 4071050 3525499 3062288
38780 3062288 3040788 2487045 1138787 493155 1445352 2573470 2361359 1614475 1932304
$$ packed form
38847B699866n19683m41022O5249O06333N54452R292n07471p69867o40503Q9734
38837A146380J007597J117262K72331m07622k57489o2818n09376r04531n02328
38828H99406J19287J97061J40199M88631O45521J5425o44789m34765J03118L6041
38818A565135k67831K2365N55977M94594M7467j19938j84932m67032l46181O16143
38808A915767J396985R40687j7302j69893K27180J39119k44631j24444J22680
38799D186148l18051q99009n76116J79879J61820m04206l95338J06487J92190
38790B233804O830K90950O48070K63727k80640M0438O20727K47144n45551m63211
38780C062288k1500n53743j348258o45632R52197J128118k12111p46884L17829
$$ plain form
38771 1932304 3087450 3741463 3702344 3679374 3645419 3128748 2451943 2194599 2051172 1486160
38761 1486160 825372 601221 647407 804274 1466438 2496608 2874065 2385407 2176538
38752 2176538 2640180 2568115 1570991 1213022 2210235 2788336 1767835 983134 2311303
38743 2311303 4475765 5371074 5470712 6150836 6680567 5915257 5073028 5658450 6455263
38734 6455263 5807264 4947974 5635990 6555145 5831805 5009555 6404663 8650979 9307844
38725 9307844 9616757 11762823 13849689 13184542 12114553 14310951 17711693 18274474 18235608
38716 18235608 22387656 28554040 31425213 33798175 42731934 56173812 66853160 78629003
38708 78629003 102728696 137769358 175446046 230368700 333707820 475963284 580732558
$$ packed form
38771A932304J155146O54013l9119k2970l3955n16671o76805k57344j43427n65012
38761A486160o60788k24151M6186J56867O62164J030170L77457m88658k08869
38752B176538M63642p2065r97124l57969R97213N78101j020501p84701J328169
38743B311303K164462Q95309R9638O80124N29731p65310q42229N85422P96813
38734F455263o47999q59290O88016R19155p23340q22250J395108K246316O56865
38725I307844L08913K146066K086866o65147j069989K196398L400742N62781l8866
38716A8235608M152048O166384K871173K372962Q933759J3441878J0679348J1775843
38708G8629003K4099693L5040662L7676688N4922654J03339120J42255464J04769274
$$ plain form
38701 580732558 570366948 451713421 308030261 208644600 155451215 118473429 87338807
38694 87338807 69299071 62161604 55242312 47326447 44766244 47766332 52812173 62254075
38686 62254075 77458134 87804979 80850977 60592265 42812588 34358569 29211116
38679 29211116 23372286 20420032 21265739 20451028 15743985 11874487 11647884 11630126 9591550
38670 9591550 8542019 10180594 11280362 9870208 8745813 9638897 9778635 7504874
38662 7504874 5772208 6691993 7688240 6467866 5036428 5367245 5591826 3966988 2429853
38653 2429853 2773158 3250946 2318145 1825408 3145015 4044769 2901350 2114379 3641716
38644 3641716 5023078 3840183 2364154 3409197 5073480 4278829 2410416 2590506
$$ packed form
38701E80732558j0365610j18653527j43683160r9385661n3193385l6977786l1134622
38694H7338807j8039736p137467o919292p915865k560203L000088N045841R441902
38686F2254075J5204059J0346845o954002k0258712j7779677q454019n147453
38679B9211116n838830k952254Q45707q14711m707043l869498k26603j7758k038576
38670I591550j049531J638575J099768j410154j124395Q93084J39738k273761
38662G504874j732666R19785R96247j220374j431438L30817K24581j624838j537135
38653B429853L43305M77788r32801m92737J319607Q99754j143419p86971J527337
38644C641716J381362j182895j476029J045043J664283p94651j868413J80090
$$ plain form
38636 2590506 4097472 4373182 4067511 5142879 6260891 5086714 3141950 3375979 4860828
38627 4860828 4889412 4320409 5611141 7545176 7438530 6665134 8184653 10477970 10160292
38618 10160292 8800380 10427714 13950222 15304344 15553057 18866548 23882578 26019976
38610 26019976 27319257 33969867 44704847 53086718 61270329 78182906 103657714 131903329
38602 131903329 174125802 253532412 361826332 440715469 433183546 346976532 245381143
38595 245381143 179255061 150544430 139746918 138691271 143976988 141679889 119888274
38588 119888274 87039021 61572633 48629895 39648947 30059496 23988643 23081101 22646676
38580 22646676 20027106 17769694 17043651 15260195 11759675 9575885 9863223 9868486 8034678
$$ packed form
38636B590506J506966K75710l05671J075368J118012j174177j944764K34029J484849
38627D860828K8584n69003J290732J934035j06646p73396J519519K293317l17678
38618A0160292j359912J627334L522508J354122K48713L313491N016030K137398
38610B6019976J299281O650610J0734980Q381871Q183611J6912577K5474808K8245615
38602A31903329M2222473P9406610J08293920P8889137p531923q6207014j01595389
38595B45381143o6126082k8710631j0797512j055647N285717k297099k1791615
38588A19888274l2849253k5466388j2942738q980948r589451o070853r07542m34425
38580B2646676k619570k257412p26043j783456l500520k183790K87338N263j833808
$$ plain form
38571 8034678 6433562 6508981 6588514 5382040 4373865 4950975 6090594 6483863 6474285
38562 6474285 6586504 6369579 5785902 5667478 5904095 5216878 3515979 2433299 2710039
38553 2710039 3054906 2428753 1518816 1057646 555795 -306983 -753226 -390235 -77547
38544 -77547 -367601 -560306 -213835 -79341 -521260 -495535 695268 1923657 1819715 796382
38534 796382 216671 391098 659275 787437 1037787 1276521 1118561 705437 453749 285061
38524 285061 -98481 -423534 -125319 716498 1421637 1618939 1501402 1237825 791363 436280
38514 436280 822492 2124880 3508750 4005739 3862681 4442547 6647325 10191162 14963900
38505 14963900 22071666 31835015 40934469 43789228 38084164 27674433 18672250 13641485
$$ packed form
38571H034678j601116P5419P9533j206474j008175N77110J139619L93269r578
38562F474285J12219k16925n83677j18424K36617o87217j700899j082680K76740
38553B710039L44867o26153r09937m61170n01851q62778m46243L62991L12688
38544g7547k90054j92705L46471J34494m41919K5725J190803J228389j03942j023333
38534G96382n79711J74427K68177J28162K50350K38734j57960m13124k51688j68688
38524B85061l83542l25053K98215Q41817P05139J97302j17537k63577m46462l55083
38514D36280L86212J302388J383870M96989j43058N79866K204778L543837M772738
38505A4963900P107766R763349R099454K854759n705064j0409731r002183n030765
$$ plain form
38497 13641485 11013590 8989816 7615793 7129655 6635780 5359595 3837768 2983514
38489 2983514 2852123 2964028 3100209 3204876 3074416 2633204 2158220 1962220 2114528
38480 2114528 2480361 2751778 2663050 2533730 3113805 4308465 4725596 3438952 1584978
38471 1584978 982480 1636170 2005947 1415488 633364 216034 -65852 -114282 479096 1113804
38461 1113804 628106 -585715 -734828 529027 1282713 262668 -1116918 -899551 697310
38452 697310 2042288 2416637 2227816 1792129 1205131 807091 727200 513099 -26537 -364524
38442 -364524 -325120 -586156 -1246800 -1057615 726565 2763057 3284445 2507428 1907384
38433 1907384 1792397 1237078 32946 -948348 -1284060 -1453097 -1671764 -1539230 -1023125
$$ packed form
38497A3641485k627895k023774j374023m86138m93875j276185j521827q54254
38489B983514j31391J11905J36181J04667j30460m41212m74984j96000J52308
38480B114528L65833K71417q8728j29320N80075J194660M17131j286644j853974
38471A584978o02498O53690L69777n90459p82124m17330k81886m8430N93378O34708
38461A113804m85698j213821j49113J263855P53686j020045j379586K17367J596861
38452F97310J344978L74349j88821m35687n86998l98040p9891k14101n39636l37987
38442c64524L9404k61036o60644J89185J784180K036492N21388p77017o00044
38433A907384j14987n55319j204132r81294l35712j69037k18667J32534N16105
$$ plain form
38424 -1023125 -693969 -730138 -615563 -77136 462194 600035 470515 349642 282921 249191
38414 249191 268018 276946 222719 210659 291945 313054 264592 450055 966190 1422119 1565097
38403 1565097 1702827 2037791 2115990 1513803 585943 -48580 -280768 -258588 6595 204459
38393 204459 -313678 -1378954 -1677406 -582791 527782 56419 -1419415 -1997912 -1197774
38384 -1197774 -238331 170428 586729 1265304 1481333 911067 343505 402075 603197 268758
38374 268758 -470589 -1076539 -1286179 -1020591 -295603 479114 771232 697932 835800 1155358
38364 1155358 1002630 334076 18534 526696 1185858 1211718 726566 265338 -37385 -250921
38354 -250921 -248447 -23140 102726 37950 199629 794375 1310098 1202459 672483 276159
$$ packed form
38424a023125L29156l6169J14575N38427N39330J37841j29520j20873o6721l3730
38414B49191J8827Q928n4227j2060Q1286K1109m8462J85463N16135M55929J42978
38403A565097J37730L34964P8199o02187r27860o34523k32188K2180K65183J97864
38393B04459n18137j065276k98452J094615J110573m71363j475834n78497Q00138
38384a197774R59443M08759M16301O78575K16029n70266n67562N8570K01122l34439
38374B68758p39347o05950k09640K65588P24988P74717K92118p3300J37868L19558
38364A155358j52728o68554l15542N08162O59162K5860m85152m61228l02723k13536
38354b50921K474K25307J25866o4776J61679N94746N15723j07639n29976l96324
$$ plain form
38344 276159 96691 -205873 -732452 -1169382 -1221686 -978009 -853971 -1185613 -1759638 -1872805
38334 -1872805 -1146965 -142740 238533 -183196 -895302 -1589562 -2309313 -2744718 -2268546
38325 -2268546 -972181 71172 43230 -627373 -962644 -741002 -617623 -1099671 -1806909
38316 -1806909 -1855780 -891106 400250 1015643 840157 679668 979184 1189333 808254
38307 808254 257093 -8489 -457952 -1502414 -2260090 -1688875 -480982 -221052 -850773
38298 -850773 -740475 581215 1618391 1334835 610504 437774 300572 -503850 -1304773
38289 -1304773 -1164945 -507893 -284377 -317803 185581 1096931 1639563 1752642 1946193 2124256
38279 2124256 1734196 885166 223443 -179214 -785934 -1509496 -1657769 -1031976 -231760
$$ packed form
38344B76159j79468l02564n26579m36930n2304K43677J24038l31642n74025j13167
38334a872805P25840J004225L81273m21729p12106o94260p19751m35405M76172
38325b268546J296365J043353k7942o70603l35271K21642J23379m82048p07238
38316a806909m8871R64674J291356O15393j75486j60489K99516K10149l81079
38307H08254n51161k65582m49463j044462p57676N71215J207893K59930o29721
38298h50773J10298J321690J037176k83556p24331j72730j37202q04422q00923
38289a304773J39828O57052K23516l3426N03384R11350N42632J13079J93551J78063
38279B124256l90060q49030o61723m02657o06720p23562j48273O25793Q00216
$$ plain form
38270 -231760 253710 557534 944186 1419454 1916671 2366005 2544783 2292881 1851961 1621883
38260 1621883 1689941 1914504 2209878 2384810 2096851 1463727 1258816 1833243 2301827 1673265
38250 1673265 448027 32339 658466 1026018 237125 -965015 -1405856 -1091626 -869426
38241 -869426 -967068 -719661 274424 1406636 1804117 1498047 1369490 1906456 2517829 2456684
38231 2456684 2023166 2151850 2932008 3379193 2836715 1780928 913101 289177 -150744
38222 -150744 -24302 789136 1556084 1606520 1310784 1371602 1707061 1894866 2133905 2700151
38212 2700151 2930647 2007133 519886 -41381 646935 1407511 1402366 1089923 1068329 1146530
38202 1146530 1053661 1045416 1208041 1034706 348225 -105820 301834 1058838 1261674 931816
$$ packed form
38270b31760M85470L03824L86652M75268M97217M49334J78778k51902m40920k30078
38260A621883O8058K24563K95374J74932k87959o33124k04911N74427M68584o28562
38250A673265j225238m15688O26127L67552p88893j202140m40841L14230K22200
38241h69426r7642K47407R94085J132212L97481l06070j28557N36966O11373o1145
38231B456684m33518J28684P80158M47185n42478j055787q67827o23924m39921
38222a50744J26442Q13438P66948N0436k95736O0818L35459J87805K39039N66246
38212B700151K30496r23514j487247n61267O88316P60576n145l12443k1594P8201
38202A146530r2869q245J62625j73335o86481m54045M07654P57004K02836l29858
$$ plain form
38192 931816 837823 1297520 1858584 2028648 1713748 985011 -38024 -997476 -1419292 -1191970
38182 -1191970 -684984 -272840 78093 619421 1356238 1994679 2374746 2713169 3206724
38173 3206724 3583834 3438279 2943495 2718501 2887620 2859597 2296265 1676440 1484697 1487868
38163 1487868 1404127 1631172 2481681 3251543 3079252 2356907 2148983 2445733 2284627 1589798
38153 1589798 1464546 2318641 3095010 3031352 2949516 3815415 4990466 5130979 4269533 3771895
38143 3771895 4413050 5617614 6713068 7952159 9859968 12227957 14398782 16380389
38135 16380389 19138386 23553110 29248754 34660234 38177875 38980753 36918481 32328203
38127 32328203 26389743 20991912 17355417 14970375 12626255 10242981 8746335 8287607
$$ packed form
38192I31816r3993M59697N61064J70064l14900p28737j023035r59452m21816K27322
38182a191970N06986M12144L50933N41328P36817O38441L80067L38423M93555
38173C206724L77110j45555m94784k24994J69119k8023n63332o19825j91743L171
38163A487868q3741K27045Q50509P69862j72291p22345k07924K96750j61106o94829
38153A589798j25252Q54095P76369o3658q1836Q65899J175051J40513q61446m97638
38143C771895O41155J204564J095454J239091J907809K367989K170825J981607
38135A6380389K757997M414724N695644N411480L517641Q02878k062272m590278
38127C2328203n938460n397831l636495k385042k344120k383274j496646m58728
$$ plain form
38119 8287607 7836984 6830350 6013560 6016091 6111143 5289709 3851985 2965052 3062542 3560923
38109 3560923 3878731 3900716 3582991 2908962 2299825 2433935 3453484 4671541 5165611
38100 5165611 4548157 3310996 2585978 3299790 5272727 7331415 8480500 8662391 8239519
38091 8239519 7305116 5934441 4615752 3828273 3473011 3209669 3036491 3030944 2895922
38082 2895922 2418073 2093062 2558144 3523962 3970469 3403724 2336566 1539796 1370981
38073 1370981 1807781 2538829 2961746 2641844 1874507 1329719 1107488 675627 -159165
38064 -159165 -773109 -477694 608097 1659241 1905191 1230887 268293 -100277 419523
38055 419523 1236045 1640550 1665316 1783250 2002834 1875665 1315276 760958 517201 554694
$$ packed form
38119H287607m50623j006634q16790K531R5052q21434j437724q86933R7490M98381
38109C560923L17808K1985l17725o74029o09137J34110J019549J218057M94070
38100E165611o17454j237161p25018P13812J972937K058688J149085J81891m22872
38091H239519r34403j370675j318689p87479l55262k63342j73178n547j35022
38082B895922m77849l25011M65082R65818M46507n66745j067158p96770j68815
38073A370981M36800P31048M22917l19902p67337n44788k22231m31861q34792
38064a59165o13944K95415J085791J051144K45950o74304r62594l68570N19800
38055D19523Q16522M04505K4766J17934K19584j27169n60389n54318k43757L7493
$$ plain form
38045 554694 954659 1798313 2528586 2291724 1215799 504882 804297 1287554 993268
38036 993268 302545 236285 871282 1455375 1733594 2073336 2389709 2087326 1293737 1134504
38026 1134504 2269804 3892855 4787068 4869945 5038219 5755243 6424771 6175320 4873565
38017 4873565 3289388 2420349 2606921 3216488 3333360 2808499 2338125 2398096 2568473
38008 2568473 2280937 1797350 1825284 2391673 2823710 2848645 2979848 3580686 4183027 4146850
37998 4146850 3546295 2946347 2613672 2411638 2272431 2304277 2496378 2700212 2897572 3201615
37988 3201615 3619580 4072661 4618819 5411898 6463492 7656382 8945476 10337253 11754084
37979 11754084 13191970 14986569 17628427 21202513 25122008 28438192 30363185 30596934
$$ packed form
38045E54694L99965Q43654P30273k36862j075925p10917K99415M83257k94286
38036I93268o90723o6260O34997N84093K78219L39742L16373l02383p93589j59233
38026A134504J135300J623051Q94213Q2877J68274P17024O69528k49451j301755
38017D873565j584177q69039J86572O09567J16872n24861m70374N9971J70377
38008B568473k87536m83587K7934N66389M32037K4935J31203O00838O02341l6177
37998D146850o00555n99948l32675k02034j39207L1846J92101K03834J97360L04043
37988C201615M17965M53081N46158P93079J051594J192890J289094J391777J416831
37979A1754084J437886J794599K641858L574086L919495L316184J924993K33749
$$ plain form
37971 30596934 29300529 26768927 23198798 18975890 15065692 12537582 11439077 10659864
37963 10659864 9336953 7911467 7221698 7028304 6308915 4830863 3506301 3078705 3240223
37954 3240223 3281558 2969619 2510099 2176326 2237157 2798631 3502946 3801704 3675283 3646291
37944 3646291 3999243 4524399 5128075 6013161 6977794 7205811 6224037 4604920 3289112
37935 3289112 2584751 2205401 1926285 1794309 1920788 2346341 2924615 3278407 3246915 3413749
37925 3413749 4622241 6767921 8622112 9131112 8462351 7634195 7613457 8770024 10450970
37916 10450970 11012498 9244893 6046464 3682250 3053443 2887393 2109015 1505686 2001273
37907 2001273 2700482 2217949 975548 462342 847738 1090646 1020923 1441599 2205586
$$ packed form
37971C0596934j296405k531602l570129m222908l910198k528110j098505p79213
37963A0659864j322911j425486o89769j93394p19389j478052j324562m27596J61518
37954C240223M1335l11939m59520l33773O0831N61474P04315K98758j26421k8992
37944C646291L52952N25156O03676Q85086R64633K28017r81774j619117j315808
37935C289112p04361l79350k79116j31976J26479M25553N78274L53792l1492J66834
37925C413749J208492K145680J854191N09000o68761q28156k0738J156567J680946
37916A0450970N61528j767605l198429k364214o28807j66050p78378o03329M95587
37907B001273O99209m82533j242401n13206L85396K42908o9723M20676P63987
$$ plain form
37898 2205586 2047666 688976 -498399 -477801 153981 441547 409436 440013 402688 200719
37888 200719 330870 1106218 1965210 2238001 2062081 1972428 2127500 2488609 3225340 4327609
37878 4327609 5219253 5337649 4834164 4257760 3784672 3133700 2076581 805186 -75289
37869 -75289 53372 1102940 2070955 2069947 1456031 1262440 1631468 1740762 1327700 1146534
37859 1146534 1555133 1805355 1391573 1049096 1507111 2110090 1774837 751235 283606
37850 283606 781238 1394373 1413850 1206239 1542992 2551197 3532644 3589538 2476516 1008714
37840 1008714 389902 918353 1694828 1842015 1501783 1228025 978803 383214 -383627
37831 -383627 -731799 -493877 -51905 208572 90067 -511230 -1355218 -1759387 -1301275 -410291
$$ packed form
37898B205586j57920j358690j187375K0598O31782K87566l2111L0577l7325k01969
37888B00719J30151P75348Q58992K72791j75920q9653J55072L61109P36731J102269
37878D327609Q91644J18396n03485n76404m73088o50972j057119j271395q80475
37869g5289J28661J049568R68015j008o13916j93591L69028J09294m13062j81166
37859A146534M08599K50222m13782l42477M58015O02979l35253j023602m67629
37850B83606M97632O13135J9477k07611L36753J008205R81447N6894j113022j467802
37840A008714o18812N28451P76475J47187l40232k73758k49222n95589p66841
37831c83627l48172K37922M41972K60477j18505o01297q43988m04169M58112Q90984
$$ plain form
37821 -410291 217323 480865 642544 670695 507538 572495 1136016 1509963 850248 -401463
37811 -401463 -932740 -413034 137364 -15964 -379029 -261801 223663 676799 1073672 1369395
37801 1369395 1173108 424145 -219077 -261278 -105309 -336550 -802250 -1009295 -931449 -762730
37791 -762730 -354205 361136 822049 553975 60295 67403 198510 -453147 -1530659 -1526884
37781 -1526884 -4288 1558426 1787933 1208228 1136705 1697204 2070585 2117851 2445793
37772 2445793 3058596 3200246 2640246 2016807 1668239 1161035 363213 -2563 525864
37763 525864 1283558 1401838 961971 563243 328971 79539 5041 375574 923501 1228173
37753 1228173 1393707 1682127 1871987 1707662 1530192 1610275 1348657 213763 -942561
$$ packed form
37821d10291O27614K63542J61679K8151j63157O4957N63521L73947o59715j251711
37811d01463n31277N19706N50398j53328l63065J17228M85464M53136L96873K95723
37801A369395j96287p48963o43222m2201J55969k31241m65700k07045P7846J68719
37791g62730M08525P15341M60913k68074m93680P108J31107o51657j077512L775
37781a526884J522596J562714K29507n79705p1523N60499L73381M7266L27942
37772B445793O12803J41650n60000o23439l48568n07204p97822l65776N28427
37763E25864P57694J18280m39867l98728k34272k49432p4498L70533N47927L04672
37753A228173J65534K88420J89860j64325j77470Q0083k61618j134894j156324
$$ plain form
37744 -942561 -817805 282246 734642 -19599 -871822 -1084444 -1378041 -2364539 -3322557
37735 -3322557 -3440966 -3125108 -3069079 -2987890 -2314751 -1380796 -867578 -705883 -450982 -143685
37725 -143685 104212 716269 1827052 2463610 1685477 97723 -889289 -945311 -858973 -1024544
37715 -1024544 -1073688 -837286 -526163 -36920 835286 1556980 1328984 396287 -200300 -211163
37705 -211163 -391239 -1021158 -1405387 -1151534 -840908 -972074 -1189206 -1049858 -730791 -497229
37695 -497229 -227990 80125 60301 -326261 -541183 -355798 -267495 -543285 -591245 77870
37685 77870 904025 1047270 659256 609271 1153366 1567240 1126194 21300 -780693 -454679
37675 -454679 833778 1976046 2014916 1141853 297481 -59321 -221905 -374104 -259432
$$ packed form
37744i42561J24756J100051M52396p54241q52223k12622k93597r86498r58018
37735c322557j18409L15858N6029Q1189O73139R33955N13218J61695K54901L07297
37725a43685K47897O12057J110783O36558p78133j587754r87012n6022Q6338j65571
37715a024544m9144K36402L11123M89243Q72206P21694k27996r32697n96587j0863
37705b11163j80076o29919l84229K53853L10626j31166k17132J39348L19067K33562
37695d97229K69239L08115j9824l86562k14922J85385Q8303k75790m7960O69115
37685G7870Q26155J43245l88014m9985N44095M13874m41046j104894q01993L26014
37675d54679J288457J142268L8870q73063q44372l56802j62584j52199J14672
$$ plain form
37666 -259432 116766 251701 -20530 -144795 263990 739468 645112 34985 -603269 -989106
37656 -989106 -1019657 -590002 110096 556135 553171 514456 747523 994644 1041802 1143801
37646 1143801 1356934 1112175 89551 -1056162 -1517505 -1352697 -1005279 -405189 591858
37637 591858 1379045 1230439 477259 83426 232096 278098 -35244 -318536 -486773 -952376
37627 -952376 -1689242 -1999499 -1490608 -552078 358171 1174412 1760912 1784452 1394172 1284705
37617 1284705 1632458 1646074 743083 -386205 -583556 220150 919216 629610 -339837
37608 -339837 -975583 -711603 16111 302569 -150724 -627130 -305972 554168 841109 51516
37598 51516 -1054128 -1505915 -1261655 -881783 -605052 -356302 -291961 -593591 -870744 -525294
$$ packed form
37666b59432L76198J34935k72231j24265M08785M75478r4356o10127o38254l85837
37656i89106l0551M29655P00098M46039k964l8715K33067K47121M7158J01999
37646A143801K13133k44759j022624j145713m61343J64808L47418O00090R97047
37637E91858P87187j48606p53180l93833J48670M6002l13342k83292j68237m65603
37627i52376p36866l10257N08891R38530R10249Q16241N86500K3540l90280j09467
37617A284705L47753J3616r02991j129288j97351Q03706O99066k89606r69447
37608c39837o35746K63980P27714K86458m53293m76406L21158Q60140K86941p89593
37598E1516j105644m51787K44260L79872K76731K48750O4341l01630k77153L45450
$$ plain form
37588 -525294 235886 447876 -334765 -1390567 -1773338 -1409234 -856023 -381001 179736
37579 179736 830516 1221620 1087688 551225 -32113 -293193 9195 750988 1375775 1377152
37569 1377152 835185 190278 -398539 -1024828 -1450696 -1196655 -363025 275206 284460 74343
37559 74343 20274 -224470 -944459 -1534833 -1299361 -627461 -435267 -731689 -767102 -448604
37549 -448604 -460588 -907240 -1011235 -464503 54109 185337 598974 1688042 2570990 2353313
37539 2353313 1585640 1362844 1541594 1074551 -144693 -990872 -734349 48217 412863
37530 412863 92786 -647173 -1488665 -2043407 -1895703 -1046635 -21188 680845 987199
37521 987199 1031405 878387 603405 345505 154586 7504 -7745 188166 362730 148068
$$ packed form
37588e25294P61180K11990p82641j055802l82771L64104N53211M75022N60737
37579A79736O50780L91104j33932n36463n83338k61080L02388P41793O24787J377
37569A377152n41967o44907n88817o26289m25868K54041Q33630O38231R254k10117
37559G4343n4069k44744p19989n90374K35472O71900J92194k96422l5413L18498
37549d48604j1984m46652j03995N46732N18612J31228M13637J089068Q82948k17677
37539B353313p67673k22796J78750m67043j219244q46179K56523P82566L64646
37530D12863l20077p39959q41492n54742J47704Q49068J025447P02033L06354
37521I87199M4206j53018k74982k57900j90919j47082j5249J95911J74564k14662
$$ plain form
37511 148068 -408728 -809040 -712315 -272348 218157 668041 1014718 1043124 646908 93964
37501 93964 -200483 -91955 225326 471631 494258 319451 110526 32301 75263 48535
37491 48535 -164539 -342418 -40847 880645 1883614 2164905 1592262 970388 1097669 1803432
37481 1803432 2337207 2481372 2643070 2906169 2757038 1941094 896171 54755 -614704
37472 -614704 -1058451 -891570 -187586 225744 -112439 -566203 -513480 -476681 -1186834 -2085050
37462 -2085050 -1914939 -555715 838428 1439163 1452432 1233420 732163 23157 -463895
37453 -463895 -498378 -220543 293844 997045 1458049 1258433 762139 663232 817712 483467
37443 483467 -271174 -523952 -75835 91679 -611260 -1416339 -1416540 -845984 -457187 -378459
$$ packed form
37511A48068n56796m00312R6725M39967M90505M49884L46677K8406l96216n52944
37501I3964k94447J08528L17281K46305K2627j74807k08925p8225M2962k6728
37491D8535k13074j77879L01571R21492J002969K81291n72643o21874J27281P05763
37481A803432N33775J44165J61698K63099j49131q15944j044923q41416o69459
37472f14704m43747J66881P03984M13330l38183m53764N2723L6799p10153q98216
37462b085050J70111J359224J394143O00735J3269k19012n01257p09006m87052
37453d63895l4483K77835N14387P03201M61004j99616m96294r8907J54480l34245
37443D83467p54641k52778M48117J67514p02939q05079k01N70556L88797P8728
$$ plain form
37433 -378459 -296077 -157855 -29850 239540 645765 803043 557839 278492 114779 -334969
37423 -334969 -1083438 -1249391 -250959 1121547 1658444 1270588 757821 483291 189049
37414 189049 -145651 -185716 75195 258590 234341 215268 240146 90058 -279183 -636013
37404 -636013 -781639 -679590 -416427 -253355 -442929 -773266 -696192 -171780 136551 -150340
37394 -150340 -587018 -827846 -1338966 -2440029 -3323536 -3023484 -1910645 -1191284 -1212033
37385 -1212033 -1296469 -1075945 -901742 -929399 -799618 -393885 -85129 -62892 -84276 9695
37375 9695 142144 359393 727121 959203 806170 630663 824965 900616 148669 -940702
37365 -940702 -1082056 -85492 834974 866275 538496 506828 559554 377033 210549 163190
$$ packed form
37433c78459Q2382J38222J28005K69390M06225J57278k45204k79347j63713m49748
37423c34969p48469j65953R98432J372506N36897l87856n12767k74530k94242
37414A89049l34700m0065K60911J83395k4249j9073K4878j50088l69241l56830
37404f36013j45626J02049K63163J63072j89574l30337P7074N24412L08331k86891
37394a50340m36678k40828n11120j101063q83507L00052J112839P19361k0749
37385a212033q4436K20524J74203k7657J29781M05733L08756K2237k1384R3971
37375I695J32449K17249L67728K32082j53033j75507J94302P5651p51947j089371
37365i40702j41354R96564R20466L1301l27779l1668N2726j82521j66484m7359
$$ plain form
37355 163190 -234497 -1026717 -1311518 -496302 717690 1386412 1594670 1851820 1987610
37346 1987610 1652938 1315223 1667961 2423404 2692858 2301081 1825173 1589535 1483133
37337 1483133 1490087 1519814 1026675 -213124 -1225566 -859051 471143 1250741 1042731
37328 1042731 887531 1365751 1693329 1294148 938813 1419238 2149775 2166673 1724807 1699546
37318 1699546 1921131 1399317 45502 -1055965 -1232224 -1015595 -1039158 -1080665 -728349
37309 -728349 -244022 -69443 31436 574100 1333602 1478372 741023 -197394 -679769 -878138
37299 -878138 -1285638 -1821480 -1932288 -1404590 -594536 128364 721798 1179584 1344747 1239057
37289 1239057 1208348 1406172 1413495 783547 -224962 -939582 -1209649 -1491010 -1927222 -1957726
$$ packed form
37355A63190l97687p92220k84801Q15216J213992O68722K08258K57150J35790
37346A987610l34672l37715L52738P55443K69454l91777m75908k35638j06402
37337A483133O954K9727m93139j239799j012442L66515J330194P79598k08010
37328A042731j55200M78220L27578l99181l55335M80425P30537J6898m41866k5261
37318A699546K21585n21814j353815j101467j76259K16629k3563m1507L52316
37309g28349M84327J74579J00879N42664P59502J44770p37349r38417m82375j98369
37299h78138m07500n35842j10808N27698Q10054P22900N93434M57786J65163j05690
37289A239057l0709J97824P323o29948j008509p14620k70067k81361m36212l0504
$$ plain form
37279 -1957726 -1168945 -55049 545743 475597 226863 104105 -16724 -160752 -81929 265734
37269 265734 589720 777785 1094069 1603827 1838832 1396709 537725 -185871 -573478 -632861
37259 -632861 -161629 884553 1799061 1676346 652853 -99264 130783 728868 778446
37250 778446 385070 380118 1018874 1630820 1536285 809097 53404 -223105 57163 546053
37240 546053 732341 419802 -13788 -23089 443814 907539 977677 759300 590016 610899
37230 610899 708134 720281 613866 551493 774147 1258037 1552602 1264086 729291 807037
37220 807037 1768785 2747724 2703579 1746802 997021 1116695 1529392 1356740 663695 241085
37210 241085 364430 437817 1111 -514914 -452104 54190 262634 -139112 -739915 -1118958
$$ packed form
37279a957726P88781J113896O00792p0146k48734j22758j20829j44028P8823L47663
37269B65734L23986J88065L16284N09758K35005m42123q58984p23596l87607n9383
37259f32861M71232J046182R14508j22715j023493p52117K30047N98085M9578
37250G78446l93376m952O38756O11946r4535p27188p55693k76509K80268M88890
37240E46053J86288l12539m33590r301M66903M63725P0138k18377j69284K0883
37230F10899R7235J2147j06415o2373K22654M83890K94565k88516n34795P7746
37220H07037R61748R78939m4145r56777p49781J19674M12697j72652o93045m22610
37210B41085J23345P3387m36706n16025O2810N06294K08444m01746o00803l79043
$$ plain form
37200 -1118958 -1294561 -1335015 -1057559 -420761 176637 362627 311239 450987 833516 1121308
37190 1121308 1081956 793978 451144 239244 329225 706588 1033081 933268 431390 -93924
37180 -93924 -384072 -525927 -669484 -707236 -371779 367685 1102428 1300838 876824 294516
37170 294516 -31522 -243224 -677417 -1220615 -1485868 -1489617 -1543641 -1510473 -924394 5645
37160 5645 374920 -53404 -319190 297794 1118564 1175550 802571 1054298 1949781 2443872
37150 2443872 2044309 1394177 1144116 1157615 1045511 741377 312869 -204541 -613062 -685670
37140 -685670 -555669 -514525 -499340 -307321 -144380 -302790 -484511 -219437 226936 258113
37130 258113 93027 448380 1135074 1178971 478037 85744 519513 1016454 928242 643459
$$ packed form
37200a118958j75603m0454K77456O36798N97398J85990n1388J39748L82529K87792
37190A121308l9352k87978l42834k11900Q9981L77363L26493r9813n01878n25314
37180i3924k90148j41855j43557l7752L35457P39464P34743J98410m24014n82308
37170B94516l26038k11702m34193n43198k65253l749n4024L3168N86079R30039
37160E645L69275m28324k65786O16984Q20770N6986l72979K51727Q95483M94091
37150B443872l99563o50132k50061J3499j12104l04134m28508n17410m08521p2608
37140f85670J30001M1144J5185J92019J62941j58410j81721K65074M46373L1177
37130B58113j65086L55353O86694M3897p00934l92293M33769M96941q8212k84783
$$ plain form
37120 643459 538945 205205 -553359 -1050451 -850751 -535229 -528421 -260730 558649 970965
37110 970965 248774 -676732 -607610 1072 -9879 -414459 -135363 648853 686839 -265996
37100 -265996 -1209930 -1663861 -2034666 -2204970 -1466300 -141737 385995 -219902 -642855
37091 -642855 -55175 599518 332087 -207876 107435 1031744 1438402 1010542 357891 -101869
37081 -101869 -412135 -529165 -331556 12192 297957 649124 1108417 1252845 810763 282113
37071 282113 292979 672887 856299 879867 1204267 1757093 1977771 1751564 1504959 1337734
37061 1337734 849827 -3059 -638431 -742155 -759562 -1055440 -1180170 -597404 256027 393419
37051 393419 -338976 -1018761 -910530 -339344 -10737 -20505 -31930 -25620 -228605 -506493
$$ packed form
37120F43459j04514l33740p58564m97092J99700L15522O808K67691Q19379M12316
37110I70965p22191r25506O9122O08682j0951m04580K79096P84216L7986r52835
37100b65996r43934m53931l70805j70304P38670J324563N27732o05897m22953
37091f42855N87680O54693k67431n39963L15311R24309M06658m27860o52651m59760
37081a01869l10266j17030J97609L43748K85765L51167M59293J44428m42082n28650
37071B82113J0866L79908J83412K3568L24400N52826K20678k26207k46605j67225
37061A337734m87907q52886o35372j03724j7407k95878j24730N82766Q53431J37392
37051C93419p32395o79785J08231N71186L28607r768j1425O310k02985k77888
$$ plain form
37041 -506493 -530844 -511804 -1015254 -1915704 -2295928 -1707337 -805399 -286319 71122 660486
37031 660486 1046999 629130 -158709 -327519 193749 559285 404466 249461 432187 603806
37021 603806 517604 449250 509205 312050 -280800 -741774 -593035 -16177 546678 884725
37011 884725 888715 497073 -1094 -172339 -112943 -279538 -534026 -191298 736952 1288916
37001 1288916 984830 589650 858129 1392208 1446968 1047815 501179 -420604 -1847530
36992 -1847530 -3010493 -3099064 -2436383 -1830092 -1269601 -369693 358940 35307 -928916
36983 -928916 -1042501 187584 1524786 1681829 787737 -198466 -720497 -821415 -732720
36974 -732720 -700734 -811146 -743283 -104635 865746 1413145 1216724 724252 411734 248744
$$ packed form
37041e06493k4351J9040n03450r00450l80224N88591R01938N19080L57441N89364
37031F60486L86513m17869p87839j68810N21268L65536j54819j55005J82726J71619
37021F03806q6202o8354N9955j97155n92850m60974J48739N76858N62855L38047
37011H84725L990l91642m98167j71245N9396j66595k54488L42728R28250N51964
37001A288916l04086l95180K68479N34079N4760l99153n46636r21783j426926
36992a847530j162963q8571O62681O06291N60491Q99908P28633l23633r64223
36983i28916j13585J230085J337202J57043q94092r86203n22031j00918Q8695
36974g32720L1986j10412O7863O38648R70381N47399j96421m92472l12518j62990
$$ plain form
36964 248744 95431 113725 490947 1093856 1586092 1633328 1009519 -95915 -912916 -758223
36954 -758223 81181 645576 526986 239694 312843 653706 977406 1233496 1345827 1096308
36944 1096308 555924 135635 -30496 -236821 -521305 -428038 214029 837493 870505 466710
36934 466710 139752 128898 482318 1265460 2240956 2790832 2640815 2287489 2249415 2265166
36924 2265166 1721173 555110 -739990 -1716637 -2133494 -1851488 -1096301 -575979 -812192
36915 -812192 -1500028 -1927351 -1811112 -1335061 -655394 152709 891471 1438045 1916126 2277431
36905 2277431 2073963 1156976 213328 -34333 187609 239818 223936 657228 1202607 858693
36895 858693 -436079 -1448946 -1296136 -554602 -222557 -335632 -280959 52457 163472
$$ packed form
36964B48744j53313J8294L77222O02909M92236M7236o23809j105434q17001J54693
36954g58223Q39404N64395j18590k87292P3149L40863L23700K56090J12331k49519
36944A096308n40384m20289j66131k06325k84484R3267O42067O23464L3012m03795
36934D66710l26958j0854L53420P83142R75496N49876j50017l53326l8074J5751
36924B265166n43993j166063j295100r76647m16857K82006P55187N20322k36213
36915h12192o87836m27323J16239M76051O79667Q08103P38762N46574M78081L61305
36905B277431k03468r16987r43648k47661K21942N2209j5882M33292N45379l43914
36895H58693j294772j012867J52810P41534L32045j13075N4673L33416J11015
$$ plain form
36886 163472 -260197 -978671 -1519095 -1534035 -1059313 -694997 -1211656 -2601279 -3799221
36877 -3799221 -3768915 -2655481 -1477903 -919242 -895052 -1118862 -1471311 -1761058 -1678581 -1238206
36867 -1238206 -922147 -1122597 -1640473 -1953230 -1830725 -1460049 -1045488 -560922 19455
36858 19455 461264 475038 133825 -166925 -231612 -286767 -520013 -679503 -454129 -42633
36848 -42633 90162 -78641 -154692 -35182 -23599 -119530 199570 1177310 2269056 2826396
36838 2826396 2861283 2698106 2277127 1360336 168360 -735530 -1047445 -791217 -60686
36829 -60686 785275 979543 122969 -1031322 -1328153 -725876 -278195 -523778 -766113 -285001
36819 -285001 529484 791836 291334 -525179 -1312631 -1991056 -2430337 -2494795 -2247127 -1755054
$$ packed form
36886A63472m23669p18474n40424j4940M74722L64316n16659j389623j197942
36877c799221L0306J113434J177578N58661K4190k23810l52449k89747Q2477M40375
36867a238206L16059k00450n17876l12757J22505L70676M14561M84566N80377
36858A9455M41809J3774l41213l00750o4687n5155k33246j59490K25374M11496
36848d2633J32795j68803p6051J19510J1583r5931L19100R77740J091746N57340
36838B826396L4887j63177m20979r16791j191976r03890l11915K56228P30531
36829f0686Q45961J94268q56574j154291k96831O02277M47681k45583k42335M81112
36819b85001Q14485K62352n00502q16513p87452o78425m39281o4458K47668M92073
$$ plain form
36809 -1755054 -928389 127088 912546 1091119 933110 790190 473627 -329395 -1346045
36800 -1346045 -2031659 -2334127 -2496287 -2343855 -1559719 -551310 -173702 -519675 -819549
36791 -819549 -690726 -599932 -782424 -634013 233974 1093457 985723 -30264 -1211390
36782 -1211390 -2184555 -2852064 -2730854 -1492781 -40049 104343 -1268881 -2684167 -2935278
36773 -2935278 -2516928 -2496242 -2771561 -2432388 -1421098 -714513 -835537 -1201863 -1247200 -1244950
36763 -1244950 -1424044 -1091719 388463 2202051 2819372 2075297 1372149 1587154 1999761
36754 1999761 1936344 2273812 4062518 6391888 7165491 5854835 4033359 2987526 2213817
36745 2213817 858673 -609309 -1123991 -594019 223598 865031 1261584 1148760 347978
$$ packed form
36809a755054Q26665J055477P85458J78573j58009j42920l16563q03022j016650
36800a346045o85614l02468j62160J52432P84136J008409L77608l45973k99874
36791h19549J28823R0794j82492J48411Q67987Q59483j07734j015987j181126
36782a211390r73165o67509J21210J238073J452732J44392j373224j415286k51111
36773b935278M18350K0686k75319L39173J011290P06585j21024l66326m5337K250
36763a244950j79094L32325J480182J813588O17321p44075p03148K15005M12607
36754A999761o3417L37468J788706K329370P73603j310656j821476j045833p73709
36745B213817j355144j467982n14682N29972Q17617O41433L96553j12824q00782
$$ plain form
36736 347978 -571248 -775581 -226478 439964 903585 1267003 1359487 858387 128844 27910
36726 27910 657579 1110321 746974 3630 -433279 -577856 -784980 -984887 -864963 -508525
36716 -508525 -317087 -416501 -536640 -456497 -319542 -473548 -1042110 -1627857 -1575837 -742861
36706 -742861 170433 424835 212024 286950 739610 862729 360111 -92474 131878 667932
36696 667932 715752 56030 -955777 -1968686 -2711377 -2864954 -2393424 -1754891 -1358066
36687 -1358066 -1074814 -662303 -293865 -195026 -118064 253163 669790 684725 402464 241169
36677 241169 170638 -128003 -514274 -572196 -488977 -918148 -1836458 -2352009 -1981106 -1412116
36667 -1412116 -1498540 -1999603 -1926843 -924986 233451 574665 35144 -498973 -215848
$$ packed form
36736C47978r19226k04333N49103O66442M63621L63418R2484n01100p29543j00934
36726B7910O29669M52742l63347p43344m36909j44577k07124j99907J19924L56438
36716e08525J91438r9414j20139Q0143J36955j54006n68562n85747N2020Q32976
36706g42861R13294K54402k12811P4926M52660J23119n02618m52585K24352N36054
36696F67932M7820o59722j011807j012909p42691j53577M71530O38533L96825
36687a358066K83252M12511L68438R8839P6962L71227M16627J4935k82261j61295
36677B41169p0531k98641l86271n7922Q3219m29171r18310n15551L70903N68990
36667a412116q6424n01063P2760J001857J158437L41214n39521n34117K83125
$$ plain form
36658 -215848 677389 1231597 1005625 634220 804125 1093384 563862 -641512 -1210324
36649 -1210324 -409387 889648 1414136 1074408 718955 779724 912417 786148 512485
36640 512485 258338 -272 -207446 -140620 227552 571743 585719 342003 188682 402903
36630 402903 946495 1429894 1377204 734212 75807 60673 661311 1167368 990208 239784
36620 239784 -535329 -920734 -854861 -544322 -349814 -569192 -1122383 -1549837 -1472202 -949944
36610 -949944 -290711 297238 683053 699511 383809 150179 296269 452332 71906 -521973
36600 -521973 -292043 995010 2082116 1682186 180624 -867850 -678456 162108 924088
36591 924088 1573423 2141309 2187097 1462841 479716 -182966 -636849 -1172669 -1489924 -1167050
$$ packed form
36658b15848Q93237N54208k25972l71405J69905K89259n29522j205374n68812
36649a210324Q00937J299035N24488l39728l55453O0769J32693j26269k73663
36640E12485k54147k58610k07174O6826L68172L44191J3976k43716j53321K14221
36630D02903N43592M83399n2690o42992o58405j5134O00638N06057j77160p50424
36620B39784p75113l85405O5873L10539J94508k19378n53191m27454P7635N22258
36610i49944O59233N87949L85815J6458l15702k33630J46090J56063l80426n93879
36600e21973K29930J287053J087106l99930j501562j048474J89394Q40564P61980
36591I24088O49335N67886M5788p24256r83125o62682m53883n35820l17255L22874
$$ plain form
36581 -1167050 -537572 -285027 -363448 -154368 360615 438393 -286329 -1262709 -1853331 -2021711
36571 -2021711 -1903746 -1342520 -282093 843625 1532697 1693777 1428285 758006 -93297
36562 -93297 -570794 -372598 141181 495598 740465 1156001 1645350 1877988 1789008 1498734
36552 1498734 990904 342829 14397 330609 839818 802831 254601 -52808 207884 510502
36542 510502 361851 3265 -100949 16658 48651 23801 220104 598567 744319 411327
36532 411327 -139848 -430935 -249255 229068 709693 1046255 1182197 951252 217883 -676378
36522 -676378 -926369 -91544 1222889 1929716 1688391 1145542 911650 832386 537814 215253
36512 215253 316121 733782 837858 336826 -348422 -698021 -718593 -736534 -819560 -715819
$$ packed form
36581a167050O29478K52545p8421K09080N14983P7778p24722r76380n90622j68380
36571b021711J17965N61226J060427J125718O89072J61080k65492o70279q51303
36562i3297m77497J98196N13779L54417K44867M15536M89349K32638q8980k90274
36552A498734n07830o48075l28432L16212N09209l6987n48230l07409K60692L02618
36542E10502j48651l58586j04214J17607L1993k4850J96303L78463J45752l32992
36532D11327n51175k91087J81680M78323M80625L36562J35942k30945p33369q94261
36522f76378k49991Q34825J314433P06827k41325n42849k33892p9264k94572l22561
36512B15253J00868M17661J04076n01032o85248l49599k0572j7941q3026J03741
$$ plain form
36502 -715819 -315312 95279 135297 -243567 -747463 -1096184 -1264173 -1374245 -1493927 -1607008
36492 -1607008 -1675787 -1626585 -1362999 -917924 -500869 -231336 68554 548879 847887 331440
36482 331440 -996651 -2141372 -2037355 -744921 573779 888141 260306 -486446 -790726
36473 -790726 -797854 -878298 -1034360 -986882 -699342 -490257 -545726 -610358 -400506 -116259 -183294
36462 -183294 -561633 -727824 -425587 -50748 -101767 -563590 -1070416 -1398353 -1502398 -1286719
36452 -1286719 -681205 162291 1013583 1771160 2287181 2220292 1458844 538807 176419 429589
36442 429589 769902 948379 1238670 1717771 1885277 1312765 261320 -677380 -1230682
36433 -1230682 -1426215 -1253759 -748714 -211895 31111 -15335 -154743 -299360 -353667 -38302
$$ packed form
36502g15819M00507M10591M0018l78864n03896l48721j67989j10072j19682j13081
36492a607008o8779M9202K63586M45075M17055K69533K99890M80325K99008n16447
36482C31440j328091j144721J04017J292434J318700L14362o27835p46752l04280
36473g90726p128q0444j56062M7478K87540K09085n5469o4632K09852K84247o7035
36462a83294l78339j66191L02237L74839n1019m61823n06826l27937j04045K15679
36452a286719O05514Q43496Q51292P57577N16021o6889p61448r20037l62388K53170
36442D29589L40313J78477K90291M79101J67506n72512j051445r38700n53302
36433a230682j95533J72456N05045N36819K43006m6446j39408j44617n4307L15365
$$ plain form
36423 -38302 778595 1726971 2293568 2404031 2272047 1852899 974517 -36737 -430397 125945
36413 125945 1179232 2054570 2399390 2129971 1352799 534786 283478 658778 1036692
36404 1036692 891268 362312 -168574 -610221 -912239 -746783 -11797 635525 428747
36395 428747 -359420 -560513 402397 1655389 1850746 763330 -453002 -601234 231802
36386 231802 864527 451395 -570651 -1145183 -941738 -598293 -692029 -1058703 -1345497 -1663314
36376 -1663314 -2207951 -2625056 -2371568 -1583556 -1043153 -1264194 -2000118 -2655224 -2846111
36367 -2846111 -2591186 -2275529 -2375706 -2893635 -3166221 -2624487 -1626331 -1045523 -1084904 -1077782
36357 -1077782 -567519 -4384 -84664 -814320 -1551434 -1720815 -1242778 -462368 134809 263614
$$ packed form
36423c8302Q16897R48376N66597J10463j31984m19148q78382j011254l93660N56342
36413A25945J053287Q75338L44820k69419p77172q18013k51308L75300L77914
36404A036692j45424n28956n30886m41647l02018J65456P34986O47322k06778
36395D28747p88167k01093R62910J252992J95357j087416j216332j48232Q33036
36386B31802O32725m13132j022046n74532K03445L43445r3736l66674k86794l17817
36376a663314n44637m17105K53488P88012N40403k21041p35924o55106j90887
36367b846111K54925L15657j00177n17929k72586N41734R98156N80808l9381P122
36357a077782N10263N63135q0280p29656p37114j69381M78037P80410N97177J28805
$$ plain form
36347 263614 22739 -306051 -543467 -543964 -105000 643944 991150 398514 -583473 -870678
36337 -870678 -334352 83689 -92471 -167881 441856 1148413 1173885 880251 1157680 1906396
36327 1906396 2136616 1473432 680876 591589 1171713 1766481 1770967 993089 -202568 -1064862
36317 -1064862 -1142985 -790653 -663085 -858083 -977886 -872987 -782299 -803153 -757375 -579138
36307 -579138 -370047 -109872 244088 493378 533054 749469 1445012 2074354 1880485 1179868
36297 1179868 1021948 1509260 1586938 837146 309025 867984 1720258 1541625 385028
36288 385028 -561568 -695092 -486860 -473658 -656333 -841382 -851024 -445486 331935 842027
36278 842027 526629 -214519 -492769 -172992 66711 -156004 -542753 -848343 -1170513 -1383002
$$ packed form
36347B63614k40875l28790k37416m97M38964P48944L47206n92636r81987k87205
36337h70678N36326M18041j76160p5410O09737P06557K5472k93634K77429P48716
36327A906396K30220o63184p92556q9287N80124N94768M486p77878j195657q62294
36317a064862p8123L52332J27568j94998j19803J04899R0688k0854M5778J78237
36307e79138K09091K60175L53960K49290L9676K16415O95543O29342j93869p00617
36297A179868j57920M87312P7678p49792n28121N58959Q52274j78633j156597
36288C85028r46596j33524K08232J3202j82675j85049r642M05538P77421N10092
36278H42027l15398p41148k78250L19777K39703k22715l86749l05590l22170k12489
$$ plain form
36268 -1383002 -1108690 -477230 -92357 30285 605994 1732729 2322858 1576932 256504
36259 256504 -340430 -38688 489473 1062828 1883255 2429938 1826265 418386 -281584
36250 -281584 337372 1045728 529238 -805052 -1582548 -1360993 -853240 -636523 -594837 -562666
36240 -562666 -670009 -894134 -902793 -564212 -167386 34170 121557 225186 309200 385580
36230 385580 609584 1010734 1408139 1673707 1752958 1389599 321875 -1062913 -1811688
36221 -1811688 -1522084 -916906 -819641 -977950 -583076 307607 737096 317863 -104520 324512
36211 324512 1197222 1406351 645888 -308184 -739689 -789117 -955137 -1321088 -1633029 -1820660
36201 -1820660 -1987174 -2003966 -1585814 -832254 -274030 -188668 -233416 -50451 102441 -213005
$$ packed form
36268a383002K74312O31460L84873J22642N75709J126735N90129p45926j320428
36259B56504n96934L01742N28161N73355Q20427N46683o03673j407879o99970
36250b81584O18956P08356n16490j334290p77496K21555N07753K16717M1686L2171
36240e62666j07343k24125q659L38581L96826K01556Q7387J03629Q4014P6380
36230C85580K24004M01150L97405K65568P9251l63359j067724j384788p48775
36221a811688K89604O05178R7265j58309L94874Q90683M29489m19233m22383M29032
36211C24512Q72710K09129p60463r54072m31505m9428j66020l65951l11941j87631
36201a820660j66514j6792M18152P53560N58224Q5362m4748J82965J52892l15446
$$ plain form
36191 -213005 -765396 -844166 -318026 105157 -105843 -574757 -686024 -549601 -766732 -1455790
36181 -1455790 -2055949 -2068323 -1548022 -827686 -149436 321397 449683 290031 109913 93590
36171 93590 108455 -136109 -720129 -1323669 -1429787 -825106 81190 630116 691357 804117
36161 804117 1336210 1801350 1420793 230011 -824028 -929720 -209223 610794 1041028
36152 1041028 1195430 1454903 1884690 2045137 1521197 623744 212094 640380 1275127
36143 1275127 1373657 1001232 594290 87783 -757602 -1472883 -1292900 -435937 -24144 -543238
36133 -543238 -1250033 -1382320 -1085165 -730823 -184291 648250 1265031 1272684 1087806 1239004
36123 1239004 1463752 1224078 666745 273661 -55195 -675167 -1220263 -939754 35171
$$ packed form
36191b13005n52391p8770N26140M23183k11000m68914j11267J36423k17131o89058
36181a455790o00159j2374N20301P20336O78250M70833J28286j59652j80118j6323
36171I3590J4865k44564n84020o03540j06118O04681R06296N48926O1241J12760
36161H04117N32093M65140l80557j190782j054039j05692P20497Q20017M30234
36152A041028J54402K59473M29787J60447n23940q97453m11650M28286O34747
36143A275127R8530l72425m06942n06507q45385p15281J79983Q56963M11793n19094
36133e43238p06795j32287K97155L54342N46532Q32541O16781P653j84878J51198
36123A239004K24748k39674n57333l93084l28856o19972n45096K80509R74925
$$ plain form
36114 35171 709958 629174 380669 461494 486539 -30527 -778750 -1089334 -847466 -468117
36104 -468117 -272071 -335546 -702608 -1267409 -1584382 -1271525 -616369 -386220 -903314 -1573662
36094 -1573662 -1523642 -578180 565802 1086577 779968 40465 -671532 -1139834 -1284974
36085 -1284974 -1056794 -530487 71156 542127 760691 601231 7470 -798009 -1418390
36076 -1418390 -1662209 -1586571 -1181339 -407633 395738 669283 410274 260313 517456 665836
36066 665836 355755 200858 849613 1772062 1930941 1398403 1258507 1899697 2440898 2123439
36056 2123439 1372333 1024409 1203840 1480741 1620290 1645886 1522808 1267346 1146990 1389671
36046 1389671 1848777 2216593 2394582 2447136 2386903 2200579 1920935 1548172 1078559 658095
$$ packed form
36114C5171O74787q0784k48505Q0825K5045n17066p48223l10584K41868L79349
36104d68117J96046o3475l67062n64801l16973L12857O55156K30149n17094o70348
36094a573662N0020R45462J143982N20775l06609p39503p11997m68302j45140
36085a284974K28180N26307O01643M70971K18564j59460n93761q05479o20381
36076a418390k43819P5638M05232P73706Q03371K73545k59009j49961K57143J48380
36066F65836l10081j54897O48755R22449J58879n32538j39896O41190N41201l17459
36056B123439p51106l47924J79431K76901J39549K5596j23078k55462j20356K42681
36046A389671M59106L67816J77989N2554o0233j86324k79644l72763m69613m20464
$$ plain form
36036 658095 456887 369831 166242 -42975 104032 594910 967227 987333 929831 1013324
36026 1013324 1080547 1087518 1354274 1942251 2280206 1906655 1216120 954829 1242564 1585683
36016 1585683 1647284 1498701 1215514 702930 -33290 -737387 -1076857 -872951 -280083 185347
36006 185347 32948 -647803 -1266022 -1461037 -1425279 -1391930 -1253301 -915007 -583532 -427981
35996 -427981 -379396 -480795 -878754 -1206847 -718249 490220 1177364 594478 -310113 -217270
35986 -217270 706512 1369716 1570453 1864793 1979660 1022766 -584077 -1042003 307566
35977 307566 1748708 1372117 -507734 -2054532 -2230560 -1402536 -223681 949400 1715156
35968 1715156 1705311 1149424 752951 889186 1271826 1399628 1022012 289340 -261489 -66857
$$ packed form
36036F58095k01208q7056k03589k09217J47007M90878L72317K0106n7502Q3493
36026A013324O7223O971K66756N87977L37955l73551o90535k61291K87735L43119
36016A585683O1601j48583k83187n12584p36220p04097l39470K03906N92868M65430
36006A85347j52399o80751o18219j95015L5758L3349J38629L38294L31475J55551
35996d27981M8585j01399l97959l28093M88598J208469O87144n82886r04591R2843
35986b17270R23782O63204K00737K94340J14867r56894j606843m57926J349569
35977C07566J441142l76591j879851j546798j76028Q28024J178855J173081P65756
35968A715156r845n55887l96473J36235L82640J27802l77616p32672n50829J94632
$$ plain form
35958 -66857 788915 1482747 1389150 851025 624078 861394 1162609 1337672 1446535 1241574
35948 1241574 361600 -836299 -1370446 -818255 174483 838714 1156317 1399043 1346283
35939 1346283 598133 -587022 -1394019 -1377593 -845913 -336777 -134674 -314147 -784924
35930 -784924 -1151399 -960810 -321122 119010 93912 202028 993939 1935699 1983589 1089288
35920 1089288 355353 530023 1085218 1169492 826471 690278 944694 1247748 1381263 1312850
35910 1312850 852490 -40639 -774465 -731876 -308123 -488896 -1299465 -1590345 -702156 509622
35900 509622 864945 400895 66310 347883 868392 1071190 741275 55232 -444736 -189525
35890 -189525 684571 1266142 980853 379954 258100 415371 85227 -679480 -981652 -448047
$$ packed form
35958f6857Q55772O93832r3597n38125k26947K37316L01215J75063J08863k04961
35948A241574q79974j197899n34147N52191R92738O64231L17603K42726n2760
35939A346283p48150j185155q06997J6426N31680N09136K02103j79473m70777
35930g84924l66475J90589O39688M40132k5098J08116P91911R41760M7890q94301
35920A089288p33935J74670N55195Q4274l43021j36193K54416L03054J33515o8413
35910A312850m60360q93129p33826M2589M23753j80773q10569k90880Q88189J211778
35900E09622L55323m64050l34585K81573N20509K02798l29915o86043m99968K55211
35890a89525Q74096N81571k85289o00899j21854J57271l30144p64707l02172N33605
$$ plain form
35880 -448047 246209 432976 324109 528560 1219676 2049400 2489802 2111235 950749
$$ packed form
35880d48047O94256J86767j08867K04451O91116Q29724M40402l78567j160486
$$ [...]
##END NTUPLES=NMR SPECTRUM
##END=
