##TITLE=31Pdec_LR-669-K1
 CDCl3, 124 sc
 10.4.2019
##JCAMPDX= 6.0         $$ Bruker NMR JCAMP-DX V2.0
##DATA TYPE= NMR SPECTRUM
##DATA CLASS= NTUPLES
##ORIGIN= UXNMR, Bruker Analytische Messtechnik GmbH
##OWNER= root
$$ XWIN-NMR		Version 3.5
$$ Wed Apr 10 15:29:51 2019 Russian Standard Time (UT+4h)  she@DPX200
##.OBSERVE FREQUENCY= 81.013821
##.OBSERVE NUCLEUS= ^31P
##.ACQUISITION MODE= SIMULTANEOUS
##.ACQUISITION SCHEME= undefined
##.AVERAGES= 124
##.DIGITISER RES= 17
##SPECTROMETER/DATA SYSTEM= spect
##.PULSE SEQUENCE= zgpg30
##.SOLVENT NAME= CDCl3
##.SHIFT REFERENCE= (INTERNAL, CDCl3, 0, 182.463)
##AUDIT TRAIL= $$ (NUMBER, WHEN, WHO, WHERE, WHAT)
$$ ##TITLE= Audit trail, XWIN-NMR		Version 3.5
$$ ##JCAMPDX= 5.01
$$ ##ORIGIN= Bruker BioSpin GmbH
$$ ##OWNER= she
$$ F:/spectra/data/she/nmr/P31/1/pdata/1/auditp.txt
$$ ##AUDIT TRAIL=  $$ (NUMBER, WHEN, WHO, WHERE, WHAT)
(   1,<2019-04-10 14:59:29.60 +0400>,<she>,<DPX200>,
      <continue with go, POWCHK disabled, PULCHK disabled
       configuration hash MD5:
       00 E9 B6 7A A2 85 ED C7 34 08 36 98 17 FE 4E 26
       data hash MD5: 32K
       66 09 84 E3 B2 E1 C1 1E 80 B1 76 E2 5D 23 DC 64>)
(   2,<2019-04-10 15:29:01.12 +0400>,<she>,<DPX200>,
      <Start of raw data processing
       efp BC_mod = 2 LB = 1 FT_mod = 6 PKNL = 1 PHC0 = -1814.541 PHC1 = 71.19899 SI = 64K 
       data hash MD5: 64K
       52 76 3F 64 54 CF C5 67 08 F2 12 E8 73 4A EF FB>)
(   3,<2019-04-10 15:29:07.00 +0400>,<she>,<DPX200>,
      <abs ABSG = 5 
       data hash MD5: 64K
       13 E8 15 C6 20 22 F5 EB 5B 41 C2 60 95 46 32 21>)
(   4,<2019-04-10 15:29:19.96 +0400>,<she>,<DPX200>,
      <pk PHC0 = -62.75594 PHC1 = 0 
       data hash MD5: 64K
       80 70 15 52 67 21 48 88 28 8F 26 84 64 A1 95 B3>)
(   5,<2019-04-10 15:29:25.90 +0400>,<she>,<DPX200>,
      <abs ABSG = 5 
       data hash MD5: 64K
       3B 40 52 5A FE 21 3C 1C 4D A1 0B 49 C0 86 FF D4>)
$$ ##END=
$$ 
$$ hash MD5
$$ 36 C0 B2 09 4A 17 76 9D DC 22 2C F5 98 9C 3B 87
##$RELAX= 
##$RELAX= 
##$RELAX= 
##$RELAX= 
##$RELAX= 
##$RELAX= 
##$RELAX= 
##$RELAX= 
$$ Bruker specific parameters
$$ --------------------------
##$DU= <F:/spectra>
##$EXPNO= 1
##$NAME= <P31>
##$PROCNO= 1
##$TYPE= <nmr>
##$USER= <she>
##$AMP= (0..31)
100 100 100 100 100 100 100 100 100 100 100 100 100 100 100 100 100 100 
100 100 100 100 100 100 100 100 100 100 100 100 100 100 
##$AQSEQ= 0
##$AQ_mod= 1
##$AUNM= <au_zg>
##$AUTOPOS= <>
##$BF1= 81.014009
##$BF2= 200.13
##$BF3= 200.13
##$BF4= 200.13
##$BF5= 200.13
##$BF6= 200.13
##$BF7= 200.13
##$BF8= 200.13
##$BYTORDA= 1
##$CFDGTYP= 0
##$CFRGTYP= 5
##$CHEMSTR= <none>
##$CNST= (0..31)
1 1 145 1 1 1 1 1 1 1 1 1 1 1 1 1 1 1 1 1 1 1 1 1 1 1 1 1 1 1 1 1 
##$CPDPRG= <waltz16>
##$CPDPRG1= <>
##$CPDPRG2= <waltz16>
##$CPDPRG3= <>
##$CPDPRG4= <mlev>
##$CPDPRG5= <mlev>
##$CPDPRG6= <mlev>
##$CPDPRG7= <mlev>
##$CPDPRG8= <mlev>
##$CPDPRGB= <>
##$CPDPRGT= <>
##$D= (0..31)
0 1 0 0 0 0 0 0 0 0 0 0.03 2e-05 3e-06 0 0 0 0 0 0 0 0 0 0 0 0 0 0 0 0 
0 0 
$$ [...]
##$SUBNAM3= <"">
##$SUBNAM4= <"">
##$SUBNAM5= <"">
##$SUBNAM6= <"">
##$SUBNAM7= <"">
##$SUBNAM8= <"">
##$SUBNAM9= <"">
##$SW= 369.568048894756
##$SWIBOX= (0..15)
0 1 3 0 0 0 0 0 0 0 0 0 0 0 0 0 
##$SW_h= 29940.119760479
##$TD= 32768
##$TD0= 1
##$TE= 0
##$TE2= 300
##$TE3= 300
##$TEG= 300
##$TL= (0..7)
0 120 53 12 22 120 120 120 
##$TP= (0..7)
150 150 150 150 150 150 150 150 
##$TP07= 0
##$TPNAME0= <>
##$TPNAME1= <>
##$TPNAME2= <>
##$TPNAME3= <>
##$TPNAME4= <>
##$TPNAME5= <>
##$TPNAME6= <>
##$TPNAME7= <>
##$TPOAL= (0..7)
0.5 0.5 0.5 0.5 0.5 0.5 0.5 0.5 
##$TPOFFS= (0..7)
0 0 0 0 0 0 0 0 
##$TUNHIN= 0
##$TUNHOUT= 0
##$TUNXOUT= 0
##$USERA1= <user>
##$USERA2= <user>
##$USERA3= <user>
##$USERA4= <user>
##$USERA5= <user>
##$V9= 5
##$VALIST= <valist>
##$VCLIST= <CCCCCCCCCCCCCCC>
##$VD= 0
##$VDLIST= <DDDDDDDDDDDDDDD>
##$VPLIST= <PPPPPPPPPPPPPPP>
##$VTLIST= <TTTTTTTTTTTTTTT>
##$WBST= 1024
##$WBSW= 4
##$XGAIN= (0..3)
0 0 0 0 
##$XL= 0
##$YL= 0
##$YMAX_a= 8474
##$YMIN_a= -17672
##$ZGOPTNS= <>
##$ZL1= 120
##$ZL2= 120
##$ZL3= 120
##$ZL4= 120
##$ABSF1= 182.463
##$ABSF2= -187.1042
##$ABSG= 5
##$ABSL= 3
##$ALPHA= 0
##$AQORDER= 0
##$ASSFAC= 0
##$ASSFACI= 0
##$ASSFACX= 0
##$ASSWID= 0
##$AUNMP= <proc_1d>
##$AZFE= 0.1
##$AZFW= 0.5
##$BCFW= 0
##$BC_mod= 2
##$BYTORDP= 0
##$COROFFS= 0
##$CY= -3
##$DATMOD= 1
##$DC= 0
##$DFILT= <>
##$DTYPP= 0
##$F1P= 0
##$F2P= 0
##$FCOR= 1
##$FTSIZE= 65536
##$FT_mod= 6
##$GAMMA= 0
##$GB= 0
##$INTBC= 1
##$INTSCL= 5.30512e-09
##$ISEN= 30
##$LB= 1
##$LEV0= 0
##$LPBIN= 0
##$MAXI= 10000
##$MC2= 0
##$MEAN= 0
##$ME_mod= 0
##$MI= 50
##$NCOEF= 0
##$NC_proc= -9
##$NLEV= 6
##$NOISF1= 182.463
##$NOISF2= 159.3651
##$NSP= 0
##$NTH_PI= 0
##$NZP= 0
##$OFFSET= 182.463
##$PC= 4
##$PHC0= -1877.297
##$PHC1= 71.19899
##$PH_mod= 1
##$PKNL= yes
##$PPARMOD= 0
##$PSCAL= 0
##$PSIGN= 0
##$REVERSE= no
##$SF= 81.0140089999434
##$SI= 65536
##$SIGF1= 159.3651
##$SIGF2= -187.1042
##$SINO= 113.3802
##$SIOLD= 16384
##$SREGLST= <1H.CDCl3>
##$SSB= 0
##$STSI= 65536
##$STSR= 0
##$SW_p= 29940.119760479
##$SYMM= 0
##$S_DEV= 0
##$TDeff= 32768
##$TDoff= 0
##$TI= <>
##$TILT= no
##$TM1= 0
##$TM2= 0
##$TOPLEV= 0
##$USERP1= <user>
##$USERP2= <user>
##$USERP3= <user>
##$USERP4= <user>
##$USERP5= <user>
##$WDW= 1
##$XDIM= 65536
##$YMAX_p= 522229132
##$YMIN_p= -164695452
$$ End of Bruker specific parameters
$$ ---------------------------------
##NTUPLES= NMR SPECTRUM
##VAR_NAME=  FREQUENCY,     SPECTRUM/REAL,   SPECTRUM/IMAG
##SYMBOL=    X,             R,               I
##VAR_TYPE=  INDEPENDENT,   DEPENDENT,       DEPENDENT
##VAR_FORM=  AFFN,          ASDF,            ASDF
##VAR_DIM=   65536,         65536,           65536
##UNITS=     HZ,            ARBITRARY UNITS, ARBITRARY UNITS
##FACTOR=    0.456856943014862, 1,           1
##FIRST=     14782.0589164792, 0,            0
##LAST=      -15158.0608439998, 0,           0
##MIN=       -15158.0608439998, -164695452,  0
##MAX=       14782.0589164792, 522229132,    0
$$ Real data points
##PAGE= N=1
##DATA TABLE= (X++(R..R)), XYDATA
$$ [...]
5903 -51630114 -43246957 -29075735 -33153041 -42798265 -31689332 2449604 37995694 54727206
5895 54727206 48253404 30284346 21652348 32566513 45192534 32717794 1088235
5888 1088235 -10802786 15806410 50258227 55050747 35735720 23248673 24609891 22508145
5880 22508145 13408590 12504768 23202063 32986980 41157119 60516996 87082375 98380747
5872 98380747 89879375 82505004 82005751 63277220 15421451 -27451404 -29301621 -4385811
5864 -4385811 4896052 -13479531 -37987372 -57526584 -80777624 -103068483 -101316255 -71689844
5856 -71689844 -43018843 -39521304 -52284372 -59169366 -52029532 -31787446 2434072 41987528
5848 41987528 63037943 52081037 27339373 17006878 22962836 22937247 5128030 -15538840
5840 -15538840 -17507360 1874786 24539477 30759178 18266669 3064375 695467 10007809
5832 10007809 20310852 28319063 36037717 37106817 23908580 7386720 7175186 18267903
5824 18267903 13541475 -11064143 -23045214 -3347636 18455067 6839151 -24667236
5817 -24667236 -35561566 -19861701 -7319936 -11009802 -13731928 -7251223 -5872457 -12687386
5809 -12687386 -8571027 10674308 18388376 -1985611 -26584274 -25060457 -4593178 5185709
5801 5185709 -2369143 -6651380 3775988 12993890 -494725 -36483033 -72131706 -84626395
5793 -84626395 -74294610 -63838785 -70290771 -82699540 -78910859 -59135245 -43795024
5786 -43795024 -39167456 -29450500 -8572489 5718385 1425333 -7889499 -8404797 -8623428
5778 -8623428 -17933307 -23997498 -13794960 2357962 12771956 30973365 69227487 101049613
5770 101049613 87907527 37576598 -1446101 -4725718 4600228 2796975 31963 13043079
5762 13043079 33223539 42848520 43091941 46260688 54120370 60360600 62987217 60022440
5754 60022440 44036529 15586447 -6804469 -4746117 16562409 33367133 27660390
5747 27660390 348205 -31743174 -44996159 -25113438 16105270 48033067 53757905
5740 53757905 46145446 43148396 41149654 28917028 16235205 24256600 48339131 54460496
5732 54460496 21918814 -26992501 -52990958 -45521983 -27759598 -19491069 -11347686 16681611
5724 16681611 60782409 90975130 84724553 52650682 24448316 16362133 21538427 27424938
5716 27424938 29925981 29859148 27290165 23554764 20488196 14644383 958256 -15039341
5708 -15039341 -18973030 -6516756 9303777 15490327 13791750 11571373 9401672 7202341
5700 7202341 11237748 21616201 22080684 -1197290 -35683141 -54126448 -47847314 -31459927
5692 -31459927 -15016658 8496836 41433085 65310899 59858107 28784088 -5345880
5685 -5345880 -26059378 -32565680 -29525131 -19171224 -3490508 14411508 32126884 45639511
5677 45639511 47232866 34143827 18656186 18352341 32503264 39496004 26061869 8359741
5669 8359741 9471504 23094434 21116962 -927114 -10620435 15238625 52015377 58604584
5661 58604584 35220497 20445589 33141969 49354316 45736497 35408696 39904687
5654 39904687 47538023 27941745 -20263986 -61359151 -62334964 -24378815 24400381 53569588
5646 53569588 49777705 25937429 10484318 16090253 22592071 3452008 -36619947 -66292422
5638 -66292422 -64321474 -33645385 13922134 61577982 79263678 44169554 -22019104
5631 -22019104 -65668511 -64260226 -50028269 -55846964 -68563607 -61068550 -41547019 -34267696
5623 -34267696 -31677995 -9460521 19459665 13064078 -33029167 -71174596 -68777760 -49881074
5615 -49881074 -46348074 -43425608 -10109407 38883625 54126957 20418011 -21187837
5608 -21187837 -26821409 793181 26000478 24126544 657068 -21345740 -24180926 -13257757
5600 -13257757 -14846885 -46374887 -87919326 -97789616 -61488803 -9841726 20196255
5593 20196255 26460028 28373709 27587189 7386351 -29995943 -51440050 -31238571 13477334
5585 13477334 41987470 38785750 26809585 30710685 42962108 37933327 11244349 -11906809
5577 -11906809 -10561750 4375126 6841307 -9242097 -26083630 -29774615 -25744373 -24577950
5569 -24577950 -28378985 -37562697 -55906205 -78167306 -86330680 -72693309 -55308471 -52782793
5561 -52782793 -53695572 -34402612 -1423285 14020398 7679071 15281345 55936999 90919514
5553 90919514 69904111 3433288 -45419574 -39529644 -5458070 13028895 7361993
5546 7361993 -6636898 -25210145 -54035388 -82131439 -88468405 -73778273 -60391782
5539 -60391782 -56429299 -44445727 -15581911 8211812 4164845 -16799968 -28762800
5532 -28762800 -31521235 -43826341 -61273263 -55546911 -22885886 963690 -6593957 -17315613
5524 -17315613 2806974 32732768 20606652 -38455139 -89678714 -89098955 -50712980
5517 -50712980 -11931191 13356319 27729344 27660707 16652531 18461493 45231312 67794482
5509 67794482 51659675 12904457 862785 26164210 44679491 23358737 -12570032
5502 -12570032 -18398838 9160721 34423201 31385561 6443137 -20342837 -35621640
5495 -35621640 -34732177 -19014241 4105556 23991350 31390349 21648944 960195 -10421008
5487 -10421008 4703525 33977346 41970613 15411181 -13119690 -5340396 29611586
5480 29611586 45342418 17883933 -28020217 -54391801 -49935431 -27812728 -4002184
5473 -4002184 8885561 502018 -27851044 -57410739 -67124507 -53391653 -29469163 -10019939
5465 -10019939 -1912826 -4726827 -12762675 -18712707 -19309599 -14459314 -1147399 21951471
5457 21951471 41501176 36529279 8510399 -10962306 -218679 17101781 1860151
5450 1860151 -40528859 -60596701 -32177955 10208049 18970226 -5038181 -23834210
5443 -23834210 -19492829 -8994314 -6122730 -41192 19986703 42557055 50054519 40436402
5435 40436402 21218017 -3409500 -25770505 -29023293 -7011231 18281065 18706149 -3620985
5427 -3620985 -20115336 -14797788 378024 12431047 27771958 53726668 76717883
5420 76717883 76909344 56178768 34613649 23978283 21382321 26088725 41739464 57901892
5412 57901892 51071981 17536499 -11276316 -5724218 19841997 25151714 1220327 -17108127
5404 -17108127 -2417119 27723139 41407269 38790307 41366038 47825930 33624874 -4958015
5396 -4958015 -37655405 -41780740 -31691497 -31591369 -40578445 -44905981 -47993812 -62804527
5388 -62804527 -82587241 -84543781 -62417529 -35249045 -21478613 -20387490 -20908797 -14253899
5380 -14253899 3155427 24704397 31241705 10199366 -21153721 -29388792 -6432686
5373 -6432686 20019403 23929619 11017890 2419173 5674378 14691700 23726619 26548008
5365 26548008 13641088 -13790134 -35656397 -33926811 -15190479 625654 6087349
5358 6087349 6992332 6692089 7540758 20649975 52507046 83937010 84866838 53801355
5350 53801355 22790910 16348323 23170030 18314460 -2106600 -21879951 -30130295 -31497828
5342 -31497828 -34799694 -42247176 -48738882 -45541940 -27187860 206423 21090722 26009725
5334 26009725 20774378 14748080 5597324 -15468299 -46345180 -72252582 -82129399 -78339992
5326 -78339992 -68485128 -56720472 -47385941 -47610565 -56859422 -59883823 -42882379 -16402291
5318 -16402291 -9363009 -35676885 -77131703 -105326301 -109755783 -95531125 -66388337
5311 -66388337 -27421155 3047331 7230530 -5109506 -4673031 16401112 32004966 20677278
5303 20677278 -3137053 -12344965 -5097344 1074830 1374307 6497741 18187896 24905216
5295 24905216 22795843 21645447 26637900 30437562 27407559 21500130 15974132 8275652
5287 8275652 -954084 -6538400 -11025153 -25986385 -54818695 -83932783 -96894547 -90359148
5279 -90359148 -73804059 -62095284 -68851654 -94739733 -118622981 -112503713 -71761995
5272 -71761995 -22355209 5694195 3819356 -16285916 -36459462 -41641614 -29212638
5265 -29212638 -14210706 -13938622 -24239440 -24705553 -10325656 -27208 -6457077 -15573493
5257 -15573493 -7930124 14778844 35625184 40356716 19804087 -26772393 -76693858
5250 -76693858 -91864390 -61119950 -18119601 2912664 11102500 33770935 65749519
5243 65749519 77732898 64924992 50732525 44860099 34061270 16901301 11279563
5236 11279563 19279559 19335638 5554326 827481 14364429 20549319 3878419 -7199882
5228 -7199882 16103333 50627882 51444072 19039328 -4762314 -2245930 531805 -15310140
5220 -15310140 -29091874 -15269795 17352132 40638373 43024023 32780143 18820168
5213 18820168 4576979 -7777294 -19732190 -35498506 -49554795 -45962582 -21225978
5206 -21225978 3658195 7970011 -2429702 -9909718 -15794136 -33805558 -57535902 -60773415
5198 -60773415 -35335417 -5994754 2113958 -7767870 -19208669 -27945333 -35511397 -33204067
5190 -33204067 -14948571 1847994 -8174500 -42902316 -73317816 -80775894 -73738098
5183 -73738098 -64012190 -48766031 -26821313 -12929818 -18614421 -31705898 -33121580 -25639048
5175 -25639048 -27333559 -40779281 -47781589 -35489495 -11575404 9211938 19122004 14554700
5167 14554700 -5788822 -32511099 -47740139 -45235781 -38867595 -41588277 -45267522 -34356190
5159 -34356190 -13475060 -5204349 -19218268 -37458918 -36459829 -15796078 3541313 5255797
5151 5255797 -4684232 -6446575 11533730 39860230 56977482 50784800 30187660 12887194
5143 12887194 4214363 -5310948 -21344378 -34392824 -33115046 -21433537 -13274636 -14663214
5135 -14663214 -20756540 -27429481 -34309403 -37304023 -30597063 -17653468 -8690803 -6007236
5127 -6007236 -4744596 -8287121 -24144826 -40943877 -34046176 -5782244 6669000 -15142883
5119 -15142883 -35395440 -14073432 28243808 38045372 10518009 -5583632 13149572
5112 13149572 31876237 19385358 -4075254 -7645687 943770 -138211 -6065745 -6260385
5104 -6260385 -18728246 -61235667 -106892582 -112330698 -80366783 -53928003 -53310998 -58224940
5096 -58224940 -49337892 -30044324 -6851185 16929184 28261431 19453943 13020099 32675257
5088 32675257 53175066 27273504 -33535117 -59901272 -22285831 26850700 35536132
5081 35536132 24225680 35614410 58412064 53179921 23440182 6252586 8884025
5074 8884025 5738381 -10745359 -23021616 -27823654 -38848108 -51091392 -44253671 -23766614
5066 -23766614 -17786338 -27826605 -22488635 9174685 36101273 32646469 13937809 5086919
5058 5086919 4817206 1887531 2997109 18795831 38049385 39113026 18661832 -6917692
5050 -6917692 -20785892 -15961098 2248166 15038546 5209517 -17593135 -23199512 -2041046
5042 -2041046 20552427 24339192 23631133 34499149 36418552 394497 -58518652 -94704305
5034 -94704305 -94123732 -84761153 -80705597 -56189395 5034416 66778811 78436350 40634868
5026 40634868 2912196 805842 22207655 38622817 44490394 52088812 63160000 64240098
5018 64240098 47739371 24415315 11694752 16355887 31261762 43687712 43000350 24240984
5010 24240984 -8980145 -43337457 -61671854 -55251364 -32073907 -10760584 -3125146
5003 -3125146 -3330828 2284231 15443706 23248071 18821860 15930569 32094833 60953474
4995 60953474 75434651 60584995 30119053 4957402 -11274952 -24955703 -32132679
4988 -32132679 -21996923 2126829 19906488 15346095 -6722406 -26817832 -28214074
4981 -28214074 -9564524 13899663 23472643 16448917 8933524 13735725 22289589 18403925
4973 18403925 3685381 -4696724 802849 9587711 10476821 5169080 2192612 7839111
4965 7839111 23495904 41403111 44777416 25996965 3573027 3670803 22680097 27760107
4957 27760107 1848601 -30611884 -34968796 -8986374 18964009 23709564 3457998
4950 3457998 -24463196 -36802667 -21321713 9589922 29240407 26545615 14608424
4943 14608424 4670450 -9434364 -28673646 -32547714 -8096777 21695983 27178965 18721064
4935 18721064 30944662 64124514 78301516 52881568 16612380 1445368 -2252236
4928 -2252236 -19049201 -41406818 -42446000 -23030663 -10929991 -14555013 -11115765 11049472
4920 11049472 28425613 17786374 -7079881 -16687703 -8889292 -5766259 -16429516 -29580740
4912 -29580740 -39521830 -49907006 -48381520 -10854034 53525561 92075327 69601777
4905 69601777 17707048 -7646739 -777816 -1456109 -25722442 -46121548 -44445820 -39600438
4897 -39600438 -46621984 -47036032 -24849040 15038 3612938 -3143374 -200073 -247057
4889 -247057 -25772992 -58667859 -56016862 -13882820 24644839 30280946 20772808 23682438
4881 23682438 39185703 56027282 76284593 101801935 114424139 93110947 43138415
4874 43138415 -7918694 -38649387 -48010912 -47192534 -46722985 -48116808 -43582525 -28442605
4866 -28442605 -13841067 -17128244 -38315220 -58309871 -63015073 -55341875 -40133075 -14679005
4858 -14679005 17349439 39156749 40700073 32818191 29067620 25077822 10146721 -10096034
4850 -10096034 -18541179 -9216724 8770496 26928940 44422855 59821418 66082000 56918347
4842 56918347 35341225 15578879 13737040 29510341 39925348 24411458 -4384117
4835 -4384117 -13315322 3990827 16013910 1016232 -19126208 -13529834 11335661 28336267
4827 28336267 35674642 50716098 66536574 54848037 15659702 -14012897 -13181005 -4873257
4819 -4873257 -13371315 -24820446 -16750678 -1968946 -8805172 -30388369 -29244145 7939136
4811 7939136 50428855 64646028 50814262 29210613 11513337 213688 34179 11153428
4803 11153428 18995723 8417098 -13788170 -24892523 -15525224 -634412 1670339 -8962026
4795 -8962026 -21158832 -29651495 -37674711 -45323116 -45156778 -31871447 -12053780 -1166753
4787 -1166753 -10098339 -33596407 -52132071 -48347214 -24033587 593083 6180750 -7765498
4779 -7765498 -23660389 -22553726 -1767777 19750905 15711325 -20073715 -60380157 -68189700
4771 -68189700 -36009977 7862967 33810735 37293881 25919177 -217815 -39429044
4764 -39429044 -74094451 -85761419 -77232640 -62945122 -46950924 -29041435 -20206873
4757 -20206873 -25868002 -23530293 10457684 56143365 68077662 39719707 11321998
4750 11321998 6947544 6102002 -7008586 -11282878 7100612 19948334 3375919 -16295856
4742 -16295856 -6298221 12708520 1526495 -24409241 -14959449 30296152 57381549
4735 57381549 41921213 21056170 26886009 40327728 35577117 25619941 31661797 41749693
4727 41749693 34006848 16184041 9849132 14529211 17757165 23705117 39841127 47337535
4719 47337535 18996485 -35970886 -74834408 -72742761 -48569882 -34134436 -36213969
4712 -36213969 -37509663 -22909936 5153391 33250121 51325943 57300545 48893132 20154730
4704 20154730 -24176883 -58164727 -56914185 -29138631 -7534743 -4216835 6680 14761117
4696 14761117 18516567 -2999425 -24151064 -15057852 8402554 5335532 -27087024 -46884206
4688 -46884206 -27192950 6992294 13115873 -18405214 -60042854 -80529728 -72092563
4681 -72092563 -51659805 -41627119 -46743550 -50440929 -37556838 -14518903 1730008
4674 1730008 7972958 14556696 25040158 31032102 27250541 18595479 10797326 4815008
4666 4815008 1574786 2495250 3911321 -1367287 -16103389 -36325687 -53334511 -54660836
4658 -54660836 -33215792 -4123763 124477 -32877799 -71879281 -74701092 -39604576
4651 -39604576 -4803660 892256 -13008961 -20574926 -11386967 5845707 18877424 24327433
4643 24327433 29818318 44468160 64559315 75554662 73098853 68946951 66881828 51385736
4635 51385736 17987566 -4844100 8413185 37024551 38539059 7170701 -26093535
4628 -26093535 -44545124 -58927337 -71636332 -68304800 -50195418 -37186579 -31794836
4621 -31794836 -17907796 -1992945 -12957308 -48792610 -68348196 -55423789 -46255450
4614 -46255450 -67387533 -89776238 -78005529 -46162300 -26777315 -18321504 -3993168
4607 -3993168 8256033 7539154 13416365 41106610 58957767 31401488 -16812642 -33759987
4599 -33759987 -21188390 -23620376 -47204523 -53354672 -33761134 -27263236 -49992283 -68442367
4591 -68442367 -61229327 -52045028 -55730992 -43588682 3646446 51449147 58032158 32067246
4583 32067246 8062224 -6627321 -22939397 -32730213 -20434903 1912730 6687533
4576 6687533 -9754366 -26164612 -26241479 -7353754 27261297 61488777 66425780 34551112
4568 34551112 1030694 2362002 25008502 26162354 -3405726 -32411839 -41873044 -46612750
4560 -46612750 -56075717 -48872157 -6771170 47767042 71201567 48780389 9313727
4553 9313727 -8143178 6716283 30304639 34286110 16068012 -2565783 -4254768 6051874
4545 6051874 13266149 9056736 -9327972 -41749535 -74731342 -82485440 -55296106 -17184942
4537 -17184942 1371974 -847080 -4852822 -5415525 -12232661 -22595096 -19151494 2422577
4529 2422577 24943495 33604373 31562387 28862522 31234736 40538347 50163530 41484325
4521 41484325 4814414 -36623946 -47088134 -25102650 -4147258 -1324237 4094840
4514 4094840 26644685 40285334 15129000 -32128761 -56098919 -41661975 -15943028
4507 -15943028 -4837947 -5924489 -8652411 -16166396 -34539848 -55845538 -65640108 -60931310
4499 -60931310 -52289029 -51993493 -64235807 -81673307 -87774102 -68876274 -30303142 2893096
4491 2893096 7496582 -15666738 -43642613 -53546523 -40144388 -14774251 6706457 14332877
4483 14332877 8489785 -1923245 -7887147 -9242978 -13214526 -22568701 -29730037 -26628961
4475 -26628961 -15951748 -6873764 -4225558 -9438885 -25821511 -49211181 -57464081 -29685098
4467 -29685098 19764895 47373344 31954571 1899738 -3873799 15261525 31668636
4460 31668636 32032524 22833746 3989360 -29806327 -62123876 -62616699 -30535400 -2155714
4452 -2155714 -2623291 -16243088 -19925987 -20238187 -33812586 -50857779 -47672702 -26692343
4444 -26692343 -16340474 -31661514 -57159163 -70632322 -65497333 -46563754 -21227952
4437 -21227952 -1098223 2098941 -8944051 -16119057 -7269310 8509732 14176658 7295279
4429 7295279 292884 794153 1701742 -5926453 -17413245 -19492821 -8547416 5176901
4421 5176901 13515709 20521694 29657756 30620439 12563059 -14385677 -27236023 -19999991
4413 -19999991 -9102810 -6122820 -3060634 7858701 17961959 18913270 20508578 34402648
4405 34402648 50702789 49980639 32709323 17706427 13996053 13651323 13578604 24009180
4397 24009180 46824622 60957016 43104451 -2740963 -46683207 -62390649 -49446105
4390 -49446105 -28279721 -19015124 -26281115 -40067143 -46851013 -40044289 -24048457 -10575581
4382 -10575581 -6772031 -3339179 18774698 61205100 94800115 89314592 54485572 31998545
4374 31998545 42806566 63527528 64587847 49710834 40304031 39551967 35612129 27996658
4366 27996658 24932495 21257725 5129928 -15144611 -16419140 4601757 24812495 27544068
4358 27544068 20948355 17601965 16372682 13517931 13158230 15310811 9050413 -10005938
4350 -10005938 -27526287 -27216962 -9915727 12867039 32946958 43250459 34647625 9830026
4342 9830026 -7951462 3913203 39260930 67524427 65732457 39010199 11554618
4335 11554618 3696806 15292591 26235964 16124665 -12521482 -34672977 -29918508
4328 -29918508 -3676157 22279110 32822584 27225225 12161512 -3610732 -12251815
4321 -12251815 -13381899 -15078245 -21677985 -24353132 -12059032 9773486 19588916 973092
4313 973092 -39265099 -74999667 -83323837 -66009294 -47331588 -45321550 -47995602 -29230682
4305 -29230682 11682487 42354127 36658620 6947139 -15891842 -22433080 -27200998 -37813845
4297 -37813845 -41670433 -25241949 8493911 45906669 74312392 83543476 67077500
4290 67077500 29994029 -8532791 -26978102 -16997032 10397299 30649971 21718583
4283 21718583 -16491100 -57630660 -71273023 -52415366 -24299832 -12467679 -22810342
4276 -22810342 -44177595 -61204756 -60640936 -37103452 -2565553 18108764 13702616 3676554
4268 3676554 13417359 34220754 28624549 -16185473 -61182830 -62030189 -29140864 -12169459
4260 -12169459 -27391484 -35645356 -5904260 32163867 28773661 -13519865 -45150753
4253 -45150753 -40196464 -23233524 -21264601 -26173693 -21395962 -14958386 -20780631 -27985415
4245 -27985415 -17015562 5251320 13999477 5853496 4539684 24833246 51272892 59241463
4237 59241463 42912475 15495038 -7940731 -21141788 -26841602 -32090666 -40526901 -46553666
4229 -46553666 -39412363 -14913465 17172655 37963907 34611483 14646308 2216415
4222 2216415 12170838 30179967 30410357 12264592 2758803 17735505 39649202 45179104
4214 45179104 37429615 33985260 36784942 34350172 26088952 24252584 34618107 51096210
4206 51096210 66270019 73415088 63807314 38169311 16155470 17788107 38829341 59752465
4198 59752465 73179854 84243545 89854651 80382280 60352714 44773950 34023030
4191 34023030 15033030 -9788822 -18296767 -161531 27541129 43571511 42898695 27864157
4183 27864157 -583133 -33893948 -56960009 -67634170 -77556761 -85773529 -73655354
4176 -73655354 -39033710 -12791477 -21182488 -48126372 -57112778 -39258685 -17418819
4169 -17418819 -9855384 -12336297 -14625044 -14438512 -11369702 -2057755 12293051 22419853
4161 22419853 20545659 9355186 -1642616 -6909428 -10038328 -17252893 -26888845 -30431782
4153 -30431782 -25863520 -21107718 -17949812 -5186995 18338051 27661810 2787945 -32604010
4145 -32604010 -34584845 -861115 23959745 11560121 -15462965 -24905752 -17204540 -6994348
4137 -6994348 6318843 24529037 33454993 26286550 21069059 29426083 32460135 15230958
4129 15230958 -2694297 -4651612 -14365915 -51259158 -75754990 -37685526 35414084
4122 35414084 63114976 24687172 -17660172 -17857237 -1984024 -1302974 6021069 43392182
4114 43392182 76713117 60485856 11074205 -18241391 -14589645 -7846808 -9353651 -109577
4106 -109577 21060580 25633607 2677189 -19259653 -13432810 8680778 17923640 5150842
4098 5150842 -15218672 -25210408 -16248306 6509694 24796770 22159173 3874358 -7871502
4090 -7871502 -2286729 8378985 9674669 3731651 -299593 -1714161 -3476324 -2515400
4082 -2515400 1749384 -3801713 -32168948 -70883418 -85659977 -57501134 -8505290 18606249
4074 18606249 5019367 -26996347 -41311750 -25288505 2632186 15683998 2589644
4067 2589644 -27188185 -53472299 -61086932 -52855115 -47267341 -56421716 -66909084 -52389308
4059 -52389308 -7384644 41837302 65299686 59208195 41840310 29362574 25327127
4052 25327127 26522444 26496915 15832755 -9094649 -35851760 -42897478 -20934423 15161708
4044 15161708 37061720 26551731 -7381327 -34145205 -30554068 -6144829 8681973
4037 8681973 1234422 -11324331 -15169237 -24859084 -54840581 -81121646 -63244240 -4121030
4029 -4121030 43306681 40077424 6704343 -11329639 -2415861 8860281 3951870 -11218614
4021 -11218614 -25770265 -37642210 -44619047 -40399525 -25978687 -11484379 -1569277 8575866
4013 8575866 18059674 15426345 -2866294 -22158968 -28580741 -26734658 -25561208 -18343568
4005 -18343568 4403866 29816562 34411989 21178442 19929798 42170086 58635855
3998 58635855 38085637 -8861465 -44985499 -54037854 -50862056 -50578809 -51796422 -50817478
3990 -50817478 -50198198 -48057918 -37808132 -24908949 -25909130 -42587098 -54695023 -49484584
3982 -49484584 -41788011 -50535138 -70150456 -82529505 -84965071 -85363588 -77703305 -45753210
3974 -45753210 8711665 60476292 86234598 81273061 52132852 10505960 -23877974
3967 -23877974 -33717799 -24969218 -22427203 -37672927 -55623832 -59772152 -54446965 -50823888
3959 -50823888 -45952839 -31390267 -11959459 1388529 11039598 27901909 49761118
3952 49761118 60052491 48164516 18163626 -21143408 -59798133 -80135589 -64881142
3945 -64881142 -19849483 24279145 42386153 38930183 34952232 40962634 51629538 58161352
3937 58161352 54010877 34490477 4011620 -19040396 -17776029 2284377 18416282
3930 18416282 17288909 5894637 -4010411 -8932145 -7986920 713101 9357198 -972380
3922 -972380 -38077527 -83185578 -110702329 -117117751 -116689446 -114653516 -102971737 -81459806
3914 -81459806 -63071666 -53049162 -41061773 -23164040 -14484447 -25793862 -41055234
3907 -41055234 -37078006 -17816451 -8568898 -17809813 -25699166 -15751786 -36480 -2158258
3899 -2158258 -27062810 -59256518 -82525772 -88981330 -74447634 -40421100 -2187770
3892 -2187770 17659539 10453985 -9824947 -23517445 -25281944 -22091087 -17541802 -8100131
3884 -8100131 5648288 14093301 10084213 -362682 -5222686 -2061816 -573675 -9533337
3876 -9533337 -25956719 -38754731 -40478343 -34145833 -29531466 -32652259 -38578987 -36894930
3868 -36894930 -25280979 -13123616 -8558344 -8633783 -9438383 -18135842 -40646022 -61094960
3860 -61094960 -53646338 -20126277 3790606 -7235275 -34180176 -41918814 -28402847
3853 -28402847 -20454515 -25873203 -20473070 8461217 32923633 19529588 -20603694 -41222627
3845 -41222627 -16937488 29830008 59452055 55403606 28578884 -2604539 -24289484
3838 -24289484 -28916680 -19283593 -8805690 -7397829 -8930711 -2593865 6683108 4298506
3830 4298506 -6745502 -3628041 22103321 45499949 39067123 9440266 -15694690 -26249702
3822 -26249702 -31709898 -32553340 -19785795 -2653858 -3903943 -19518179 -16089137 17088970
3814 17088970 46401913 46226707 39757791 55601411 73351649 56186205 18074662 7771967
3806 7771967 33086032 53280677 49742908 51079411 73575776 87650233 69774410 44573655
3798 44573655 42366966 50214656 41469211 24518418 22638584 28604654 20609232 5780424
3790 5780424 6007384 13846491 5377793 -12912283 -14603496 -3734859 -6511028 -14826769
3782 -14826769 8090505 57640678 78976788 48013126 9395364 5327937 15903178
3775 15903178 8730971 2711543 30438131 69491496 70536437 37481883 21181018 37858338
3767 37858338 49452773 30026864 -85628 -18630789 -32077169 -43735428 -36010407
3760 -36010407 -10089347 -3878005 -38112812 -76281345 -73274142 -38055121 -10608202
3753 -10608202 991754 16678916 31991705 19150747 -19030044 -42289151 -31177594
3746 -31177594 -13267437 -14660165 -20200834 -5976679 16320985 18012959 467950 -6794300
3738 -6794300 10220470 33128491 38575439 23756210 1858691 -14006631 -18448896 -14086510
3730 -14086510 -6982951 1300399 13626691 26188138 27281628 16035728 11496556 28159969
3722 28159969 50716414 52316564 33871043 22858719 31024787 36566487 18385276 -11301528
3714 -11301528 -23927679 -11460069 9699543 23511938 26772010 20646964 5486803
3707 5486803 -14329524 -31238097 -42315611 -49054554 -50226365 -44140406 -37800366 -42325301
3699 -42325301 -55303174 -58130018 -38623653 -9250149 6342024 908948 -12136736
3692 -12136736 -20123460 -24178243 -26909254 -19867605 3629013 28278425 25843282 -10710174
3684 -10710174 -53934351 -71086787 -58160151 -35271733 -16706088 -1227202 10805055
3677 10805055 10122732 -5118812 -21380839 -29488095 -40275628 -64792200 -85953271 -70189864
3669 -70189864 -11152214 53887817 80822409 63170889 30671724 10656111 4187702
3662 4187702 199637 -1571438 7254436 23953728 30512244 14296605 -14143873 -31335822
3654 -31335822 -26467880 -10354644 -926682 -8219292 -33472532 -70603978 -101272544 -99497321
3646 -99497321 -56800511 -1179902 24134512 5958876 -25843932 -36605184 -25703209
3639 -25703209 -15179069 -10266006 7245731 45280421 82428809 93699109 80610910
3632 80610910 62179347 48666529 42020902 51221017 80635757 104966615 86437242
3625 86437242 27965292 -17472647 -10145930 24333262 31034798 -1289037 -33928205
3618 -33928205 -38566734 -29552756 -29245943 -31238132 -15673349 16740679 44069558 48187019
3610 48187019 29095129 1656976 -13844600 -6197385 14343827 25946016 21631655
3603 21631655 14055821 9377873 -6139033 -41444229 -78492127 -92131665 -81775175
3596 -81775175 -65832823 -53069795 -38639439 -23668115 -18848989 -27964881 -43390845
3589 -43390845 -58961958 -74344112 -86769790 -91048913 -87735812 -79917545 -63487530 -32645392
3581 -32645392 6965013 42712755 69011590 83951017 78978861 51284139 21435917
3574 21435917 14181980 21810711 13534282 -14312465 -27297056 -3958683 31249827 45065949
3566 45065949 39138269 31413555 16984232 -18229919 -57641556 -65735890 -39494211 -15064962
3558 -15064962 -17083609 -30585815 -33787025 -31209502 -35791377 -38584846 -20105027 16996488
3550 16996488 46948358 50129055 29005312 -2358039 -30714343 -46511809 -48209152
3543 -48209152 -46288701 -52166476 -60588389 -53905282 -27752987 -791766 8732025 5350553
3535 5350553 3531848 1191776 -16119493 -45807001 -62708090 -50820440 -24962125 -8356146
3527 -8356146 -818266 13842651 35913673 45488710 30738153 2633072 -23174007 -43599038
3519 -43599038 -60225334 -68180587 -63078282 -49310423 -32530076 -12886603 6186217
3512 6186217 13223532 3582266 -10633100 -17474896 -22410149 -34493401 -44521590 -35408847
3504 -35408847 -9611325 12477668 19743048 18406715 14554441 7822910 2662508 5358021
3496 5358021 7787378 -3471610 -17582870 -5248950 34906081 62474257 47187320
3489 47187320 12727795 4654670 31575498 64917655 83920773 89896467 82308701 54008297
3481 54008297 13735875 -14741222 -23600408 -28908479 -41472127 -51390901 -48151918 -34021403
3473 -34021403 -10093356 26545654 60569714 59644757 17160529 -27473135 -34049070 -11502949
3465 -11502949 -22027 -16505307 -42126842 -54676077 -48522895 -28184723 -5565488
3458 -5565488 83 -19013666 -41863277 -42668219 -24885130 -10203465 -352731 19888721
3450 19888721 43915949 42934281 11846063 -17352577 -20648239 -10121341 -1835784 12486013
3442 12486013 38160291 49951223 23782210 -20644569 -39976060 -21178203 9945087
3435 9945087 25403757 15752077 -16534966 -56745121 -75892926 -56760141 -21666839
3428 -21666839 -9788105 -27179468 -44117449 -42064971 -34768864 -36668343 -38662305 -28906063
3420 -28906063 -15484461 -11914592 -15730366 -17102733 -17568037 -26169256 -44092742 -63232660
3412 -63232660 -74271395 -70621617 -52550352 -31838059 -22516914 -23449666 -22007099 -17077308
3404 -17077308 -20224060 -27605789 -14078653 27558825 61508362 49474759 5781428
3397 5781428 -17193130 2021532 28106884 20984755 -10962952 -28719760 -18838742 -7059125
3389 -7059125 -16796368 -36724747 -40672134 -25108908 -9426339 -4181983 1943171 20506127
3381 20506127 45265927 62874640 66645670 51318169 12660527 -32261248 -44123977
3374 -44123977 -7170516 37019553 34415161 -8303750 -32629171 -12649388 11601905
3367 11601905 1077794 -23354099 -20670470 2118542 2995467 -28210377 -56870003 -55840732
3359 -55840732 -36037966 -19942112 -14011731 -17106955 -32019874 -53870773 -62231579 -39296019
3351 -39296019 9924675 61839102 92806493 92135069 67339486 41280965 35148965 47783180
3343 47783180 56215075 40219353 3758264 -27931589 -30142810 -1439745 31112565
3336 31112565 36284019 15122803 2773556 21490159 44737445 31859087 -8091500
3329 -8091500 -19728073 24034363 82030502 98847080 73861732 48724153 42773046
3322 42773046 36432160 16327266 658929 6545314 19361478 15782436 338015 -4575253
3314 -4575253 4472489 10406195 8413989 13676359 30412794 38644474 26452620 14141312
3306 14141312 24353716 43187834 38829424 12606631 746678 20634544 43761957
3299 43761957 36775214 8438043 -4422911 13628450 41713947 54720818 53427495
3292 53427495 56978465 73200329 85033553 70762669 35302902 10365208 16781866
3285 16781866 38545047 47957518 44042982 43292918 42109963 21362915 -12183776 -26806316
3277 -26806316 -18476103 -24719266 -65692949 -105983450 -103024231 -64221276 -23727755 11001655
3269 11001655 50210307 79595786 72599713 37572225 11085876 5513988 710731 -11695444
3261 -11695444 -13471458 4720874 26526464 37202618 39197738 33839187 16172347 -4351878
3253 -4351878 -6799677 7297701 8988609 -17997879 -55273436 -77242186 -77897269 -62486364
3245 -62486364 -37044738 -15449912 -12225609 -17972911 -6008466 26491693 49167192
3238 49167192 41323400 18254478 2531850 -4193951 -6578051 -300888 11776575 14869715
3230 14869715 11325355 26251283 63595887 86429917 67720342 33268157 22642684
3223 22642684 31384674 27749547 8114648 -2771433 5066562 20272395 38196193 59138110
3215 59138110 64526404 33166265 -18024936 -45479723 -36260997 -20862299 -21382834 -20538793
3207 -20538793 2065254 30792175 33749280 6353476 -24542441 -32817826 -15834223
3200 -15834223 10431736 29286889 37897400 47764462 68347629 91031683 95833883 74226383
3192 74226383 38471858 7607969 -9853778 -18948841 -29271639 -43681914 -54323569
3185 -54323569 -52837725 -44599041 -43787062 -50835866 -46996922 -19888421 17174801 42880825
3177 42880825 54001326 59203278 56163487 33785010 -4861741 -37746892 -44156995 -21435519
3169 -21435519 15825692 44988517 48726955 29210592 5514733 -9825641 -23872797
3162 -23872797 -44795187 -62297194 -61722931 -49534395 -46594606 -58094229 -66281510 -55752801
3154 -55752801 -34769283 -25907314 -38349252 -52970147 -41332236 -4642526 17610979
3147 17610979 -4421304 -43841961 -46821483 -7010918 26825036 24168261 11393093
3140 11393093 18854050 32349554 27294981 13137812 7101769 -2731174 -27700909 -43427390
3132 -43427390 -29177269 -12409339 -23945528 -38158621 -17066000 12013328 -5900044
3125 -5900044 -53506621 -58408560 -9987125 22588305 4286864 -13418118 15143397
3118 15143397 56234544 58794747 34047477 26079387 44237596 66628965 77192314
3111 77192314 65057511 21295697 -32471388 -48826878 -19197054 5085382 -11110291
3104 -11110291 -33035139 -18371642 11561453 14423978 2927330 18602745 55202494
3097 55202494 68958434 50448608 29665349 18521838 1662129 -19889777 -25775907
3090 -25775907 -16221121 -10379793 -6287499 14516110 44392922 55863949 50373731 55767398
3082 55767398 72327443 67652685 33518951 2824980 -3631187 -5621413 -21599204 -36653590
3074 -36653590 -33838373 -25114855 -27357203 -33144238 -28491649 -19660258 -21226523 -32220619
3066 -32220619 -40474636 -37918277 -20317383 12998909 48267478 61752969 46479666
3059 46479666 21272133 5278217 -843823 -1002715 9258646 28650253 39936746 30336788
3051 30336788 11789261 6947444 21990361 43575992 56097705 53624211 40998977
3044 40998977 30073697 29754781 35321016 32441163 13630711 -14312558 -37803047 -44533480
3036 -44533480 -28278753 3781192 32025627 43498629 44707560 43987076 32619257 4070082
3028 4070082 -18378549 -3635666 38140425 59568478 36098668 -5242545 -25660270
3021 -25660270 -15876429 13501478 53912669 92361269 107201126 93425942 75110150
3014 75110150 71585648 67742714 42006574 9598897 7101401 36846862 56584786 34018640
3006 34018640 -8987038 -22821377 7428435 42685694 37899621 -1380043 -25595299
2999 -25595299 -5567980 28360717 26951553 -11126830 -37727126 -18370402 28177667
2992 28177667 59417259 56249900 30089254 914611 -17740628 -22498172 -19976385 -17601631
2984 -17601631 -12562714 -3252 9661848 -129985 -23887033 -36680106 -30398466 -23499622
2976 -23499622 -25540173 -19230763 5242182 24331022 15191938 -4001882 1728200 30288453
2968 30288453 43568372 20641223 -16326509 -33266188 -21791356 -579577 6434021
2961 6434021 -11397504 -44506238 -71046391 -76712581 -65295304 -46747846 -24287612
2954 -24287612 -2083740 6239581 -6123266 -20865545 -12216137 17319277 37103721
2947 37103721 28459739 8743490 6827508 25739049 41115852 32615210 6478012 -14739834
2939 -14739834 -17412008 -5622705 11567504 30470252 46410980 48960553 35631442
2932 35631442 22515501 25452087 35315755 30623165 12050915 1418332 4727974 3276217
2924 3276217 -9912622 -13755547 3372840 16635871 1523874 -22672867 -18613583 10608911
2916 10608911 22907394 -3073356 -39994725 -50765668 -31537015 -5320088 8662944
2909 8662944 5717514 -12314977 -40629201 -68703103 -83061392 -76644065 -55843010 -37161018
2901 -37161018 -32545916 -35819655 -28413906 -1840853 30609888 47886344 41105621 16835840
2893 16835840 -11218620 -29225329 -30618748 -22669806 -18987828 -22438051 -25157817 -27391216
2885 -27391216 -40696608 -65548372 -82213729 -75042550 -51563552 -26296472 -1327140
2878 -1327140 23367108 36808955 32229383 21824487 17754978 11342740 -8414800 -27689307
2870 -27689307 -22916683 4240636 29048945 34995451 22804393 -3835526 -37747771
2863 -37747771 -58244238 -46497644 -11629101 17819851 27100672 22410752 10065464
2856 10065464 -9854375 -31467589 -45554005 -52656944 -55757382 -45699638 -15389951
2849 -15389951 18057943 30687259 26271390 26376258 30966202 21454092 2133316 1657833
2841 1657833 25506091 41921979 29203098 6956986 4044456 21493041 44000873
2834 44000873 64406778 78647853 77078999 59139610 40152064 29151999 17447452
2827 17447452 1658342 -3618381 7164724 12427532 -6115902 -32340297 -37984604 -22758387
2819 -22758387 -9270944 -7683328 -8013020 -2290290 5780172 11588570 14708836 14203091
2811 14203091 9593067 4174207 196298 -3859174 -5662896 2171238 18893073 31505132
2803 31505132 31273844 23986464 17746616 13291031 12057090 17631087 22134315 10873089
2795 10873089 -9431226 -9926147 17586980 40939816 31980329 8203026 2953634 13843247
2787 13843247 14478862 3761356 4273054 15178882 6864752 -29160627 -59017473 -51359458
2779 -51359458 -19413848 -70162 -6665670 -19489198 -14385754 12700804 44964893
2772 44964893 58790652 41440607 2344701 -32796369 -42683451 -27785814 -9433168
2765 -9433168 -10834461 -33967415 -55384427 -52464360 -32904970 -24549003 -34126246 -36658893
2757 -36658893 -16131164 6278628 5384083 -6135768 941537 20271277 14556069 -26489322
2749 -26489322 -65794911 -67736162 -42122490 -24486880 -30172948 -43677099 -43181892 -22946204
2741 -22946204 3470590 15871905 8704111 1075491 16073326 49355126 71505377
2734 71505377 64659894 42041218 25323474 18143939 12084970 4878806 -2151704 -16109929
2726 -16109929 -45171603 -79961621 -95378065 -75965473 -34573537 -2436626 -1138154
2719 -1138154 -24237939 -46264020 -49542861 -39333494 -31188942 -30306840 -31042240 -31131024
2711 -31131024 -33328060 -33429005 -20835565 4285137 26198990 32834591 30088503 28909075
2703 28909075 27315471 17303972 4854787 8520412 34486362 62899528 67015397 43291607
2695 43291607 15909350 10461976 27801363 46303745 45511727 22615025 -10600002 -38423008
2687 -38423008 -48982739 -41218328 -28286425 -26803359 -38213531 -47000670 -41079000 -26895528
2679 -26895528 -20300993 -30226463 -55136167 -85063496 -100978245 -84658226 -40483950
2672 -40483950 1791805 17380384 11418823 3682058 439179 -3287624 -4860069 1438564
2664 1438564 6404780 -5904904 -32155174 -50386929 -47759979 -31595884 -13057267 3057068
2656 3057068 11785463 9252656 2934930 4278706 9533361 5488601 -4257118 429406
2648 429406 24267954 45601495 46696294 37068201 35980305 47272899 62010254 71386145
2640 71386145 66566886 40811549 4070426 -18216355 -14399449 -3491857 -10434463 -35420908
2632 -35420908 -59634696 -69484798 -61976532 -38835024 -11892825 -3299593 -20842537 -40016901
2624 -40016901 -30327950 4402909 30662907 27474341 4556828 -21072969 -44803006
2617 -44803006 -64783646 -72162443 -63175837 -48954696 -41768975 -40119386 -38376695 -43470891
2609 -43470891 -67308778 -103579954 -125763173 -113982580 -76426813 -38055240 -13218850
2602 -13218850 2982025 19190373 34369668 43055532 45183837 43601247 37426228 26285237
2594 26285237 17225956 16918629 17876574 4094136 -26326141 -54520052 -62983865 -55891999
2586 -55891999 -48691443 -43861419 -30060748 -6224210 6528812 -12616212 -54076802
2579 -54076802 -82281069 -73724297 -41608034 -15883920 -7621335 -5537735 -1653583 -1593811
2571 -1593811 -7988734 -13483887 -18112494 -34922904 -65320547 -85191054 -72864245 -38807822
2563 -38807822 -9484334 7994042 25408281 45869795 58378040 56720613 45610281
2556 45610281 31178319 20876241 25547243 43379702 50708208 30610893 1550198
2549 1550198 -7997101 -4133090 -15200133 -41034316 -52011004 -40209090 -33070574 -47580138
2541 -47580138 -66436659 -71079749 -64502436 -49424163 -19889887 9855066 6004051 -32987641
2533 -32987641 -60165726 -41768867 -2989502 16183033 18618999 28746435 41292615
2526 41292615 32019639 2414307 -24149600 -39385654 -50970788 -58055667 -55291289 -47762312
2518 -47762312 -33403007 11046169 91523947 161218213 165225358 111275570 56107975
2511 56107975 29829777 16812655 6393203 12690696 35430712 45034800 24296283
2504 24296283 -6559502 -21511913 -19953678 -14618838 -11228038 -10418105 -11520344 -9221288
2496 -9221288 -2785102 -5477452 -23772195 -35535215 -18471403 8127287 8212384 -9103845
2488 -9103845 1153517 44056542 68297660 41435195 -5537903 -32580731 -45862965
2481 -45862965 -67246733 -85984902 -78954349 -53205237 -32437305 -20409712 -9408992
2474 -9408992 -6428991 -18682804 -28611219 -15326848 10705308 23325168 19255959 12676233
2466 12676233 4079768 -13211993 -24937988 -10006386 19100099 24145380 -5538112
2459 -5538112 -36508348 -36514353 -12121776 9909135 19133631 24740403 33294628 37088197
2451 37088197 24805474 -300043 -16252573 -3898870 24805314 32637122 1745601
2444 1745601 -38899957 -46420239 -17090008 10887656 4481591 -30775451 -64056295 -71088180
2436 -71088180 -50878276 -22356585 -7393933 -10899071 -18861726 -20309531 -22984076 -37084470
2428 -37084470 -52135881 -46492555 -17672374 11701522 19224964 2718066 -24705940
2421 -24705940 -47965112 -57578075 -54601807 -50257825 -53014842 -56141469 -46818525 -27914043
2413 -27914043 -20346721 -38561657 -69275618 -81369453 -58518571 -19474034 -400730
2406 -400730 -14258327 -35591532 -35202790 -21225422 -25823156 -52963426 -66211043 -39160731
2398 -39160731 5649624 26536577 13835940 -9632188 -25759332 -34592807 -37095494
2391 -37095494 -28514083 -11135521 2398729 2268042 -9242693 -19443116 -12278884 16401133
2383 16401133 44367083 39599271 3456058 -20958123 -2689360 32119746 35215748
2376 35215748 3155358 -22019674 -13191524 13436497 31644374 35434754 28177356 9563593
2368 9563593 -12910710 -20498338 -6751805 9077934 5091375 -16240944 -33936146 -34114956
2360 -34114956 -21931842 -12257914 -13005740 -16233910 -7448414 13937048 30713412 30455173
2352 30455173 21458095 16143802 11793810 3468492 2250922 18265487 36161250 33750784
2344 33750784 17994942 14109012 23829563 26499368 20384672 26466352 44446256 42166212
2336 42166212 5550210 -31905021 -31776641 -1114734 20643084 9321178 -26312359
2329 -26312359 -60375748 -68924163 -45942406 -11866406 5563736 4304483 4929961 12650582
2321 12650582 10285810 -2399686 2919544 34843767 55799744 35244264 2021686
2314 2021686 4077688 33949354 39352083 2540482 -35967103 -40339133 -26303608 -26463466
2306 -26463466 -38595009 -35453368 -11664981 6279543 -2327586 -23823916 -29593820 -15892626
2298 -15892626 -8810311 -24417913 -38584449 -15565026 38030172 73477605 61633562
2291 61633562 29451342 17802235 24457500 15692211 -17633439 -46338362 -44901579 -21072409
2283 -21072409 2161421 13136370 11161373 -3196236 -24237308 -36923133 -29576036
2276 -29576036 -8948638 5627403 3811734 -5247989 -6063470 4189596 16612529 29067485
2268 29067485 50573488 79030549 88478857 58546757 10703822 -9345153 12068840
2261 12068840 41133513 43068563 20085954 -6186085 -24180232 -28678297 -11889071
2254 -11889071 20367684 42062460 37769096 24079839 20866244 19876997 4945581 -15381596
2246 -15381596 -23175489 -23560271 -32556364 -45955091 -50551931 -53251840 -65740246 -72333452
2238 -72333452 -50708009 -15489033 173740 497513 17845083 47447420 43674311 -5624750
2230 -5624750 -51171942 -51841097 -28248095 -17670090 -15024647 3874435 31044088 41390149
2222 41390149 40783658 56881632 89271876 106257911 91947909 65871042 50794976
2215 50794976 45483717 37661020 26610358 22338673 29296024 37330765 29935472 4595129
2207 4595129 -17042530 -10434990 18964442 39557511 35485650 25916562 32230300 45994724
2199 45994724 46264076 31281962 12215033 -10830741 -43016772 -73579415 -83451969 -70636457
2191 -70636457 -50305443 -34690064 -28537328 -35131863 -46962108 -39863655 -1023387 43245498
2183 43245498 54688681 35601923 24880645 39126221 49472173 29344351 -2964322
2176 -2964322 -10966739 8542331 24381969 14264305 -11064556 -27106221 -24133028 -11720454
2168 -11720454 -3606589 -5379350 -15152060 -28404252 -36646938 -26938314 4694128 38631293
2160 38631293 45747817 22617840 -3089207 -12058458 -18661688 -39299724 -56100098 -41937308
2152 -41937308 -9200437 1860146 -19351980 -43013594 -47888520 -44724560 -42391945 -28209563
2144 -28209563 768010 20337148 15358236 4818275 7577155 11652982 4504916 4149353
2136 4149353 24519558 36226586 6976654 -36539080 -38416702 1468418 26167910
2129 26167910 10339035 -4121615 20299354 59198194 72100863 67181445 80490962
2122 80490962 114741038 138231953 132203836 105763413 72499046 42799148 32366782
2115 32366782 47486427 64675058 54367239 24825069 14038764 35402601 60048955
2108 60048955 60115824 42332750 27111360 18678581 12022288 10657781 19525518 31863506
2100 31863506 37358190 34471401 25340836 9992838 -5398340 -8431830 270088 2259368
2092 2259368 -10737724 -18218448 2794463 43729791 73613389 73158087 44579369 -691361
2084 -691361 -44832181 -64725346 -52833022 -30704055 -21192490 -16141530 3690560 26314492
2076 26314492 19882804 -14992309 -40335197 -34865460 -18178890 -9543085 1244827 21935016
2068 21935016 31081079 12805167 -8291839 -1287640 21084780 23091739 3409284 -7684572
2060 -7684572 -3008901 -8503699 -32904208 -45962730 -22657061 20396407 51265689 62643735
2052 62643735 66707842 69055302 68024385 66096349 62847947 47935166 19407864 -1917831
2044 -1917831 3375384 23461653 31368030 24317640 22391941 30929449 32838545 23281045
2036 23281045 23088106 43800316 64380403 63274290 53974479 62808198 84143090 87013450
2028 87013450 61872575 31965391 16881638 12890745 15072123 29244543 48393370
2021 48393370 45352565 10947869 -22354711 -20599021 4567896 16697593 8179159 117616
2013 117616 -2250950 -15147101 -36509438 -40872222 -25075560 -21506364 -46088395 -66606544
2005 -66606544 -50451498 -16603717 -5658879 -16759898 -13955841 10837623 20536998
1998 20536998 -13740304 -71217769 -106399976 -96659882 -53509834 -611809 46764598
1991 46764598 85620402 115551908 126103320 100856978 43332933 -9531677 -18455350
1984 -18455350 13473052 44065705 42522563 20124995 5681966 7139185 8408788 -5522837
1976 -5522837 -30806103 -49312872 -47996362 -35634248 -34670862 -48412522 -47620101 -9842348
1968 -9842348 36421250 38891715 -4157800 -33915917 -12837631 19222738 2975725
1961 2975725 -53149132 -87891561 -77251681 -60749272 -72434208 -92116527 -86837592
1954 -86837592 -64407829 -53665671 -54942361 -46404905 -28441322 -24846290 -39334029 -44416561
1946 -44416561 -23503002 3293933 10701755 3845109 3000361 9112515 7369190 -3679308
1938 -3679308 -9387104 -2697866 9381449 22402554 38198505 50268008 45290890 25673442
1930 25673442 13826178 25569742 52607059 78433511 97484596 109664632 109565790 93201040
1922 93201040 67269456 43614245 31796009 38829075 60850972 71253873 39514591
1915 39514591 -25575084 -72648503 -65402522 -25115097 3553560 9461813 12587685 22477172
1907 22477172 31036350 37129446 46720121 53284640 47100919 39146964 45766965 54563562
1899 54563562 39634028 9241670 1333897 27551258 57988627 68213616 63987057
1892 63987057 50256925 17668280 -22243411 -30071776 5783565 41423057 36600267
1885 36600267 11181825 8295748 28498193 40888914 39309887 42370286 47079119 27446677
1877 27446677 -18243510 -56249842 -61936338 -46964121 -33222362 -23529001 -8921901
1870 -8921901 12165815 31825443 39521821 27343530 -2120588 -32824431 -49926563
1863 -49926563 -56169734 -64246366 -75764579 -77740787 -57795832 -16340342 30689683 56784812
1855 56784812 44708710 9237929 -14128507 -11632162 -3795962 -5657281 -1890385 18054909
1847 18054909 29625290 10634570 -15187810 -11993580 9250522 10929804 -4592330
1840 -4592330 52659 27934381 36923956 7932708 -23904272 -22494006 5924384 38870062
1832 38870062 66609966 77002304 53106561 10527490 -1662530 33114798 66466857
1825 66466857 50361122 2486459 -29742949 -39914439 -52842319 -66196350 -52645379
1818 -52645379 -13534348 15550302 16168544 7265940 8741253 16536150 21340051 24822174
1810 24822174 28376433 27494000 24228959 25911375 27269315 14957504 -4656438 -4729880
1802 -4729880 25085626 60599352 74037930 65360322 48122108 20717018 -26143221
1795 -26143221 -80058183 -108311675 -93619531 -53605091 -17649110 3944366 18292846
1788 18292846 28747290 32844802 37547458 54157109 71861976 59796933 12558471
1781 12558471 -26759620 -16189662 25609075 42985166 20816907 -689759 7038104
1774 7038104 22027258 17877178 9253080 21062200 42484225 47912180 42574208 48808328
1766 48808328 60388343 50347221 19101052 -3417718 -5157291 -6684745 -22802382
1759 -22802382 -41552109 -51474648 -60614863 -73962362 -77008305 -60428477 -42301043 -44383270
1751 -44383270 -57007935 -48663335 -8680327 35926649 50798194 32588785 9936546
1744 9936546 8010658 20693396 25106265 17399788 17150274 32894911 43428925 28177299
1736 28177299 1355291 -4622476 17304901 41391834 42349140 19462667 -10558312 -29869748
1728 -29869748 -30005683 -18651178 -13481486 -19714782 -21566625 -7226083 10620689 16492205
1720 16492205 19781193 35303593 47056818 23845252 -29982808 -70738554 -68343093
1713 -68343093 -36979971 -5435239 18533714 41896733 62577576 66607655 43582987
1706 43582987 1418648 -31410125 -27630392 4048976 19739614 -6075831 -43402452
1699 -43402452 -47477842 -19517934 5929837 18264111 33002062 46435659 37435587
1692 37435587 14739622 12807077 33346322 38509202 12660409 -15075443 -20438088 -10194483
1684 -10194483 7859179 28305444 19800638 -33291748 -49415067 90915842 354637960
1677 354637960 522229132 431791518 186888415 21497565 12808608 45112537 25215770
1670 25215770 -6667219 2991043 18247112 -10529000 -55207620 -60627966 -32519413
1663 -32519413 -17278163 -30219815 -50566681 -61063057 -56155789 -33965503 -8234857
1656 -8234857 -4573184 -22506600 -29000044 -10902049 -713012 -23015209 -48200886 -34689547
1648 -34689547 7804114 34362601 27821303 10951419 5188559 7309731 4140675 -10357674
1640 -10357674 -30099138 -37894741 -20588652 9690229 25785929 23509582 25856633 39771991
1632 39771991 40292241 16638370 596328 18813789 44808883 35965430 -620801 -18739162
1624 -18739162 212367 27457557 30398639 5243236 -32240256 -61493390 -62768702
1617 -62768702 -30994324 14417364 48003505 60667790 52083564 18806191 -27265769
1610 -27265769 -46879463 -13186987 44840367 70542836 46730350 5800021 -21387670
1603 -21387670 -34157659 -41154947 -43975033 -46027078 -50379254 -45802500 -20531718 9899850
1595 9899850 16810962 1283491 -7044745 3930064 16489956 21269756 31252742 46213570
1587 46213570 39736934 2132747 -33641545 -33443269 -7611497 7912048 -826516 -18518295
1579 -18518295 -27714170 -23585577 -10329188 2245791 4967690 -36173 -4031715 -8912649
1571 -8912649 -22782478 -36235349 -27716669 -450130 13614963 739715 -11642974
1564 -11642974 1480393 22924026 22757260 4810797 -6085382 -6114911 -9816225 -16462025
1556 -16462025 -10780819 7091379 19528493 17636086 7681498 -5319210 -20028848 -29047220
1548 -29047220 -26274291 -19249381 -16571756 -11525951 2407937 11425889 1175524 -14670795
1540 -14670795 -14460838 -7263569 -17331670 -35879569 -28277972 7487668 29358481 9467078
1532 9467078 -31792233 -64985250 -90850695 -118831942 -135339915 -120898607 -81800050
1525 -81800050 -42194428 -17298559 -10274183 -19511505 -32191994 -27306799 -3436632 12305760
1517 12305760 1807504 -14475892 -7970142 13074856 15697659 -10268069 -43620016
1510 -43620016 -65474072 -75395697 -75527337 -64537930 -51681340 -55084337 -77280989 -96171638
1502 -96171638 -87468308 -48901471 -1361881 27351333 24128761 4561672 -1646250 11240205
1494 11240205 14710155 -9859121 -33854560 -17879208 24735298 39746513 9557998
1487 9557998 -21852244 -16048265 6337713 5948194 -12326628 -13420128 8456295 23764791
1479 23764791 16668318 4358679 2743831 3705924 -1722829 -2381003 13330510 32797385
1471 32797385 33082445 12071967 -9883996 -16469399 -11043242 -6630272 -10874987 -22310285
1463 -22310285 -33506572 -35821030 -27241401 -17308049 -18198971 -28868069 -35045683 -28955876
1455 -28955876 -21043182 -23741629 -29793709 -19904741 8365090 33353979 36220982 23239479
1447 23239479 12540445 8471343 1189386 -14206520 -30973174 -40457361 -37555067 -20197457
1439 -20197457 3578621 11608480 -11905726 -50781444 -70285967 -61562550 -53778650 -71768424
1431 -71768424 -99936827 -105073764 -81349852 -51885100 -33338999 -21311978 -9578658
1424 -9578658 -2078908 -660882 1553421 6627357 5604451 -5040251 -12801537 -6563510
1416 -6563510 4523937 3790387 -5832555 -3399401 18791731 39592273 34231498 7767796
1408 7767796 -8571748 6068381 39518243 63418057 63299174 45260729 21081467 -1322743
1400 -1322743 -15671087 -18722778 -15666117 -13439669 -7556920 11342607 35097083 39810705
1392 39810705 20125962 4397173 17677024 42360717 39753041 5569498 -22962930
1385 -22962930 -19081294 240217 5109323 -4662598 -7345321 3315703 11414392 7115998
1377 7115998 1826695 10508256 32400342 55960221 73382674 82303484 79475174 62500627
1369 62500627 36900277 13751485 -1375751 -11612816 -19030487 -18124639 -4490099 14436443
1361 14436443 24997387 22522330 14089259 7297949 4583649 7943714 17707691 23831549
1353 23831549 11683915 -15633990 -32542952 -20391213 6467792 16704796 -1255957
1346 -1255957 -30752890 -50576382 -54096560 -47106319 -38816902 -34541029 -29058737 -11719167
1338 -11719167 13160519 20931489 -2462195 -33150493 -35154256 -9363335 8850293
1331 8850293 2321243 -5144522 12174257 44759040 64797257 62223528 48354920 36650250
1323 36650250 33291083 37013429 39166321 34025339 32466018 47911176 64439422 45208407
1315 45208407 -13043341 -60322202 -51808862 -5883287 22939097 13604125 -7757142
1308 -7757142 -12747635 1182767 22846569 38947740 34301478 6114504 -20799842 -16365453
1300 -16365453 15283374 39902547 37596466 20924993 6537988 -7098728 -25631565
1293 -25631565 -42059772 -44751379 -31123353 -8662537 8709816 7667179 -8475422
1286 -8475422 -16331757 -1822934 14960150 7295827 -13655694 -13315569 9591372 18433394
1278 18433394 -1455256 -16858465 580962 28933353 29839595 3619451 -18583203
1271 -18583203 -22962525 -26029954 -45363359 -76704190 -97023047 -81064841 -24981539
1264 -24981539 38046561 60545201 30184499 -17600520 -44380653 -46154046 -36200501
1257 -36200501 -17599805 6918409 21164906 16180608 6157307 994794 -15344070
1250 -15344070 -51467221 -75772258 -53320708 -1470010 28214594 15231615 -16554801
1243 -16554801 -41423480 -50744286 -37156147 -1062877 28644710 21370734 -5783342
1236 -5783342 -6256737 25185926 44745683 30739841 13242474 14910212 12496828 -11965239
1228 -11965239 -26544194 1447458 44086957 47723539 9643798 -25794927 -36413050
1221 -36413050 -42096988 -56387219 -60452599 -36501347 3047573 33646927 46393951
1214 46393951 47135760 42305367 34598013 23904741 8067936 -11229240 -24275756 -22456356
1206 -22456356 -9028849 5871063 15420094 14757548 -68922 -21308514 -29961008 -21156131
1198 -21156131 -15438243 -26376118 -32536172 -9024820 24487336 22549021 -20044024 -56310658
1190 -56310658 -48901718 -12131929 19738265 35761503 41547585 36012833 20076610 11089725
1182 11089725 22878989 40876704 39072708 15889749 -5444971 -8230927 1776376
1175 1776376 8557668 1425709 -17136702 -29183542 -15540308 15610463 26362747 -6451623
1167 -6451623 -54381194 -67830735 -37957207 -2975740 6188839 -1265944 -3613268 400182
1159 400182 1228259 457697 3623576 3521183 -10518068 -32613548 -44553702 -37091406
1151 -37091406 -16872202 3369368 12414886 4423373 -14135013 -25986596 -21559515 -11780372
1143 -11780372 -13110527 -25058727 -32922550 -27902666 -14035302 -1120118 -2065375 -28458131
1135 -28458131 -72095270 -98758597 -82894217 -45321423 -30727461 -46538050 -54506572
1128 -54506572 -32341766 -10116862 -22172916 -50901224 -53847929 -31567832 -27319179
1121 -27319179 -58082095 -84094421 -63078126 -8444389 28647094 21746589 -7333231
1114 -7333231 -23387961 -18791454 -14138860 -25079351 -36946209 -19451874 31675753 78368724
1106 78368724 78285628 33953537 -12786955 -33542811 -38740693 -45323844 -45076265 -24143998
1098 -24143998 3830996 10296819 -8109611 -25231922 -21396703 -4060871 9932714
1091 9932714 13720548 6022374 -14734861 -40707240 -52100539 -37769873 -11201336 4990912
1083 4990912 4364972 -3751677 -12624226 -21562641 -24307631 -10894672 14797425 32446120
1075 32446120 27461090 7473963 -9046472 -12648950 -5612469 5759157 12263739 3132243
1067 3132243 -21384571 -42932835 -42968822 -25525889 -10031160 -4092009 1244365 9369752
1059 9369752 9875307 -2259487 -17277574 -29296595 -46160998 -67402085 -70689956 -41231492
1051 -41231492 -2100398 9390750 -10203020 -29806486 -28047386 -12374675 6804003
1044 6804003 32062077 58917692 65907634 43018687 12767464 3798793 14988682 24074353
1036 24074353 23541942 28268691 49356131 76918945 91794126 84223599 59040308 30063428
1028 30063428 11453526 9506851 20104342 33484404 39494437 30725200 8737089 -11755637
1020 -11755637 -14477024 -748529 12095157 14198701 12948800 14313239 9567225 -8154699
1012 -8154699 -26559490 -28226110 -14358916 -692759 4848087 7220525 10738051 12968441
1004 12968441 11207938 6171895 -173694 -6047018 -12313407 -23852920 -39043894 -38776865
996 -38776865 -4869118 45169599 65655692 38786026 -685391 -15573046 -14357093
989 -14357093 -20936378 -23278212 4570684 44643953 49448924 13571338 -16261635 -9893005
981 -9893005 11775599 22847241 28505296 35586912 29350895 7163825 -1022807 21994566
973 21994566 45917366 38761197 20262007 29511476 60473158 73935987 60296271 43783935
965 43783935 29248720 -6132808 -60184114 -89703330 -67381186 -22250503 -183495
958 -183495 -7150726 -14904290 -6262507 10124431 22853665 33301861 45434996 52933008
950 52933008 42828483 10783231 -28145595 -47795740 -36560283 -13080578 -7120112
943 -7120112 -24615156 -42342426 -39351117 -21498202 -8139297 -4360511 2814389 23304646
935 23304646 47726737 55632518 38920528 14007734 5546645 17352518 28212786 21926875
927 21926875 10537751 15354268 33668037 42207349 30110150 8947592 -10282551 -28903457
919 -28903457 -44263701 -43599341 -25979466 -12212416 -17337010 -27196685 -19554719 2358773
911 2358773 16310840 13583218 4574135 -4581203 -18634280 -33202353 -29067482 2796702
903 2796702 44351832 70368062 75931805 73139581 68397926 57108320 38481654 21791358
895 21791358 14099090 10205040 -833339 -23931236 -54815189 -83391722 -97929787 -91373823
887 -91373823 -67673879 -39378824 -17502974 -6655738 -7850011 -16850964 -19441655 -2515510
879 -2515510 23355853 27613421 -387714 -28365883 -17938806 24009818 54501805 51201343
871 51201343 32768001 20349092 9239479 -8866526 -23325186 -24987080 -28504292 -50280992
863 -50280992 -77752139 -83936640 -63753819 -35278200 -13044073 -448505 -1050650 -15382003
855 -15382003 -30361714 -31484040 -22510154 -16531669 -13910750 -7098270 895526 3469004
847 3469004 6980541 17466523 21173559 5685950 -10220273 -1454964 17275761 10513406
839 10513406 -17011604 -25525731 -9273497 -7034070 -29330751 -32082047 7222737 40339835
831 40339835 19575259 -24966916 -33078234 -7727692 -868526 -24712876 -40316140 -31451121
823 -31451121 -29200405 -51293084 -68696117 -54553806 -27409547 -20254446 -33398559 -42250037
815 -42250037 -35044187 -22818991 -20103178 -27353722 -29508658 -13000234 9523637 3754791
807 3754791 -39001490 -74010425 -53270963 6003002 41253192 29554488 7816689
800 7816689 2745340 -7724301 -40659918 -62996355 -37518582 17777956 54443256 55263242
792 55263242 36179216 7741038 -25745056 -42626826 -21577716 19771830 39277271
785 39277271 24698777 4414968 3539742 18103606 34696419 46847457 46003705 22700827
777 22700827 -13765309 -37853911 -38579551 -30174435 -26702223 -25791647 -24303661 -29081222
769 -29081222 -41102814 -47400914 -42063835 -39642674 -52232804 -65292115 -54391403 -21321388
761 -21321388 3079444 -4749113 -31462276 -40121702 -12375526 27954365 39808437 11848752
753 11848752 -27289362 -48745804 -55434251 -61484052 -59585628 -34946583 95475 17533127
745 17533127 16496249 21716106 37647107 39450617 17731576 -4160313 -12084772 -23645513
737 -23645513 -47028547 -53746067 -24284452 9893579 8917995 -14653131 -21086508 -12201467
729 -12201467 -25273024 -64545793 -90077044 -81070315 -63740156 -62401558 -64941903 -56358919
721 -56358919 -48167160 -48673620 -37482005 -1891064 27097923 12596482 -28675296 -41868612
713 -41868612 -6064388 40089314 48283922 12508019 -34549246 -58942919 -51759080 -29105943
705 -29105943 -12667906 -7821646 -3006591 7692339 12642791 2589629 -9561795 -4699670
697 -4699670 14554777 29270597 32856541 36205759 45446061 51418925 43260475 20182323
689 20182323 -10160251 -34870970 -41992251 -35949780 -39138597 -60714360 -72445075 -40877916
681 -40877916 19807354 56741292 44641316 14205721 4557742 15753114 24702570 22938664
673 22938664 16613624 7565326 -2917210 -4874677 5339782 12997449 7032452 619535
665 619535 8293802 16467767 3605637 -19917789 -22239476 3000224 29154171 36252398
657 36252398 29473954 15193141 -10303639 -37885360 -40214955 -7067142 34583372 53061478
649 53061478 47672421 35835238 22509654 4131158 -9403957 -1359924 26264344 52831146
641 52831146 63749688 59828982 44551130 19703423 -4367087 -10817742 3719797 21155495
633 21155495 20896870 876657 -24728334 -42669027 -49993431 -50802699 -51314289 -58518826
625 -58518826 -76789447 -99793293 -108458840 -86984569 -45333315 -16163518 -18864100 -33878566
617 -33878566 -27920980 95946 19455483 14983125 7886197 17671279 28494996 15877546
609 15877546 -11034951 -21770958 -9354427 6011711 13856782 23156344 31939382 18776105
601 18776105 -21165658 -56046105 -53469448 -21981108 2798606 4627650 1096301 15115240
593 15115240 47487058 79739244 94897795 92210248 83876283 77812378 66679577 40852580
585 40852580 9635216 -4461059 3820897 13112265 5540064 -7849041 -5005501 15057156
577 15057156 33903820 39295367 32238432 14457031 -11515201 -30793019 -24961494 1871864
569 1871864 21267362 12377639 -15343346 -37820807 -44297355 -41640746 -39073109 -38199900
561 -38199900 -34875250 -24407242 -6718674 10445950 16815183 10713044 679023 -6263828
553 -6263828 -11943217 -18680853 -20611834 -11656072 1100579 1889346 -13564295 -29530355
545 -29530355 -27544654 -8976302 6400792 4640020 -7110656 -13766783 -12575373 -9989118
537 -9989118 -4539914 9497387 20460340 3474831 -41833277 -77289669 -69607748 -33669116
529 -33669116 -8898179 -4437067 1222444 11969361 4790326 -23206157 -37550015 -17866113
521 -17866113 5325815 -4770394 -33540028 -37544760 -10391428 12754779 12494946 8556027
513 8556027 19599877 34151416 36428910 34011248 40419627 49692907 49098571 44085708
505 44085708 49724106 64170164 69552266 57245648 36822525 19692837 7284317 -1828490
497 -1828490 -4392921 1848560 11599772 17986919 22773463 34020053 51615236 60661415
489 60661415 46619138 16377630 -5395098 -5523463 1666424 -3393213 -16450655 -17428810
481 -17428810 -2235127 11816789 12900873 8710240 9070436 11655897 12333869 14269610
473 14269610 18413060 19834238 21934830 36949191 60419177 64050900 32311851 -9469568
465 -9469568 -25262332 -14193738 -2482937 -422978 3543147 11045856 8789591 -1191008
457 -1191008 2313260 22650735 32367919 13220915 -14409835 -21912533 -13762965 -16081748
449 -16081748 -36638381 -59303355 -71099708 -72660426 -64505938 -43500263 -14985386 7653614
441 7653614 18717105 23311731 23794261 16487239 4738672 1790573 13507075 26769152
433 26769152 22175999 -5407847 -41788260 -65047501 -61969697 -38779668 -16569545 -11301612
425 -11301612 -19212655 -26867368 -30404997 -33710191 -31689823 -13220221 16130718 32732263
417 32732263 25646027 12863545 13878870 20617833 13808903 -2534407 -6039488 8062344
409 8062344 19209747 12537229 -3469827 -16210075 -25045198 -28207561 -14449439 15254695
401 15254695 33821435 17404258 -20576279 -45695171 -46319702 -39069868 -35000974 -26875921
393 -26875921 -13124990 -7806002 -16039202 -21940090 -14843059 -7675196 -12853151 -18823323
385 -18823323 -11568599 -2772464 -9734442 -18705267 -265527 41255988 66531715 55808117
377 55808117 35206170 36151070 54554960 67699416 69493590 66494669 54979193 27564840
369 27564840 -5197833 -23105578 -22811016 -16725368 -10019465 -302270 2750957 -16237443
361 -16237443 -47395407 -56228244 -27247985 13448631 33972581 36573191 42238837 50413979
353 50413979 40607634 9483381 -20056504 -30832529 -30148311 -28387897 -19418651 2640096
345 2640096 21817955 14926830 -17672183 -52015135 -68325561 -64354169 -44290689 -13089332
337 -13089332 15465419 23739564 12109075 1138625 1941655 -794461 -21946185 -46033985
329 -46033985 -45317645 -20420980 1070774 5683015 8456045 20296843 26564275 13912473
321 13912473 -1891446 2176069 18406460 17696438 -5941021 -25145975 -19263648 -3595906
313 -3595906 -5825758 -27074362 -42510592 -34949871 -12611478 6814351 16538803 19329420
305 19329420 15214556 1617097 -15415642 -20972980 -8819134 6254502 2822842 -20735496
297 -20735496 -43168073 -46483347 -35988291 -27581405 -23319569 -11457956 12158026 35672948
289 35672948 46372898 43648425 32932590 16896522 -540797 -10334445 -8698711 -6362959
281 -6362959 -16487427 -35215645 -44889758 -36553969 -18333813 -20080 17712770 32976207
273 32976207 34934747 18479470 -2208549 -9074707 -3900129 -1531946 -3559105 2170165
265 2170165 15341617 18437492 5627420 -4615725 1310188 9702898 4398774 -2793699
257 -2793699 9751673 36301512 51209678 47408610 40381609 36749417 28188532 17776582
249 17776582 20566800 30572587 19813822 -15275138 -37848313 -22842339 2095565
242 2095565 -4234097 -37401956 -58693230 -51767907 -35699342 -28383480 -27540468 -26930535
234 -26930535 -25286665 -18275541 -3101849 10233131 12324810 13444517 25348155 31346389
226 31346389 6352300 -35307361 -49045808 -23608104 1444193 -4104071 -19389424
219 -19389424 -13653607 2181617 -3439498 -30441305 -48612550 -41158641 -18764576 3737132
211 3737132 20315801 27548616 27471947 33524561 53566562 70535098 60974613 30573508
203 30573508 9083637 9506203 15590540 14256579 15916298 29849585 39088058 19808023
195 19808023 -22271561 -52864173 -47009573 -14819415 12825032 16494922 2311287 -10963295
187 -10963295 -12108664 -4150171 2998408 1108199 -12474196 -32390811 -46630618 -47355415
179 -47355415 -41495415 -43373204 -55754326 -67071155 -69063328 -65706225 -60628608 -49145784
171 -49145784 -30917234 -17642228 -17051952 -20594277 -19296549 -20057663 -30700535 -39872735
163 -39872735 -31504226 -12027673 -2120410 -5678530 -9016951 -8561799 -14581746 -25203768
155 -25203768 -23063015 -6654770 -573517 -19847983 -44090851 -45306816 -26205845 -10739554
147 -10739554 -7417490 -4521188 2576124 2265909 -10883996 -22339686 -16144744 2292030
139 2292030 12303160 4098302 -9461492 -9698887 3972557 13773076 8467399 39344
131 39344 6377847 22775816 26333804 10777184 -873442 10616384 29432283 24777312
123 24777312 -4664042 -27307526 -21357873 -1345864 6821930 1228001 -1393591 2559320
115 2559320 -2638068 -24160980 -44125718 -42210591 -24811371 -16988282 -27918706 -39004053
107 -39004053 -30046987 -5136138 15309065 19685615 12811400 4080433 -1071186 250064
99 250064 8324112 18195659 23718821 24311015 22372839 16381676 4061405 -9723331 -17273144
90 -17273144 -18907471 -19601436 -16317933 -1997190 16260099 18476593 -1478976 -23586707
82 -23586707 -26392819 -13511453 -3304099 -854695 4041821 14548032 19348361 10854754
74 10854754 -2087271 -6103381 795373 11774407 22362471 30388187 29531794 14711161
66 14711161 -4852498 -9315790 7700891 26394833 23167806 2304327 -8122728 6579109
58 6579109 29151662 35918564 27343607 20925601 24036119 29514233 31750830 29836027
50 29836027 18237729 -6560202 -29897175 -29337141 -5701168 15216232 18842936 20177295
42 20177295 34686089 50148173 45885219 26725785 16199693 21844987 28002490 23103641
34 23103641 16291389 22001136 39895517 55741392 55901133 38569542 15567931 3221188
26 3221188 6649213 13956601 10453995 -3767082 -15696330 -15802407 -6362180 3951620
18 3951620 7409731 1373949 -9138946 -15742611 -18486419 -28211480 -49906894 -69497811
10 -69497811 -67905589 -45599618 -22691427 -15652057 -23389610 -35202605 -42092204 -39556495
2 -39556495 -28863182 -17706193
0 -17706193
$$ Imaginary data points
##PAGE= N=2
##DATA TABLE= (X++(I..I)), XYDATA
65535 -20727038 -18661476 -12834902 -9225762 -15131954 -24613348 -24357289 -12974967 -4426042
65527 -4426042 -10635698 -27282463 -37950207 -28767105 -1126904 26164289 31977288 15623254
65519 15623254 -1321104 -2737006 1203572 -7118311 -21446210 -18047008 8164598 34268745
65511 34268745 41189228 36370398 34690264 32932315 19048398 -2970051 -15698488 -13730926
65503 -13730926 -10624920 -17423833 -26986713 -26212688 -14555395 -1264201 9972041 21543111
65495 21543111 27298757 11095654 -31226157 -76558706 -94035376 -78357866 -52115012
65488 -52115012 -34916170 -24427938 -12490750 -3539326 -3671665 -3017486 12583882 36222230
65480 36222230 44017434 25831991 -3287913 -25496517 -39432728 -51165672 -59119834
65473 -59119834 -57635970 -46826025 -29954173 -8150186 13678156 22889314 11916078
65466 11916078 -9610986 -26619547 -38869370 -56450459 -76309193 -79678190 -58864400
65459 -58864400 -31894112 -18428117 -11747735 8288580 38914402 51500256 29784480
65452 29784480 -6426532 -26004913 -20617172 -817190 27685715 62163191 84760050
65445 84760050 73641639 36997400 12756515 23678006 50645963 62385529 54827905
65438 54827905 45721368 44387219 45414430 43448714 36530461 20953795 -1110781 -14870256
65430 -14870256 -9702612 3449223 7867614 6853536 14139600 25439186 23984557 11923530
65422 11923530 9533179 20720422 26443377 19522436 18963046 37028526 56304732 55939086
65414 55939086 40327962 24390194 9566863 -5558022 -8631490 7984918 25166647
65407 25166647 19977901 2661658 3475929 25874849 40810902 30996366 14693420 15434005
65399 15434005 29005146 35085240 28144439 21083402 23632653 29658837 26549178 11186096
65391 11186096 -5712056 -11611823 -7952093 -8338775 -17275906 -19591862 -1965139 22220010
65383 22220010 26637364 9511567 -1412753 13534092 40503385 53838827 49073038
65376 49073038 41480109 41756057 47170979 50928404 46843225 28436709 -2621605 -27565047
65368 -27565047 -24036278 6588164 35268724 35706594 13303599 -2840047 5801090 27677476
65360 27677476 37164947 24688417 4918149 -4989527 -7349088 -16251857 -31888236 -36440616
65352 -36440616 -20962288 -3611192 -7520435 -26614641 -30324502 -4121026 29750331
65345 29750331 39109095 18214304 -11772075 -30070784 -32865276 -27634109 -22683100 -21643924
65337 -21643924 -20266815 -10558942 4564381 6317540 -17273116 -47293601 -50922935 -25494694
65329 -25494694 -6057529 -19225402 -47741237 -57238804 -43433809 -30153205 -28562135
65322 -28562135 -24960278 -10818750 192413 -4544705 -15285509 -15833520 -7863714 -4703634
65314 -4703634 -9270315 -12731762 -10641374 -7201189 -5354720 -4290443 -6322851 -15116877
65306 -15116877 -25394545 -24645045 -9701240 5543808 4587605 -13471078 -34819506 -47018875
65298 -47018875 -48840057 -45130494 -38495083 -29899560 -23945725 -27070396 -39099178 -51038840
65290 -51038840 -54026893 -47873253 -39287909 -35417786 -40155033 -50262296 -52587885 -34883218
65282 -34883218 -5943200 6689965 -8708787 -27558591 -22209599 -6275773 -17830845
65275 -17830845 -59102971 -85935356 -69156422 -35410810 -24550842 -32259346 -26991219
65268 -26991219 -7564935 -4959045 -28246574 -45813418 -32119534 -4868949 2690557
65261 2690557 -12296986 -24493326 -18308843 -3778839 3257609 438125 -5463215 -11494133
65253 -11494133 -20587492 -35065572 -53193228 -70252801 -78692256 -69069303 -38825536
65246 -38825536 -3333386 10474678 -8609630 -39231817 -49195675 -31886447 -8203356
65239 -8203356 5711781 13931934 20624333 16651886 -1303514 -16540202 -13670865 -289689
65231 -289689 8441728 12661702 18128104 19555174 15217460 22403488 50889041 74153268
65223 74153268 59852622 20404382 -3553733 -6013477 -19817784 -54025162 -72669951
65216 -72669951 -52743729 -21939567 -13213451 -17003416 -9414085 2188896 -1649858 -10290440
65208 -10290440 -260861 18678669 15337316 -9978505 -23174149 -9741988 4530914
65201 4530914 -4924134 -28835299 -45766991 -52213123 -55050919 -51474086 -34046052 -7266741
65193 -7266741 14014663 19396542 10357558 -2104686 -4250613 8884692 25452290 27274240
65185 27274240 11601455 -4024990 -1560355 18360428 38722048 42251704 24477814
65178 24477814 -3462934 -23641898 -26811895 -18614929 -8020381 4782866 22201048
65171 22201048 37107925 38096203 24763524 7774822 -5079138 -14279093 -22370706 -30782939
65163 -30782939 -39271767 -40602339 -23530847 6922221 22216553 2749108 -28867954
65156 -28867954 -31091247 911544 28860038 24971910 5059358 -2833626 2624297 6412544
65148 6412544 6727205 12408989 22317214 26645378 21893881 9986144 -9375414 -31804655
65140 -31804655 -43330223 -37820116 -30585440 -38572810 -55493715 -63767462 -61919086 -58933053
65132 -58933053 -48793586 -17098543 27280662 53940061 50877459 39363234 39150928
65125 39150928 40510816 25678051 760833 -12421834 -6235704 8343782 20974187
65118 20974187 29240550 29215684 13807356 -16811770 -51462564 -75285124 -75950762 -47966160
65110 -47966160 -1272571 37543225 45795915 28502101 11499326 9169875 10483759
65103 10483759 1161350 -13149387 -16116604 -5083994 6111104 5757542 -5386620 -21750892
65095 -21750892 -39581812 -52747222 -51960580 -35622238 -16279134 -8713463 -13044546 -15373765
65087 -15373765 -5233766 11818620 19972011 9483041 -12924467 -29270472 -27505777
65080 -27505777 -14209838 -6825790 -11868076 -16882958 -9128812 4314060 5306504 -9438325
65072 -9438325 -23984877 -26342549 -22667081 -22047666 -19780173 -7683818 7453435 10967274
65064 10967274 2955736 -1571703 3292616 5212759 -5225689 -17241507 -14693177 216316
65056 216316 10911976 10350245 8068981 13300681 23219567 31563090 38263757 43728240
65048 43728240 41621295 26707367 6281709 -4872453 -406743 12582434 23049403
65041 23049403 24380675 14997710 -1382903 -15262816 -18173551 -11426166 -2165439 8481959
65033 8481959 23785102 37408734 34810605 15143281 -1727895 -1589711 2567025 -8426940
65025 -8426940 -26377342 -24946384 -125077 22267383 24406401 18573509 20299851 21452180
65017 21452180 9084753 -5962937 -4377848 7302908 5521910 -9400957 -10848251
65010 -10848251 9059820 21043818 2034720 -26590977 -28727687 -6188414 7758684
65003 7758684 1801340 1649893 24927219 48852555 40539224 2468569 -31980420 -39733357
64995 -39733357 -26838479 -10342923 1433652 9226461 16479043 26342242 37529586
64988 37529586 42746388 38337715 33578284 41051560 59135909 73951229 76736681 67567415
64980 67567415 44895281 8894462 -23464064 -27468507 -3505493 17449944 13393143
64973 13393143 -168493 3717581 24349316 39908320 41239137 36647380 30449489 20523106
64965 20523106 13815979 19748701 27493719 14706431 -15661504 -31254141 -13875058
64958 -13875058 12937827 14311991 -12429964 -39050957 -41269101 -20071241 4252662
64951 4252662 9650820 -9461302 -34789641 -42518054 -32242246 -24801178 -27616209 -22105717
64943 -22105717 2719121 24956548 18952125 -5044151 -15163302 -3751342 6465667
64936 6465667 -540154 -15345651 -23644262 -23582694 -17239201 -4243107 8618751 8442930
64928 8442930 -4095349 -10709376 -1075933 10805916 7994865 -2108810 3467643 31703799
64920 31703799 63742537 76406995 64260218 39183083 15671753 558664 -6204551
64913 -6204551 -6063567 -226033 7836214 13494850 17383121 26139030 42004671 55875370
64905 55875370 57065469 46506175 33192523 21480134 10773976 3638305 2117748
64898 2117748 -1713475 -16880876 -34237225 -32030471 -5974965 21339439 29699057 26353747
64890 26353747 30241925 42826755 50342176 48345351 46078307 45821348 34095150 1622165
64882 1622165 -36393379 -50351877 -27779167 9982096 26841260 8207181 -25828703
64875 -25828703 -46522487 -49940239 -55215630 -72107628 -84577442 -72221545 -36783877
64868 -36783877 1452293 25706562 31975208 23404821 7152875 -5836086 -8055825
64861 -8055825 -2154245 5671158 15020296 25490226 26239217 5218924 -29186725 -47865927
64853 -47865927 -29473041 15943345 56412970 68217910 54818512 39326267 39898077
64846 39898077 50537753 47543644 18612148 -18187143 -33153045 -21473188 -8943784
64839 -8943784 -16956945 -33959045 -32676533 -8373929 14698112 15263066 478370 -6300385
64831 -6300385 5568068 25732105 38897087 39415383 29644359 13021545 -5601570 -17608538
64823 -17608538 -16308613 -5671021 1731358 -1859852 -10634668 -12713390 -5453324 -511652
64815 -511652 -12517899 -43408284 -78757580 -99577471 -97433834 -78567660 -55281075
64808 -55281075 -35268471 -18693336 -2781093 12714063 24723060 31581051 37791565
64801 37791565 50508665 68788231 80714620 77184113 64875493 56249272 48935665
64794 48935665 28842645 -3683777 -26955857 -26611443 -16953853 -19298512 -30325907 -30930853
64786 -30930853 -20387271 -19715219 -38972751 -60124778 -59957768 -37602995 -12053814 -608101
64778 -608101 -5295637 -15323250 -19541777 -17789817 -16706040 -13624818 2374546 25623893
64770 25623893 29136286 3679696 -17712280 -4217606 20222782 10559998 -22036772
64763 -22036772 -19869893 27940442 59707082 32573060 -14658167 -27543533 -16726778
64756 -16726778 -23273309 -42507144 -42463343 -33006753 -51880378 -92483248 -108051946 -87200625
64748 -87200625 -66598253 -63335468 -52381919 -23402309 -4196537 -8317985 -10857008
64741 -10857008 332625 -1344331 -27904428 -44706537 -25810206 1629643 6804701
64734 6804701 8784186 35260303 62493484 49203221 6843383 -17513451 -13692596
64727 -13692596 -11726057 -21452627 -20961065 -4900371 4043852 -2824714 -9818114 -14896262
64719 -14896262 -35968669 -69193965 -81689981 -60848284 -34580115 -26000253 -23153953
64712 -23153953 -13933904 -16694590 -47448016 -82074389 -83178297 -50893378 -20111786
64705 -20111786 -15033529 -27560391 -35256156 -24198015 1959717 24713393 27856981
64698 27856981 17274759 12553319 15491937 6857613 -16334208 -25271289 -914178 30761295
64690 30761295 33361498 15466231 17750839 48240889 65007148 34367633 -18828988
64683 -18828988 -38224689 -2801513 50329765 70144330 47192525 16723550 9717731
64676 9717731 15726822 6308456 -16394254 -20714794 2935836 21519511 6911669 -20981759
64668 -20981759 -24345867 -3437819 8342924 -3331931 -19148269 -24076527 -28585741
64661 -28585741 -43016872 -56427319 -55533048 -47294290 -47603999 -58103320 -66816082 -65911851
64653 -65911851 -60356380 -62229104 -78997264 -102023468 -107802078 -80939886 -36459804
64646 -36459804 -7643683 -10513779 -32953534 -59110609 -86090308 -110165918 -115951195
64639 -115951195 -94250337 -59138379 -32758675 -20208162 -11436173 -1216020 5885232
64632 5885232 7192940 7379672 12608538 25294572 41801163 50812382 40177478 12018524
64624 12018524 -15188069 -27016883 -29089231 -34223111 -40705549 -35258532 -14028646 11434507
64616 11434507 28815003 35898126 36282912 32517906 25404803 15295250 3771982 -3334699
64608 -3334699 1867462 19351459 36993468 41771650 31987548 14445272 -4572474 -19877293
64600 -19877293 -26106113 -23967651 -21778217 -23286876 -21810180 -15093032 -14937117 -28151738
64592 -28151738 -38682531 -28120024 -6485189 601908 -8282827 -10246326 325090
64585 325090 -203045 -23923996 -46220624 -41192920 -21667925 -19668558 -39375995 -54030527
64577 -54030527 -44296829 -17733906 9093154 28969566 42127685 50901020 59829374
64570 59829374 70346018 73738580 59721595 33681806 15436951 17499570 31199622
64563 31199622 36126619 18632180 -17250626 -50453077 -56560611 -29629966 9181040
64556 9181040 30377252 21644036 -9333669 -48584353 -80354748 -85535528 -55163089
64549 -55163089 -7494515 24256111 25802938 11538985 -888769 -10099358 -20613578
64542 -20613578 -29686020 -34007734 -36836334 -38902817 -33452445 -19681307 -9891289 -12840928
64534 -12840928 -20300045 -20758199 -15924158 -12211542 -7563921 -1090980 -4416872 -25373548
64526 -25373548 -49077570 -55227274 -47995654 -47301581 -55111170 -55353527 -46587131 -46540147
64518 -46540147 -57629967 -55661363 -26589208 8871073 24477901 22346059 18873858
64511 18873858 16578241 14363203 28608461 71037859 112895310 107580849 54735321
64504 54735321 10644179 21421454 69267373 99712755 82025559 26621174 -37219654
64497 -37219654 -77872090 -70098153 -16049749 44305380 66619703 48320381 24773574
64490 24773574 21096519 28477911 29567342 22770099 11899204 -6122265 -28067156 -36900680
64482 -36900680 -25966209 -16696879 -31141669 -56917199 -63003325 -44831135 -28067381
64475 -28067381 -27409906 -28087744 -15729508 -743534 401833 -10133249 -20450080 -27792120
64467 -27792120 -33174744 -29814554 -13548249 5310386 16875108 28299012 47270537
64460 47270537 59333315 45071188 13430135 -8525502 -16586697 -30502274 -51842704
64453 -51842704 -55379023 -35561332 -26982240 -52923248 -81644859 -69011228 -26191527
64446 -26191527 -3569037 -14255933 -18770341 6766436 30960527 18510695 -13021861
64439 -13021861 -21053698 -1700019 11016315 681287 -13781423 -18123754 -25839032
64432 -25839032 -47585911 -64767358 -54996758 -27479677 -10731958 -13792166 -20810295
64425 -20810295 -20388275 -19015437 -22650747 -23645991 -14180909 849023 14363989 30357207
64417 30357207 54466284 77023302 79077993 56192408 26042527 8520050 5346778
64410 5346778 4791091 1635409 4015997 19584137 42086000 56871930 55751128 40012487
64402 40012487 12543970 -21399063 -44805857 -36422012 1456990 35216668 36800620
64395 36800620 20658448 23472602 50881559 70126177 59988332 40222553 37047630
64388 37047630 44426916 42245082 33436458 34277297 40037925 32808638 19274483 26453769
64380 26453769 54905186 68799251 46068003 10760814 -3875395 -2583355 -14447032
64373 -14447032 -46371065 -76061089 -86254445 -82831564 -77133955 -68109602 -48269042
64366 -48269042 -17809993 11670214 23487741 7030106 -31743949 -71833078 -93122104
64359 -93122104 -89036687 -63279876 -23260402 17943374 43462456 46796030 37880583
64352 37880583 27055610 11724531 -10999078 -29226375 -30029896 -21658246 -23974537 -38443310
64344 -38443310 -44226045 -25554186 9990037 41108322 49913785 32312038 4228604
64337 4228604 -6231368 12261440 37670914 44245017 41503874 57646247 87241930
64330 87241930 89944531 49926389 2409796 -16202864 -12077396 -3564232 19635996
64323 19635996 67855544 105672035 85810132 24172781 -9512529 13594780 41786762
64316 41786762 20414828 -29777789 -47176435 -17134068 16098908 16904263 -1320020
64309 -1320020 -8468538 1152313 13925362 21656393 24198143 19175107 4240602 -15472637
64301 -15472637 -31953233 -42023813 -43872018 -32748852 -8966176 15085998 25473741
64294 25473741 21604272 13356545 7235280 3044789 -290143 -5029867 -16979724 -37454249
64286 -37454249 -56290265 -63440871 -63117337 -63543520 -58380321 -37356493 -13012314 -12172400
64278 -12172400 -34776375 -45868867 -22200867 13943088 25060491 5831445 -19371409
64271 -19371409 -32781702 -35690423 -34267715 -33841313 -40187544 -47715995 -35274964 5376905
64263 5376905 46152107 51912678 25625252 -1952512 -19718218 -40427054 -60603247
64256 -60603247 -55412041 -22233330 6225031 7452918 -2487265 -2533838 415420 -7840881
64248 -7840881 -21270335 -29476533 -38567357 -52208399 -51791476 -21342978 23123104 52971247
64240 52971247 61630938 58596832 46433527 29342183 27413935 51316854 74736473
64233 74736473 64114218 28192677 6593055 14396712 29651571 33160265 28391979
64226 28391979 20463348 6016820 -11179876 -21292794 -29105184 -48132867 -71455456
64219 -71455456 -76089132 -61127060 -52899389 -64199869 -76057767 -70556156 -55532082
64212 -55532082 -43954921 -33059731 -18758291 -9816452 -12472324 -17783084 -16263093 -9126675
64204 -9126675 3075214 23417181 42126328 40259727 21094834 13956202 32399187
64197 32399187 51815676 45070875 17674202 -10824742 -37420786 -65162941 -82097112
64190 -82097112 -75746449 -54415326 -32883394 -11904555 8201448 12542388 -4883509
64183 -4883509 -20474509 -12286126 3279198 -2589748 -21230537 -18273767 10889243 33924594
64175 33924594 30662919 15566777 5785116 -2114346 -13540602 -20317590 -16483247 -10129436
64167 -10129436 -8720402 -8675388 -7605863 -11190004 -20217091 -25647489 -24245979 -25632297
64159 -25632297 -36248691 -48245641 -51418682 -46111380 -38363748 -30878624 -23162618 -13587199
64151 -13587199 -119478 13699359 16059217 1202179 -16077984 -14006026 8680379
64144 8680379 32595302 44399571 47855138 46685948 33493598 3093219 -34121414
64137 -34121414 -59025162 -59301549 -38605523 -16484237 -14825841 -34969662 -53373037
64130 -53373037 -50239556 -34673243 -28557871 -35722533 -44852674 -52968774 -63659956 -69614389
64122 -69614389 -61694120 -49974356 -50099016 -54131084 -43301725 -24306152 -19553942 -24068752
64114 -24068752 -10498862 20160145 33982238 19385223 5958124 14343007 28836085
64107 28836085 38251899 60356274 98230285 113593218 80148388 30617412 11816624
64100 11816624 20170905 21548661 10479696 5878505 6892584 -732838 -6280290 12078443
64092 12078443 41385437 46833737 29689066 28374577 55976355 77251126 60667522
64085 60667522 20778882 -6112979 -4450235 14183020 27912104 20222262 -4690162
64078 -4690162 -20096894 -7620339 13326209 10066856 -13267613 -20083379 3216544
64071 3216544 29381543 36090396 36430914 47137492 54572453 36238139 -495795 -24499758
64063 -24499758 -20235124 -5506369 -9627880 -39270217 -67032651 -59342402 -20178298
64056 -20178298 5675510 -13502923 -53860559 -69040794 -51576394 -31091091 -22160679
64049 -22160679 -12851018 -2996421 -11085690 -34371496 -41451536 -19027203 8141935 18239939
64041 18239939 19206941 18984865 5205784 -23922441 -42282762 -34839439 -24148326 -32036164
64033 -32036164 -43664335 -37689931 -24491983 -23661859 -28715914 -26272881 -26445644 -40172830
64025 -40172830 -48859666 -32903329 -9537675 -3676979 -1214039 25186211 60405529
64018 60405529 65158508 39675881 19375354 12229926 -6809164 -36897475 -42233561
64011 -42233561 -15770419 -593749 -23746272 -52121204 -44636356 -13974931 -1971029
64004 -1971029 -17218121 -31993128 -28652095 -18259871 -16383105 -23327222 -30365700 -31772841
63996 -31772841 -27525206 -19494965 -6918324 11498014 28239614 29031333 14696720 9483133
63988 9483133 29703400 55640185 59556306 50798953 58892974 77298069 66969922 22577660
63980 22577660 -8865315 5945679 39922608 49201420 31390904 13486231 9205492
63973 9205492 16837306 36181828 58659454 60514472 34067865 7444631 6132577 14809008
63965 14809008 7270292 -6349851 1210518 23620847 30023675 16883121 10404536 18561359
63957 18561359 19310994 1536470 -16523094 -18687530 -12257779 -8342419 -4586588 3062527
63949 3062527 10723269 15679525 18624419 14022857 -4513005 -28369799 -41368265 -42146265
63941 -42146265 -40592243 -36302679 -23599078 -13273492 -21419159 -38907157 -42545963 -35439400
63933 -35439400 -41060919 -55497615 -47287841 -15019935 -977124 -26468521 -54322326
63926 -54322326 -44719522 -13017020 2471184 252016 3252185 8903624 -4731448 -34044969
63918 -34044969 -51614173 -48990939 -42799303 -40202038 -31710359 -19493411 -20826257 -37471594
63910 -37471594 -48914551 -43555098 -33436386 -30489121 -28921953 -19567545 -4605773 9463132
63902 9463132 19875422 24611030 24460747 28780492 43781479 55726751 44493450 15946732
63894 15946732 9254 10993074 29193072 29661774 11914765 -7678898 -17702966
63887 -17702966 -17359879 -14104284 -22448241 -50341257 -79965185 -78957310 -40454263 4470423
63879 4470423 26114589 31334971 43147276 59068315 52614801 13991546 -29749867
63872 -29749867 -41798024 -15475471 17718430 20048098 -11950808 -42045467 -35208884
63865 -35208884 -43757 21277184 4510838 -30010479 -45782003 -30783439 -2949153
63858 -2949153 13243327 8232281 -6089151 -6942680 14478651 39568008 45611933 38383471
63850 38383471 41687755 57065745 62091038 52918534 54985861 77015901 87747911 62331107
63842 62331107 23164570 5226367 5119599 -1858384 -14322375 -12760887 -973433 483395
63834 483395 -5544628 1045566 15434788 12774025 -4441799 -6167740 12096585 18757711
63826 18757711 962360 -12189104 -504759 13779332 10736397 13941101 48851373
63819 48851373 86431678 73117201 6751718 -58264982 -81387578 -75783883 -71110219
63812 -71110219 -68676955 -51929476 -22052121 -416778 816371 -5884280 -2339318 9787785
63804 9787785 11799505 -4854623 -25463942 -32594570 -29874289 -32804559 -42370000 -44043257
63796 -44043257 -30688879 -9311291 14650774 41117090 61835497 63705563 51122353
63789 51122353 45259942 54081644 62457236 59012590 50817879 42243328 24089412 -1931465
63781 -1931465 -12875920 1651286 17662682 11143666 -5900930 -8236045 3031148
63774 3031148 11786160 20276625 37715014 47846745 25592482 -16802304 -35914112
63767 -35914112 -13933456 20194822 32739217 22730283 10199586 9063709 20111502
63760 20111502 34081525 36223907 21703965 6644594 8442945 18836977 16386388
63753 16386388 1279989 -6881523 -3231295 -969121 -241394 13904736 36303487 38198804
63745 38198804 12375801 -9276558 -1244905 20596347 30612881 33809764 47647995
63738 47647995 64318581 63199953 49926071 51198469 71913561 84435898 66677610
63731 66677610 32005253 11804476 18035517 31813037 27617589 4036937 -14431681
63724 -14431681 -8038423 13723384 27546674 28343290 29407305 35238384 36074110 30972046
63716 30972046 33759450 50120283 69240146 83720938 95866887 98846302 78241233
63709 78241233 42241666 22116098 28258641 33884552 19703843 4959925 11351408
63702 11351408 25696481 26926977 22698161 26078345 21645843 -5904119 -30853180 -18897161
63694 -18897161 13953939 21608006 -1583885 -18590314 -14400236 -12070073 -19721587 -13275550
63686 -13275550 13199619 27365408 11054943 -8220734 -4434432 4694753 -6111812
63679 -6111812 -21390609 -9940606 19951460 26898217 -6754396 -51284800 -63628015
63672 -63628015 -30211906 22119188 49964552 34671866 3442304 -2574775 19416862
63665 19416862 35679611 31316803 29411436 41576801 38938598 2519112 -31163096
63658 -31163096 -17693821 23422234 32884423 -800063 -26889407 -10082502 22966130
63651 22966130 31651233 19400320 18107833 37258823 54919661 49927018 23310982
63644 23310982 -9092144 -32032238 -38649092 -30211453 -11549449 10122437 21086387
63637 21086387 6787232 -27358271 -50925662 -42403665 -21480109 -24527741 -50640502
63630 -50640502 -60117448 -31440779 9813472 31579915 36268152 40595007 39941921 22874901
63622 22874901 5312577 15772226 50514323 74571786 69860941 54125294 45990907
63615 45990907 39638914 27643670 22851747 34783078 42044280 16641730 -30142471
63608 -30142471 -53289048 -28960304 17992339 49298520 56874598 57277520 56836944 43488599
63600 43488599 12475706 -17268672 -21236568 2247846 28804781 33253775 15668049
63593 15668049 647632 9471802 35047707 50504078 43449773 31615770 36366111
63586 36366111 49547951 42526856 7152444 -29905053 -41079744 -31744660 -26790848
63579 -26790848 -32892585 -33255083 -20519153 -15459845 -39995363 -81698686 -103236938 -88309800
63571 -88309800 -61789182 -54714512 -62277059 -53953333 -19286071 19363079 43308492
63564 43308492 62131140 87030154 100951310 80832506 38445403 10407580 9858167
63557 9858167 15628971 11695165 8648231 17000913 26529105 27320416 27923909 34667825
63549 34667825 34607905 20678954 14145893 35393723 67030733 74877865 55291703 31945092
63541 31945092 14436317 -5366390 -19716371 -7820797 20807465 24964636 -9197271
63534 -9197271 -41158162 -30727184 8651108 38017965 49347104 60440886 70974978
63527 70974978 62173183 34294507 8075999 -11648671 -38662117 -66136307 -61528340
63520 -61528340 -17438539 24161252 24175798 135421 -1506456 29054183 60190061 71744088
63512 71744088 75882191 81253629 72536137 42688250 16921912 19114879 32921596 24628424
63504 24628424 -5996953 -27645783 -26437958 -21243163 -25233594 -23718975 -5503117 10442847
63496 10442847 3026989 -14955788 -16034921 -1702171 3180775 -4352316 1679314 30345523
63488 30345523 50002569 28931053 -18512992 -47846329 -38322768 -11962009 -1228183
63481 -1228183 -14113982 -34420927 -45072736 -44195213 -41547127 -43436110 -43426247 -30911119
63473 -30911119 -8499741 5997306 -807741 -21793888 -38362932 -40526138 -31571939
63466 -31571939 -18393668 -7213461 -6029281 -18960305 -35877878 -38405526 -22127560
63459 -22127560 -5490985 -9516063 -32822090 -53539109 -53830516 -36362994 -17506930
63452 -17506930 -10648072 -17355653 -29246377 -34756780 -26863901 -8123799 11765555 24805916
63444 24805916 30987955 35996303 44638386 56670346 65762904 61701310 39090928 7883222
63436 7883222 -10547539 -5728066 7080664 4639294 -12915404 -21527785 -7284701 13352086
63428 13352086 17204247 6800040 4323202 18829214 35767146 39635730 32815408 27274007
63420 27274007 28055071 31037978 30376502 23296703 12515088 7156541 15870308 35246566
63412 35246566 49413308 44856058 23100491 -2735254 -20510588 -27245630 -28842556
63405 -28842556 -33215377 -41579468 -47786882 -48536473 -48665889 -49811812 -41530561 -16995664
63397 -16995664 8047748 11537127 622978 8014046 44523977 77776589 74468941
63390 74468941 45789843 29643278 40338528 59526139 69246361 68160198 56507323
63383 56507323 30651306 -1953976 -23028371 -25635878 -19180131 -7817458 16115862
63376 16115862 49540374 70901894 67958782 54494414 44721307 31054572 7473267
63369 7473267 -5184548 12536382 37833483 29475489 -9675599 -32455398 -17797555
63362 -17797555 -2043974 -18331157 -39375629 -17062182 40914228 76251285 58751144
63355 58751144 21292766 7506251 16393496 16414037 -7008524 -38060438 -53047904 -40802802
63347 -40802802 -8484139 21434167 27540070 12229062 3833 6144348 19345108
63340 19345108 24255689 24923089 30751545 34741639 25934384 10738622 -1061736 -19377672
63332 -19377672 -54556947 -84984728 -80175240 -54017830 -53096625 -82962622 -90295003 -42019280
63324 -42019280 17394669 24128843 -18010277 -51690487 -49149155 -33595896 -23529927
63317 -23529927 -6258659 22237143 35349183 17400049 -4719466 848090 23798537
63310 23798537 30885092 17281809 8266000 15745773 22521148 12758345 -5670878 -16488859
63302 -16488859 -14033465 1474663 30965881 66425029 86140688 75415182 46465000
63295 46465000 24435252 16834250 9919319 -5571763 -19415484 -16969350 1386436
63288 1386436 21366042 27442503 10969302 -23627684 -54642370 -57168275 -32106098
63281 -32106098 -10553523 -15919269 -32385003 -29643179 -9677023 -2212427 -15152939
63274 -15152939 -20951666 -2327974 18074840 13726493 -3559738 -4313471 10413964 11359802
63266 11359802 -13314993 -41830923 -50114499 -37733549 -18894568 -5402203 -2732284
63259 -2732284 -8502621 -11953548 -6888626 -3118227 -9725624 -11456023 14958767 59687056
63251 59687056 81380052 58941569 17926086 -7704513 -17381656 -28715567 -39469726
63244 -39469726 -30225739 2188536 35197218 43745178 21310600 -16970305 -41363016
63237 -41363016 -27176555 17123912 48356673 31853062 -17868283 -54829097 -55066878
63230 -55066878 -35098542 -20450585 -16502702 -14331117 -8339378 -18278 6416833 7312566
63222 7312566 3977338 2538974 2963521 -4940550 -22844192 -31043141 -14991725 1915573
63214 1915573 -18651378 -70700899 -98875821 -67411030 -8165158 21018917 5520214
63207 5520214 -22860467 -36042459 -33611407 -23404253 -8020027 5580476 5653471 -7875185
63199 -7875185 -21250297 -24794259 -19748822 -7461411 10191345 16904450 -9793683 -64825323
63191 -64825323 -106793230 -99016681 -51144387 -7088422 2610679 -14536486 -30560733
63184 -30560733 -27611266 -11883444 -4382263 -17340303 -37609405 -39195060 -15428783
63177 -15428783 10560436 14072736 -2336221 -18044904 -22757508 -21763244 -19539948 -15180075
63169 -15180075 -13002577 -21263147 -36415179 -40924236 -22006639 14910757 53041433
63162 53041433 76558688 76407078 55065376 28450435 13554319 10994278 7876574 -1111999
63154 -1111999 -6373455 -53161 11243565 15949128 11465069 4504933 4788532 19214612
63146 19214612 42151044 52016674 32774464 755437 -9423939 7300526 14399540
63139 14399540 -16505667 -64411568 -88200966 -81013865 -69957709 -71614762 -75744305
63132 -75744305 -70775996 -59439570 -46296876 -31662565 -21592856 -24000130 -31567432
63125 -31567432 -29114187 -21702743 -31780399 -60317666 -76238265 -60028230 -34848284
63118 -34848284 -31710344 -41389977 -30155036 4398407 24960702 7163514 -25820727
63111 -25820727 -35965881 -19920385 -5433758 -5485956 435491 31283955 67577036 68697271
63103 68697271 24457811 -29354676 -53565776 -47704092 -36813800 -30729950 -18820392
63096 -18820392 56559 8298190 -4062789 -24786728 -40379778 -52773048 -63277598
63089 -63277598 -58789417 -32424846 -3951385 2622760 -6019876 -3622860 12016217 12078136
63081 12078136 -19838138 -59478400 -72031255 -56257989 -40106589 -38247672 -34218959
63074 -34218959 -10033479 22022967 31517156 9527589 -18065514 -20605783 4818491
63067 4818491 37599174 59948069 66614786 55644195 28143086 -998237 -9569542
63060 -9569542 6790499 28033243 35397547 30814227 21737886 1786254 -36467110 -78496764
63052 -78496764 -97704209 -87050197 -64038467 -43363203 -21670569 5040476 24854872
63045 24854872 23470897 6502041 -5365153 -3439277 -2262011 -17571117 -39133271
63038 -39133271 -37730699 -3844700 31199091 26841994 -16585248 -56283298 -59162202
$$ [...]
##END NTUPLES=NMR SPECTRUM
##END=
