##TITLE=31Pdec_LR-668-RM1
 , 24 sc
 8.4.2019
##JCAMPDX= 6.0         $$ Bruker NMR JCAMP-DX V2.0
##DATA TYPE= NMR FID
##DATA CLASS= NTUPLES
##ORIGIN= UXNMR, Bruker Analytische Messtechnik GmbH
##OWNER= root
$$ XWIN-NMR		Version 3.5
$$ Tue Apr  9 15:00:46 2019 Russian Standard Time (UT+4h)  she@DPX200
##.OBSERVE FREQUENCY= 81.013821
##.OBSERVE NUCLEUS= ^31P
##.DELAY= (6, 6)
##.ACQUISITION MODE= SIMULTANEOUS
##.ACQUISITION SCHEME= undefined
##.AVERAGES= 24
##.DIGITISER RES= 17
##SPECTROMETER/DATA SYSTEM= spect
##.PULSE SEQUENCE= zgpg30
##.SOLVENT NAME= CDCl3
##.SHIFT REFERENCE= (INTERNAL, CDCl3, 0, 243.863)
##AUDIT TRAIL= $$ (NUMBER, WHEN, WHO, WHERE, WHAT)
$$ ##TITLE= Audit trail, XWIN-NMR		Version 3.5
$$ ##JCAMPDX= 5.01
$$ ##ORIGIN= Bruker BioSpin GmbH
$$ ##OWNER= she
$$ F:/spectra/data/she/nmr/P31/1/audita.txt
$$ ##AUDIT TRAIL=  $$ (NUMBER, WHEN, WHO, WHERE, WHAT)
(   1,<2019-04-09 14:59:43.31 +0400>,<she>,<DPX200>,
      <created by zg, POWCHK disabled, PULCHK disabled
       configuration hash MD5:
       00 E9 B6 7A A2 85 ED C7 34 08 36 98 17 FE 4E 26
       data hash MD5: 32K
       1A 43 0D B0 8A B3 58 DA D1 A4 1B A3 5F 82 26 AC>)
$$ ##END=
$$ 
$$ hash MD5
$$ E8 02 5F CA 5A BF B8 7E 8F 15 26 49 31 8C 32 1D
##$RELAX= 
##$RELAX= 
##$RELAX= 
##$RELAX= 
##$RELAX= 
##$RELAX= 
##$RELAX= 
##$RELAX= 
$$ Bruker specific parameters
$$ --------------------------
##$DU= <F:/spectra>
##$EXPNO= 1
##$NAME= <P31>
##$PROCNO= 1
##$TYPE= <nmr>
##$USER= <she>
##$AMP= (0..31)
100 100 100 100 100 100 100 100 100 100 100 100 100 100 100 100 100 100 
100 100 100 100 100 100 100 100 100 100 100 100 100 100 
##$AQSEQ= 0
##$AQ_mod= 1
##$AUNM= <au_zg>
##$AUTOPOS= <>
##$BF1= 81.014009
##$BF2= 200.13
##$BF3= 200.13
##$BF4= 200.13
##$BF5= 200.13
##$BF6= 200.13
##$BF7= 200.13
##$BF8= 200.13
##$BYTORDA= 1
##$CFDGTYP= 0
##$CFRGTYP= 5
##$CHEMSTR= <none>
##$CNST= (0..31)
1 1 145 1 1 1 1 1 1 1 1 1 1 1 1 1 1 1 1 1 1 1 1 1 1 1 1 1 1 1 1 1 
##$CPDPRG= <waltz16>
##$CPDPRG1= <>
##$CPDPRG2= <waltz16>
##$CPDPRG3= <>
##$CPDPRG4= <mlev>
##$CPDPRG5= <mlev>
##$CPDPRG6= <mlev>
##$CPDPRG7= <mlev>
##$CPDPRG8= <mlev>
##$CPDPRGB= <>
##$CPDPRGT= <>
##$D= (0..31)
0 1 0 0 0 0 0 0 0 0 0 0.03 2e-05 3e-06 0 0 0 0 0 0 0 0 0 0 0 0 0 0 0 0 
0 0 
##$DATE= 1554807582
##$DBL= (0..7)
120 120 120 11 120 120 24 19 
##$DBP= (0..7)
150 150 150 150 150 150 150 150 
##$DBP07= 0
##$DBPNAM0= <>
##$DBPNAM1= <>
##$DBPNAM2= <>
##$DBPNAM3= <>
##$DBPNAM4= <>
##$DBPNAM5= <>
##$DBPNAM6= <>
##$DBPNAM7= <>
##$DBPOAL= (0..7)
0.5 0.5 0.5 0.5 0.5 0.5 0.5 0.5 
##$DBPOFFS= (0..7)
0 0 0 0 0 0 0 0 
##$DE= 6
##$DECBNUC= <off>
##$DECIM= 4
##$DECNUC= <off>
##$DECSTAT= 4
##$DIGMOD= 1
##$DIGTYP= 9
##$DL= (0..7)
0 0 52 120 120 21 21 25 
##$DP= (0..7)
150 150 150 150 150 150 150 150 
##$DP07= 0
##$DPNAME0= <>
##$DPNAME1= <>
##$DPNAME2= <>
##$DPNAME3= <>
##$DPNAME4= <>
##$DPNAME5= <>
##$DPNAME6= <>
##$DPNAME7= <>
##$DPOAL= (0..7)
0.5 0.5 0.5 0.5 0.5 0.5 0.5 0.5 
##$DPOFFS= (0..7)
0 0 0 0 0 0 0 0 
##$DQDMODE= 0
##$DR= 17
##$DS= 0
$$ [...]
##$SUBNAM1= <"">
##$SUBNAM2= <"">
##$SUBNAM3= <"">
##$SUBNAM4= <"">
##$SUBNAM5= <"">
##$SUBNAM6= <"">
##$SUBNAM7= <"">
##$SUBNAM8= <"">
##$SUBNAM9= <"">
##$SW= 369.568048894756
##$SWIBOX= (0..15)
0 1 3 0 0 0 0 0 0 0 0 0 0 0 0 0 
##$SW_h= 29940.119760479
##$TD= 32768
##$TD0= 1
##$TE= 0
##$TE2= 300
##$TE3= 300
##$TEG= 300
##$TL= (0..7)
0 120 53 12 22 120 120 120 
##$TP= (0..7)
150 150 150 150 150 150 150 150 
##$TP07= 0
##$TPNAME0= <>
##$TPNAME1= <>
##$TPNAME2= <>
##$TPNAME3= <>
##$TPNAME4= <>
##$TPNAME5= <>
##$TPNAME6= <>
##$TPNAME7= <>
##$TPOAL= (0..7)
0.5 0.5 0.5 0.5 0.5 0.5 0.5 0.5 
##$TPOFFS= (0..7)
0 0 0 0 0 0 0 0 
##$TUNHIN= 0
##$TUNHOUT= 0
##$TUNXOUT= 0
##$USERA1= <user>
##$USERA2= <user>
##$USERA3= <user>
##$USERA4= <user>
##$USERA5= <user>
##$V9= 5
##$VALIST= <valist>
##$VCLIST= <CCCCCCCCCCCCCCC>
##$VD= 0
##$VDLIST= <DDDDDDDDDDDDDDD>
##$VPLIST= <PPPPPPPPPPPPPPP>
##$VTLIST= <TTTTTTTTTTTTTTT>
##$WBST= 1024
##$WBSW= 4
##$XGAIN= (0..3)
0 0 0 0 
##$XL= 0
##$YL= 0
##$YMAX_a= 122800
##$YMIN_a= -236056
##$ZGOPTNS= <>
##$ZL1= 120
##$ZL2= 120
##$ZL3= 120
##$ZL4= 120
##$ABSF1= 60
##$ABSF2= -190
##$ABSG= 5
##$ABSL= 3
##$ALPHA= 0
##$AQORDER= 0
##$ASSFAC= 0
##$ASSFACI= 0
##$ASSFACX= 0
##$ASSWID= 0
##$AUNMP= <proc_1d>
##$AZFE= 0.1
##$AZFW= 0.5
##$BCFW= 1
##$BC_mod= 2
##$BYTORDP= 1
##$COROFFS= 0
##$CY= 9.86611175537109
##$DATMOD= 1
##$DC= 1
##$DFILT= <>
##$DTYPP= 0
##$F1P= 182.46299112037
##$F2P= -745.623069630181
##$FCOR= 0.5
##$FTSIZE= 0
##$FT_mod= 0
##$GAMMA= 1
##$GB= 0
##$INTBC= 1
##$INTSCL= 1
##$ISEN= 30
##$LB= 1
##$LEV0= 0
##$LPBIN= 0
##$MAXI= 11.51145
##$MC2= 0
##$MEAN= 0
##$ME_mod= 0
##$MI= 1.244541
##$NCOEF= 0
##$NC_proc= 0
##$NLEV= 6
##$NOISF1= 0
##$NOISF2= 0
##$NSP= 1
##$NTH_PI= 0
##$NZP= 1
##$OFFSET= 243.8632
##$PC= 1.4
##$PHC0= -1815.05
##$PHC1= 71.19899
##$PH_mod= 0
##$PKNL= yes
##$PPARMOD= 0
##$PSCAL= 0
##$PSIGN= 0
##$REVERSE= no
##$SF= 81.0140731611343
##$SI= 65536
##$SIGF1= 0
##$SIGF2= 0
##$SINO= 80
##$SIOLD= 65536
##$SREGLST= <31P.CDCl3>
##$SSB= 0
##$STSI= 0
##$STSR= 0
##$SW_p= 25641.0256410257
##$SYMM= 0
##$S_DEV= 0
##$TDeff= 0
##$TDoff= 0
##$TI= <>
##$TILT= no
##$TM1= 0
##$TM2= 0
##$TOPLEV= 0
##$USERP1= <user>
##$USERP2= <user>
##$USERP3= <user>
##$USERP4= <user>
##$USERP5= <user>
##$WDW= 1
##$XDIM= 64
##$YMAX_p= 0
##$YMIN_p= 0
$$ End of Bruker specific parameters
$$ ---------------------------------
##NTUPLES= NMR FID
##VAR_NAME=  TIME,          FID/REAL,        FID/IMAG
##SYMBOL=    X,             R,               I
##VAR_TYPE=  INDEPENDENT,   DEPENDENT,       DEPENDENT
##VAR_FORM=  AFFN,          ASDF,            ASDF
##VAR_DIM=   16384,         16384,           16384
##UNITS=     SECONDS,       ARBITRARY UNITS, ARBITRARY UNITS
##FACTOR=    3.34e-05,      1,               1
##FIRST=     0,             0,               0
##LAST=      0.547192200000001, 0,           0
##MIN=       0,             -236056,         0
##MAX=       0.547192200000001, 122800,      0
$$ Real data points
##PAGE= N=1
##DATA TABLE= (X++(R..R)), XYDATA
$$ plain form
0 0 0 0 0 0 0 0 0 0 0 0 0 0 0 0 0 5 -13 23 -24 24 -24 26 -34 41 -48 51 -61 71 -79 90 -104 114 -133 145 -163 182
36 182 -203 227 -255 280 -311 341 -374 417 -459 506 -557 614 -675 745 -824 908 -1009 1122
54 1122 -1250 1398 -1579 1794 -2060 2397 -2846 3465 -4384 5888 -8799 16482 -75159 -236056
68 -236056 -120422 10664 113308 98307 46818 9394 23913 37351 22949 -39114 -98058
79 -98058 -111928 -64434 19916 97046 122800 87575 11420 -61015 -92784 -76526 -30687 10660
91 10660 24606 27147 30705 48839 55270 33877 -17042 -70682 -99075 -74172 -16408 45697 78067
104 78067 76188 47223 8488 -27603 -51734 -58003 -50527 -31905 -5353 27174 55323 70506 56512
117 56512 18774 -28602 -62793 -70913 -52410 -23640 16394 49641 67788 61581 34271 -7825
$$ packed form
0@%%%%%%%%%%%%%%%Nj8L6m7M8m8N0o0P5q9R9j12J32j50J69j94K18k47K78l08L45
36A82l85M30m82N35n91O52p15P91q76R65j063J171j289J420j569J732j917K131
54A122k372K648k977L373l854M457n243O311p849J0272j4687K5281r1641j60897
68b36056J15634J31086J02644j5001n1489l7424J4519J3438j4402o2063n8944
79i8058j3870M7494Q4350P7130K5754l5225p6155p2435l1769J6258M5839M1347
91A0660J3946K541L558J8134O431k1393n0919n3640k8393K4903N7764O2105L2370
104G8067j879k8965l8735l6091k4131o269P476J8622K6552L2527K8149J5183j3994
117E6512l7738m7376l4191q120J8503K8770M0034L3247J8147o207k7310m2096
$$ plain form
129 -7825 -42139 -59243 -58421 -41494 -11947 23586 54913 68181 54415 21545 -15182 -41900 -53717
142 -53717 -54090 -42778 -15098 27136 73038 90619 63682 2600 -51613 -75875 -64536 -39024
154 -39024 -15175 4061 33330 65505 77155 55354 626 -55800 -84847 -75520 -40542 1183
166 1183 38253 66365 72508 50550 5404 -42934 -64922 -54857 -34218 -13077 4896 27872
178 27872 59260 72901 49136 -6779 -61062 -84526 -67739 -29189 10063 37609 58621 66378
190 66378 54738 21107 -25531 -59471 -72760 -58784 -31330 6733 44699 72943 74288 52073
202 52073 7108 -39481 -70489 -78560 -57733 -19242 28543 67719 76967 56552 18394 -17224
214 -17224 -41826 -54387 -57132 -45674 -15220 28001 63516 73879 50892 10254 -29608 -55034
$$ packed form
129g825l4314j7104Q22J6927K9547L5533L1327J3268j3766l2870l6727k6718j1817
142e3717l73J1312K7680M2234M5902J7581k6937o1082n4213k4262J1339K5512
154c9024K3849J9236K9269L2175J1650k1801n4728n6426k9047R327L4978M1725
166A183L7070K8112O143k1958m5146m8338k1988J0065K0639K1141J7973K2976
178B7872L1388J3641k3765n5915n4283k3464J6787L8550L9252K7546K1012P757
190F6378j1640l3631m6638l3940j3289J3976K7454L8063L7966K8244J345k2215
202E2073m4965m6589l1008q071K0827L8491M7785L9176R248k0415l8158l5618
214a7224k4602j2561k745J1458L0454M3221L5515J0363k2987m0638l9862k5426
$$ plain form
226 -55034 -62820 -52637 -24971 16637 50329 66764 54538 20383 -12553 -39549 -53432 -58327
238 -58327 -50307 -20342 26754 68500 87003 67914 19515 -30618 -66244 -75568 -59639 -24997
250 -24997 16931 54769 74113 62912 32954 -6910 -35912 -59182 -68076 -55454 -21767 30147
262 30147 80267 92304 61071 3346 -45865 -69125 -62014 -43393 -23833 6205 40452 71256
274 71256 77521 49441 -3967 -49026 -69732 -64992 -41319 -11074 16849 45850 62349 59818 30745
287 30745 -11352 -49088 -65700 -57613 -32400 3452 34995 57324 58456 37696 6246 -22943
299 -22943 -43925 -59269 -53216 -24954 16749 55643 70829 56367 19588 -19917 -41514 -52832
311 -52832 -53229 -38123 -8103 34066 62062 67644 42052 11045 -19592 -43433 -56406 -59787 -35706
$$ packed form
226e5034p786J0183K7666M1608L3692J6435j2226l4155l2936k6996j3883m895
238e8327Q020K9965M7096M1746J8503j9089m8399n0133l5626r324J5929L4642
250b4997M1928L7838J9344j1201k9958l9864k9002k3270q894J2622L3687N1914
262C0147N0120J2037l1233n7725m9211k3260P111J8621J9560L0038L4247L0804
274G1256O265k8080n3408m5059k0706M740K3673L0245K7923K9001J6499k531k9073
287C0745m2097l7736j6612Q087K5213L5852L1543K2329J132k0760l1450k9189
299b2943k0982j5344O053K8262M1703L8894J5186j4462l6779l9505k1597j1318
311e2832l97J5106L0020M2169K7996N582k5592l1007l0637k3841j2973l381K4081
$$ plain form
324 -35706 4551 47970 71191 67448 40555 1409 -36711 -65801 -72734 -54428 -12140 32948
336 32948 59857 60920 49701 27315 -89 -34128 -72635 -85845 -56690 2826 63447 88656
348 88656 70844 33838 -6061 -35211 -57137 -64912 -55731 -22484 18789 55151 69698 58745
360 58745 30277 -4044 -39862 -69108 -77174 -50077 1141 52301 77898 65954 26209 -10407
372 -10407 -32014 -39284 -43177 -44228 -29037 3951 46934 75387 75517 41265 -8046 -56425 -77232
385 -77232 -72517 -35786 9136 47001 63365 55657 32724 7009 -13422 -33575 -53808 -64421
397 -64421 -46605 -4376 50567 82907 80449 38583 -15695 -54330 -67027 -54850 -29290 -6212
409 -6212 18791 39288 54370 58876 42475 4630 -43253 -78350 -79831 -45607 7352 50480 65592
$$ packed form
324c5706M0257M3419K3221l743k6893l9146l8120k9090o933J8306M2288M5088
336C2948K6909J063j1219k2386k7404l4039l8507j3210K9155N9516O0621K5209
348H8656j7812l7006l9899k9150k1926p775R181L3247M1273L6362J4547j0953
360E8745k8468l4321l5818k9246q066K7097N1218N1160K5597j1944l9745l6616
372a0407k1607p270l893j051J5191L2988M2983K8453J30l4252m9311m8379k0807
385g7232M715L6731M4922L7865J6364p708k2933k5715k0431k0153k0233j0613
397f4421J7816M2229N4943L2340k458m1866n4278l8635j2697J2177K5560K3078
409f212K5003K0497J5082M506j6401l7845m7883l5097j481L4224N2959M3128J5112
$$ plain form
422 65592 55038 32727 8788 -19042 -42039 -58506 -52614 -24426 14003 44872 60787 55384
434 55384 33116 164 -40041 -68833 -71786 -41796 8521 47752 65681 58597 38984 13816
446 13816 -21796 -58669 -79120 -63449 -19224 30320 60648 62243 49662 29752 3678 -31891
458 -31891 -69821 -79991 -55652 -2215 46718 63378 60631 40490 14798 -13234 -49351 -71684
470 -71684 -67551 -31896 16847 51977 63153 55340 36623 11212 -26048 -59450 -78861 -62022
482 -62022 -17246 37913 74885 73120 45686 9403 -23705 -40928 -49265 -48433 -38827 -11718 27650
495 27650 59990 76234 56722 12916 -38830 -66154 -64109 -38104 -3413 22393 38091 44485
507 44485 48415 36028 6962 -32229 -63279 -70708 -47309 -4025 39194 62718 63098 43482 9263
$$ packed form
422F5592j0554k2311k3939k7830k2997j6467N892K8188L8429L0869J5915n403
434E5384k2268l2952m0205k8792k953K9990N0317L9231J7929p084j9613k5168
446A3816l5612l6873k0451J5671M4225M9544L0328J595j2581j9910k6074l5569
458c1891l7930j0170K4339N3437M8933J6660k747k0141k5692k8032l6117k2333
470g1684M133L5655M8743L5130J1176p813j8717k5411l7260l3402j9411J6839
482f2022M4776N5159L6972j765k7434l6283l3108j7223q337Q32R606K7109L9368
495B7650L2340J6244j9512m3806n1746k7324K045K6005L4691K5806J5698O394
507D4485L930j2387k9066l9191l1050p429K3399M3284M3219K3524L80j9616l4219
$$ plain form
520 9263 -25533 -56920 -66848 -54741 -24747 12251 44718 65205 68849 49018 5360 -44442 -78423
533 -78423 -77477 -41726 681 32668 51108 58547 56123 35090 -8500 -56305 -82087 -67270 -26958
546 -26958 20668 48933 58617 54508 38984 11605 -29366 -61171 -70000 -46467 -7820 27952 47569
559 47569 55341 55525 42356 2787 -46192 -78878 -74749 -31088 22508 51058 51123 36912 24940
572 24940 15655 -6343 -37669 -66267 -64009 -32540 19784 62628 79805 62313 19088 -26912
584 -26912 -56528 -62094 -44291 -20783 515 21730 42726 59584 60225 32603 -18362 -63687 -81066
597 -81066 -63857 -23914 21368 52714 64377 55412 30386 -3099 -28585 -46622 -51263 -49624 -31560
610 -31560 5774 51615 85257 72848 27317 -27142 -64267 -66096 -45799 -19540 922 24011
$$ packed form
520I263l4796l1387r928J2107K9994L6998L2467K0487L644j9831m3658m9802l3981
533g8423R46L5751M2407L1987J8440P439k424k1033m3590m7805k5782J4817M0312
546b6958M7626K8265R684m109j5524k7379m0971l1805q829K3533L8647L5772J9617
559D7569P772J84j3169l9569m8979l2686M129M3661N3596K8550O5j4211j1972
572B4940r285k1998l1326k8598K258L1469N2324M2844J7177j7492m3225m6000
584b6912k9616n566J7803K3508K1298K1215K0996J6858O41k7622n0965m5325j7379
597h1066J7209L9943M5282L1346J1663q965k5026l3485k5486j8037m641J639J8064
610c1560L7334M5841L3642j2409m5531n4459l7125j829K0297K6259K0462K3089
$$ plain form
622 24011 49919 68168 60834 19426 -35096 -72644 -74077 -49066 -8869 25928 50308 60053 54930
635 54930 30467 -8732 -43210 -64016 -58933 -36630 -3243 29485 56789 69407 54271 13213
647 13213 -38520 -71719 -71123 -41391 -4242 20909 34602 47852 56913 48365 16540 -39795 -81174
660 -81174 -83474 -48789 3495 47872 70141 67102 46103 10205 -25808 -51286 -60333 -48830 -28793
673 -28793 -239 29860 60420 76173 61830 12992 -46969 -81843 -76289 -35607 8947 39519
685 39519 50251 44502 37733 22995 1335 -27643 -58619 -69584 -51652 -8607 43845 77091
697 77091 77576 40174 -7942 -43322 -57740 -52035 -40371 -24723 3698 39641 66231 66327 35920
710 35920 -12100 -49060 -63765 -53002 -33715 -6803 27926 58649 71431 50523 6353 -40253
$$ packed form
622B4011K5908J8249p334m1408n4522l7548j433K5011M0197L4797K4380R745n123
635E4930k4463l9199l4478k0806N083K2303L3387L2728K7304J2618j5136m1058
647A3213n1733l3199N96K9732L7149K5151J3693J3250R061q548l1825n6335m1379
660h1174k300L4685N2284M4377K2269l039k0999l5898l6013k5478r047J1503K0037
673b8793K8554L0099L0560J5753j4343m8838n9961l4874N554M0682M4554L0572
685C9519J0732n749o769j4738k1660k8978l0976j0965J7932M3045N2452L3246
697G7091M85l7402m8116l5380j4418N705J1664J5648K8421L5943K6590R6l0407
710C5920m8020l6960j4705J0763J9287K6912L4729L0723J2782k0908m4170m6606
$$ plain form
722 -40253 -63816 -63203 -42658 -16076 17118 47985 68420 62849 32827 -8844 -43638 -59905 -61293
735 -61293 -44790 -13221 25989 63628 78051 56507 13041 -29092 -55792 -56660 -43179 -23360
747 -23360 2358 30891 54091 61288 44355 9856 -30943 -57516 -63986 -49674 -14861 20604
759 20604 56494 67994 53309 16319 -24767 -54777 -59196 -42736 -18317 3347 25387 45442
771 45442 58240 49921 16308 -26195 -64212 -72269 -48802 -12113 27486 55383 60204 45931 20248
784 20248 -8433 -33432 -46848 -51377 -41644 -17146 21300 58364 73523 55328 12650 -29289
796 -29289 -55544 -64317 -51316 -28478 9571 43796 66870 60920 32286 -478 -30844 -52629
808 -52629 -61341 -54579 -26164 20416 63004 77293 56997 16370 -24677 -46630 -59188 -51021 -32009
$$ packed form
722d0253k3563O13K0545K6582L3194L0867K0435n571l0022m1671l4794j6267j388
735f1293J6503L1569L9210L7639J4423k1544m3466m2133k6700q68J3481J9819
747b3360K5718K8533K3200P197j6933l4499m0799k6573o470J4312L4813L5465
759B0604L5890J1500j4685l6990m1086l0010m419J6460K4419K1664K2040K0055
771D5442J2798q319l3613m2503l8017q057K3467L6689L9599K7897M821j4273k5683
784B0248k8681k4999j3416m529R733K4498L8446L7064J5159j8195m2678m1939
796b9289k6255q773J3001K2838L8049L4225K3074n950k8634l2764l0366k1785
808e2629q712O762K8415M6580M2588J4289k0296m0627m1047k1953j2558Q167J9012
$$ plain form
821 -32009 -364 35163 58414 56963 36399 5881 -23774 -48390 -60049 -54555 -27243 22078
833 22078 60692 71382 47943 11314 -17652 -33874 -44833 -50650 -43163 -15407 29138 68607
845 68607 76196 50368 3512 -37121 -60269 -60132 -48613 -16903 17003 50412 64342 54750 30372
858 30372 -4560 -36388 -58371 -64526 -46919 -6408 41355 69630 69440 42427 1911 -29313 -49353
871 -49353 -57379 -51112 -30119 2829 38637 65000 68699 44852 3545 -39773 -68193 -67339 -46138
884 -46138 -8749 26461 50233 54876 43913 21764 -7969 -35095 -57253 -57998 -36717 1485 38220
897 38220 62975 58688 34960 -1218 -36707 -56080 -59653 -40671 -6730 27839 50728 55610 46360
910 46360 24746 -4986 -37604 -62314 -65437 -41137 9143 53397 69298 53593 23233 -2786
$$ packed form
821c2009L1645L5527K3251j451k0564l0518k9655k4616j1659N494K7312M9321
833B2078L8614J0690k3439l6629k8966j6222j0959n817P487K7756M4545L9469
845F8607P589k5828m6856m0633k3148J37J1519L1710L3906L3409J3930r592k4378
858C0372l4932l1828k1983o155J7607M0511M7763K8275j90k7013m0516l1224k0040
871d9353q026O267K0993L2948L5808K6363L699k3847m1307m3318k8420Q54K1201
884d6138L7389L5210K3772M643j0963k2149k9733k7126k2158p45K1281L8202L6735
897C8220K4755m287k3728l6178l5489j9373l573J8982L3941L4569K2889M882r250
910D6360k1614k9732l2618k4710l123K4300N0280M4254J5901j5705l0360k6019
$$ plain form
922 -2786 -19522 -34293 -51294 -56773 -37487 8320 54494 73409 58034 20068 -18477 -42797
934 -42797 -54497 -53954 -34234 -5654 28564 51095 54784 45378 24298 -6732 -46725 -73749 -74100
947 -74100 -36312 21266 62273 65021 41841 14327 -3842 -14751 -34288 -53744 -58693 -31601
959 -31601 13996 59677 72633 54032 16351 -22050 -46510 -54997 -43862 -20611 6203 30664
971 30664 43351 44138 37938 13554 -13676 -46666 -65088 -56472 -22117 22852 60122 67350 53709
984 53709 19867 -18737 -46620 -57717 -51132 -28910 -263 24240 47532 60236 55691 28159
996 28159 -20614 -62633 -80617 -59316 -12950 30087 49465 48835 39552 26731 5358 -24827 -52682
1009 -52682 -61920 -49165 -12701 25824 55635 62837 48060 19217 -15254 -48590 -64788 -53926
$$ packed form
922b786j6736j4771j7001n479J9286M5807M6174J8915j5375l7966l8545k4320
934d2797j1700N43J9720K8580L4218K2531L689r406k1080l1030l9993k7024l51
947g4100L7788N7578M1007K748k3180k7514j8169j0909j9537j9456m949K7092
959c1601M5597M5681J2956j8601l7681l8401k4460q487J1135K3251K6814K4461
971C0664J2687P87o200k4384k7230l2990j8422Q616L4355M4969L7270P228j3641
984E3709l3842l8604k7883j1097O585K2222K8647K4503K3292J2704m545k7532
996B8159m8773m2019j7984K1301M6366M3037J9378o30r283j2821k1373l0185k7855
1009e2682r238J2755L6464L8525K9811P202j4777k8843l4471l3336j6198J0862
$$ plain form
1021 -53926 -23650 8412 35090 51150 53544 40838 14641 -21660 -56120 -67862 -48675 -8101
1033 -8101 31991 53398 46910 38220 22304 2087 -30462 -60583 -66565 -39549 11466 48877 62794
1046 62794 49963 24306 -30 -19265 -41983 -54036 -52813 -25153 13508 47832 62264 54547
1058 54547 27916 -7956 -43764 -65373 -60719 -29832 6263 35495 48147 49681 41863 21263
1070 21263 -10035 -48155 -69601 -64512 -30476 13958 52021 67738 58557 30476 -7182 -40059
1082 -40059 -58441 -55045 -33864 -10060 15466 42226 61522 57820 35249 -11137 -53733 -74008
1094 -74008 -55323 -18285 18081 38646 45795 44280 30630 8791 -20108 -41044 -51328 -40009
1106 -40009 -18335 10854 40345 60010 55670 26529 -19125 -56163 -64106 -41186 -8228 12737
$$ packed form
1021e3926L0276L2062K6678J6060K394j2706k6197l6301l4460j1742J9187M0574
1033h101M0092K1407o488q690j5916k0217l2549l0121n982K7016N1015L7411J3917
1046F2794j2831k5657k4336j9235k2718j2053J223K7660L8661L4324J4432p717
1058E4547k6631l5872l5808k1609M654L0887L6095K9232J2652J534p818k0600
1070B1263l1298l8120k1446N089L4036M4434L8063J5717r181k8081l7658l2877
1082d0059j8382L396K1181K3804K5526K6760J9296l702k2571m6386m2596k0275
1094g4008J8685L7038L6366K0565P149j515j3650k1839k8899k0936j0284J1319
1106d0009K1674K9189K9491J9665m340k9141m5654l7038p943K2920L2958K0965
$$ plain form
1118 12737 22878 29934 45228 51165 33303 -13020 -64039 -83503 -63650 -12960 33480 58390
1130 58390 55881 40346 16940 -4990 -29583 -45316 -53934 -42970 -17773 16896 51635 69427
1142 69427 57295 22760 -23967 -58986 -65458 -45174 -11697 16958 35677 43372 44167 37301 15949
1155 15949 -18853 -53072 -71612 -55846 -18316 29421 60610 65228 46451 18271 -19074 -44838
1167 -44838 -54782 -49213 -28970 -1761 28611 50840 60081 47190 12660 -31292 -63047 -65030 -41605
1180 -41605 -6976 25861 47197 51283 42377 18484 -13405 -42081 -53496 -49546 -31281 -4786
1192 -4786 28516 58135 68761 49187 5533 -39508 -62517 -53643 -32108 -9641 5965 26669
1204 26669 50501 62932 44951 4692 -44450 -68379 -59271 -31870 21 26360 47400 54836
$$ packed form
1118A2737J0141P056J5294N937j7862m6323n1019j9464J9853N0690M6440K4910
1130E8390k509j5535k3406k1930k4593j5733q618J0964K5197L4669L4739J7792
1142F9427j2132l4535m6727l5019o472K0284L3477K8655J8719P695P95o866k1352
1155A5949l4802l4219j8540J5766L7530M7737L1189M618j8777k8180l7345k5764
1167d4838r944N569K0243K7209L0372K2229R241j2891l4530m3952l1755j983K3425
1180d1605L4629L2837K1336M086q906k3893l1889k8676j1415L950J8265K6495
1192d786L3302K9619J0626j9574m3654m5041k3009Q874K1535K2467J5606K0704
1204B6669K3832J2431j7981m0259m9142k3929R108K7401L1891K6339K1040P436
$$ plain form
1216 54836 46498 21622 -11931 -41143 -53656 -48835 -29307 2185 35703 60085 62972 37978
1228 37978 -4187 -39872 -55783 -49431 -30837 -9129 12504 35196 52481 51299 26487 -9608
1240 -9608 -43812 -62131 -52140 -26033 3694 30970 53522 55578 39077 7161 -28346 -50047
1252 -50047 -54479 -39216 -16344 15582 39974 58357 56308 34766 -3415 -41524 -67538 -65518
1264 -65518 -39385 -611 41010 62324 64074 40513 6737 -24374 -44784 -56227 -53341 -28878
1276 -28878 5773 43168 68821 64869 34196 -8509 -45572 -58688 -53116 -30055 -2106 24070
1288 24070 45560 51336 43370 18289 -11709 -39309 -54541 -53329 -32064 803 38073 61278
1300 61278 61147 35030 -5986 -36630 -50528 -48046 -34448 -15232 11944 40126 57899 54271 25103
$$ packed form
1216E4836q338k4876l3553k9212j2513M821J9528L1492L3518K4382K887k4994
1228C7978m2165l5685j5911O352J8594K1708K1633K2692J7285j182k4812l6095
1240i608l4204j8319R991K6107K9727K7276K2552K056j6501l1916l5507k1701
1252e0047m432J5263K2872L1926K4392J8383k049k1542l8181l8109k6014K020
1264f5518K6133L8774M1621K1314J750k3561l3776l1111k0410j1443K886K4463
1276b8878L4651L7395K5653l952l0673m2705l7063j3116N572K3061K7949K6176
1288B4070K1490N776p966k5081k9998k7600j5232J212K1265L2867L7270K3205
1300F1278j31k6117m1016l0644j3898K482J3598J9216K7176K8182J7773l628k9168
$$ plain form
1313 25103 -12698 -41433 -54869 -50142 -34502 -278 37214 59434 60870 31656 -9653 -33825
1325 -33825 -42005 -38749 -33323 -21636 2371 35442 64888 64155 31992 -12452 -48240 -60114 -52587
1338 -52587 -30366 -1913 28196 50144 55214 44819 18500 -10512 -38384 -57204 -58292 -37048
1350 -37048 3789 43676 65734 57850 30107 -5227 -29406 -47824 -54119 -44035 -18587 19508
1362 19508 50677 61398 46160 16362 -19144 -43054 -56381 -49599 -28948 3959 37165 59750
1374 59750 59261 38014 2613 -32366 -56198 -58538 -37153 -7707 27751 47571 51013 40521 18691
1387 18691 -5680 -30667 -52007 -58148 -40384 -11 42434 64704 57689 30706 -2923 -29215
1399 -29215 -41177 -46643 -43080 -24318 9052 43429 60593 57784 30784 -6010 -40225 -60769
$$ packed form
1313B5103l7801k8735j3436M727J5640L4224L7492K2220J436k9214m1309k4172
1325c3825q180L256N426J1687K4007L3071K9446p33l2163m4444l5788j1874P527
1338e2587K2221K8453L0109K1948N070j0395k6319k9012k7872j8820j088K1244
1350c7048M0837L9887K2058p884k7743l5334k4179j8418o295J0084K5448L8095
1362A9508L1169J0721j5238k9798l5506k3910j3327O782K0651L2907L3206K2585
1374E9750m89k1247l5401l4979k3832k340K1385K9446L5458J9820L442j0492k1830
1387A8691k4371k4987k1340o141J7764M0373M2445K2270p015k6983l3629k6292
1399b9215j1962n466L563J8762L3370L4377J7164k809k7000l6794l4215k0544
$$ plain form
1411 -60769 -60076 -41133 -3045 33877 57296 53286 34527 9322 -13733 -33575 -47164 -50731 -34705
1424 -34705 -1768 39012 63518 58011 28582 -8321 -35173 -48358 -44187 -32405 -13680 13889
1436 13889 38647 51832 47628 24241 -3770 -35556 -55779 -60529 -38809 3844 46471 66085
1448 66085 55085 25224 -5395 -22433 -35688 -45014 -45697 -30134 6601 46823 72371 62185
1460 62185 28552 -18877 -56666 -66183 -50584 -17448 16958 35582 39643 35647 32084 20989 -1776
1473 -1776 -40522 -72075 -69748 -28198 24780 64757 68745 43147 13136 -13797 -32022 -42472
1485 -42472 -44262 -35330 -15079 13282 43076 57218 55035 28885 -10678 -51850 -68993 -56586
1497 -56586 -15678 23845 45371 49014 36471 19722 6390 -14386 -37211 -53257 -46198 -17258
$$ packed form
1411f0769O93J8943L8088L6922K3419m010j8759k5205k3055j9842j3589l567J6026
1424c4705L2937M0780K4506n507k9429l6903k6852j3185M171J1782J8725K7569
1436A3889K4758J3185m204k3387k8011l1786k0223m750K1720M2653M2627J9614
1448F6085j1000k9861l0619j7038j3255r326o83J5563L6735M0222K5548j0186
1460F2185l3633m7429l7789r517J5599L3136L4406J8624M061l996l563j1095k2765
1473a776l8746l1553K327M1550N2978L9977L988k5598l0011k6933j8225j0450
1485d2472j790Q932K0251K8361K9794J4142k183k6150l9563m1172j7143J2407
1497e6586M0908L9523K1526L643j2543j6749j3332k0776k2825j6046P059K8940
$$ plain form
1509 -17258 22442 54829 59678 43195 12207 -18274 -43519 -51602 -45799 -23320 5599 32084
1521 32084 47345 45719 33184 12086 -16401 -44560 -59476 -52300 -18308 24000 49744 53197
1533 53197 37944 15693 -6374 -24665 -45792 -56165 -45843 -13522 28619 60911 63063 37281
1545 37281 1155 -32206 -47443 -46725 -38997 -19759 3371 30666 51536 56909 43303 6914 -34703
1558 -34703 -64977 -64453 -35273 7609 41608 48922 39526 25418 10662 -2763 -24810 -45713 -56634
1571 -56634 -38139 -156 40635 62600 59630 32247 -5328 -41113 -56081 -48945 -25248 -364
1583 -364 18573 30382 38768 44281 34838 5777 -38480 -68321 -65979 -30459 11580 41773 51473
1596 51473 43567 28481 7799 -23678 -49083 -52844 -39992 -12152 16099 36704 46532 45437 31752
$$ packed form
1509a7258L9700L2387M849j6483l0988l0481k5245q083N803K2479K8919K6485
1521C2084J5261j626j2535k1098k8487k8159j4916P176L3992M2308K5744L453
1533E3197j5253k2251k2067j8291k1127j0373J0322L2321M2141L2292K152k5782
1545C7281l6126l3361j5237P18P728J9238K3130K7295K0870N373j3606l6389m1617
1558c4703l0274N24K9180M2882L3999P314r396j4108j4756j3425k2047k0903j0921
1571e6634J8495L7983M0791K1965k970k7383l7575l5785j4968P136K3697K4884
1583c64J8937J1809Q386N513r443k9061m4257k9841K342L5520M2039L0193R700
1596E1473p906j5086k0682l1477k5405l761J2852K7840K8251K0605R828j095j3685
$$ plain form
1609 31752 3855 -34870 -58633 -55348 -33979 402 32635 46608 46812 37287 13634 -14882 -41139
1622 -41139 -53023 -44587 -19731 10016 34184 47228 46010 33255 7526 -22622 -49666 -56055
1634 -56055 -41557 -11449 24693 49854 57087 40373 12131 -21429 -41906 -47691 -37979 -19489
1646 -19489 4533 25592 41608 48335 41050 15124 -22529 -58843 -67278 -46024 -3784 35692
1658 35692 54266 51641 33761 9016 -11935 -29908 -39604 -43206 -36729 -14123 18640 51610 68128
1671 68128 52826 12914 -35963 -60833 -57270 -29324 2078 20261 29357 36908 39232 31558 10446
1684 10446 -23026 -53874 -58155 -39941 -4887 28126 50613 57535 42394 9969 -22972 -48193
1696 -48193 -51656 -34008 -11771 8881 23496 35706 43097 41061 12113 -24839 -54721 -57928 -36863
$$ packed form
1609C1752k7897l8725k3763L285K1369L4381L2233J3973K04r525k3653k8516k6257
1622d1139j1884Q436K4856K9747K4168J3044j218j2755k5729l0148k7044o389
1634e6055J4498L0108L6142K5161P233j6714k8242l3560k0477n785R712J8490
1646a9489K4022K1059J6016O727p285k5926l7653l6314q435K1254M2240L9476
1658C5692J8574k625j7880k4745k0951j7973r696l602O477K2606L2763L2970J6518
1671F8128j5302l9912m8877k4870L563K7946L1402J8183R096P551K324p674k1112
1684A0446l3472l0848m281J8214L5054L3013K2487O922j5141l2425l2941k5221
1696d8193l463J7648K2237K0652J4615J2210P391k036k8948l6952k9882l207K1065
$$ plain form
1709 -36863 -3274 23884 42063 46751 36919 15427 -14271 -37572 -48008 -40627 -23386 -668
1721 -668 21223 44510 55602 44955 8966 -32152 -57264 -53651 -34435 -7172 15003 33748
1733 33748 48173 51543 31163 -2628 -36404 -54410 -51906 -32221 -298 31715 50551 51367 32284
1746 32284 7998 -19670 -39873 -47521 -42174 -23694 4209 39511 59058 53789 27575 -7535
1758 -7535 -35892 -47258 -44421 -29427 -7428 19302 38980 52133 42672 19252 -13961 -40523
1770 -40523 -53961 -46635 -25700 4557 34348 55832 50937 28957 -5406 -37337 -51587 -45784
1782 -45784 -26546 -5548 16899 35832 46786 42627 21069 -10283 -41132 -54797 -46177 -26156
1794 -26156 6818 35168 52762 51404 30915 -924 -28754 -42384 -42752 -34192 -20070 2654 30949
$$ packed form
1709c6863L3589K7158J8179M688r832k1492k9698k3301j0436P381J7241K2718
1721f68K1891K3287J1092j0647l5989m1118k5112L613J9216K7263K2175J8745
1733C3748J4425L370k0380l3791l3776j8006K504J9685L1923L2013J8836Q16j9083
1746C2284k4286k7668k0203p648N347J8480K7903L5302J9547n269k6214l5110
1758g535k8357j1366K837J4994K1999K6730J9678J3153r461k3420l3213k6562
1770d0523j3438P326K0935L0257K9791K1484m895k1980l4363l1931j4250N803
1782d5784J9238K0998K2447J8933J0954m159k1558l1352l0849j3665Q620K0021
1794b6156L2974K8350J7594j358k0489l1839k7830j3630l68Q560J4122K2724K8295
$$ plain form
1807 30949 55932 58328 33657 -9909 -42414 -55537 -43617 -25540 -1765 21470 40186 51393
1819 51393 39392 15432 -18434 -42669 -50954 -39496 -20081 5755 32107 50299 49676 28384
1831 28384 -2400 -33093 -46687 -46247 -30467 -10361 18741 44915 52077 40063 13967 -16238
1843 -16238 -36230 -45433 -39766 -22903 1120 27231 49544 52380 32685 1813 -29548 -45251
1855 -45251 -49690 -37363 -13392 20163 45681 55594 42426 16139 -15325 -34769 -47920 -45392
1867 -45392 -28318 -4180 25736 52151 58013 39981 10467 -24307 -49908 -59170 -47731 -14938
1879 -14938 22165 48266 52743 35942 14213 -4773 -19431 -37073 -47690 -46119 -21534 17363
1891 17363 55916 65364 45507 5792 -31303 -47429 -42810 -30148 -15970 4625 22039 39560
$$ packed form
1807C0949K4983K396k4671m3566l2505j3123J1920J8077K3775K3235J8716J1207
1819E1393j2001k3960l3866k4235q285J1458J9415K5836K6352J8192o23k1292
1831B8384l0784l0693j3594M40J5780K0106K9102K6174P162j2014k6096l0205
1843a6238j9992r203N667J6863K4023K6111K2313K836j9695l0872l1361j5703
1855d5251m439J2327K3971L3555K5518R913j3168k6287l1464j9444j3151K528
1867d5392J7074K4138K9916K6415N862j8032k9514l4774k5601r262J1439L2793
1879a4938L7103K6101M477j6801k1729j8986j4658j7642j0617J571K4585L8897
1891A7363L8553R448j9857l9715l7095j6126M619J2662J4178K0595J7414J7521
$$ plain form
1903 39560 45080 36417 11047 -22060 -50188 -60063 -45211 -11805 27084 54171 56869 37066 5256
1916 5256 -21562 -34196 -39494 -36133 -28742 -5523 27443 56039 59873 36421 -4867 -33224 -49115
1929 -49115 -45750 -33787 -11965 15199 42143 56042 46315 19581 -12571 -37203 -44926 -41765 -28501
1942 -28501 -2372 24181 45397 53273 40654 9207 -18371 -44606 -55466 -45578 -21448 13431
1954 13431 42205 53014 44558 20363 -3806 -29773 -46535 -51374 -35433 -1709 28184 46878
1966 46878 45432 30633 10290 -9998 -32278 -52453 -52196 -30085 14680 49411 58110 39022 9053
1979 9053 -11818 -23917 -29694 -33785 -34362 -20315 10007 39863 56922 51192 22515 -13686 -45158
1992 -45158 -58920 -45543 -15019 21261 39040 40900 27053 21361 11536 -3981 -30597 -55643
$$ packed form
1903C9560N520q663k5370l3107k8128r875J4852L3406L8889K7087K698j9803l1810
1916E256k6818j2634n298L361P391K3219L2966K8596L834k3452m1288k8357j5891
1929d9115L365J1963K1822K7164K6944J3899r727k6734l2152k4632p723L161J3264
1942b8501K6129K6553K1216P876j2619l1447k7578k6235j0860R888K4130L4879
1954A3431K8774J0809q456k4195k4169k5967j6762m839J5941L3724K9893J8694
1966D6878j446j4799k0343k0288k2280k0175K57K2111M4765L4731Q699j9088k9969
1979I053k0871j2099n777m091n77J4047L0322K9856J7059n730k8677l6201l1472
1992d5158j3762J3377L0524L6280J7779J860j3847n692r825j5517k6616k5046
$$ plain form
2004 -55643 -60123 -32681 18068 59195 68035 45481 8687 -20261 -38103 -42363 -36456 -24239 -8002
2017 -8002 16479 35468 48055 43241 19480 -12551 -42334 -54621 -45899 -18361 15651 40719
2029 40719 47891 37251 15824 -4351 -21348 -35280 -38631 -35168 -14855 13652 42741 54403
2041 54403 44962 16345 -19634 -43803 -52467 -42059 -19035 9971 32310 43323 42282 29699
2053 29699 7127 -19620 -44479 -56803 -45142 -9301 26673 51300 50817 36196 8578 -13454
2065 -13454 -33078 -46095 -46587 -31359 -56 31384 49108 48975 33122 7132 -24675 -48555 -54245
2078 -54245 -38197 -7360 20680 33447 34926 33130 27682 8239 -21164 -49556 -60804 -41898
2090 -41898 -464 37250 51698 45219 22970 4711 -12455 -31075 -43170 -39796 -24326 4001
$$ packed form
2004e5643m480K7442N0749M1127Q840k2554l6794k8948j7842m260N907J2217J6237
2017h002K4481J8989J2587m814k3761l2031k9783j2287Q722K7538L4012K5068
2029D0719P172j0640k1427k0175j6997j3932l351L463K0313K8507K9089J1662
2041E4403r441k8617l5979k4169q664J0408K3024K9006K2339J1013j041j2583
2053B9699k2572k6747k4859j2324J1661L5841L5974K4627m83j4621k7618k2032
2065a3454j9624j3017m92J5228L1303L1440J7724j33j5853k5990l1807k3880n690
2078e4245J6048L0837K8040J2767J479j796n448j9443k9403k8392j1248J8906
2090d1898M1434L7714J4448o479k2249j8259j7166j8620j2095L374J5470K8327
$$ plain form
2102 4001 33039 48477 47278 29035 386 -31338 -50842 -50021 -27725 1839 27824 40108 38970
2115 38970 30528 13859 -5352 -31921 -49149 -46506 -23506 6792 34302 45246 41522 25936
2127 25936 4189 -24804 -43739 -48802 -38138 -8436 17174 39143 47494 38710 18294 -7757
2139 -7757 -34451 -47663 -45528 -27141 -1243 25007 46599 50698 38413 11470 -21200 -46561
2151 -46561 -53703 -39563 -12000 17701 38642 47955 40815 19376 -5383 -29056 -41187 -42976 -28458
2164 -28458 -6708 16731 40001 51096 41785 15317 -20432 -48919 -53321 -33979 -4943 18782
2176 18782 29939 30417 26835 24313 12335 -12397 -40242 -56721 -44829 -10310 27818 50468 51002
2189 51002 34761 5282 -20343 -36532 -43479 -33779 -17583 2071 21877 37576 47234 39695 13664
$$ packed form
2102D001K9038J5438j199j8243k8649l1724j9504Q21K2296K9564K5985J2284j138
2115C8970q442j6669j9211k6569j7228K643K3000L0298K7510J0944l724j5586
2127B5936k1747k8993j8935n063J0664K9702K5610K1969Q351q784k0416k6051
2139g757k6694j3212K135J8387K5898K6250K1592M099j2285k6943l2670k5361
2151d6561p142J4140K7563K9701K0941R313p140k1439k4759k3673j2131j789J4518
2164b8458K1750K3439K3270J1095r311k6468l5749k8487m402J9342K9036K3725
2176A8782J1157M78l582k522j1978k4732k7845j6479J1892L4519L8128K2650N34
2189E1002j6241k9479k5625j6189o947R700J6196J9654J9806J5699R658p539k6031
$$ plain form
2202 13664 -25167 -54406 -57636 -33967 -1277 25570 35826 37883 36824 22872 -1036 -30100
2214 -30100 -49493 -46514 -24119 2970 25754 37494 45330 36206 17947 -11573 -38261 -52025
2226 -52025 -40396 -16666 11285 33351 44431 41896 23873 573 -25711 -40648 -43919 -28719
2238 -28719 -8442 18551 36701 48512 38615 14653 -18019 -40019 -47896 -37297 -16462 5578
2250 5578 28649 44925 45570 27006 -3571 -33758 -45084 -40628 -23733 -5964 13179 30804 43227
2263 43227 41031 22989 -8611 -38601 -52436 -46791 -21951 8195 34269 48383 46018 23789
2275 23789 -1139 -26162 -36656 -38908 -29152 -17252 5805 30180 51480 51564 28480 -8932 -43479
2288 -43479 -54735 -44842 -19335 6493 25943 36815 41419 29704 11669 -12566 -31865 -42820
$$ packed form
2202A3664l8831k9239l230K3669L2690K6847J0256K057j059j3952k3908k9064
2214c0100j9393K979K2395K7089K2784J1740P836r124j8259k9520k6688j3764
2226e2025J1629K3730K7951K2066J1080k535j8023k3300k6284j4937l271J5200
2238b8719K0277K6993J8150J1811r897k3962l2672k2000p877J0599K0835K2040
2250E578K3071J6276O45j8564l0577l0187j1326M456J6895J7769J9143J7625J2423
2263D3227k196j8042l1600k9990j3835N645K4840L0146K6074J4114k365k2229
2275B3789k4928k5023j0494k252R756J1900K3057K4375K1300Q4k3084l7412l4547
2288d3479j1256R893K5507K5828J9450J0872M604j1715j8035k4235j9299j0955
$$ plain form
2300 -42820 -36367 -19233 2159 28027 44355 47639 30276 -2265 -34146 -50574 -41274 -16913
2312 -16913 3808 17765 27099 32287 30930 20773 -3423 -28970 -45427 -47047 -27998 3885 32930
2325 32930 53493 51484 28945 -7101 -36381 -44275 -36340 -19151 -5277 6142 21723 40367
2337 40367 46904 30862 -3554 -37981 -58200 -51640 -26164 8094 35463 47063 39288 20474
2349 20474 -940 -16152 -28284 -35534 -37602 -26145 2918 35990 58329 50603 21335 -14480
2361 -14480 -34301 -43063 -36356 -24712 -6496 16351 37898 45410 36664 9319 -19045 -35928 -41693
2374 -41693 -36377 -22171 4050 33003 48345 44838 21668 -8376 -32321 -37575 -35402 -26331 -10198
2387 -10198 13564 37256 47920 41432 12773 -17229 -39408 -45719 -34563 -15839 6330 25183
$$ packed form
2300d2820O453J7134K1392K5868J6328L284j7363l2541l1881j6428R300K4361
2312a6913K0721J3957R334N188j357j0157k4196k5547j6457j620J9049L1883K9045
2325C2930K0563k009k2539l6046k9280p894P935J7189J3874J1419J5581J8644
2337D0367O537j6042l4416l4427k0219O560K5476L4258K7369J1600p775j8814
2349B0474k1414j5212j2132p250k068J1457K9063L3072K2339p726k9268l5815
2361a4480j9821q762O707J1644J8216K2847K1547P512q746k7345k8364j6883n765
2374d1693N316J4206K6221K8953J5342l507k3170l0044k3945n254K173R071J6133
2387a0198K3762K3692J0664o488k8659l0002k2179o311J1156J8724K2169J8853
$$ plain form
2399 25183 38099 39350 29497 6675 -17824 -36160 -44196 -36221 -14096 15917 42093 49325 36980
2412 36980 12456 -11052 -29848 -35653 -34399 -26972 -9618 13407 40871 52667 43335 11996 -24985
2425 -24985 -49246 -50576 -30945 -5707 13773 26922 37595 35809 27203 3275 -21971 -43845
2437 -43845 -47257 -32701 -4939 24891 42510 41757 26837 6342 -15274 -26235 -36783 -36821 -26779
2450 -26779 412 31244 52450 46076 21893 -8217 -27691 -38382 -35681 -26114 -6751 17877
2462 17877 39503 48204 37097 14765 -13941 -30971 -44870 -42632 -26694 5285 38549 52107
2474 52107 41260 15925 -5471 -17390 -27249 -32704 -33713 -20968 6608 34099 52093 44844 18038
2487 18038 -12330 -35658 -44623 -37078 -20514 4035 23854 34781 33838 24515 11941 -4618 -26312
$$ packed form
2399B5183J2916J251r853k2822k4499j8336q036P975K2125L0013K6176P232j2345
2412C6980k4524k3508j8796n805J254P427J7354K3025K7464J1796r332l1339l6981
2425b4985k4261j330J9631K5238J9480J3149J0673j786q606k3928k5246k1874
2437d3845l412J4556K7762K9830J7619p53j4920k0495k1616j0961j0548l8J0042
2450b6779K7191L0832K1206o374k4183l0110j9474j0691K701R567J9363K4628
2462A7877K1626Q701j1107k2332k8706j7030j3899K238J5938L1979L3264J3558
2474E2107j0847k5335k1396j1919r859n455j009J2745K7576K7491J7994p249k6806
2487A8038l0368k3328q965P545J6564K4549J9819J0927r43r323j2574j6559k1694
$$ plain form
2500 -26312 -43818 -45759 -29765 4102 39766 53099 42937 16670 -12962 -29901 -34459 -29978
2512 -29978 -20552 -9912 5959 29799 42560 43512 24999 -7839 -42477 -54497 -44974 -14985 16831
2525 16831 36652 40164 29467 18802 3018 -13221 -31858 -45226 -41934 -16258 15000 44496
2537 44496 53802 38293 12129 -15831 -35770 -41870 -35211 -22270 -508 19156 37226 43985 35989
2550 35989 12005 -16749 -45677 -53740 -38473 -8455 22227 41675 41510 27919 14608 -1117
2562 -1117 -19061 -35000 -48303 -36766 -7961 29169 51078 48110 26269 -38 -23126 -35696
2574 -35696 -38157 -32557 -13045 10700 30677 36910 33023 22269 5457 -15131 -38030 -49995 -37719
2587 -37719 -4889 29905 51189 44604 21363 -1689 -17285 -20973 -28827 -32093 -25603 -4153 22225
$$ packed form
2500b6312j7506j941J5994L3867L5664J3333j0162k6267k9632j6939m558M481
2512b9978R426J0640J5871K3840J2761R52j8513l2838l4638j2020R523K9989L1816
2525A6831J9821L512j0697j0665j5784j6239j8637j3368L292K5676L1258K9496
2537D4496R306j5509k6164k7960j9939o100O659J2941K1762J9664J8070O759p996
2550C5989k3984k8754k8928q063J5267L0018L0682J9448j65j3591j3311j5725
2562a117j7944j5939j3303J1537K8805L7130K1909k968k1841k6307k3088j2570
2574c5696k461N600J9512K3745J9977O233l887j0754j6812k0588k2899j1965J2276
2587c7719L2830L4794K1284o585k3241k3052j5596l688p854l266O490K1450K6378
$$ plain form
2600 22225 40984 47637 36059 6975 -29685 -52065 -53313 -29851 6192 29584 34331 28238 22683
2613 22683 17116 8191 -18559 -40155 -55223 -38857 -4602 32422 51096 45108 24065 -802
2625 -802 -24868 -35635 -32214 -23544 -11499 3656 19496 34567 39991 31106 4857 -26789 -48029
2638 -48029 -49439 -28967 2847 28080 40401 39713 30292 11214 -10130 -31227 -40616 -36574 -17737
2651 -17737 5208 24437 38915 42332 28328 4311 -23462 -45846 -46810 -29468 2014 25135
2663 25135 38597 37426 28866 11753 -6761 -28765 -44944 -43169 -23887 4217 31359 41975
2675 41975 40038 25625 3925 -21008 -39758 -45543 -35474 -11934 15143 35081 42971 35474 19919
2688 19919 -481 -25300 -38629 -41677 -27498 -328 21206 35595 40700 33661 14958 -12193
$$ packed form
2600B2225J8759O653j1578k9084l6660k2380j248K3462L6043K3392M747o093n555
2613B2683n567q925k6750k1596j5068J6366L4255L7024J8674n988k1043k4867
2625h02k4066j0767L421Q670J2045J5155J5840J5071N424q885k6249l1646k1240
2638d8029j410K0472L1814K5233J2321o88r421j9078k1344k1097r389M042J8837
2651a7737K2945J9229J4478L417j4004k4017k7773k2384r64J7342L1482K3121
2663B5135J3462j171q560j7113j8514k2004j6179J775J9282K8104K7142J0616
2675D1975j937j4413k1700k4933j8750n785J0069K3540K7077J9938P890p497j5555
2688A9919k0400k4819j3329l048J4179K7170K1534J4389N105p039j8703k7151
$$ plain form
2700 -12193 -38900 -48980 -38120 -11199 17562 33891 36984 30912 20768 2677 -19057 -39194
2712 -39194 -46068 -34377 -5384 25131 44784 43767 30221 7429 -19388 -37147 -40895 -32918 -17427
2725 -17427 5094 23039 36840 41989 32148 5653 -25731 -44287 -44190 -25835 -3211 18454 33414
2738 33414 38619 35011 21655 -9301 -36356 -45963 -38183 -19233 5395 27857 38955 44824 29822
2751 29822 4269 -23282 -38996 -41402 -28777 -10411 10903 30444 42555 40629 20800 -10232
2763 -10232 -32967 -42183 -32455 -14790 1441 18819 29971 38745 33276 11058 -16023 -40307 -43920
2776 -43920 -31616 -10042 11594 27044 32628 33007 24235 4152 -24201 -42257 -44430 -27361 -894
2789 -894 21029 36405 37037 28168 12151 -7289 -28485 -41378 -36879 -18891 4199 27806 41196
$$ packed form
2700a2193k6707j0080J0860K6921K8761J6329L093o072j0144j8091k1734k0137
2712c9194o874J1691K8993L0515J9653j017j3546k2792k6817j7759l748P977J5491
2725a7427K2521J7945J3801N149r841k6495l1384j8556R7J8355K2624K1665J4960
2738C3414N205l608j3356l0956k7055r607P780J8950K4628K2462J1098N869j5002
2751B9822k5553k7551j5714k406J2625J8366K1314J9541J2111j926j9829l1032
2763a0232k2735r216R728J7665J6231J7378J1152Q774n469k2218k7081k4284l613
2776d3920J2304K1574K1636J5450N584L79q772k0083k8353j8056k173J7069K6467
2789h94K1923J5376O32q869j6017j9440k1196j2893M499J7988K3090K3607J3390
$$ plain form
2802 41196 40582 24277 468 -23734 -40303 -41122 -25539 -6470 15804 29537 38345 37100 19197
2815 19197 -6105 -30933 -42290 -40402 -22358 1997 23966 36483 40597 28562 5134 -16852
2827 -16852 -35387 -40863 -29129 -13949 8528 27285 37950 38478 22722 94 -26162 -40217
2839 -40217 -41256 -25297 -2339 21052 39947 42448 25901 3648 -20629 -32941 -35292 -28835 -17756
2852 -17756 -1230 24906 45891 51294 24620 -10801 -37841 -43272 -30741 -14212 -1031 9137
2864 9137 23515 37659 40314 23432 -9110 -37862 -45285 -33417 -13883 6978 23353 35845
2876 35845 37448 25611 3386 -19589 -34285 -39576 -30795 -14993 11069 35379 48191 41443 15010
2889 15010 -12377 -33940 -40458 -31875 -16883 -18 16760 33076 39552 32667 13034 -13127 -36338
$$ packed form
2802D1196o14j6305k3809k4202j6569q19J5583J9069K2274J3733Q808j245j7903
2815A9197k5302k4828j1357J888J8044K4355K1969J2517M114j2035k3428k1986
2827a6852j8535n476J1734J5180K2477J8757J0665N28j5756k2628k6256j4055
2839d0217j039J5959K2958K3391J8895K501j6547k2253k4277j2312k351O457J1079
2852a7756J6526K6136K0985N403k6674l5421k7040n431J2531J6529J3181J0168
2864I137J4378J4144K655j6882l2542k8752p423J1868J9534K0861J6375J2492
2876C5845J603j1837k2225k2975j4696n291Q781J5802K6062K4310J2812o748k6433
2889A5010k7387k1563o518Q583J4992J6865J6778J6316O476o885j9633k6161k3211
$$ plain form
2902 -36338 -46492 -37365 -10518 16696 33669 37962 28582 10874 -6013 -22453 -32282 -30903 -24100
2915 -24100 -7411 16500 37942 45278 35036 10279 -19188 -40439 -45652 -31615 -9757 15297
2927 15297 29620 36636 29951 17271 5402 -14330 -30357 -40985 -39060 -16333 19237 45877
2939 45877 52014 33686 414 -25693 -33306 -26771 -20478 -15028 -6628 12350 34193 45514 35744
2952 35744 7597 -23654 -42625 -43333 -26344 -5888 15594 29279 35796 28311 9241 -5083 -18740
2965 -18740 -28438 -35150 -30578 -12169 17458 43973 50071 29636 -1604 -24510 -31887 -29835 -19871
2978 -19871 -14192 700 19929 39951 40522 26349 -3216 -28452 -42059 -38480 -20615 217 20565
2991 20565 34394 39112 30510 11490 -8064 -28270 -40997 -38814 -22260 6039 31315 45283
$$ packed form
2902c6338j0154R127K6847K7214J6973M293r380j7708j6887j6440r829J379O803
2915b4100J6689K3911K1442P336j0242k4757k9467k1251n213J4037K1858K5054
2927A5297J4323P016o685j2680j1869j9732j6027j0628J925K2727L5570K6640
2939D5877O137j8328l3272k6107p613O535O293N450Q400J8978K1843J1321r770
2952C5744k8147l1251j8971p08J6989K0456K1482J3685O517p485j9070j4324j3657
2965a8740r698o712M572J8409K9627K6515O098k0435l1240k2906p377K052R964
2978a9871N679J4892J9229K0022N71j4173k9565k5236j3607L579J7865K0832K0348
2991B0565J3829M718q602j9020j9554k0206j2727K183J6554K8299K5276J3968
$$ plain form
3003 45283 40369 21440 -2375 -22441 -32402 -35525 -26272 -11146 11109 29585 40067 35557 19449
3016 19449 -3512 -29875 -43123 -44340 -20477 8075 32646 37867 29603 17315 5453 -10755
3028 -10755 -24649 -37835 -38251 -22110 7301 37001 47487 36913 12360 -12644 -29167 -33958
3040 -33958 -27203 -19090 -1581 14556 26980 34490 31786 14437 -9946 -32059 -42228 -38010 -10791
3053 -10791 17654 37205 39182 23966 6391 -5804 -11530 -22543 -31736 -36996 -18685 14055 45763
3066 45763 55460 35330 4432 -26359 -37211 -36019 -24971 -14795 722 18250 32762 36903
3078 36903 29575 7084 -15062 -40356 -46058 -36108 -9789 19887 38475 37980 25304 6481 -9086
3091 -9086 -21061 -31468 -31879 -25797 -7590 18835 37289 42074 32021 8377 -18537 -37050 -42755
$$ packed form
3003D5283m914j8929k3815k0066r961l123R253J5126K2255J8476J0482m510j6108
3016A9449k2961k6363j3248j217K3863K8552K4571N221q264j2288j1862j6208
3028a0755j3894j3186m16J6141K9411K9700J0486j0574k4553k5004j6523m791
3040c3958O755Q113J7509J6137J2424P510k704j7349k4383k2113j0169M218K7219
3053a0791K8445J9551J977j5216j7575j2195n726j1013r193n260J8311L2740L1708
3066D5763R697k0130l0898l0791j0852J192J1048J0176J5517J7528J4512M141
3078C6903p328k2491k2146k5294n702R950K6319K9676J8588m95j2676j8823j5567
3091i086j1975j0407m11O082J8207K6425J8454M785j0053k3644k6914j8513n705
$$ plain form
3104 -42755 -30433 -7609 16004 32844 32779 27929 14838 3628 -14816 -34289 -41636 -33415 -6011
3117 -6011 22883 43054 40605 25424 1364 -16996 -32482 -34946 -25571 -10018 9159 22130 32394
3130 32394 32073 24992 4539 -21874 -44086 -47432 -28350 2317 24102 34322 30968 22697 11301
3143 11301 -2878 -22666 -39413 -42256 -26456 2157 28423 40381 36198 21164 1394 -18180
3155 -18180 -33223 -37434 -30872 -10366 9834 30148 37441 35183 17790 -6532 -28525 -39161 -34947
3168 -34947 -21013 1673 21858 34304 32106 24490 7820 -10531 -29289 -40241 -35868 -16294
3180 -16294 9432 32569 41787 31618 15911 -5025 -20270 -33452 -34290 -24906 -5901 18259 34875
3193 34875 37247 25954 10217 -10071 -29050 -40119 -36063 -18362 7899 31843 41630 38242 21572
$$ packed form
3104d2755J2322K2824K3613J6840o5m850j3091j1210j8444j9473p347Q221K7404
3117f011K8894K0171k449j5181k4060j8360j5486k464R375J5553J9177J2971J0264
3130C2394l21p081k0453k6413k2212l346J9082L0667K1785J0220l354q271j1396
3143A1301j4179j9788j6747k843J5800K8613K6266J1958m183j5034j9770j9574
3155a8180j5043m211O562K0506K0200K0314P293k258j7393k4322k1993j0636M214
3168c4947J3934K2686K0185J2446k198p616j6670j8351j8758j0952M373J9574
3180a6294K5726K3137R218j0169j5707k0936j5245j3182q38R384J9005K4160J6616
3193C4875K372j1293j5737k0288j8979j1069M056J7701K6261K3944R787l388j6670
$$ plain form
3206 21572 -2048 -24637 -38720 -36690 -26878 -4456 13697 31420 36972 34415 20931 -5407 -32152
3219 -32152 -45657 -39709 -15292 11243 28748 30928 30616 21889 6452 -9509 -30805 -37784 -30589
3232 -30589 -10775 13369 29075 36718 33713 17197 -4964 -26542 -40540 -34148 -18547 1529
3244 1529 18523 31271 34745 29175 13199 -12753 -32762 -39274 -31634 -10733 9594 25627 33019
3257 33019 32650 21826 65 -24673 -40937 -39094 -20769 2997 20617 29037 30997 27219 13025
3270 13025 -7351 -31676 -41418 -38394 -18149 10244 31292 39619 35140 20577 757 -17982 -30501
3283 -30501 -35849 -29205 -12062 12434 33531 41130 34668 13537 -8003 -27233 -37112 -35772 -19808
3296 -19808 562 18976 35026 36149 29221 5017 -16263 -32946 -36287 -28548 -9720 9131 27890
$$ packed form
3206B1572k3620k2589j4083K030R812K2422J8153J7723N552k557j3484k6338k6745
3219c2152j3505N948K4417K6535J7505K180l12q727j5437j5961k1296o979P195
3232c0589J9814K4144J5706P643l005j6516k2161k1578j3998O392J5601K0076
3244A529J6994J2748L474n570j5976k5952k0009o512P640K0901K0327J6033P392
3257C3019l69j0824k1761k4738j6264J843J8325K3766J7620Q420J960l778j4194
3270A3025k0376k4325r742L024K0245K8393K1048Q327m479j4563j9820j8739j2519
3283c0501n348O644J7143K4496K1097P599o462k1131k1540j9230r879J340J5964
3296a9808K0370J8414J6050J123o928k4204k1280j6683l341P739J8828J8851J8759
$$ plain form
3309 27890 34221 33832 17934 -3123 -25533 -37161 -37019 -24160 1470 21134 34882 34020 25224
3322 25224 8869 -12249 -28477 -35140 -31579 -13630 2224 20714 36462 38899 23759 -1570
3334 -1570 -30069 -41537 -33410 -15022 -222 10975 23700 33747 33614 19721 -8200 -34240 -44266
3347 -44266 -35247 -15074 6388 24139 37355 37971 25752 5812 -19624 -34571 -37050 -23891 -5520
3360 -5520 12223 24767 35983 36492 21054 -1507 -28267 -43383 -35957 -17167 5237 24553 34211
3373 34211 32737 20693 2110 -14527 -26860 -32820 -30620 -17040 1250 25693 41700 40979 20443
3386 20443 -8307 -33303 -40133 -33602 -14242 4284 15584 25587 29071 28087 14456 -4235 -27832
3399 -27832 -40482 -37990 -17844 10976 35502 43723 31157 8010 -11136 -22815 -22775 -23794 -22799
$$ packed form
3309B7890O331l89j5898k1057k2410j1628J42J2859K5630J9664J3748q62q796
3322B5224j6355k1118j6228o663L561J7949J5854J8490J5748K437j5140k5329
3334a570k8499j1468Q127J8388J4800J1197J2725J0047j33j3893k7921k6040j0026
3347d4266R019K0173K1462J7751J3216O16j2219j9940k5436j4947k479J3159J8371
3360e520J7743J2544J1216N09j5438k2561k6760j5116P426J8790K2404J9316R658
3373C4211j474j2044j8583j6637j2333n960K200J3580J8290K4443J6007p21k0536
3386B0443k8750k4996o830O531J9360J8526J1300J0003L484r84j3631j8691k3597
3399b7832j2650K492K0146K8820K4526Q221j2566k3147j9146j1679M0j019R95
$$ plain form
3412 -22799 -14309 5158 28111 45034 37437 13910 -14110 -33623 -39112 -28536 -12775 6538
3424 6538 21117 31010 31604 22485 6378 -13388 -28297 -34287 -31924 -16179 8347 30820 41244
3437 41244 35324 15659 -10255 -29556 -33595 -25126 -13966 466 10214 25173 35356 32875 13004
3450 13004 -16240 -38959 -41925 -27064 -8393 10763 25273 35236 32913 18050 -2427 -23283
3462 -23283 -33044 -33756 -25099 -8011 14769 32813 41779 33212 10073 -18067 -32634 -32950 -23544 -10898
3476 -10898 1661 18602 33265 37171 27889 4540 -21032 -38026 -39558 -23069 -1244 21584
3488 21584 35034 33769 22424 9034 -3099 -16867 -30824 -37588 -29989 -5299 23759 44577
3500 44577 40733 20400 -5666 -21772 -28575 -27853 -19900 -10238 3875 22370 32661 31402 18067
$$ packed form
3412b2799Q490J9467K2953J6923p597k3527k8020j9513n489J0576J5761J9313
3424F538J4579R893N94r119j6107j9766j4909n990K363J5745K4526K2473J0424
3437D1244n920j9665k5914j9301m039Q469J1160J4432R748J4959J0183k481j9871
3450A3004k9244k2719k966J4861J8671J9156J4510R963k323j4863k0477k0856
3462b3283r761p12Q657J7088K2780J8044Q966q567k3139k8140j4567l16R406J2646
3476a0898J2559J6941J4663L906r282k3349k5572j6994j532J6489K1825K2828
3488B1584J3450j265j1345j3390j2133j3768j3957o764P599K4690K9058K0818
3500D4577l844k0333k6066j6106o803P22P953R662J4113J8495J0291j259j3335
$$ plain form
3513 18067 -1872 -22992 -36676 -33452 -23239 662 22752 36788 34958 18179 1732 -12641
3525 -12641 -23762 -30077 -29458 -20145 1780 24687 40759 37296 20973 -6717 -24736 -33059 -30216
3538 -30216 -20439 -2001 14851 31399 37271 25350 10732 -9999 -25352 -34810 -30249 -16859 2530
3551 2530 24626 38538 36107 18681 -1506 -20675 -29945 -30833 -24403 -10482 9268 28124 41583
3564 41583 33847 13969 -11825 -30692 -33783 -26905 -13791 169 14057 28033 32696 26845 10320
3577 10320 -11843 -32377 -41517 -30866 -9472 17124 34136 33597 22013 5464 -4795 -14221 -22186
3590 -22186 -26993 -27858 -10893 16195 40696 43020 28286 3581 -19987 -33704 -32022 -22733 -6819
3603 -6819 10652 23473 25676 23628 19222 10194 -9593 -31953 -45084 -35389 -7015 23104 39489
$$ packed form
3513A8067j9939k1120j3684L224J0213K3901K2090J4036j830j6779j6447j4373
3525a2641j1121o315O19R313K1925K2907J6072l463j6323k7690j8019q323K843
3538c0216R777J8438J6852J6548N872j1921j4618k0731j5353r458M561J3390J9389
3551B530K2096J3912k431j7426k0187j9169r270q88O430J3921J9750J8856J3459
3564D1583p736j9878k5794j8867l091O878J3114J3960J3888J3976M663n851j6525
3577A0320k2163k0534r140J0651K1394K6596J7012n39j1584j6549j0259r426p965
3590b2186m807q65J6965K7088K4501K324j4734k4705k3568j3717J682R289J5914
3603f819J7471J2821K203k048m406r028j9787k2360j3131R695K8374L0119J6385
$$ plain form
3616 39489 36640 16301 1119 -8891 -16900 -24840 -28468 -21297 -4510 15471 33490 37124 25540
3629 25540 5269 -18124 -35880 -37887 -28956 -7752 18693 32187 31411 21076 11838 -1483 -12717
3642 -12717 -27585 -35644 -28306 -8054 20605 40327 41586 24365 1111 -22254 -30273 -29554 -21611
3655 -21611 -8496 5111 19965 30976 32678 24342 222 -21500 -39090 -40367 -24211 3602
3667 3602 25539 33751 30519 19571 4246 -10515 -23648 -30804 -31157 -20793 1138 24808 39740
3680 39740 36382 20049 -5514 -25544 -35828 -29466 -18448 -2194 11450 23660 29315 24659 15329
3693 15329 -4704 -23860 -36651 -34795 -19089 4007 24130 33146 32292 19087 2500 -14344 -28647
3706 -28647 -32580 -25683 -8171 10529 23312 31549 29372 19602 1571 -17714 -37140 -40740 -25113
$$ packed form
3616C9489k849k0339j5182j0010q009p940l628P171J6787J9981J8019L634j1584
3629B5540k0271k3393j7756k007Q931K1204K6445J3494p76j0335r238j3321j1234
3642a2717j4868q059P338K0252K8659J9722J259j7221k3254k3365q019P19P943
3655b1611J3115J3607J4854J1011J702q336k4120k1722j7590j277J6156K7813
3667C602K1937Q212l232j0948j5325j4761j3133p156l53J0364K1931K3670J4932
3680C9740l358j6333k5563k0030j0284O362J1018J6254J3644J2210N655m656r330
3693A5329k0033j9156j2791J856J5706K3096K0123R016q54j3205j6587j6844j4303
3706b8647l933O897J7512J8700J2783Q237k177r770j8031j9285j9426l600J5627
$$ plain form
3719 -25113 3636 25370 35793 28112 15341 2189 -9008 -21404 -31020 -28319 -16938 4186
3731 4186 25208 34206 34311 22374 -1263 -24958 -38773 -37743 -20281 3445 17695 26828 25249
3744 25249 23037 14958 -428 -24324 -38288 -37734 -20438 5996 28049 35968 33784 16228 -895
3757 -895 -20259 -31431 -30754 -21989 -5523 11678 26647 31622 27462 14169 -5693 -25722 -34902
3770 -34902 -32080 -16505 3424 21396 34859 33591 20720 502 -17173 -30055 -29553 -24002 -8401
3783 -8401 7313 22297 32332 32631 17027 -3894 -26066 -36826 -32459 -17147 1448 15664 28014
3796 28014 31461 25189 9085 -11476 -28753 -35701 -30172 -11734 7028 26246 30622 28477 16383
3809 16383 1816 -19315 -30095 -33549 -24200 -9105 10192 29564 37243 30898 12411 -12154 -30071
$$ packed form
3719b5113K8749K1734J0423p681j2771j3152j1197j2396r616K701J1381K1124
3731D186K1022Q998J05j1937k3637k3695j3815J030J7462K3726J4250R133j579
3744B5249k212q079j5386k3896j3964N54J7296K6434K2053P919k184j7556j7123
3757h95j9364j1172O77Q765J6466J7201J4969M975m160j3293j9862k0029r180
3770c4902K822J5575J9929J7972J3463j268j2871k0218j7675j2882N02N551J5601
3783h401J5714J4984J0035K99j5604k0921k2172j0760M367J5312J8595J4216J2350
3796B8014L447o272j6104k0561j7277o948N529J8438J8762J9218M376k145j2094
3809A6383j4567k1131j0780l454R349J5095J9297J9372P679o345j8487k4565j7917
$$ plain form
3822 -30071 -33806 -25647 -8867 4910 14925 20459 26437 26745 13527 -11759 -36139 -42510 -29761
3835 -29761 -4636 20386 30079 28736 21763 11183 -2924 -17893 -30439 -34741 -19379 -3067 17946
3848 17946 33052 35067 27097 6089 -17195 -35738 -39737 -28895 -3586 11568 24108 29917 27690
3861 27690 15799 -1636 -21806 -32355 -32803 -19933 -2635 16240 27934 34075 27838 7896 -16217
3874 -16217 -32819 -33666 -25081 -10211 5102 20318 30367 32931 20443 -113 -21403 -31358 -30625
3887 -30625 -22519 -7366 10776 28704 35794 28860 13332 -8363 -25371 -34639 -28043 -16047 1628
3900 1628 20725 34162 33852 20131 1444 -16205 -25068 -27141 -21348 -14852 5150 23452 38346
3913 38346 37861 17991 -8700 -32172 -37814 -26551 -9658 6125 13747 21062 25667 26118 16616 -5751
$$ packed form
3822c0071l735Q159J6780J3777J0015N534N978L08j3218k5286k4380o371J2749
3835b9761K5125K5022R693j343o973j0580j4107j4969j2546m302J5362J6312K1013
3848A7946J5106K015p970k1008k3284j8543l999J0842K5309J5154J2540N809k227
3861B7690j1891j7435k0170j0549m48J2870J7298J8875J1694O141o237j9942k4113
3874a6217j6602q47Q585J4870J5313J5216J0049K564j2488k0556k1290r955P33
3887c0625Q106J5153J8142J7928P090o934j5528k1695j7008r268O596J1996J7675
3900A628J9097J3437l10j3721j8687j7649q863k073N793O496K0002J8302J4894
3913C8346m85j9870k6691k3472n642J1263J6893J5783P622P315M605M51r502k2367
$$ plain form
3927 -5751 -29245 -39683 -33684 -14318 12000 32458 35826 27259 11532 -7940 -21061 -28244 -26123
3940 -26123 -17600 -6914 8593 24340 38525 33783 15757 -13939 -37012 -40982 -25736 -4936
3952 -4936 10952 22168 26517 26565 20634 7870 -12140 -28542 -34626 -28900 -10011 14031 31980
3965 31980 36308 26481 5610 -11609 -23931 -29853 -25993 -14583 -902 13499 27552 32848 24314
3978 24314 7129 -16557 -29612 -33249 -26595 -8766 12344 30410 33816 23485 9152 -7174
3990 -7174 -17227 -23270 -25797 -26092 -12371 10694 35275 45043 30543 401 -25218 -33011 -27949
4003 -27949 -14681 -8446 1973 13938 26937 31996 24429 6461 -17784 -32727 -38428 -24596 -3139
4016 -3139 21561 38083 36258 19534 -464 -11340 -19837 -24314 -24759 -23324 -8208 16820 37087
$$ packed form
3927e751k3494j0438N999J9366K6318K0458L368q567j5727j9472j3121p183K121
3940b6123Q523J0686J5507J5747J4185m742j8026k9696k3073l970J5246K0800
3952d936J5888J1216M349M8n931j2764k0010j6402o084N726J8889K4042J7949
3965C1980M328r827k0871j7219j2322n922L860J1410J3681J4401J4053N296q534
3978B4314j7185k3686j3055l637O654J7829K1110J8066L406j0331j4333j6326
3990g174j0053o043k527k95J3721K3065K4581R768j4500l0142k5619p793N062
4003b7949J3268O235J0419J1965J2999N059p567j7968k4245j4943n701J3832K1457
4016c139K4700J6522j825j6724j9998j0876q497m477m45J435J5116K5028K0267
$$ plain form
4029 37087 43663 25916 -484 -22511 -36768 -32783 -18587 -4516 10967 22146 28743 26205 15106
4042 15106 -3784 -21557 -31991 -31647 -18634 23 20216 31720 31978 20675 1895 -16378 -26564
4055 -26564 -32162 -20343 -7889 12681 24600 31097 26628 16582 -2942 -20009 -30585 -31018 -20882
4068 -20882 -2494 17853 30117 30883 23607 6772 -12982 -23693 -30400 -28366 -16158 5971 25800
4081 25800 34964 27712 14161 -4575 -17489 -24984 -27227 -24419 -10904 9141 27043 37968 29567
4094 29567 10331 -12589 -28181 -32972 -25449 -14313 3476 18792 26740 26602 19560 6043 -7090
4107 -7090 -22970 -34052 -32133 -15346 13347 35624 38502 23724 2196 -13494 -19806 -21326 -20053
4120 -20053 -18167 -7523 10501 30902 36538 27241 5416 -14223 -30858 -33922 -22162 -7599 14449
$$ packed form
4029C7087O576j7747k6400k2027j4257L985J4196J4071J5483J1179O597k538j1099
4042A5106j8890j7773j0434L44J3013J8657K0193J1504K58j1303j8780j8273j0186
4055b6564n598J1819J2454K0570J1919O497m469j0046j9524j7067j0576m33J0136
4068b0882J8388K0347J2264P66p276j6835j9754j0711o707K034J2208K2129J9829
4081B5800R164p252j3551j8736j2914p495k243K808J3515K0045J7902J0925q401
4094B9567j9236k2920j5592m791P523J1136J7789J5316P948j38p042j3517j3133
4107g090j5880j1082J919J6787K8693K2277K878j4778k1528j5690o312j520J273
4120b0053J886J0644J8024K0401N636r297k1825j9639j6635l064J1760J4563K2048
$$ plain form
4133 14449 27090 29048 22451 14245 -1569 -16350 -26859 -33269 -24272 -4295 18501 31040 33485
4146 33485 21042 6399 -10914 -24857 -31213 -26775 -13959 8335 22541 29831 25834 16499 -357
4159 -357 -16288 -29776 -33217 -23130 -7258 11676 25106 30503 26686 12542 -5496 -24019 -32873
4172 -32873 -28557 -16675 3986 20872 30661 29486 19577 1729 -13008 -26038 -29228 -22278 -8479
4185 -8479 9532 25026 31421 27345 16724 -1763 -21125 -33341 -32605 -19485 3747 25092 33672
4198 33672 27490 14558 3499 -9013 -18891 -27043 -29928 -19964 2767 25707 36836 31856 16015
4211 16015 -7832 -23330 -31512 -27241 -16191 740 14656 25437 25289 22121 12321 -2771 -23282
4224 -23282 -35655 -34362 -18652 9016 28998 33704 27697 12260 -2369 -15782 -25889 -29169 -24034
$$ packed form
4133A4449J2641J958o597q206j5814j4781j0509o410Q997J9977K2796J2539K445
4146C3485j2443j4643j7313j3943o356M438J2816K2294J4206P290l997r335j6856
4159c57j5931j3488l441J0087J5872J8934J3430N397l817j4144j8038j8523q854
4172c2873M316J1882K0661J6886R789j175r909j7848j4737j3030l190O950J3799
4185h479J8011J5494O395m076j0621j8487j9362j2216P36J3120K3232K1345Q580
4198C3672o182j2932j1059j2512r878q152k885R964K2731K2940J1129m980j5841
4211A6015k3847j5498q182M271J1050J6931J3916J0781j48l168r800j5092k0511
4224b3282j2373J293J5710K7668J9982M706o007j5437j4629j3413j0107l280N135
$$ plain form
4237 -24034 -6472 10305 25839 28224 26788 14258 -2145 -19958 -32465 -31952 -19094 3939 22447
4250 22447 31326 27314 15809 -819 -13468 -23710 -23694 -20651 -9626 5992 18296 29714 26268
4263 26268 19576 -2659 -24181 -37919 -33347 -11552 5739 19363 21497 21238 19709 10953 -4108
4276 -4108 -21068 -34413 -31790 -13267 5895 24407 31554 27592 16707 -2293 -16744 -28387 -30364
4289 -30364 -16465 -3052 11150 23916 28501 25781 12887 -5710 -25734 -32857 -30854 -14276 4742
4302 4742 20927 31601 29677 18909 1741 -11415 -27521 -30681 -22667 -8053 8905 24387 30629
4315 30629 27092 14285 -4920 -23010 -33733 -31028 -14816 5689 19415 25089 23190 17856 6451
4328 6451 -5150 -24838 -36676 -30387 -13023 14772 29072 31466 20394 7212 -5495 -16470
$$ packed form
4237b4034J7562J6777J5534K385j436j2530j6403j7813j2507N13J2858K3033J8508
4250B2447Q879m012j1505j6628j2649j0242J6L043J1025J5618J2304J1418l446
4263B6268o692k2235k1522j3738M572K1795J7291J3624K134k59j529q756j5061
4276d108j6960j3345K623J8523J9162J8512P147l962j0885j9000j4451j1643j977
4289c0364J3899J3413J4202J2766M585k720j2894j8597k0024p123K003J6578J9018
4302D742J6185J0674j924j0768j7168j3156j6106l160Q014J4614J6958J5482O242
4315C0629l537j2807j9205j8090j0723K705J6212K0505J3726N674j899n334j1405
4328F451j1601j9688j1838O289J7364K7795J4300K394j1072j3182j2707j0975
$$ plain form
4340 -16470 -24051 -26178 -20374 -7004 11366 27250 36045 28762 10932 -15475 -32031 -34830 -20674
4353 -20674 -3988 9657 18150 21309 23468 20791 7809 -12722 -29421 -34951 -23960 -3433 16151
4366 16151 29890 31929 22179 6493 -8533 -22710 -25488 -22898 -14594 -1887 14117 26315 33285
4379 33285 24150 2743 -17611 -30950 -30035 -19180 -3814 6668 18459 26216 27465 16879 -1104
4392 -1104 -23532 -35597 -31039 -14083 2259 16144 28360 27040 22525 7711 -12455 -28773 -29359
4405 -29359 -24440 -10350 8206 19998 29877 31483 18376 -1914 -23821 -33589 -27916 -14124 3503
4418 3503 14133 22144 24014 22136 10832 -2331 -19253 -33556 -31901 -16836 4912 26298 33858
4431 33858 28946 13985 -5717 -18177 -25617 -22121 -17560 -6977 2744 17335 30517 32214 20147
$$ packed form
4340a6470p581k127N804J3370J8370J5884Q795p283j7830k6407j6556k799J4156
4353b0674J6686J3645Q493L159K159k677j2982k0531j6699n530J0991K0527J9584
4366A6151J3739K039r750j5686j5026j4177k778K590Q304J2707J6004J2198O970
4379C3285r135k1407k0354j3339R15J0855J5366J0482J1791P757J249j0586j7983
4392a104k2428j2065M558J6956J6342J3885J2216j320m515j4814k0166j6318n86
4405b9359M919J4090J8556J1792R879J606j3107k0290k1907r768N673J3792J7627
4418C503J0630Q011J870j878j1304j3163j6922j4303J655J5065K1748K1386P560
4431C3858m912j4961j9702j2460p440L496M561J0583R721J4591J3182J697j2067
$$ plain form
4444 20147 -3181 -28510 -36664 -33479 -9373 10151 23662 25198 19298 9061 3872 -4721 -15627
4457 -15627 -26526 -28362 -17070 4780 24878 37462 33000 10739 -12562 -28091 -26950 -17651 -9513
4470 -9513 -724 9410 21892 29362 30143 12071 -12012 -30949 -32898 -25376 -7140 7496 20918
4483 20918 29074 30030 16846 -1685 -19011 -28850 -27627 -20711 -5657 8429 27020 34032 28754
4496 28754 10043 -12136 -28149 -30226 -22922 -8485 1888 14359 25228 29643 23478 4944 -16629
4509 -16629 -30946 -34568 -24007 -5028 14620 27081 29293 22085 6813 -8030 -15917 -24180 -24401
4522 -24401 -20627 -5945 11868 29776 37249 27020 3647 -19820 -32220 -29235 -15004 -1108
4534 -1108 10728 18969 21122 21948 17662 5663 -13222 -32580 -37129 -25145 -2728 24842 37740
$$ packed form
4444B0147k3328k5329q154L185K4106J9524J3511J536n900j0237n189q593j0906
4457a5627j0899j836J1292K1850K0098J2584m462k2261k3301j5529J141R299Q138
4470i513Q789J0134J2482P470P81j8072k4083j8937j949P522J8236J4636J3422
4483B0918Q156R56j3184j8531j7326r839J223O916J5054J4086J8591P012n278
4496B8754j8711k2179j6013k077P304J4437J0373J2471J0869M415o165j8534k1573
4509a6629j4317l622J0561J8979J9648J2461K212p208j5272j4843p887q263k21
4522b4401L774J4682J7813J7908P473j0229k3373k3467j2400K985J4231J3896
4534a108J1836Q241K153Q26m286j1999j8885j9358m549J1984K2417K7570J2898
$$ plain form
4547 37740 33372 14751 -1986 -15701 -20387 -19687 -21132 -16224 -1906 15289 31637 34138 19193
4560 19193 -866 -21949 -30170 -27982 -16429 -638 14999 23584 29028 22052 8736 -6520 -20651
4573 -20651 -25956 -28549 -16752 -1457 16938 31102 33949 19882 -29 -17598 -27357 -27306 -20715
4586 -20715 -6044 8392 22822 31876 25633 12652 -4827 -18872 -25544 -26338 -19075 -3502 15508
4599 15508 30624 31826 20488 1062 -15068 -24348 -27264 -18944 -12033 4931 21662 31997 27648
4612 27648 14017 -4057 -21051 -29254 -26346 -16878 -2373 10679 25069 31178 23666 9544 -9776
4625 -9776 -22486 -30518 -26061 -12362 4790 22244 26017 23847 12605 -186 -11227 -21893 -29820
4638 -29820 -24177 -8519 12362 28420 31974 22440 6295 -10888 -19808 -23352 -24052 -14020 -274
$$ packed form
4547C7740m368j8621j6737j3715m686P00j445M908J4318J7195J6348K501j4945
4560A9193k0059k1083q221K188J1553J5791J5637Q585N444o976j3316j5256j4131
4573b0651n305k593J1797J5295J8395J4164K847j4067j9911j7569r759N1O591
4586b0715J4671J4436J4430R054o243j2981j7479j4045o672p94P263J5573J9010
4599A5508J5116J202j1338j9426j6130r280k916Q320O911J6964J6731J0335m349
4612B7648j3631j8074j6994q203K908R468J4505J3052J4390O109p512j4122j9320
4625i776j2710q032M457J3699J7152J7454L773k170j1242j2791j1041j0666p927
4638b9820N643J5658K0881J6058L554r534j6145j7183q920l544p00J0032J3746
$$ plain form
4651 -274 17248 28922 28025 21431 5564 -14091 -27388 -32178 -24587 -7617 11810 23404 26661
4664 26661 21527 12943 -1093 -13809 -27599 -32055 -20705 -163 19643 30451 28899 17296 2590
4677 2590 -11333 -19487 -25645 -23111 -13824 6118 20431 32913 29773 15575 -5585 -19918 -28049
4690 -28049 -26815 -20512 -3812 13794 26567 27184 19768 10037 -8817 -19269 -27353 -25159 -16840 944
4704 944 18063 29365 27486 16407 -524 -18088 -28077 -28874 -18744 -5382 13705 24005 24341
4717 24341 22074 8616 -774 -15844 -27071 -32544 -21095 1537 22359 35085 29457 11812 -3294
4730 -3294 -17711 -21195 -20668 -20329 -12144 3638 18102 28930 28278 18325 -1697 -20459 -31531 -29978
4744 -29978 -17179 4159 18271 25171 21337 16885 6706 -6338 -19245 -28563 -27438 -12676 6957
$$ packed form
4651b74J7522J1674q97o594j5867j9655j3297m790P591J6970J9427J1594L257
4664B6661n134q584j4036j2716j3790m456J1350K0542J9806J0808j552j1603j4706
4677B590j3923q154o158K534R287J9942J4313J2482l140j4198k1160j4333q131
4690b8049J234O303J6700J7606J2773O17p416r731j8854j0452q084K194Q319J7784
4704I44J7119J1302j879j1079j6931j7564r989p97J0130J3362J9087J0300L36
4717B4341k267j3458r390j5070j1227n473J1449K2632K0822J2726n628j7645j5106
4730c294j4417l484N27L39Q185J5782J4464J0828o52r953k0022j8762j1072J553
4744b9978J2799K1338J4112O900l834m452j0179j3044j2907r318J125J4762J9633
$$ plain form
4757 6957 19655 28802 23713 16305 -1898 -17796 -30629 -32213 -19123 115 18808 23537 22413
4770 22413 18065 8069 -3309 -17652 -27827 -26967 -18556 2509 18570 31009 27717 15968 -1119
4783 -1119 -17725 -25980 -26158 -16504 -2559 8815 19620 24688 23250 16766 -1710 -19721 -31230
4796 -31230 -30445 -16417 5082 21611 26268 23183 15393 4356 -7467 -19992 -30301 -24771 -13300
4809 -13300 6616 23671 30624 25012 9951 -3528 -19119 -23504 -25761 -17337 -2674 10876 22628
4822 22628 29151 22624 7831 -9542 -22298 -30016 -27403 -12063 6243 20281 26957 24788 12569
4835 12569 132 -13094 -22428 -29116 -22768 -6576 10066 24642 31432 23766 9669 -9750 -22517
4848 -22517 -29994 -22614 -8356 5988 15309 20423 21005 17801 9593 -8072 -25458 -34717 -26825 -5757
$$ packed form
4757F957J2698R147n089p408j8203j5898j2833j584J3090J9238J8693M729j124
4770B2413m348r996j1378j4343j0175Q60Q411K1065J6061J2439l292j1749j7087
4783a119j6606q255j78R654J3945J1374J0805N068j438o484j8476j8011j1509
4796c1230P85J4028K1499J6529M657l085p790j1037j1823j2525j0309N530J1471
4809a3300J9916J7055O953n612j5061j3479j5591m385k257Q424J4663J3550J1752
4822B2628O523o527j4793j7373j2756p718K613J5340J8306J4038O676k169j2219
4835A2569j2437j3226r334o688O348J6192J6642J4576O790p666j4097j9419j2767
4848b2517p477P380J4258J4344R321N114N82l204q208j7665j7386r259P892K1068
$$ plain form
4862 -5757 14960 29516 29849 20925 5837 -8734 -21100 -23380 -19768 -13146 -1899 7218 19939
4875 19939 28626 28952 11703 -12225 -35484 -36029 -22554 87 17500 19822 17719 14512 14121 5819
4889 5819 -7927 -24333 -28728 -25143 -5073 15110 31828 31233 22850 4084 -13339 -24989 -24823
4902 -24823 -19161 -8539 2888 14332 22832 26122 20191 5612 -14844 -27277 -30027 -19016 -2276
4915 -2276 12900 22543 25411 21405 7967 -5016 -18221 -25581 -22600 -14894 -203 14682 24827
4928 24827 26737 19082 3086 -12325 -24935 -28577 -21714 -6474 8003 21767 27758 24581 13566
4941 13566 -4584 -18044 -28974 -26900 -16435 -603 15538 25532 25726 19766 6150 -10048 -20627
4954 -20627 -24737 -21720 -11711 4222 18940 28482 29534 14275 -6409 -20217 -27978 -23800 -10100
$$ packed form
4862e757K0717J4556L33q924j5088j4571j2366k280L612O622J1247R117J2721
4875A9939Q687L26j7249k3928k3259n45J3475K2641J7413K322k103l207l91q302
4889E819j3746j6406m395L585K0070K0183J6718n95q383j8766j7423j1650J66
4902b4823N662J0622J1427J1444Q500L290n931j4579k0456j2433k750J1011J6740
4915b276J5176R643K868m006j3438j2983j3205p360K981P706J4691J4885J0145
4928B4827J910p655j5996j5411j2610l642O863J5240J4477J3764N991l177j1015
4941A3566j8150j3460j0930K074J0465J5832J6141R994J94n960j3616j6198j0579
4954b0627m110L017J0009J5933J4718R542J052j5259k0684j3808p761M178J3700
$$ plain form
4967 -10100 225 7692 15860 23759 26359 17426 -4818 -25598 -35595 -27877 -7741 9968 22231
4980 22231 23675 20321 11619 4222 -7972 -19987 -28853 -21613 -13303 6574 23762 32915 27072 8741
4994 8741 -12224 -26101 -25878 -19432 -6481 1783 10040 17261 27936 25801 9802 -13393 -27422
5007 -27422 -33456 -22289 -3882 11945 24604 28003 21573 8671 -3455 -12755 -19976 -25564 -20381
5020 -20381 -8662 11622 27120 31977 23254 7570 -14267 -26207 -25217 -18557 -6854 4457 15500
5033 15500 22262 23588 18370 3384 -10559 -25385 -31136 -25242 -7693 13956 31385 32231 18915
5046 18915 362 -13356 -19840 -20614 -18397 -15165 -4455 9201 25212 35876 24422 1715 -18214
5059 -18214 -31402 -29256 -14566 632 13864 20002 19495 17534 9711 -503 -13500 -24507 -26725
$$ packed form
4967a0100J0325P467Q168P899K600q933k2244k0780r997P718K0136J7709J2263
4980B2231J444l354q702p397j2194j2015q866P240Q310J9877J7188R153n843j8331
4994H741k0965j3877K23O446J2951Q264Q257P221J0675k135j5999k3195j4029
5007b7422o034J1167J8407J5827J2659L399o430j2902j2126r300p221n588N183
5020b0381J1719K0284J5498M857q723j5684k1837j1940R90O660J1703J1311J1043
5033A5500O762J326n218j4986j3943j4826n751N894J7549K1649J7429Q46j3316
5046A8915j8553j3718o484p74K217L232J0710J3656J6011J0664j1454k2707j9929
5059a8214j3188K146J4690J5198J3232O138n07j961p823j0214j2997j1007k218
$$ plain form
5072 -26725 -19816 -1915 17881 31472 31895 17656 -734 -16468 -22635 -20822 -15107 -8124 500
5085 500 14725 29293 31504 18928 -1890 -22354 -30072 -26958 -13457 1155 13303 20820 23491
5098 23491 18272 8673 -6228 -20515 -26547 -22892 -14091 2941 19349 27353 25219 10403 -2344
5111 -2344 -16191 -23135 -24520 -17293 -8360 6370 23213 29249 23232 9267 -7131 -20815 -24284
5124 -24284 -25118 -12591 1319 14500 26621 28733 16319 -507 -13669 -22129 -24801 -19285 -10713
5137 -10713 7868 20862 28626 26071 11794 -6267 -19534 -27214 -25137 -13612 2393 15669 25260
5150 25260 22002 18014 5133 -6818 -18291 -29476 -29423 -15713 7530 24359 32442 25358 8201
5163 8201 -6269 -16066 -20100 -22009 -18823 -8291 8184 22142 28199 23012 7227 -9354 -23058
$$ packed form
5072b6725O909J7901J9796J3591M23j4239j8390j5734o167J813N715O983Q624
5085E00J4225J4568K211j2576k0818k0464p718L114J3501J4612J2148P517K671
5098B3491n219r599j4901j4287o032L655Q801J7032J6408Q004k134j4816j2747
5111b344j3847o944j385P227Q933J4730J6843O036o017j3965j6398j3684l469
5124b4284q34J2527J3910J3181J2121K112j2414j6826j3162q460k672N516Q572
5137a0713J8581J2994P764k555j4277j8061j3267p680K077J1525J6005J3276R591
5150B5260l258l988j2881j1951j1473j1185N3J3710K3243J6829Q083p084j7157
5163H201j4470r797m034j909L186J0532J6475J3958O057n187j5785j6581j3704
$$ plain form
5176 -23058 -28931 -23018 -10933 4168 17222 26153 25594 17222 267 -15941 -24271 -26812 -16886 -6411
5190 -6411 10650 21626 25222 23665 10962 -5647 -19540 -27743 -26463 -13680 5228 18851 25197
5203 25197 25854 13031 98 -9878 -18714 -25764 -22761 -11649 5562 24626 32148 27860 11215
5216 11215 -9016 -22581 -26687 -23542 -14170 -594 12432 21830 25076 21573 9438 -7888 -20489
5229 -20489 -30637 -26269 -13788 5598 20117 25219 22526 12678 0 -13646 -23838 -26151 -20256
5242 -20256 -3770 13018 24627 26759 17408 6074 -4110 -18198 -24836 -25969 -14629 3568 21531
5255 21531 29558 23130 12665 -691 -12713 -20778 -23185 -21469 -7828 8130 20724 25433 21848
5268 21848 12430 -4876 -17516 -25591 -26381 -14107 2627 18281 23292 21065 13987 3870 -7523
$$ packed form
5176b3058n873N913J2085J5101J3054Q931n59q372j6955j6208q330k541R926J0475
5190f411J7061J0976L596j557j2703j6609j3893q203J280J2783J8908J3623O346
5203B5197O57j2823j2933r976q836p050L003J1112J7211J9064P522m288j6645
5216A1215k0231j3565m106L145R372J3576J3026R398L246l503j2135j7326j2601
5229b0489j0148M368J2481J9386J4519N102k693r848j2678j3646j0192k313N895
5242b0256J6486J6788J1609K132r351j1334j0184j4088o638j133J1340J8197J7963
5255B1531Q027o428j0465j3356j2022q065k407J716J3641J5958J2594M709l585
5268B1848r418j7306j2640q075p90J2274J6734J5654N011k227p078j0117j1393
$$ plain form
5281 -7523 -20097 -26393 -23354 -9581 8697 21168 25673 22161 11205 -2610 -15959 -25401 -26773
5294 -26773 -18628 -2047 13830 24754 25308 18979 6895 -6897 -17735 -24250 -22537 -15065 -609
5307 -609 16846 28657 26153 17636 -3187 -17532 -23458 -21324 -13112 -2111 7542 17085 22914 23012
5321 23012 14626 -2915 -18836 -30298 -26963 -12111 6218 20662 26339 21111 9261 -634 -7130
5334 -7130 -17163 -22656 -21027 -12956 5135 20279 32170 24341 9643 -6541 -22347 -26538 -23311
5347 -23311 -8835 4970 14244 18462 17346 17664 9415 -5300 -22469 -33381 -27558 -8986 11843
5360 11843 25362 26668 18969 8893 -3648 -14246 -22475 -24390 -17446 -3247 10722 19727 26001
5373 26001 24078 11300 -4179 -21939 -30656 -21903 -8619 9138 20200 21104 17169 13944 2096
$$ packed form
5281g523j2574o296L039J3773J8278J2471M505l512j0956j3815j3349r442j372
5294b6773Q145J6581J5877J0924N54o329j2084j3792j0838o515J713P472J4456
5307f09J7455J1811k504q517k0823j4345n926K134Q212J1001R653R543N829R8
5321B3012q386j7541j5921j1462L335J4852J8329J4444N677n228j1850r895o496
5334g130j0033n493J629Q071J8091J5144J1891p829j4698j6184j5806m191L227
5347b3311J4476J3805R274M218j116L18q249j4715j7169j0912N823J8572K0829
5360A1843J3519J306p699j0076j2541j0598q229j915O944J4199J3969R005O274
5373B6001j923j2778j5479j7760q717Q753J3284J7757J1062R04l935l225j1848
$$ plain form
5386 2096 -5238 -19431 -25793 -22362 -7725 9727 25679 29023 21907 6467 -10835 -22243 -25102
5399 -25102 -18628 -10782 542 8813 19842 24213 24432 8535 -11554 -28912 -32170 -20991 -112
5412 -112 14291 20576 18498 14476 11227 -2045 -11763 -23227 -25413 -17683 -4937 12823 28481 30554
5426 30554 17082 1004 -14983 -23133 -20698 -14065 -7104 1269 12828 22351 27087 18373 2308
5439 2308 -16807 -28892 -26354 -17142 569 16199 22225 21388 19028 9062 -4371 -16707 -23731 -23985
5453 -23985 -11813 137 17246 25061 24672 14410 392 -14533 -25620 -24309 -16215 -912 11157
5466 11157 17807 19479 20423 10694 -2929 -18554 -29645 -27698 -15521 2928 18568 23037 21015
5479 21015 14274 1850 -9076 -19680 -22226 -17788 -6532 4804 15572 26556 26143 15168 -1495
$$ packed form
5386B096p334j4193o362L431J4637J7452J5952L344p116j5440j7302j1408k859
5399b5102O474P846J1324Q271J1029M371K19j5897k0089j7358l258J1179K0879
5412a12J4403O285k078m022l249j3272r718j1464k186P730J2746J7760J5658K073
5426C0554j3472j6078j5987q150K435O633O961Q373J1559R523M736q714j6065
5439B308j9115j2085K538R212J7711J5630O026q37k360r966j3433j2336p024k54
5453b3985J2172J1950J7109P815l89j0262j4018j4925j1087J311Q094J5303J2069
5466A1157O650J672R44r729j3623j5625j1091J947J2177J8449J5640M469k022
5479B1015o741j2424j0926j0604k546M438J1256J1336J0768J0984m13j0975j6663
$$ plain form
5492 -1495 -20514 -29341 -22385 -10417 4377 14631 18620 21466 19333 9232 -5814 -19439 -29959
5505 -29959 -24307 -12539 6697 21305 26421 23308 10224 -1360 -14425 -19727 -19704 -16394 -6860 4961
5519 4961 21417 30643 22513 9451 -12535 -24042 -26859 -18239 -6259 2190 11791 17974 22304 18216
5533 18216 5384 -11724 -23435 -26044 -18095 -7245 11931 21165 26054 20203 7199 -5584 -15818
5546 -15818 -21079 -21849 -14031 -2608 11579 24474 28156 19091 3245 -14978 -23671 -22884 -15537 -5424
5560 -5424 8135 19476 21257 20171 12409 -772 -13861 -21366 -21217 -15088 -4640 12772 24328
5573 24328 26743 17177 4210 -10021 -19856 -21347 -18432 -9039 2475 12246 20798 24843 18893 5962
5587 5962 -13417 -28007 -30533 -17820 1142 13488 20712 19682 14546 6372 -4309 -13165 -20927
$$ packed form
5492a495j9019q827O956J1968J4794J0254L989K846k133j0101j5046j3625j0520
5505b9959N652J1768J9236J4608N116l113j3084j1584j3065n302K3L310R534J1821
5519D961J6456R226q130j3062k1986j1507k817Q620J1980Q449R601O183M330m088
5533A8216j2832j7108j1711k609P949J0850J9176R234M889n851j3004j2783j0234
5546a5818n261p70P818J1423J4187J2895L682r065j5846j8223q693P87P347J0113
5560e424J3559J1341J781j086p762j3181j3089p505J49O129J0448J7412J1556
5573B4328K415r566j2967j4231r835j491K915R393J1514R771Q552M045n950j2931
5587E962j9379j4590k526J2713J8962J2346P224j030n136q174j0681q856p762
$$ plain form
5600 -20927 -25183 -19225 -2540 16476 29107 30656 16200 -5178 -18715 -21275 -19196 -9811 -4528
5613 -4528 1068 14108 22086 25087 16086 -876 -18480 -25301 -26427 -13285 2971 13933 25083
5626 25083 21920 13334 4510 -7855 -16096 -20414 -18315 -12635 1102 17887 27764 25742 11610 -3520
5640 -3520 -18854 -23512 -22687 -14160 -1662 12158 22649 24715 16637 3825 -6677 -18076 -21777
5653 -21777 -19596 -14356 -263 15844 25998 27858 16104 -3032 -16849 -23563 -20540 -13435 -3297
5666 -3297 6784 17001 23006 19238 11787 -2386 -17329 -25048 -26251 -15845 890 17950 27244
5679 27244 24282 13209 1109 -10171 -20586 -24330 -18696 -9834 4835 16312 25352 23536 13368
5692 13368 -2268 -16510 -24898 -23550 -15096 -2710 12538 21536 23870 14929 3221 -10393 -18792
$$ packed form
5600b0927m256N958J6685J9016J2631J549j4456k1378j3537k560K079R385N283
5613d528N596J3040P978L001r001j6962j7604o821j126J3142J6256J0962J1150
5626B5083l163q586q824j2365q241m318K099N680J3737J6785R877k022j4132j5130
5640c520j5334m658Q25Q527J2498J3820J0491K066q078j2812j0502j1399l701
5653b1777K181N240J4093J6107J0154J860j1754j9136j3817o714L023P105J0138
5666c297J0081J0217O005l768p451j4173j4943p719j203J0406J6735J7060R294
5679B7244k962j1073j2100j1280j0415l744N634Q862J4669J1477R040j816j0168
5692A3368j5636j4242q388J348Q454J2386J5248Q998K334q941j1708j3614q399
$$ plain form
5705 -18792 -24160 -19039 -10064 3550 16147 21699 21544 14545 -1085 -16199 -22381 -25211 -16145 -2023
5719 -2023 11605 20974 24117 17150 9095 -4189 -15442 -23696 -20568 -14020 182 17892 26198 22851
5733 22851 10678 598 -14298 -17430 -20087 -17025 -8043 5511 22380 28042 20415 7150 -7413
5746 -7413 -16927 -20675 -20133 -11634 682 11339 20166 23784 16148 2921 -10364 -21067 -23893 -21001
5760 -21001 -10319 8034 20122 23886 15474 9171 -1194 -8649 -19604 -25922 -18687 -5868 12803
5773 12803 25161 24831 15868 2754 -10890 -18868 -19458 -18185 -9609 2335 16417 22321 22791 14138
5787 14138 1068 -13994 -20069 -26169 -19169 -3806 12226 22729 24615 18059 9159 -5431 -16963
5800 -16963 -24726 -20301 -10997 1877 14328 20862 24563 17240 4639 -8937 -22476 -26399 -19335
$$ packed form
5705a8792n368N121Q975J3614J2597N552j55o999j5630j5114o182k830R066J4122
5719b023J3628R369L143o967q055j3284j1253q254L128O548J4202J7710Q306l347
5733B2851j2173j0080j4896l132k657L062Q982J3554J6869N662p627j3265j4563
5746g413r514l748N42Q499J2316J0657Q827L618p636j3227j3285j0703k826K892
5760b1001J0682J8353J2088L764q412o303j0365p455j0955o318P235J2819J8671
5773A2803J2358l30q963j3114j3644p978n90J273Q576J1944J4082N904M70q653
5787A4138j3070j5062o075o100P000J5363J6032J0503J886o556q900j4590j1532
5800a6963p763M425R304J2874J2451O534L701p323j2601j3576j3539l923P064
$$ plain form
5813 -19335 -4615 10917 19466 20833 18595 8921 -3644 -14826 -21713 -24540 -16937 21 15211
5826 15211 23483 24339 16785 2949 -9386 -20112 -23581 -18951 -10726 5383 17294 23621 24127 12536
5840 12536 -2639 -14756 -24954 -22979 -11809 2840 11360 18918 18802 16280 10440 -2510 -16766
5853 -16766 -26492 -24068 -15021 9744 21417 27247 18723 6679 -3896 -9081 -15926 -18267 -19693 -10365
5867 -10365 5042 20613 28587 22232 7608 -8773 -22574 -26626 -19786 -6589 6291 12873 18201
5880 18201 17800 13768 7238 -7370 -20071 -28843 -23879 -8939 9590 23592 25020 18140 6846
5893 6846 -5318 -14737 -21791 -19723 -13047 -1922 9925 19238 24258 20622 9719 -6910 -23709
5906 -23709 -27973 -20615 -4878 9786 18077 21152 15395 9393 756 -8232 -18804 -23657 -19605 -7326
$$ packed form
5813a9335J4720J5532Q549J367k238r674j2565j1182o887k827P603J6958J5190
5826A5211Q272Q56p554j3836j2335j0726l469M630Q225J6109J1911O327N06j1591
5840A2536j5175j2117j0198J975J1170J4649Q520P558j16k522n840j2950j4256
5853a6766r726K424R047K4765J1673N830q524j2044j0575n185o845k341j426R328
5867a0365J5407J5571P974o355j4624j6381j3801m052O840J3197J2880O582N328
5880A8201m01m032o530j4608j2701q772M964J4940J8529J4002J428o880j1294
5893F846j2164r419p054K068O676J1125J1847R313N020l636j0903j6629j6799
5906b3709m264P358J5737J4664Q291L075n757o002q637q988j0572m853M052J2279
$$ plain form
5920 -7326 9511 23206 28588 22032 2946 -13107 -21619 -23879 -13441 -3498 1451 7974 15871 21126
5934 21126 22317 10121 -8770 -28127 -32070 -21263 -535 18022 21965 19876 12369 3508 -3197
5947 -3197 -8884 -15927 -23737 -19120 -4340 12069 25374 29625 20804 1075 -16193 -26506 -21886
5960 -21886 -12384 -2406 7308 11889 17931 17195 13605 4555 -12053 -24597 -26405 -17218 -318 18464
5974 18464 23976 20681 13963 3750 -6982 -16157 -21600 -18662 -7040 3190 13442 19476 20372 13744
5988 13744 707 -12521 -23973 -24375 -16112 -2778 11191 18977 21582 15355 6954 -5384 -17246
6001 -17246 -22269 -21676 -12255 494 13342 21420 24346 19895 1659 -13369 -25478 -23444 -13859 -4349
6015 -4349 5774 15338 22163 24139 11452 -4084 -18114 -26423 -18223 -6529 2489 9171 16905 20430
$$ packed form
5920g326J6837J3695N382o556j9086j6053q512k260J0438R943M949O523P897N255
5934B1126J191j2196j8891j9357l943J0807K0728J8557L943k089p507q861o705
5947c197n687p043p810M617J4780J6409J3305M251q821j9729j7268j0313M620
5960b1886R502R978R714M581O042p36l590r050j6608j2544j808R187J6900J8782
5974A8464N512l295o718j0213j0732r175n443K938J1622J0230J0252O034Q96o628
5988A3744j3037j3228j1452m02Q263J3334J3969P786K605o227q401j2338j1862
6001a7246n023N93R421J2749J2848Q078K926m451j8236j5028j2109K034R585R510
6015d349J0123R564O825J976j2687j5536j4030q309Q200J1694R018O682P734L525
$$ plain form
6029 20430 18790 8169 -7968 -21526 -25294 -21559 -8076 7929 22603 25817 20546 9509 -6262
6042 -6262 -11626 -17853 -19320 -14598 -7757 4262 19558 26359 24491 6901 -11022 -23774 -25317 -17100
6056 -17100 489 7555 14365 17841 16579 12752 3161 -10578 -23169 -24544 -19523 -2706 13496
6069 13496 22175 22398 15881 5084 -7648 -16960 -21220 -19138 -10177 464 12852 20140 24285 16666
6083 16666 2566 -11954 -20709 -22394 -17287 -2746 6684 18533 22157 19386 8819 -1637 -14334
6096 -14334 -19199 -20006 -10564 -1311 12814 22165 23248 17972 2530 -10747 -21387 -22826 -17636 -6389
6110 -6389 2692 13496 20397 20755 12413 510 -15111 -23292 -22325 -12669 -1992 11837 16601 18986
6124 18986 14071 3594 -4861 -13688 -17731 -19672 -14490 -1800 14353 24510 26130 15704 -4476
$$ packed form
6029B0430j640j0621j6137j3558l768L735J3483J6005J4674L214n271j1037j5771
6042f262n364o227j467M722O841J2019J5296O801j868j7590j7923j2752j543Q217
6056a7100J7589P066O810L476j262l827r591j3739j2591j375N021J6817J6202
6069A3496Q679K23o517j0797j2732r312m260K082Q961J0641J2388P288M145p619
6083A6666j4100j4520q755j685N107J4541R430J1849L624k771j0567j0456j2697
6096a4334m865q07R442R253J4125R351J083n276j5442j3277j0640j439N190J1247
6110f389R081J0804O901L58q342j1903j5621q181R67R656J0677J3829M764K385
6124A8986m915j0477q455q827m043j941N182J2690J6153J0157J620j0426k0180
$$ plain form
6137 -4476 -19432 -22047 -18371 -10141 -1739 4492 11206 21650 24030 11692 -4104 -20086 -26939 -23345
6151 -23345 -12598 3169 15087 21810 20902 11457 766 -8580 -16086 -18112 -18560 -8384 3249 17541
6165 17541 23469 21404 9340 -3220 -14914 -20567 -23700 -12645 -2396 12411 20683 19261 12058
6178 12058 4881 -4193 -15579 -18922 -18622 -10982 1033 16862 22103 23970 13296 -1319 -14951
6191 -14951 -22045 -21323 -13414 236 10206 17218 18813 17171 7744 -1879 -15229 -23404 -21751 -11705
6205 -11705 3815 18609 24384 19725 7520 -3893 -11100 -16207 -18152 -15395 -8933 4929 16125
6218 16125 26033 22686 10187 -6945 -17420 -21292 -19542 -10021 -1248 10268 18913 20712 14860 4372
6232 4372 -8746 -17582 -20765 -19511 -9377 6378 18490 24033 19942 10203 -6255 -16732 -20207
$$ packed form
6137d476j4956k615L676Q230Q402O231O714J0444K380j2338j5796j5982o853L594
6151b3345J0747J5767J1918O723r08r445j0691r346p506k026m48J0176J1633J4292
6165A7541N928k065j2064j2560j1694n653l133J1055J0249J4807Q272j422p203
6178A2058p177r074j1386l343L00P640J2015J5829N241J867j0674j4615j3632
6191a4951p094P22P909J3650R970P012J595j642r427r623j3350q175J653J0046
6205a1705J5520J4794N775m659j2205j1413p207n107j945K757O462J3862J1196
6218A6125R908l347j2499j7132j0475l872J750R521Q773J1516Q645J799n852j0488
6232D372j3118q836l183J254J0134J5755J2112N543m091r739j6458j0477l475
$$ plain form
6245 -20207 -19692 -14507 -3099 8884 18570 20599 17626 7439 -6904 -17931 -21119 -20419 -11867 6500
6259 6500 20150 24022 18650 5123 -3327 -9055 -13243 -15010 -15776 -10016 3277 20003 25003 21484
6273 21484 7959 -9951 -19532 -22430 -17058 -6286 3636 14746 15403 17347 12924 5086 -5410 -17716
6287 -17716 -28541 -22770 -8608 11499 23341 24407 16768 3923 -7694 -13795 -15908 -16098 -12759
6300 -12759 -2921 10029 17483 22597 15683 5279 -9589 -20915 -24071 -20225 -5719 8634 17942
6313 17942 18601 16162 8302 541 -11300 -18246 -20285 -13560 -5379 8238 19350 23171 18850 6186
6327 6186 -7856 -16942 -22914 -19525 -10424 3191 15034 21791 20883 10598 1088 -11216 -18765 -20539
6341 -20539 -15173 -5703 10261 20071 23981 17821 5647 -5934 -14887 -20075 -20413 -11042 -1195 15682
$$ packed form
6245b0207N15N185J1408J1983R686K029k973j0187j4343j1027l188P00Q552J8367
6259F500J3650L872n372j3527q450n728m188j767p66N760J3293J6726N000l519
6273B1484j3525j7910r581k898N372J0772R922J1110O57J944m423p838j0496j2306
6287a7716j0825N771J4162K0107J1842J066p639j2845j1617o101k113j90L339
6300a2759R838J2950P454N114o914j0404j4868j1326l156L846J4506J4353R308
6313A7942O59k439p860p761j1841o946k039O725Q181J3617J1112L821m321j2664
6327F186j4042r086n972L389R101J3615J1843O757r08j0285r510j2304p549j774
6341b0539N366R470J5964R810L910o160j2174j1581q953n188l38R371R847J6877
$$ plain form
6355 15682 23732 19896 9757 -994 -13272 -16969 -15891 -14341 -7715 527 15788 21766 22932 14267
6369 14267 -3136 -18718 -26851 -21277 -11044 4343 13679 18244 17020 11362 6760 -3406 -15035
6382 -15035 -23680 -24596 -14688 4584 22168 27253 19607 7566 -7069 -13735 -17736 -17409 -12843 -4216
6396 -4216 3808 13984 20282 18160 11140 -1636 -17856 -26944 -20877 -8224 8472 15887 18226 14387
6410 14387 10950 3426 -7343 -15768 -22699 -17136 -3968 9371 19919 21361 19227 10849 -4620
6423 -4620 -14768 -21947 -21613 -10312 2129 13058 18499 19052 15128 4251 -9096 -20091 -23938 -18596
6437 -18596 -5978 7100 16950 21839 15841 6465 -4299 -11183 -17426 -19228 -12803 -4139 8968 22241
6451 22241 25993 18780 2621 -11358 -18407 -19649 -15361 -3945 4150 10693 16098 17871 16002 7073
$$ packed form
6355A5682Q050l836j0139j0751j2278l697J078J550O626Q242J5261N978J166q665
6369A4267j7403j5582q133N574J0233J5387R336M565j224n658m602j0166j1629
6382a5035q645r16R908J9272J7584N085p646j2041j4635o666m001L27M566Q627
6396d216Q024J0176O298k122p020j2776j6220r088O067J2653J6696P415K339l839
6410A4387l437p524j0769q425o931N563J3168J3339J0548J442k134q378j5469
6423d620j0148p179L34J1301J2441J0929N441N53l924j0877j3347j0995l847N342
6437a8596J2618J3078R850M889n998r376j0764o884o243j802O425Q664J3107J3273
6451B2241L752p213j6159j3979p049j242M288J1416Q095O543N405J773j869q929
$$ plain form
6465 7073 -9085 -23527 -26235 -20127 -124 16208 21915 20700 8764 1951 -6744 -10373 -13779 -15438
6479 -15438 -14760 -4250 10947 23291 26842 15978 -1959 -15642 -26490 -20626 -8476 768 9297
6492 9297 11685 15312 15737 13477 2897 -11251 -23624 -23338 -13613 2238 14106 21798 19056 13388
6506 13388 1206 -8899 -17864 -20149 -15257 -7027 2005 11135 18126 21922 16290 -228 -14800 -26342
6520 -26342 -23110 -11391 4689 10745 18033 17925 13893 7047 -4627 -13978 -20919 -19879 -10328 3141
6534 3141 14022 21093 21163 12445 671 -12421 -20002 -20061 -12235 -2735 6499 13383 16801 18931 9252
6549 9252 -1115 -16989 -22557 -20417 -9671 3757 14277 17978 18307 11134 623 -9110 -16868 -18220
6563 -18220 -20911 -9463 4070 18957 26296 21118 7175 -7499 -18368 -17954 -14265 -10834 -1699
$$ packed form
6465G073j6158j4442k708O108K0003J6332N707j215j1936o813q695l629l406j659
6479a5438O78J0510J5197J2344L551j0864j7937j3683j0848N864J2150R244Q529
6492I297K388L627M25k260j0580j4148j2373K86R725J5851J1868P692k742n668
6506A3388j2182j0105q965k285M892Q230R032R130O991L796n632j6518j4572j1542
6520b6342L232J1719J6080O056P288j08m032o846j1674r351o941J040R551J3469
6534C141J0881P071P0q718j1774j3092p581n9P826R500R234O884L418K130r679
6549I252j0367j5874n568K140J0746J3428J0520L701L29p173j0511r733p758j352
6563a8220k691J1448J3533J4887P339n178j3943j4674j0869M14L689L431R135
$$ plain form
6576 -1699 7903 17435 20928 18212 6329 -7479 -19735 -21481 -18586 -5941 7657 15172 19951 16223
6590 16223 12055 -861 -11317 -19837 -20498 -14886 -3614 8195 20264 19938 16938 4200 -8010
6603 -8010 -16422 -20233 -19340 -9857 2532 12100 17852 21157 12797 458 -13056 -20982 -18541 -11621
6617 -11621 -2454 5768 15178 17297 17295 11299 -4652 -14778 -23315 -17453 -9413 2877 14260 16941
6631 16941 19844 14150 4589 -9682 -19921 -18531 -12039 -2643 4233 11741 17770 19932 14622 2061
6645 2061 -13408 -22257 -23335 -11472 1082 12780 21154 20493 12817 1184 -7736 -14730 -14699 -15630 -12420
6660 -12420 -390 11595 23385 24889 12382 -1790 -17415 -23048 -19241 -9181 1478 9820 16079
6673 16079 18189 13121 5912 -2347 -11785 -18580 -20037 -11852 -171 14478 24192 23201 11562 -2083
$$ packed form
6576a699R602R532L493k716j1883j3808j2256j746K895J2645J3598P515M779l728
6590A6223m168j2916j0456q520o61N612J1272J1809J2069l26l000j2738j2210
6603h010q412l811Q93R483J2389R568N752L305q360j2339j3514p926K441O920
6617a1621R167Q222R410K119kn996j5951j0126q537N862Q040J2290J1383K681
6631A6941K903n694r561j4271j0239J390O492R396O876P508O029K162n310j2561
6645B061j5469q849j078J1863J2554J1698Q374o61p676j1633q920o994L1r31L210
6660a2420J2030J1985J1790J504j2507j4172j5625n633L807J0060J0659Q342O259
6673A6079K110n068p209q259r438o795j457Q185J1681J4649R714r91j1639j3645
$$ plain form
6687 -2083 -13185 -18805 -15332 -13954 -5358 5493 14745 20916 16842 6122 -3502 -14452 -18229 -20292
6701 -20292 -13220 -1649 14183 22203 21416 11815 -517 -12641 -15766 -17244 -12370 -4562 4258 11385
6715 11385 18885 19613 12993 466 -16098 -22043 -20630 -12803 425 9649 16175 16613 14409 2566
6729 2566 -6082 -14471 -17974 -16473 -8573 1276 14774 20013 19916 11208 -2058 -13640 -19773 -18687 -11964
6744 -11964 -5578 5874 15438 20638 18723 6929 -5023 -15161 -18170 -14800 -6058 1706 10879 17022
6758 17022 18308 12771 3465 -9070 -16894 -21358 -16567 -4535 8322 18447 18821 15689 7167 -5199
6772 -5199 -13453 -18136 -16202 -12072 -1343 11458 18413 18831 13577 5920 -6833 -14052 -21209 -18347
6786 -18347 -10638 6166 19672 21057 14727 4206 -5416 -9022 -14014 -15416 -15088 -7411 5318 17679
$$ packed form
6687b083j1102n620L473J378Q596J0851R252O171m074j0720r624j0950l777k063
6701b0292P072J1571J5832Q020p87r601j2332j2124l125j478M874P808Q820P127
6715A1385P500P28o620j2527j6564n945J413P827J3228R224O526M38k204j1843
6729B566q648q389l503J501P900R849J3498N239r7q708j3266j1582o133J086O723
6744a1964O386J1452R564N200j915j1794j1952j0138l009L370Q742P764R173O143
6758A7022J286n537r306j2535p824m464M791J2032J2857J0125L74l132q522j2366
6772e199q254m683J934M130J0729J2801O955M18n254p657j2753p219p157K862
6786a8347P709J6804J3506J385o330j0521r622l606m992j402L28P677J2729J2361
$$ plain form
6800 17679 25130 19650 6290 -10942 -18961 -22394 -15188 -3966 7700 12962 15401 13670 8910 3106
6814 3106 -6953 -15076 -22549 -20374 -7307 9637 20865 25437 15896 3905 -9081 -12482 -15182
6827 -15182 -15369 -9096 -3777 6447 16473 23299 16737 4057 -13066 -21322 -22296 -13027 -2556 7111
6841 7111 14671 19097 13824 8375 -2485 -12729 -17824 -17708 -12463 -2217 10533 17833 17890 15853 4692
6856 4692 -7918 -16860 -19804 -15242 -6438 4892 12476 17785 13927 9115 -545 -9724 -17947 -19454
6870 -19454 -13417 -3749 10835 18285 18618 13364 5146 -6088 -12816 -17916 -18263 -11963 1407 14780
6884 14780 22931 20187 8833 -2208 -12742 -18550 -19914 -12501 -4858 7122 15546 15837 16075 7367
6898 7367 1285 -15535 -22128 -21152 -10594 4444 16280 18289 12770 5955 234 -4105 -11852 -16995
$$ packed form
6800A7679P451n480j3360j7232q019l433P206J1222J1666N262K439j731m760n804
6814C106j0059q123p473K175J3067J6944J1228M572r541j1991j2986l401k700
6827a5182j87O273N319J0224J0026O826o562j2680j7123q256r74R269J0471R667
6841G111P560M426n273n449j0860j0244n095J16N245J0246J2750P300N7k037j1161
6856D692j2610q942k944M562Q804J1330P584N309l858m812r660r179q223j507
6870a9454O037R668J4584P450L33n254q218j1234o728n100l47O300J3370J3373
6884A4780Q151k744j1354j1041j0534n808j364P413P643J1980Q424K91K38q708
6898G367o082j6820o593R76J0558J5038J1836K009n519o815n721m339p747n143
$$ plain form
6912 -16995 -17157 -9800 4096 17218 23186 16672 5898 -4237 -14128 -16978 -15872 -10563 -2468 7323
6926 7323 14764 19382 16860 8037 -6465 -17389 -21822 -16507 -4692 5653 13508 17413 14845 9008
6940 9008 378 -7610 -17921 -18523 -14911 -2949 8970 19678 20795 15346 4765 -7518 -16424 -18849
6954 -18849 -13242 -8496 1381 7637 14843 16689 14993 6197 -8609 -18961 -21068 -17368 -5878 9694
6968 9694 17260 19925 13588 4698 -2071 -9947 -16215 -15518 -13194 -3606 9671 18099 23245 20175 5267
6983 5267 -10977 -22744 -24833 -13074 155 11309 15327 13812 12377 9988 5512 -4886 -18745
6996 -18745 -24472 -18671 -810 15246 23271 20724 9770 -1517 -9375 -14139 -14251 -10704 -6971 704
7010 704 10067 15154 19319 16922 3519 -12811 -24704 -22125 -13035 1083 13438 17326 13704 11689
$$ packed form
6912a6995j62P357J3896J3122N968o514j0774j0135r891k850J106N309Q095R791
6926G323P441M618k522q823j4502j0924m433N315J1815J0345P855L905k568n837
6940I008q630p988j0311o02L612J1962J1919J0708J117n449j0581j2283q906k425
6954a8849N607M746R877O256P206J846j696q796j4806j0352k107L700J1490J5572
6968I694P566K665o337q890o769p876o268O97K324R588J3277Q428N146l070j4908
6983E267j6244j1767k089J1759J3229J1154M018j515j435k389m476j0398j3859
6996a8745n727N801J7861J6056Q025k547j0954j1287p858m764j12L547L733P675
7010G04R363N087M165k397j3403j6330j1893K579R090J4118J2355L888l622k015
$$ plain form
7024 11689 7371 -614 -12886 -22446 -20694 -11847 2842 13120 20051 19829 12780 1569 -9885 -17277
7038 -17277 -18105 -12802 -4286 7192 15284 18911 15503 8528 -4005 -13073 -18017 -15446 -8189 749
7052 749 9925 16291 19686 15239 3364 -8995 -15938 -18645 -13710 -6045 2971 11679 18219 21389 12413
7067 12413 -2522 -13663 -18687 -17012 -10003 2491 7542 14295 17116 14171 6395 -3818 -17162
7080 -17162 -20821 -19383 -8696 5994 15616 18616 15847 7326 -1162 -10475 -15368 -15819 -15646 -7301 6166
7095 6166 17294 20140 18290 8725 -6046 -16466 -19843 -14805 -7479 3699 8992 15453 17305 14556
7109 14556 7809 -5262 -17225 -18563 -16393 -5025 6546 13913 16960 14723 9111 -523 -10976
7122 -10976 -18960 -18831 -11129 1835 11606 17756 16901 13610 5655 -7136 -13685 -17930 -15522 -9300 3278
$$ packed form
7024A1689m318p985j2272r560J752Q847J4689J0278O931k22p049j1211j1454p392
7038a7277q28N303Q516J1478Q092L627l408o975j2533r068m944K571P257Q938
7052G49R176O366L395m447j1875j2359o943k707M935P665R016Q708O540L170q976
7067A2413j4935j1141n024J675P009J2494N051O753K821k945p776j0213j3344
7080a7162l659J438J0687J4690R622L000k769q521q488r313m893m51J73Q345J3467
7095F166J1128K846j850r565j4771j0420l377N038P326J1178N293O461J852k749
7109A4556o747j3071j1963j338K170J1368J1571P367L047k237n612r634j0453
7122a0976p984J29P702J2964R771O150q55l291p955j2791o549m245K408O222J2578
$$ plain form
7137 3278 14193 17807 18895 10102 -2709 -11652 -20610 -15024 -9651 -3876 3754 13026 17256 15682
7151 15682 8461 -5429 -16337 -21484 -18030 -8893 2521 13697 19503 19518 12711 906 -11373 -16571
7165 -16571 -17351 -12498 -5845 3714 14686 21146 18314 7721 -6012 -15116 -17703 -17013 -9954 -1418
7179 -1418 9495 17747 18430 13284 1268 -9181 -15707 -14083 -13465 -6703 808 12480 19682 20210 9285
7194 9285 -3602 -15179 -19518 -15855 -9843 1955 7224 16645 19263 15089 6515 -3757 -15715 -20129
7208 -20129 -16987 -7888 2838 13670 18500 16294 11222 -1240 -8884 -15824 -18123 -12183 -1306 7891
7222 7891 15850 18639 16422 5978 -4494 -15673 -19590 -16740 -8583 2113 13069 19319 17779 12441
7236 12441 1480 -11472 -18659 -19557 -13588 -3813 6954 12269 18063 15994 8982 -201 -14533 -17974
$$ packed form
7137C278J0915L614J088q793j2811q943q958N586N373N775P630R272M230j574
7151A5682p221j3890j0908n147L454R137J1414J1176N806J5o807j1805j2279n198
7165a6571p80M853O653R559J0972O460k832j0593j3733r104k587O90P059Q536
7179a418J0913Q252O83n146j2016j0449o526J624O18O762P511J1672P202N28j0925
7194I285j2887j1577m339L663O012J1798N269R421K618m174q574j0272j1958m414
7208b0129L142R099J0726J0832M830k206n072j2462p644o940k299N940J0877R197
7222G891P959K789k217j0444j0472j1179l917K850Q157J0696J0956O250j540n338
7236A2441j0961j2952p187q98N969R775J0767N315N794k069p012r183j4332l441
$$ plain form
7250 -17974 -19614 -9782 644 11879 16748 14891 9021 589 -5782 -12054 -15778 -17757 -9226 456
7264 456 17406 22689 18338 3877 -7896 -16563 -14000 -11748 -7767 -2309 5212 12030 19521 16703
7278 16703 6110 -6710 -16416 -19075 -16530 -6747 4636 13366 17895 15013 7026 -1746 -6106 -11643
7292 -11643 -13384 -14318 -8250 3906 17375 22436 18372 7954 -6688 -17000 -19142 -14981 -5805 228
7306 228 12119 13713 15130 12004 3423 -3105 -14603 -18754 -18558 -9450 4650 16211 19813 14837
7320 14837 4948 -7328 -13768 -15855 -11778 -6873 -4533 3347 10376 18706 16671 9412 -6548 -19670
7334 -19670 -23765 -15149 -1419 11422 17343 13164 12369 7240 2658 -3447 -11926 -20291 -16853 -4993
7348 -4993 9068 20851 22916 12355 1498 -9889 -13768 -14272 -11196 -5465 1666 9400 16048 17538
$$ packed form
7250a7974j640R832J0426J1235M869j857n870q432o371o272l724j979Q531R682
7264D56J6950N283m351j4461j1773q667K563K252L981N458P521O818P491k818
7278A6703j0593j2820r706k659K545R783J1383Q730M529k882p987q772m360n537
7292a1643j741r34O068J2156J3469N061m064j0418j4642j0312k142M161R176O033
7306B28J1891J594J417l126q581o528j1498m151J96R108J4100J1561L602m976
7320A4837r889j2276o440k087M077M905K340P880P029Q330k035p259j5960j3122
7334a9670m095Q616J3730J2841N921m179p95n129m582o105q479q365L438J1860
7348d993J4061J1783K065j0561j0857j1387l879n04L076N731P131P734O648J490
$$ plain form
7362 17538 13085 1402 -9997 -17893 -19143 -12573 -865 8529 15508 16947 11882 5118 -4314 -10282
7376 -10282 -14037 -18666 -12727 -2975 10098 21192 19292 11461 -95 -9454 -13875 -15576 -10813 -6571
7390 -6571 2868 12500 17795 15020 9758 162 -10952 -17570 -19389 -12261 -736 11003 20198 18606
7404 18606 6688 -218 -8817 -11316 -13248 -13869 -10062 -793 11514 20042 18775 11521 -1679 -14511
7418 -14511 -19252 -17186 -9578 1704 8227 10550 12121 12259 9880 1005 -10567 -20229 -20005 -10270 3791
7433 3791 16106 19481 16964 6995 -2123 -8859 -14135 -15727 -13587 -7686 4840 16260 21180 18230
7447 18230 9172 -5425 -16290 -19892 -14886 -5938 2516 8158 12933 12344 12782 7044 -5079 -15481
7461 -15481 -20073 -17604 -3789 7977 14030 15935 12490 5784 923 -7864 -11740 -15686 -12734 -3875
$$ packed form
7362A7538m453j1683j1399p896j250O570J1708R394O979J439n065o764r432n968
7376a0282l755m629N939R752J3073J1094j900p831j1556r359m421j701M763M242
7390f571R439R632N295k775n262r596j1114o618j819P128J1525J1739R195j592
7404A8606j1918o906q599k499j932o21L807R269J2307Q528j267p254j3200j2832
7418a4511m741K066P608J1282O523K323J571J38k379q875j1572r662K24R735J4061
7433C791J2315L375k517r969r118o736n276j592K140N901J2526J1420M920k950
7447A8230r058j4597j0865l602N006Q948Q454N642M775n89M38n738j2123j0402
7461a5481m592K469J3815J1766O053J905l445o706m861q787l876l946K952Q859
$$ plain form
7475 -3875 10039 17452 20086 12911 3783 -7055 -14448 -16688 -14457 -6576 3109 12326 16175 15747 11114
7490 11114 139 -8987 -15910 -21470 -13596 -2688 8498 17019 17622 12071 3514 -8224 -10794 -14365
7504 -14365 -14090 -8560 1074 7877 15886 17013 12417 3031 -11051 -18353 -20314 -12555 -2171 9425
7518 9425 12575 13180 11569 8646 1116 -5668 -17311 -21109 -15740 -3009 12782 18930 19092 12151 144
7533 144 -7814 -14980 -13895 -9833 -6994 960 7175 15045 18222 13700 1209 -14012 -21284 -18932 -7766
7548 -7766 4190 12255 13109 10126 8313 6509 -2762 -10728 -16184 -16985 -11044 2023 12031 19915 16806
7563 16806 9773 -1304 -12554 -16541 -15935 -7294 -436 6246 10934 16513 14617 9802 -739 -11888
7577 -11888 -21220 -15570 -9512 3165 13770 17485 14861 10296 97 -8870 -15037 -15469 -12970 -5485
$$ packed form
7475c875J3914P413K634p175r128j0838p393k240K231P881R685R217L849m28m633
7490A1114j0975r126o923n560P874J0908J1186Q521O03n551q557j1738k570l571
7504a4365K75N530R634O803Q009J127m596r386j4082p302j961P759J0384J1596
7518I425L150O05j611k923p530o784j1643l798N369J2731J5791O148J62o941j2007
7533A44p958p166J085M062K839P954O215P870L177m522j2491j5221p272K352J1166
7548g766J1956Q065Q54k983j813j804r271p966n456q01N941J3067J0008P884l109
7563A6806p033j1077j1250l987O06Q641O858O682M688N579j896m815j0541j1149
7577a1888r332N650O058J2677J0605L715k624m565j0199q967o167m32K499P485
$$ [...]
##END NTUPLES=NMR FID
##END=
