##TITLE=31Pdec_LR-668-RM3
 , 24 sc
 10.4.2019
##JCAMPDX= 6.0         $$ Bruker NMR JCAMP-DX V2.0
##DATA TYPE= NMR SPECTRUM
##DATA CLASS= NTUPLES
##ORIGIN= UXNMR, Bruker Analytische Messtechnik GmbH
##OWNER= root
$$ XWIN-NMR		Version 3.5
$$ Wed Apr 10 15:56:29 2019 Russian Standard Time (UT+4h)  she@DPX200
##.OBSERVE FREQUENCY= 81.013821
##.OBSERVE NUCLEUS= ^31P
##.ACQUISITION MODE= SIMULTANEOUS
##.ACQUISITION SCHEME= undefined
##.AVERAGES= 24
##.DIGITISER RES= 17
##SPECTROMETER/DATA SYSTEM= spect
##.PULSE SEQUENCE= zgpg30
##.SOLVENT NAME= CDCl3
##.SHIFT REFERENCE= (INTERNAL, CDCl3, 0, 182.463)
##AUDIT TRAIL= $$ (NUMBER, WHEN, WHO, WHERE, WHAT)
$$ ##TITLE= Audit trail, XWIN-NMR		Version 3.5
$$ ##JCAMPDX= 5.01
$$ ##ORIGIN= Bruker BioSpin GmbH
$$ ##OWNER= she
$$ F:/spectra/data/she/nmr/P31/1/pdata/1/auditp.txt
$$ ##AUDIT TRAIL=  $$ (NUMBER, WHEN, WHO, WHERE, WHAT)
(   1,<2019-04-10 15:55:32.21 +0400>,<she>,<DPX200>,
      <created by zg, POWCHK disabled, PULCHK disabled
       configuration hash MD5:
       00 E9 B6 7A A2 85 ED C7 34 08 36 98 17 FE 4E 26
       data hash MD5: 32K
       A8 99 9B 75 1D 86 DE FC 59 AC 5A A6 AB A0 BE E8>)
(   2,<2019-04-10 15:55:34.50 +0400>,<she>,<DPX200>,
      <Start of raw data processing
       efp BC_mod = 2 LB = 1 FT_mod = 6 PKNL = 1 PHC0 = -1829.883 PHC1 = 96.59899 SI = 64K 
       data hash MD5: 64K
       08 8D 0B EA 4B E4 DA 3A 91 FB ED FF A9 C8 4E AC>)
(   3,<2019-04-10 15:55:48.64 +0400>,<she>,<DPX200>,
      <pk PHC0 = -1.18 PHC1 = 11.4 
       data hash MD5: 64K
       0C E7 AD 15 0A 57 B9 9E A2 02 93 6E 4C E7 76 77>)
(   4,<2019-04-10 15:55:52.28 +0400>,<she>,<DPX200>,
      <abs ABSG = 5 
       data hash MD5: 64K
       E2 DD 37 0F 9C 88 69 63 AC 92 0D 64 E9 8B 0A 32>)
$$ ##END=
$$ 
$$ hash MD5
$$ 9A 9E D5 1D 46 83 1C F2 04 BD E4 86 FD 22 AF C1
##$RELAX= 
##$RELAX= 
##$RELAX= 
##$RELAX= 
##$RELAX= 
##$RELAX= 
##$RELAX= 
##$RELAX= 
$$ Bruker specific parameters
$$ --------------------------
##$DU= <F:/spectra>
##$EXPNO= 1
##$NAME= <P31>
##$PROCNO= 1
##$TYPE= <nmr>
##$USER= <she>
##$AMP= (0..31)
100 100 100 100 100 100 100 100 100 100 100 100 100 100 100 100 100 100 
100 100 100 100 100 100 100 100 100 100 100 100 100 100 
##$AQSEQ= 0
##$AQ_mod= 1
##$AUNM= <au_zg>
##$AUTOPOS= <>
##$BF1= 81.014009
##$BF2= 200.13
##$BF3= 200.13
##$BF4= 200.13
##$BF5= 200.13
##$BF6= 200.13
##$BF7= 200.13
##$BF8= 200.13
##$BYTORDA= 1
##$CFDGTYP= 0
##$CFRGTYP= 5
##$CHEMSTR= <none>
##$CNST= (0..31)
1 1 145 1 1 1 1 1 1 1 1 1 1 1 1 1 1 1 1 1 1 1 1 1 1 1 1 1 1 1 1 1 
##$CPDPRG= <waltz16>
##$CPDPRG1= <>
##$CPDPRG2= <waltz16>
##$CPDPRG3= <>
##$CPDPRG4= <mlev>
##$CPDPRG5= <mlev>
##$CPDPRG6= <mlev>
##$CPDPRG7= <mlev>
##$CPDPRG8= <mlev>
##$CPDPRGB= <>
##$CPDPRGT= <>
##$D= (0..31)
0 1 0 0 0 0 0 0 0 0 0 0.03 2e-05 3e-06 0 0 0 0 0 0 0 0 0 0 0 0 0 0 0 0 
0 0 
##$DATE= 1554897331
##$DBL= (0..7)
120 120 120 11 120 120 24 19 
##$DBP= (0..7)
150 150 150 150 150 150 150 150 
##$DBP07= 0
##$DBPNAM0= <>
##$DBPNAM1= <>
##$DBPNAM2= <>
$$ [...]
##$SUBNAM3= <"">
##$SUBNAM4= <"">
##$SUBNAM5= <"">
##$SUBNAM6= <"">
##$SUBNAM7= <"">
##$SUBNAM8= <"">
##$SUBNAM9= <"">
##$SW= 369.568048894756
##$SWIBOX= (0..15)
0 1 3 0 0 0 0 0 0 0 0 0 0 0 0 0 
##$SW_h= 29940.119760479
##$TD= 32768
##$TD0= 1
##$TE= 0
##$TE2= 300
##$TE3= 300
##$TEG= 300
##$TL= (0..7)
0 120 53 12 22 120 120 120 
##$TP= (0..7)
150 150 150 150 150 150 150 150 
##$TP07= 0
##$TPNAME0= <>
##$TPNAME1= <>
##$TPNAME2= <>
##$TPNAME3= <>
##$TPNAME4= <>
##$TPNAME5= <>
##$TPNAME6= <>
##$TPNAME7= <>
##$TPOAL= (0..7)
0.5 0.5 0.5 0.5 0.5 0.5 0.5 0.5 
##$TPOFFS= (0..7)
0 0 0 0 0 0 0 0 
##$TUNHIN= 0
##$TUNHOUT= 0
##$TUNXOUT= 0
##$USERA1= <user>
##$USERA2= <user>
##$USERA3= <user>
##$USERA4= <user>
##$USERA5= <user>
##$V9= 5
##$VALIST= <valist>
##$VCLIST= <CCCCCCCCCCCCCCC>
##$VD= 0
##$VDLIST= <DDDDDDDDDDDDDDD>
##$VPLIST= <PPPPPPPPPPPPPPP>
##$VTLIST= <TTTTTTTTTTTTTTT>
##$WBST= 1024
##$WBSW= 4
##$XGAIN= (0..3)
0 0 0 0 
##$XL= 0
##$YL= 0
##$YMAX_a= 135765
##$YMIN_a= -229192
##$ZGOPTNS= <>
##$ZL1= 120
##$ZL2= 120
##$ZL3= 120
##$ZL4= 120
##$ABSF1= 182.463
##$ABSF2= -187.1042
##$ABSG= 5
##$ABSL= 3
##$ALPHA= 0
##$AQORDER= 0
##$ASSFAC= 0
##$ASSFACI= 0
##$ASSFACX= 0
##$ASSWID= 0
##$AUNMP= <proc_1d>
##$AZFE= 0.1
##$AZFW= 0.5
##$BCFW= 0
##$BC_mod= 2
##$BYTORDP= 0
##$COROFFS= 0
##$CY= -3
##$DATMOD= 1
##$DC= 0
##$DFILT= <>
##$DTYPP= 0
##$F1P= 0
##$F2P= 0
##$FCOR= 1
##$FTSIZE= 65536
##$FT_mod= 6
##$GAMMA= 0
##$GB= 0
##$INTBC= 1
##$INTSCL= 5.30512e-09
##$ISEN= 30
##$LB= 1
##$LEV0= 0
##$LPBIN= 0
##$MAXI= 10000
##$MC2= 0
##$MEAN= 0
##$ME_mod= 0
##$MI= 50
##$NCOEF= 0
##$NC_proc= -3
##$NLEV= 6
##$NOISF1= 182.463
##$NOISF2= 159.3651
##$NSP= 0
##$NTH_PI= 0
##$NZP= 0
##$OFFSET= 182.463
##$PC= 4
##$PHC0= -1831.063
##$PHC1= 107.999
##$PH_mod= 1
##$PKNL= yes
##$PPARMOD= 0
##$PSCAL= 0
##$PSIGN= 0
##$REVERSE= no
##$SF= 81.0140089999434
##$SI= 65536
##$SIGF1= 159.3651
##$SIGF2= -187.1042
##$SINO= 113.3802
##$SIOLD= 16384
##$SREGLST= <1H.CDCl3>
##$SSB= 0
##$STSI= 65536
##$STSR= 0
##$SW_p= 29940.119760479
##$SYMM= 0
##$S_DEV= 0
##$TDeff= 32768
##$TDoff= 0
##$TI= <>
##$TILT= no
##$TM1= 0
##$TM2= 0
##$TOPLEV= 0
##$USERP1= <user>
##$USERP2= <user>
##$USERP3= <user>
##$USERP4= <user>
##$USERP5= <user>
##$WDW= 1
##$XDIM= 65536
##$YMAX_p= 423393749
##$YMIN_p= -3503685
$$ End of Bruker specific parameters
$$ ---------------------------------
##NTUPLES= NMR SPECTRUM
##VAR_NAME=  FREQUENCY,     SPECTRUM/REAL,   SPECTRUM/IMAG
##SYMBOL=    X,             R,               I
##VAR_TYPE=  INDEPENDENT,   DEPENDENT,       DEPENDENT
##VAR_FORM=  AFFN,          ASDF,            ASDF
##VAR_DIM=   65536,         65536,           65536
##UNITS=     HZ,            ARBITRARY UNITS, ARBITRARY UNITS
##FACTOR=    0.456856943014862, 1,           1
##FIRST=     14782.0589164792, 0,            0
##LAST=      -15158.0608439998, 0,           0
##MIN=       -15158.0608439998, -3503685,    0
##MAX=       14782.0589164792, 423393749,    0
$$ Real data points
##PAGE= N=1
##DATA TABLE= (X++(R..R)), XYDATA
$$ [...]
44146 940924 923426 853105 885913 1089250 1243620 1137867 929085 937028 1152004 1244659 1078224
44135 1078224 915860 1005610 1207502 1239299 1137683 1207004 1530832 1799677 1736666 1498989
44125 1498989 1457004 1676228 1860996 1805028 1641686 1558634 1501988 1342037 1156558 1122977
44115 1122977 1231056 1326024 1371421 1446072 1521907 1478275 1333413 1239591 1229754 1177111 1031902
44104 1031902 891755 803065 704558 619739 690988 939886 1179841 1250477 1177137 1044777
44094 1044777 898004 819895 903599 1072340 1132725 1075703 1094761 1226573 1245598 1049734
44084 1049734 875472 942638 1135543 1246841 1293578 1347153 1289600 1043604 850421 973684
44074 973684 1255000 1316021 1127242 1021183 1157177 1318968 1297565 1177014 1139363 1212693
44064 1212693 1318877 1408615 1469716 1526062 1669025 1972743 2361826 2675587 2853856 2940338
44054 2940338 2937634 2809259 2600860 2405665 2230625 2041532 1895952 1865635 1880264 1835386
44044 1835386 1791568 1842616 1855013 1631527 1316208 1302314 1676665 2080460 2230236 2249214
44034 2249214 2312207 2289764 2019565 1686136 1608100 1792627 2004094 2169569 2400470 2666924
44024 2666924 2790526 2797497 2961040 3368834 3706511 3651326 3294650 2969902 2796887 2636132
44014 2636132 2424777 2278147 2216046 2053147 1715903 1473712 1624998 2050248 2333340 2321590
44004 2321590 2311030 2596685 3068554 3414396 3557133 3677177 3873847 4017787 3958526 3732087
43994 3732087 3516897 3468898 3634481 3972640 4427249 4973105 5583824 6201641 6831799 7638761
43984 7638761 8786341 10155098 11415862 12465156 13554297 14812966 15869044 16222997
43976 16222997 15878193 15324709 14992137 15009305 15405959 16130516 16776450 16653817 15373478
43967 15373478 13224667 10869307 8815610 7253773 6170961 5428849 4828681 4255681
43959 4255681 3737607 3327741 3020350 2808864 2705508 2660315 2578416 2449943 2337973 2225241
43949 2225241 2034494 1823084 1762680 1871625 1972408 1993951 2097336 2382184 2684785 2831081
43939 2831081 2896744 3023481 3149487 3153381 3138697 3317684 3664941 3915148 3894337 3671995
43929 3671995 3403465 3200163 3143898 3236923 3302739 3100762 2606359 2068121 1738359 1636863
43919 1636863 1614288 1548937 1422856 1279872 1182734 1181418 1269633 1377738 1434895 1437119 1444235
43908 1444235 1511113 1624042 1708672 1711904 1678130 1731037 1968361 2364930 2763355 2967648
43898 2967648 2893607 2651194 2438661 2335383 2256505 2129291 2006351 1935963 1842538 1664504
43888 1664504 1513259 1534011 1678836 1791426 1856757 1969407 2100546 2126294 2077847 2122554
43878 2122554 2273364 2357535 2316460 2287840 2323902 2286753 2122006 1974395 1898417 1717571
43868 1717571 1354373 1062295 1104021 1381183 1599648 1637441 1537079 1309179 1000941 823497
43858 823497 933649 1166924 1236500 1130910 1070972 1131651 1171001 1120909 1092511 1154033 1212332
43847 1212332 1174708 1077548 1011987 1036544 1173224 1383670 1561024 1647443 1723743 1874157
43837 1874157 2020716 2023597 1887468 1727833 1598797 1509040 1529111 1687335 1817527 1729583
43827 1729583 1505790 1408237 1505855 1631207 1720518 1934291 2361061 2838007 3190762 3459092
43817 3459092 3739693 3960124 3973241 3774686 3472846 3113012 2683189 2259528 1990504 1905649
43807 1905649 1851779 1687396 1478391 1409774 1513159 1593779 1498600 1367918 1479891 1875138
43797 1875138 2308557 2601691 2854926 3217657 3620651 3879446 3929722 3805632 3504295 3049102
43787 3049102 2594254 2279045 2042883 1757739 1470470 1320325 1281422 1210027 1117812 1167125
43777 1167125 1384007 1591904 1666136 1658500 1626335 1532960 1389126 1319568 1394432 1524746 1604128
43766 1604128 1636033 1649375 1610626 1515890 1476126 1597894 1815529 1927038 1802399 1526979
43756 1526979 1333971 1386487 1617378 1808361 1831687 1757713 1715248 1747789 1855979 2061071
43746 2061071 2329699 2538060 2619665 2653710 2699731 2664598 2478607 2285541 2270080 2379651
43736 2379651 2416693 2351318 2338364 2447798 2568842 2581926 2466579 2244791 1962910 1719762
43726 1719762 1583994 1508422 1440441 1452625 1618702 1827871 1896745 1827530 1791448 1881559 2022640
43715 2022640 2094378 2028586 1846584 1710505 1840225 2250223 2672797 2861083 2829448 2680151
43705 2680151 2409874 2078318 1936281 2120301 2406842 2534008 2570321 2685086 2784926 2723948
43695 2723948 2653822 2766787 2886263 2749937 2529881 2593808 2874965 2975164 2810717 2660872
43685 2660872 2632211 2570984 2473283 2492678 2556579 2443410 2217769 2139227 2195883 2179387 2115995
43674 2115995 2145271 2139310 1984468 2016115 2522000 3055334 3013615 2677816 2797946 3349955
43664 3349955 3704604 3851077 4286137 4779754 4576369 3884500 3763543 4365442 4779664
43655 4779664 4847768 5457550 6699038 7644326 8479237 10649438 14169819 17599011 22075121
43646 22075121 31770839 46939029 59216104 58767255 45654377 29867954 19896334 15428588
43638 15428588 12121694 8795691 6970363 6548811 5803502 4447688 3720612 3887008 3946246
43629 3946246 3565898 3392184 3552523 3462238 3082919 2995682 3233514 3238356 2956188 2886602
43619 2886602 3072191 3053791 2806588 2760059 2901762 2785440 2438385 2371083 2650285 2817617
43609 2817617 2780753 2938386 3324354 3464821 3256898 3202990 3538931 3840401 3759670 3510563
43599 3510563 3342013 3120525 2744394 2457636 2436214 2490339 2448463 2437919 2536598 2534250 2301122
43588 2301122 2052217 1996719 2028221 1988461 1955330 2052663 2224625 2387917 2577279 2789449
43578 2789449 2926247 3029057 3304569 3762146 4085971 4041084 3766514 3489029 3183346 2731961
43568 2731961 2238880 1956168 1986851 2203123 2378270 2324944 2025583 1695564 1592382 1719484
43558 1719484 1859798 1908910 1970405 2090367 2144464 2080645 2043492 2133717 2248590 2295966 2376308
43547 2376308 2594783 2846470 2947225 2866299 2703247 2542243 2438935 2438865 2496445 2474378 2322492
43536 2322492 2163715 2123372 2183791 2288647 2460789 2706167 2924223 3054649 3218041 3543120
43526 3543120 3893189 3935059 3524734 2922235 2549115 2563701 2741894 2788586 2688694 2660827
43516 2660827 2810854 2998855 3090349 3156553 3305081 3470958 3541345 3551798 3562727 3465587
43506 3465587 3154138 2802585 2706901 2890563 3126174 3310955 3533327 3778762 3891547 3878280
43496 3878280 3939568 4122345 4252940 4320768 4587399 5125564 5566690 5578925 5358209 5340728
43486 5340728 5590028 5782750 5718683 5550959 5523559 5719191 6077782 6462243 6678068 6604643
43476 6604643 6365179 6240941 6354963 6515295 6411229 5920086 5211525 4593429 4256490
43467 4256490 4132083 3995444 3713693 3364674 3111163 3022772 3052929 3125197 3184475 3202907
43457 3202907 3192480 3201050 3269221 3398152 3551997 3661892 3648511 3498118 3307899 3201598
43447 3201598 3213277 3298934 3414992 3517721 3559317 3591225 3779922 4156527 4441002 4358748
43437 4358748 4096002 4141476 4628428 5159064 5432370 5726860 6464520 7490642 8143480
43428 8143480 8013938 7355094 6703799 6334847 6184057 6118837 6098328 6107737 6091859 6026752
43418 6026752 5997240 6100178 6252054 6191935 5755144 5076213 4427277 3930940 3562901 3349773
43408 3349773 3344572 3422266 3346947 3104789 2950762 3033590 3187693 3223540 3220785 3364359 3664063
43397 3664063 4035659 4515552 5155124 5777529 6085232 6025349 5880166 5968961 6367708 6909197
43387 6909197 7336093 7445505 7189802 6678874 6061462 5426261 4831483 4346256 3999102
43378 3999102 3756656 3615839 3637805 3825511 4062040 4251349 4424274 4617272 4752243 4745147
43368 4745147 4636970 4508931 4374061 4269177 4325536 4586349 4861471 4944800 4891190 4894067
43358 4894067 4974243 5004028 4979847 5037426 5215715 5428134 5661853 5977019 6294181 6423343
43348 6423343 6361192 6338110 6495440 6731364 6958559 7280663 7747842 8128928 8152705 7884947
43338 7884947 7660849 7670656 7775533 7738579 7514348 7287526 7306423 7693033 8349389 9009703
43328 9009703 9387637 9289707 8657647 7616946 6495521 5650160 5167229 4807650 4342687
43319 4342687 3871452 3682553 3851591 4136236 4288488 4325461 4416440 4604512 4752233 4732806
43309 4732806 4580875 4438387 4405796 4473274 4575592 4692863 4892817 5261871 5778982 6267490
43299 6267490 6500570 6369981 5957078 5460326 5069194 4871253 4820271 4794787 4744792 4785546
43289 4785546 5075846 5586615 6089702 6446515 6821164 7485155 8434192 9303747 9664580
43280 9664580 9329491 8412120 7228185 6166062 5515337 5312389 5368142 5460047 5460075 5321820
43270 5321820 5087651 4945244 5129162 5655239 6231327 6534171 6525749 6411448 6341370 6263619
43260 6263619 6056276 5698912 5287992 4949863 4773883 4790314 4958324 5155124 5205942 4994420
43250 4994420 4586249 4195091 3959623 3795300 3555792 3296848 3232025 3412044 3607789 3591841
43240 3591841 3412253 3278229 3266451 3278174 3250761 3268547 3421951 3644127 3771734 3762045
43230 3762045 3769892 3937196 4145669 4114831 3786043 3457351 3420067 3595387 3701470 3665381
43220 3665381 3642370 3701679 3763905 3834125 4015670 4263181 4403831 4461746 4666871 5045310
43210 5045310 5304461 5266782 5113315 5009138 4798681 4344023 3902738 3834438 4096006 4342769
43200 4342769 4411039 4404747 4402520 4377128 4352210 4375807 4377704 4278339 4179030 4223686 4347653 4393097
43188 4393097 4388587 4465836 4580400 4583047 4503772 4490939 4522762 4461985 4357167 4400912 4606454
43177 4606454 4799387 4915823 5054284 5271818 5582315 6064023 6654679 6949744 6605420
43168 6605420 5880990 5348237 5113439 4831390 4469659 4432825 4807573 5144617 5252788 5563570
43158 5563570 6329456 7104336 7553710 8188952 9608552 11528362 13438908 15811530 19434630
43149 19434630 23473764 25421758 23640407 19241184 14806959 11802156 9929759 8525361
43141 8525361 7522003 6984328 6603660 6112005 5706397 5633865 5674146 5448204 5027688 4811256
43131 4811256 4891384 4953940 4806954 4628485 4607019 4669731 4706239 4778713 4940403 5084572
43121 5084572 5150193 5259472 5470595 5613192 5566548 5472345 5444548 5317796 4976909 4696380
43111 4696380 4786394 5097794 5291302 5434978 5858616 6523342 7081864 7555244 8355967 9493588
43101 9493588 10304206 10241415 9523065 8725544 8099170 7564721 7063680 6592550 6104253 5624805
43091 5624805 5286125 5079871 4813296 4457489 4257770 4332657 4470867 4512142 4598137 4832547
43081 4832547 5049591 5182903 5505759 6188505 6941067 7420325 7679032 7883919 7928371 7706340
43071 7706340 7459105 7450524 7577979 7674003 7878115 8330774 8846547 9278731 9812030 10511160
43061 10511160 11102072 11651376 12786316 14643705 16452835 18030858 20704557 25518681
43053 25518681 31723581 39007092 49971551 66796236 84917600 93846864 87004558 68930930
43045 68930930 50385137 37785410 29979207 23826546 18874840 15879576 14120786 12308045
43037 12308045 10537864 9613372 9355401 8974673 8454254 8334481 8542110 8476490 8005455
43028 8005455 7526677 7233427 7022257 6933359 7048982 7134851 6943487 6671714 6595439 6510113
43018 6510113 6111687 5688264 5788207 6348655 6775072 6789619 6609909 6369321 5969570 5501632
43008 5501632 5258325 5304400 5495413 5860782 6480309 7092356 7384076 7577413 8164622 9234862
42998 9234862 10724773 13033832 16329384 19269162 19694961 17081871 13313415 10488940
42990 10488940 8877163 7626036 6468611 5735138 5372275 5033633 4792362 4870030 4959176
42981 4959176 4640099 4183258 4123113 4306518 4198159 3880691 3866282 4107603 4127591 4021785
42971 4021785 4374269 5192310 5872797 6276649 6874970 7690206 8055685 7689068 7128343
42962 7128343 6807239 6526949 6159425 6062372 6430641 6972941 7555886 8421765 9466148
42953 9466148 10107029 10221849 10403128 10932261 11366111 11528944 11985727 13069704 14372970
42944 14372970 15661195 17304112 19402057 21703805 24832105 30076580 37473313 46240332
42936 46240332 58055496 76600558 100599693 119557307 121328504 104526264 80037081
42929 80037081 59596829 46172362 36434923 28306978 22545734 19207268 16640784 13949870
42921 13949870 11811538 10599165 9620819 8493756 7690581 7377681 6992775 6306890 5818625
42912 5818625 5768819 5702232 5325348 4974942 4913119 4875549 4644730 4458365 4530673 4672432
42902 4672432 4663118 4576747 4515340 4398092 4206998 4118107 4241928 4496265 4782906 5010854
42892 5010854 4971082 4533629 3945085 3569008 3376930 3094414 2780696 2770081 3040415 3171046
42882 3171046 3014080 2897671 3025769 3166584 3124452 3062788 3129561 3177177 3109890 3139619
42872 3139619 3424968 3775524 3978783 4132584 4400322 4712934 4969518 5266716 5662483
42863 5662483 5974016 6110853 6374688 7088618 8098275 8980806 9623710 10245464 10901885
42854 10901885 11320677 11263352 10785578 10082144 9289123 8508868 7851931 7350906 6924907
42845 6924907 6493757 6070953 5720376 5480154 5346642 5285061 5242185 5178577 5090326 4988332
42835 4988332 4883610 4810809 4822683 4923994 5041866 5094415 5062982 4977433 4872706 4793888
42825 4793888 4806617 4951438 5190331 5428329 5602474 5751237 5986571 6375935 6855736 7299622
42815 7299622 7677925 8105827 8734507 9647218 10817085 12014676 12752328 12557528 11460930
42806 11460930 10061820 8938646 8124003 7335292 6542606 5999418 5788893 5689468 5536288
42797 5536288 5420324 5435596 5487378 5485520 5523191 5722174 6066707 6521585 7152088 7967714
42787 7967714 8772703 9343372 9681747 9947449 10190295 10292523 10171317 9935993 9808450
42778 9808450 9895169 10022890 9832040 9119383 8084410 7139639 6490548 6035061 5655337
42769 5655337 5386109 5224648 5008647 4652470 4335687 4257970 4329020 4318993 4234531 4304029
42759 4304029 4605533 4939961 5116888 5175355 5253608 5403530 5624180 5941994 6338396 6675663
42749 6675663 6793496 6637310 6250050 5728596 5250961 5029367 5111192 5291656 5332143 5195299
42739 5195299 4957336 4603243 4101253 3604393 3332005 3257188 3157652 2997472 2983513 3175973
42729 3175973 3348097 3372479 3437330 3664104 3806455 3625476 3319589 3239594 3370939 3461081
42719 3461081 3488855 3605591 3748598 3753705 3760723 4048389 4522694 4841008 5000848 5293383
42709 5293383 5694338 5877247 5872057 6091854 6588013 6911190 6895042 6943749 7309012 7717058
42699 7717058 7972061 8265249 8598578 8631871 8461208 8770486 9771560 10810314 11515612
42690 11515612 12428373 13921832 15580240 17409809 20425576 25054508 30530499 37413973
42682 37413973 48686461 65113622 80302623 84410573 74150596 56506682 41161628
42675 41161628 31644138 25511629 20405610 16543793 14286303 12664743 10939722 9549951
42667 9549951 8861003 8399893 7823357 7463488 7473516 7439020 7228322 7321440 7897816 8391949
42657 8391949 8341034 7979891 7649965 7278829 6806935 6521797 6570009 6638260 6483727 6340586
42647 6340586 6467905 6707227 6827010 6952084 7324909 7921341 8566151 9163582 9590406
42638 9590406 9634476 9269539 8763407 8334284 7929041 7479163 7098973 6857331 6614493 6272441
42628 6272441 5956637 5774847 5613616 5348669 5068533 4934208 4979482 5159309 5418391 5625192
42618 5625192 5638763 5529531 5530256 5692770 5815123 5780043 5714636 5724999 5746372 5786890 6047295
42607 6047295 6615443 7264403 7746126 8109573 8551532 9096969 9577000 9798167 9628230
42598 9628230 9067534 8344617 7784205 7463387 7137054 6600381 5977285 5549634 5435869
42589 5435869 5524292 5593776 5436997 5010066 4526537 4272447 4295667 4420450 4555471 4775122
42579 4775122 5086220 5362575 5558643 5743008 5871359 5798938 5592075 5535631 5719317 5907650
42569 5907650 5959036 6072729 6425933 6838534 7034274 7021942 6989197 6997954 6998724 6986309 6944132
42558 6944132 6787611 6542940 6417488 6507883 6606065 6490008 6240727 6062074 5949185 5776565
42548 5776565 5588505 5547160 5657044 5754325 5726152 5575081 5328458 5043911 4850837 4849364
42538 4849364 5015323 5287850 5645345 6005748 6205259 6214918 6232639 6397926 6550347 6455527
42528 6455527 6159203 5919026 5857910 5870701 5832304 5734815 5628083 5539151 5455280 5346629
42518 5346629 5236122 5225269 5342663 5404720 5221326 4935948 4911587 5234537 5608571 5823199
42508 5823199 6014948 6322252 6608321 6749848 6914575 7283808 7720277 7961709 7949387 7757884
42498 7757884 7441230 7179730 7305160 7886604 8536796 8936107 9299771 9984811 10885353
42489 10885353 11635729 12249189 13152526 14692699 16945028 19906069 23643945 28473993
42481 28473993 35096614 43849401 53127511 59150792 58590398 51704378 42168210 33701429
42473 33701429 27545212 23143295 19967598 17871230 16447651 15115439 13745379 12595753
42465 12595753 11716047 10878219 9998441 9206211 8545964 7943087 7407536 6990115 6615721
42456 6615721 6216927 5927611 5871070 5855587 5576141 5060187 4625265 4418210 4275524 4062686
42446 4062686 3896092 3940707 4155698 4333520 4311888 4108614 3893519 3822860 3876435 3911247
42436 3911247 3893956 3959525 4169467 4348603 4291017 4036705 3819825 3811485 4010399 4300401
42426 4300401 4513477 4526310 4399063 4331220 4395588 4441318 4365165 4323498 4514053 4878411
42416 4878411 5203759 5408356 5533306 5560054 5463349 5365246 5385286 5380794 5106424 4638765
42406 4638765 4362660 4456256 4637896 4558733 4248826 4004869 3976742 4054123 4087041 4035426
42396 4035426 3919865 3787668 3750605 3914952 4213684 4422742 4432492 4404176 4522825 4667505
42386 4667505 4534986 4110967 3784316 3858941 4149560 4277359 4216524 4251039 4455710 4580500
42376 4580500 4524852 4591822 5076763 5839749 6507878 6927773 7180985 7281008 7133432 6775918
42366 6775918 6423822 6223651 6101114 5903626 5613987 5390089 5411308 5658903 5850764 5691897
42356 5691897 5218731 4767550 4557600 4481751 4398286 4402002 4605286 4835371 4820350 4575672
42346 4575672 4343211 4219321 4119033 4064313 4199231 4491020 4705609 4759694 4843859 5091401
42336 5091401 5352901 5436397 5391482 5416216 5621438 6004407 6523303 7081697 7559517 7974965
42326 7974965 8511951 9280353 10140052 10848465 11279755 11417686 11263999 10886807 10474323
42317 10474323 10210312 10132170 10181102 10333063 10628055 11139724 11940419 13004900 14173395
42308 14173395 15391841 16986003 19451379 22954880 27374500 32837095 39560557 46687287
42300 46687287 51794634 52460467 48454264 41922695 35403637 30108091 26031554 22910004
42292 22910004 20630744 19169213 18569706 18800399 19485595 20167369 21005011 22730765 25720757
42283 25720757 29805532 35343383 43362972 53383165 61671108 63441246 57369186 46978482
42275 46978482 37127126 29996816 24913175 20799769 17464423 14944788 12979650 11415404
42267 11415404 10368484 9735982 9092194 8271682 7603244 7372940 7428892 7492261 7523910 7593992
42257 7593992 7663078 7679086 7684198 7679856 7560547 7284947 6945833 6604076 6234716 5883351
42247 5883351 5665998 5556276 5384627 5102519 4825752 4575135 4243775 3896649 3801197 4017140
42237 4017140 4236453 4214635 4104294 4142503 4240032 4151039 3890314 3707761 3735965 3893976
42227 3893976 4077722 4242771 4342726 4364305 4401892 4563516 4826373 5073706 5220445 5237876
42217 5237876 5151939 5089933 5203547 5456313 5625701 5611565 5576503 5658840 5739676 5678803 5611835
42206 5611835 5783347 6195458 6640272 6997897 7301298 7582988 7856842 8192347 8627789
42197 8627789 9069209 9426916 9751824 10062504 10160231 9843108 9217694 8570392 8006973 7453871
42187 7453871 6934869 6568601 6322911 6044124 5733047 5541562 5485241 5406386 5249506 5137565
42177 5137565 5135625 5162428 5183353 5276206 5444511 5556636 5531784 5427082 5310642 5206557
42167 5206557 5163288 5193402 5159469 4928367 4618651 4454121 4394573 4205147 3897043 3751184
42157 3751184 3829143 3825279 3556856 3254334 3151574 3107787 2910720 2680101 2636876 2669094
42147 2669094 2490112 2129361 1924245 2041361 2285911 2401341 2329399 2150276 1964070 1872094
42137 1872094 1921354 2028760 2066746 2022862 1971981 1922668 1824870 1713228 1697460 1794767 1899668
42126 1899668 1957964 2069723 2359942 2789902 3138021 3179499 2909429 2578304 2437098 2442531
42116 2442531 2322241 1960643 1574516 1424769 1508021 1666315 1851924 2081777 2229687 2113383
42106 2113383 1783116 1508410 1439821 1463143 1442308 1436069 1572636 1823414 2011594 1996258
42096 1996258 1783085 1497846 1300735 1284510 1403300 1513504 1505916 1386515 1237295 1138885
42086 1138885 1130240 1192117 1253873 1258381 1238947 1293856 1457645 1627032 1655859 1520805 1351180
42075 1351180 1266624 1219308 1068057 814714 668646 804567 1130845 1400848 1498001 1487496
42065 1487496 1439138 1368972 1338967 1415528 1499323 1400714 1148549 1013256 1123366 1275992
42055 1275992 1268233 1189871 1181024 1111465 792395 375605 220337 406361 676649 860820
42045 860820 1060703 1359575 1613840 1647181 1464513 1180952 897598 717532 722193 854441
42035 854441 965272 1025290 1130735 1265536 1272027 1144113 1121663 1341052 1585382 1573262
42025 1573262 1352077 1207398 1289505 1518035 1759068 1895099 1797921 1456329 1102420 1004054
42015 1004054 1134625 1233749 1187863 1146471 1239773 1394280 1495857 1542976 1545218 1449998 1295908
42004 1295908 1279261 1504610 1785268 1871249 1797931 1816709 2015824 2213472 2249813 2194993
41994 2194993 2186117 2206832 2150010 2010670 1891831 1859133 1899182 2007931 2215818 2501624
41984 2501624 2758087 2890664 2919765 2953524 3073376 3263469 3441066 3538306 3548199 3493616
41974 3493616 3373291 3175770 2946280 2775987 2678260 2529608 2221618 1855449 1678071 1788854
41964 1788854 2000604 2064608 1969454 1916785 2027943 2196362 2266415 2252992 2287858 2394838
41954 2394838 2433811 2288561 2021139 1785456 1646916 1556538 1466281 1386449 1334345 1303685
41944 1303685 1298248 1330117 1369201 1362098 1322407 1328882 1400577 1452328 1428584 1411604 1525561 1778300
41932 1778300 2054882 2222994 2206507 2035460 1886455 1976396 2313269 2637007 2730930 2711201
41922 2711201 2852444 3191745 3499917 3624988 3654138 3701846 3736671 3699254 3631086 3586565
41912 3586565 3538221 3460437 3406453 3422560 3475593 3529339 3601033 3693675 3784690 3930609 4238608
41901 4238608 4649628 4899097 4821301 4574492 4427629 4431405 4457013 4468515 4558328 4730435
41891 4730435 4824232 4697118 4386133 4063681 3890941 3905391 3995953 4006163 3902020 3794977
41881 3794977 3764671 3743914 3646705 3507949 3381383 3187086 2821387 2384292 2129010 2154512
41871 2154512 2273019 2237667 2020847 1807277 1756813 1843833 1946187 2039565 2209241 2438457
41861 2438457 2510886 2269507 1901451 1761686 1921699 2115379 2157842 2151907 2186678 2124281
41851 2124281 1881744 1674370 1719034 1880280 1884642 1737449 1639207 1613607 1538090 1466182 1582582
41840 1582582 1851145 2021411 2007944 1977274 2023756 2039361 1965674 1913964 1957011 2036818 2152446
41829 2152446 2405813 2774666 3062712 3171408 3215350 3277143 3258894 3085618 2860428 2702813
41819 2702813 2607021 2556511 2590705 2655121 2583587 2357645 2201146 2280908 2481059 2605790
41809 2605790 2632955 2621212 2539088 2365931 2232108 2284939 2504253 2770168 2994910 3077312
41799 3077312 2887676 2458096 2054189 1894012 1913610 1958803 2058159 2306109 2599554 2726576
41789 2726576 2660967 2564379 2531673 2517356 2489612 2485502 2516333 2556156 2617839 2726586 2834778
41778 2834778 2861572 2793177 2672201 2545777 2492957 2605034 2840340 3008635 3020537 3030143
41768 3030143 3174661 3298303 3149767 2779497 2505289 2492709 2578097 2533110 2331056 2111503
41758 2111503 2020156 2119887 2343849 2507453 2466224 2282152 2150367 2163781 2244730 2302152
41748 2302152 2335814 2348888 2260153 1991551 1625218 1398704 1475593 1718943 1792621 1565075
41738 1565075 1302881 1310460 1489290 1510119 1354505 1326730 1493261 1526908 1271621 1044507
41728 1044507 1094864 1151241 899773 588445 662723 1015482 1141763 942129 822922 985306
41718 985306 1138875 1036433 837751 766661 778861 761616 762140 835396 904087 909590 893931
41707 893931 853997 743829 661589 759139 934733 941749 844104 973641 1342005 1528748 1325513
41696 1325513 1052988 1000674 992812 826782 715534 879887 1062501 930053 685379 765364
41686 765364 1119060 1310223 1223947 1148249 1196303 1165320 1006060 945234 1035909 1022998 805621
41675 805621 645387 731049 874414 851088 761988 827846 1038594 1221930 1301873 1311457 1280683
41664 1280683 1251806 1280079 1316578 1238755 1085884 1077554 1283164 1472613 1444193 1305597 1249661
41653 1249661 1238820 1137244 1006945 1018260 1156443 1258555 1280143 1292746 1263950 1086349
41643 1086349 818768 662392 671340 703656 697576 775348 995708 1202649 1225157 1065824 800417
41632 800417 467977 181530 162662 474029 835703 906552 680380 427098 310643 266312
41622 266312 214396 167774 112738 1175 -82270 51627 406155 710568 742537 598655
41612 598655 521723 589637 714337 830096 915756 914454 804495 697123 703315 751533 703507
41601 703507 605705 634099 804528 942250 963466 988157 1112899 1252218 1295759 1274989 1273124
41590 1273124 1282910 1242673 1121439 909718 633354 425537 448466 671863 870130 921991
41580 921991 954369 1076597 1147279 986082 686557 507780 531642 633372 741867 910114
41570 910114 1124433 1245568 1192828 1044761 911094 818462 756041 730261 741748 789164 901771
41559 901771 1082421 1234279 1259654 1223938 1282769 1427669 1451970 1229037 900346 706484
41549 706484 719077 812469 829326 708577 509247 366956 380847 503764 592954 591171 585999
41538 585999 662187 785969 888847 976547 1076058 1145983 1133732 1077768 1059554 1073951 1030048
41527 1030048 879479 684091 557848 583470 765595 1010596 1168463 1159705 1063217 1024693
41517 1024693 1076980 1111194 1038757 917758 877578 960081 1086799 1166160 1183276 1178431 1174804
41506 1174804 1148541 1057056 888244 693865 573833 597944 725043 823517 798469 682747
41496 682747 578299 533837 524096 529141 566285 632716 680161 681515 679881 731468 824278 889274
41484 889274 885151 854308 895655 1071922 1323628 1493152 1471070 1300516 1097430 913878
41474 913878 760115 706130 811566 959258 937815 747903 653966 828977 1105819 1219833
41464 1219833 1157894 1095495 1104656 1127176 1154217 1206950 1183474 965589 680466 618726 846138
41453 846138 1112410 1207121 1187421 1161755 1079353 898270 774603 870160 1081574 1168256 1087718
41442 1087718 1008771 1022891 1038312 979075 915767 934072 997234 1018790 997158 1006080 1087947
41431 1087947 1203334 1267937 1225453 1114389 1064112 1171445 1366030 1461707 1378780 1248702
41421 1248702 1226771 1257940 1155253 915098 802114 1020629 1409404 1619981 1551025 1418640
41411 1418640 1383546 1324879 1095037 817102 740841 900733 1106239 1219498 1260333 1263646
41401 1263646 1220661 1173199 1202490 1301799 1397858 1493521 1629016 1714980 1609743 1382709 1274273
41390 1274273 1338751 1367249 1254886 1182187 1279358 1369492 1269040 1122224 1160600 1299110
41380 1299110 1281609 1117404 1045862 1119940 1156637 1104654 1134752 1301405 1410112 1322375 1136002
41369 1136002 956694 744555 518693 462846 653404 905517 1080035 1316398 1715282 2004543
41359 2004543 1861616 1449659 1254256 1396337 1481692 1227749 896779 899543 1216393 1478287
41349 1478287 1486860 1380225 1321316 1281230 1194986 1138834 1223306 1401603 1507008 1458264 1339582
41338 1339582 1271801 1274300 1287616 1284630 1295674 1326895 1324350 1266633 1244886 1363349 1562796
41327 1562796 1645444 1530238 1398235 1479923 1735447 1871877 1699904 1363393 1155180 1193267
41317 1193267 1367787 1540915 1667664 1725247 1664456 1506238 1403618 1507595 1792427 2089818
41307 2089818 2289581 2432687 2592646 2739182 2771233 2648572 2436691 2229293 2066535 1934723
41297 1934723 1822692 1768298 1841981 2054358 2271390 2284580 2036033 1741817 1693629 1927466
41287 1927466 2185418 2240334 2153105 2131613 2230595 2320343 2309922 2261425 2274762 2374957 2535871
41276 2535871 2709420 2797749 2699463 2436968 2157726 1967131 1847921 1784398 1842360 2031159
41266 2031159 2192740 2165323 2001377 1885059 1858155 1768045 1505380 1176073 985147 1014583
41256 1014583 1158006 1242464 1194967 1104181 1110696 1227378 1309809 1233413 1044621 888891 846620
41245 846620 895713 968250 975540 858330 703104 717766 969024 1233996 1271206 1158939 1162879
41234 1162879 1317995 1386550 1245244 1062073 1005411 997865 889551 708616 595864 605018
41224 605018 692151 816402 950239 1058314 1130197 1163535 1101970 916978 760003 842702
41214 842702 1114515 1277439 1214519 1163731 1319260 1510768 1498626 1362039 1312160 1300324
41204 1300324 1143747 924845 905395 1079725 1164693 1063034 1012765 1197454 1490787 1692224
41194 1692224 1772331 1774285 1693462 1572568 1518451 1513582 1404791 1186283 1078571 1185581 1292239
41183 1292239 1194222 1033837 1065751 1230961 1242115 1032050 846546 875134 1017349 1080027
41173 1080027 1033372 980191 982013 1005399 987694 899728 769904 668860 650332 709991 821549
41162 821549 977720 1147130 1231166 1149801 970019 870538 949300 1112240 1184001 1106343 999954
41151 999954 1026512 1199835 1359110 1351753 1212928 1104040 1087031 1052383 900411 701406
41141 701406 605284 653014 756847 833218 880058 932639 997751 1032251 967422 783018 577450
41130 577450 514159 653734 874808 999451 962335 831138 717936 713998 854543 1087439
41120 1087439 1304905 1432928 1448096 1316799 1031175 731235 638409 778757 914119 864448
41110 864448 748504 747319 791130 718522 622518 730973 986992 1082793 946807 858893 970263
41099 970263 1042812 866954 641590 647453 759297 633888 275935 56374 167309 382866
41089 382866 439760 384459 407581 536187 655864 713990 742284 736718 643136 452051 238913
41078 238913 117424 171679 388766 634218 749425 706723 624360 609569 640637 623770 511316
41067 511316 343477 220945 239068 388981 527459 518099 398756 330237 394674 541479
41057 541479 704962 842534 879401 787225 715346 839371 1055850 1066563 828263 645847
41047 645847 700467 781450 679317 548059 605176 740997 758357 760114 915927 1081072 1127012
41036 1127012 1441125 2453606 3709463 4128279 3364526 2261169 1666888 1435479 1036770
41027 1036770 577095 555803 950304 1233745 1174960 1022753 944493 838834 727787 811864
41017 811864 1039639 1084751 881262 759380 890559 1001888 854526 642398 648679 800433
41007 800433 855222 803300 789058 801306 734289 645910 678652 782305 761781 581989 421454
40996 421454 426622 579503 796528 994650 1061243 926043 701461 617120 756755 952128
40986 952128 988995 844738 668955 587676 598379 639845 691240 764902 836869 844544 758580
40975 758580 605837 411367 188261 13296 15659 211639 431774 513352 494591 504401 539345
40964 539345 505268 422296 404028 455414 481272 495076 617095 829973 931789 800774 543497
40953 543497 315323 147894 18299 -61814 -94382 -97834 -20512 194955 429069 458742 274387
40942 274387 128602 193307 370379 527699 694208 889272 978299 869676 677970 531271
40932 531271 388931 206716 95598 133814 195217 156861 113281 190271 311807 355765 371465
40921 371465 424490 402891 225951 75944 145894 308794 331272 272104 343557 500225 525567
40910 525567 444570 471121 581593 527747 288687 134650 182493 237781 165318 91739 133322
40899 133322 220352 305740 468784 691679 796458 727899 651308 652488 593080 391174 191819
40888 191819 109509 40131 -106822 -207280 -126631 61089 212302 299533 331341 275010 178393
40877 178393 164048 188336 46646 -247231 -363075 -125148 190488 261149 159583 122287
40867 122287 129761 46435 -32674 50510 152774 23977 -224603 -240141 19271 238147 259578
40856 259578 264705 368608 404745 254411 85111 83245 187800 264385 339171 472338 561227
40845 561227 467747 243249 62217 5588 46657 176684 390624 579750 582791 372179
40835 372179 113346 10960 121003 311142 389069 278822 74987 -81466 -142455 -127623
40825 -127623 -23544 179000 366683 367516 181922 33617 109705 328484 449722 363545
40815 363545 186374 95491 142221 232604 250490 184491 128188 140224 137228 4326 -187273
40804 -187273 -190531 114335 513708 671283 502901 220407 22783 -99961 -208633 -221052
40794 -221052 -20547 314745 550008 560162 432968 297639 184768 96359 78610 143104
40784 143104 224178 300288 444284 648076 728530 573835 381356 439572 724030 932619
40774 932619 907476 785532 706001 619794 473491 348288 285301 173852 -31600 -159566
40764 -159566 -64802 120664 171706 92049 52351 91452 90851 5422 -86584 -167453 -333592
40753 -333592 -624088 -928521 -1120724 -1205565 -1293111 -1466712 -1690182 -1834422 -1814006 -1682079
40743 -1682079 -1525091 -1300722 -930679 -553956 -466888 -722065 -1003171 -1035160 -900560 -772236
40733 -772236 -581058 -232170 51544 -27643 -351862 -511262 -390294 -268926 -318644 -362154
40723 -362154 -225581 123 184349 355933 521654 541423 361412 157038 69553 -2394
40713 -2394 -169952 -305899 -240187 -51172 56076 46204 19622 -13227 -97344 -143750 -15827
40702 -15827 206955 275483 120391 -30971 39849 262116 397758 351720 250998 242147 305703
40691 305703 305970 177518 -2088 -130971 -206447 -278689 -333095 -302202 -176013 -22895 86224
40680 86224 104914 -1129 -195002 -330030 -290977 -152019 -66988 -40644 18073 45151 -134662
40669 -134662 -468635 -634646 -461277 -170793 -44742 -45328 26796 160998 180001 76883
40659 76883 52767 205677 374348 341445 75585 -258334 -450600 -405573 -216194 -73289
40649 -73289 -64071 -107267 -117483 -127653 -167302 -137554 49947 280952 336008 151854 -129919
40638 -129919 -337883 -385084 -258900 -26594 173492 255927 276448 310447 313409 220794 105144
40627 105144 71251 55865 -75789 -261809 -284180 -100212 68461 42611 -93264 -165403
40617 -165403 -159745 -183148 -276198 -377387 -419049 -374704 -248257 -77928 73862 168548 205059
40606 205059 185409 123416 89143 158855 284876 291987 68697 -271790 -475823 -395437 -134488
40595 -134488 54949 33578 -73736 -35698 171851 310538 200739 -16573 -75746 35971
40585 35971 83083 -53792 -216892 -222958 -103867 -3237 40962 101520 224658 377604 488564
40574 488564 485990 352678 183324 122487 197387 275491 232290 90010 -62640 -208409 -373471
40563 -373471 -509745 -502926 -308619 -32783 145418 138451 47439 63683 232087 359072 242911
40552 242911 -42705 -226693 -196075 -112268 -130954 -179862 -120355 16568 103552 125826 159938
40541 159938 211744 237912 286633 440811 620823 620370 396069 181664 221505 473463 664891
40530 664891 597292 322238 44404 -77102 -29349 93063 187658 211146 178221 126284 86586
40519 86586 61154 12648 -93039 -215198 -254195 -180953 -104787 -141550 -242347 -243423 -86083
40508 -86083 108423 209162 225073 228219 215515 145091 63048 78663 209001 343409 389502
40497 389502 376450 375610 390958 385952 363820 351880 343732 329394 352976 454996 571319 587934
40485 587934 509359 472434 550217 633451 578948 410803 287748 303333 399783 469500 469553 423688
40473 423688 360075 272757 140834 -9955 -81351 6402 187010 288440 243775 180514 225984
40462 225984 305613 257374 105321 71676 290953 624946 816502 759440 567781 421196
40452 421196 389604 408083 409036 444312 605570 815719 829868 552145 249407 274046 608585
40441 608585 872130 793575 494611 252324 169945 195105 305591 505883 716253 830599
40431 830599 872281 971039 1180193 1414681 1591119 1748745 1984047 2316278 2708544 3260043
40421 3260043 4284519 5998672 8030198 9404035 9291867 7817440 5937519 4482766
40413 4482766 3509838 2656917 1842412 1329414 1225686 1251696 1078068 696845 356097 241230
40403 241230 321457 452400 532087 546651 518687 463226 404047 383671 402690 383186 275466
40392 275466 178267 235658 411401 507629 442403 350310 340868 337618 279110 295983 490833
40381 490833 678086 587373 264547 35002 89254 327901 610518 907871 1151092 1171919
40371 1171919 930030 640926 537805 604834 655605 589385 459622 345102 256545 163660
40361 163660 64793 21860 101567 244690 259044 53458 -175471 -159658 56063 160180
40351 160180 43711 -19460 213010 573763 716646 571506 348527 191009 60888 -70484
40341 -70484 -148554 -174299 -230406 -324480 -352659 -261685 -118426 20440 178308 344695 415259
40330 415259 328833 178053 99466 107506 104273 13995 -142385 -269671 -260439 -83492 148460
40319 148460 248543 145392 -28444 -79596 46801 249917 414446 507197 549642 561938
40309 561938 557801 561360 594598 643035 654358 601459 546870 592755 732778 813854 723376 567562
40297 567562 544324 655849 707195 632751 645487 931086 1330697 1518578 1429005 1297238
40287 1297238 1277886 1238094 1012077 694127 545056 689942 1013063 1292950 1359676 1189833
40277 1189833 948228 883016 1070121 1293804 1285594 1052280 845620 817386 848007 758253
40267 758253 560284 406382 367236 367902 322453 246861 220596 278647 367436 407990 395919
40256 395919 412775 512708 626993 636820 527078 398600 329319 303653 288702 281443 244358
40245 244358 102221 -122752 -265605 -209466 -53675 19762 -6462 -1774 76848 115968 33326
40234 33326 -98334 -167674 -159990 -113513 -31815 78570 146657 102278 -25202 -141833 -201051
40223 -201051 -221879 -218920 -183213 -129311 -99296 -108050 -130680 -156415 -211168 -303660 -382528 -380691
40211 -380691 -291792 -176518 -91968 -34710 31903 102409 112928 30980 -50394 30419 305952
40200 305952 570712 546169 177915 -283696 -535323 -508755 -358758 -215221 -55924 163651
40190 163651 374673 478296 499393 546388 635884 669163 604028 546957 615304 779527 914548
40179 914548 961936 963878 961031 943390 916819 945707 1073897 1224550 1239132 1052268 803959
40168 803959 713264 817940 910585 801955 584006 509325 634118 738372 634321 394829
40158 394829 194244 74853 -421 3782 118528 229869 210679 146432 221745 389911 380908
40147 380908 99373 -185585 -165300 131515 411453 474841 382222 312145 354837 446673 470473
40136 470473 416433 404677 491682 530021 370784 157630 192036 480859 679792 590369 438966
40125 438966 471593 538870 383514 134708 120531 276502 178524 -284907 -687708 -677006
40115 -677006 -454584 -398739 -486535 -419900 -161696 8281 -63454 -212439 -251177 -210512 -200702
40104 -200702 -219093 -206791 -170836 -143188 -98251 -1335 107879 143937 61677 -105144 -245946
40093 -245946 -219286 14260 289570 374778 253152 153568 235829 373888 364407 231574 152523
40082 152523 149575 69660 -115235 -187737 39223 450276 734374 699103 412659 97171
40072 97171 -55660 -14341 92410 137933 161822 285534 461163 461194 200391 -85617 -129210
40061 -129210 15199 81171 -23536 -138840 -128035 -32248 56100 89128 15499 -172332 -306852
40050 -306852 -168652 180299 388882 263122 35519 31044 226678 345855 279816 187966
40040 187966 218394 331912 411902 393490 270467 97255 -12334 10992 110347 216030
40030 216030 369603 596445 739967 631537 382347 263126 293267 221103 -31185 -195378
40020 -195378 -66255 186491 313477 354230 455171 519280 363255 108857 61208 220480
40010 220480 266574 81444 -57593 57347 216515 132485 -101925 -167476 7564 203899
40000 203899 277832 301469 328512 264294 49986 -195800 -315508 -283423 -173331 -59731
39990 -59731 -12558 -85028 -228285 -304457 -264047 -230751 -321749 -456121 -448713 -248200 25009
39979 25009 247119 385295 433881 373769 228299 78576 -15765 -60904 -75751 -49693 21854
39968 21854 103881 150381 145241 115009 125759 240704 427657 538089 461968 291550 229771
39957 229771 324656 405518 322145 138523 19476 12785 28297 -26024 -161289 -311206 -362483
39946 -362483 -246437 -55603 18937 -58691 -86809 85221 296242 278612 55290 -83078
39936 -83078 10277 170310 211241 174695 182125 212980 175175 84941 39182 83900 218971
39925 218971 448489 706988 819808 682102 424081 258603 213196 168056 121976 227091
39915 227091 530710 854213 1000562 960508 850886 762540 738575 796211 884550 901114 823539
39904 823539 744939 712274 630158 417386 156756 -31813 -169891 -313917 -353986 -139615
39894 -139615 206073 340788 148925 -78685 -46186 144840 190151 56932 9745 183259
39884 183259 384548 402100 301080 256504 239259 80091 -201838 -352433 -214795 59731
39874 59731 230632 273406 329333 426865 427027 257439 52297 -8360 95802 251231 366847
39863 366847 423773 423664 379455 335191 319903 298614 233836 167237 161596 190598 187522 188241 298323
39850 298323 494460 590575 472275 262475 163023 206871 268031 267067 254911 298340 369782
39839 369782 374097 250397 47361 -94252 -78178 7198 -37856 -253381 -410022 -279607
39829 -279607 44191 234660 126622 -114501 -231590 -149156 35142 204683 286544 250251
39819 250251 140962 66529 74126 80482 630 -92878 -38238 190134 422697 502657 479435
39808 479435 520454 665757 771564 725138 621150 631946 751997 802433 700707 583261
39798 583261 583537 611988 491070 233009 18497 -82068 -194605 -405841 -587442 -550469
39788 -550469 -293360 -291 172411 233167 289546 403901 531032 577478 499416 331160
39778 331160 140249 2199 6445 190296 430510 511769 387704 268587 331413 452169
39768 452169 402800 232613 218878 445000 667531 663361 504223 396590 422019 534708
39758 534708 660928 690874 506077 134184 -215924 -354902 -261506 -4182 330687 582821
39748 582821 585421 391291 252937 273878 285204 196168 212245 479061 736739 638557 274967
39737 274967 59591 168085 397849 543250 596808 573465 444486 308618 359794 592959
39727 592959 764421 731726 627350 603064 598442 479500 250996 21087 -121626 -116970 52217
39716 52217 280415 397308 368494 318307 315993 299275 266353 352643 599842 810628 781909
39705 781909 571348 396533 361811 415419 499118 603323 711329 793487 834868 809383 677010
39694 677010 466318 304929 311477 501999 821566 1180102 1431361 1444409 1271761 1139722
39684 1139722 1187931 1316017 1371405 1378521 1465897 1653083 1840453 1959008 2012874 2004948 1920935
39673 1920935 1771771 1586995 1399678 1288135 1364285 1636972 1936969 2065699 1992295 1842999
39663 1842999 1735958 1687354 1640078 1527718 1344841 1185800 1153024 1201003 1171587 1037283
39653 1037283 984123 1145625 1363486 1365761 1126376 891115 859858 985910 1109258 1160240
39643 1160240 1166488 1135881 1023425 822400 640482 627506 804499 1013576 1093960 1057868
39633 1057868 1002198 908046 693562 450937 412259 605747 753139 649092 471306 528306
39623 528306 820352 1059177 1061881 926752 839071 883520 1061241 1336781 1625835 1842810
39613 1842810 1993430 2145512 2303217 2390712 2366339 2276640 2183828 2098357 1995875 1864680
39603 1864680 1734758 1669782 1698309 1749015 1724958 1662680 1717282 1934208 2142289 2164881 2051059
39592 2051059 1992064 2070295 2187778 2191691 1992502 1624261 1266853 1129179 1220436 1316070
39582 1316070 1234757 1047681 914772 842921 755683 685664 705819 747096 689566 591982 619357
39571 619357 746710 744539 509036 238485 198815 415153 663892 717749 565297 411968
39561 411968 456553 663774 828280 880035 989259 1284258 1611304 1720402 1579501 1351532
39551 1351532 1164569 1070750 1123110 1288117 1359767 1173249 853660 656747 623858 604195
39541 604195 552947 561118 623807 636879 624048 716647 886627 945890 858772 826856 995605
39530 995605 1274107 1512722 1685843 1837910 1993907 2159097 2285122 2257846 2065297 1921643
39520 1921643 2051093 2447551 3068337 4087647 5545864 6819182 6968732 5781419 4072721
39511 4072721 2785559 2144988 1858766 1709402 1612713 1413998 1032120 666766 568157 710606
39501 710606 907380 1094367 1281214 1385905 1357930 1327500 1406944 1483472 1434256 1396758 1565683
39490 1565683 1841021 1954677 1881243 1870912 2104358 2519680 2950467 3261742 3387341 3376771
39480 3376771 3351195 3307740 3081917 2622767 2145296 1851252 1672942 1482193 1357670 1401451
39470 1401451 1476080 1415289 1339177 1439307 1584234 1495999 1225657 1072673 1083419 1033366
39460 1033366 906512 964183 1254263 1461756 1404915 1316522 1425173 1576025 1526208 1364475
39450 1364475 1342577 1454511 1476654 1341144 1202573 1155232 1113353 1002845 892066 864011
39440 864011 880388 857138 806113 810481 877554 907496 844046 778951 820582 909545 894228 777057
39428 777057 725724 810077 907681 939896 1000634 1130452 1178726 1079000 1058310 1319912 1689484
39417 1689484 1885858 2014532 2419374 3083780 3573443 3641932 3544432 3619286 3847028 3982720
39407 3982720 3889385 3572780 3077015 2515786 2071218 1827320 1711672 1670916 1746082 1898021
39397 1898021 1951472 1835795 1707535 1696257 1692910 1548162 1333660 1225368 1234812 1231994 1155751
39386 1155751 1041018 908877 791527 809606 1051268 1387488 1561347 1488009 1362523 1436304
39376 1436304 1743085 2064781 2149403 1975855 1801914 1896075 2222191 2485390 2513363 2460002
39366 2460002 2549957 2750969 2850862 2795075 2772477 2939249 3184090 3245249 3010648 2626629
39356 2626629 2304526 2086367 1869576 1632156 1501500 1539331 1586571 1459394 1217970 1074620
39346 1074620 1086746 1132113 1164122 1264830 1415466 1455623 1367813 1383683 1654983 1988158
39336 1988158 2081516 1907374 1685520 1563499 1497533 1405513 1279759 1152603 1062107 1050528
39326 1050528 1120551 1206355 1238360 1201937 1101803 948219 829592 890321 1136148 1350952
39316 1350952 1334435 1168695 1122278 1316036 1599104 1751238 1715173 1625731 1681677 1994894
39306 1994894 2513704 3083100 3587734 4007936 4341364 4549493 4608741 4527467 4274288 3796706
39296 3796706 3177620 2658687 2401014 2312389 2228933 2180538 2318650 2621837 2842911 2779508
39286 2779508 2489706 2207411 2109835 2173262 2199825 1999043 1600735 1255148 1148915 1171197
39276 1171197 1076119 839834 691417 762476 881277 826067 655844 620661 788399 941564
39266 941564 881721 679457 522317 435911 314730 170109 150929 293040 433427 457553
39256 457553 469886 592480 735312 738408 643871 633829 755293 901065 1027320 1180876
39246 1180876 1316829 1310765 1191337 1154534 1280832 1426021 1472884 1512683 1679406 1968256
39236 1968256 2328298 2780381 3311820 3780242 4058779 4186034 4264468 4308067 4295302 4264732
39226 4264732 4229457 4079862 3703449 3156354 2621396 2237741 2025164 1897582 1699992 1342057
39216 1342057 964074 844285 1050049 1314050 1373471 1299625 1341939 1558082 1775565 1848441
39206 1848441 1776924 1610861 1397800 1219870 1148702 1151311 1123808 1007730 816940 602195
39196 602195 457802 488317 672024 824197 800783 679805 636996 705012 773315 771303 722032
39185 722032 651020 573305 554585 656377 808845 847682 714812 554139 568017 803168
39175 803168 1095685 1225506 1128543 944790 846918 869545 950795 1061397 1184807 1240827
39165 1240827 1184226 1132882 1221870 1372829 1419203 1419878 1575476 1836425 1921298 1784163 1703221
39154 1703221 1772347 1687010 1268070 839476 760411 876217 814277 596966 534474 652915
39144 652915 680814 567879 591495 888639 1238310 1422753 1528358 1747723 2070373 2303805
39134 2303805 2311386 2162425 2084366 2242658 2524212 2631218 2462425 2256353 2234908 2282308
39124 2282308 2165688 1905175 1688335 1563555 1486303 1545375 1842402 2228199 2461507 2573113
39114 2573113 2767861 3006909 3016572 2727538 2401163 2270201 2311875 2411620 2496513 2465529
39104 2465529 2239391 1941431 1807770 1864604 1900079 1793493 1658313 1611902 1611703 1581173 1516842
39093 1516842 1416163 1259039 1098544 1024153 1017891 983026 904059 837953 781163 694672 608934
39082 608934 553933 473518 379288 455617 778290 1067059 1014842 751916 644074 713016 648904
39071 648904 381083 218383 341229 525964 515380 370154 305919 410578 648956 967056
39061 967056 1298514 1597797 1883414 2123898 2160602 1943606 1739388 1830020 2084226 2129534
39051 2129534 1888503 1624485 1513597 1522431 1671935 2040455 2489516 2742887 2770939 2785473
39041 2785473 2866081 2915520 2939130 3005675 2987195 2739403 2482758 2556451 2833211 2862532 2580365
39030 2580365 2365528 2386569 2440027 2475523 2695146 3023638 3053614 2672805 2223377 1918039
39020 1918039 1644071 1446130 1575776 1895382 1882567 1455459 1154277 1252096 1352613 1175390
39010 1175390 1045898 1204680 1294366 1013468 683335 655555 703254 533034 395152 618797
39000 618797 971381 1036037 864863 756153 730578 694361 774383 1046320 1269605 1291721
38990 1291721 1344084 1561931 1639721 1365245 1047239 991498 1011184 883014 801473 928828
38980 928828 998994 844895 805308 1115174 1421258 1409355 1353682 1514712 1594407 1374910
38970 1374910 1273935 1614573 1961023 1875131 1714313 1935264 2225536 2133066 1967501 2229262
38960 2229262 2692077 2895394 3001503 3323355 3576085 3463748 3417889 3871739 4422985 4605156
38950 4605156 4795183 5425831 6078065 6361341 6837016 7973469 9129356 9780148 10716865
38941 10716865 12689728 15005128 16961423 19395246 23106718 27213145 31064179 36164204
38933 36164204 43885808 53259846 63991191 79441328 102970987 134290662 174795973
38926 174795973 232386922 309762373 386241506 423393749 398231575 326520710 246683850
38919 246683850 184858858 142189531 110275355 86076808 69784401 58511031 48640482
38912 48640482 40196909 34523336 30446162 26007988 21653784 18784443 16924579 14792172
38904 14792172 12686077 11593821 11127749 10287310 9253928 8722275 8364205 7505854 6509116
38895 6509116 6067929 5883260 5331761 4732255 4710703 4958592 4789983 4338856 4113761 3939115
38885 3939115 3403426 2834734 2795018 3052697 3013954 2753207 2719747 2839361 2770849 2644854
38875 2644854 2711073 2667052 2180611 1676488 1738330 2086849 2025531 1595233 1405894 1555897
38865 1555897 1587595 1372023 1227391 1238104 1181149 1067533 1104912 1195707 1080894 893855
38855 893855 984459 1285103 1418593 1337240 1296503 1296624 1119445 844476 769836 866564 839261
38844 839261 687927 694452 878463 971338 927199 973151 1124437 1103340 804835 466856 329698
38833 329698 435797 749600 1161155 1412411 1339791 1147320 1147495 1319733 1434775 1498726
38823 1498726 1714507 2085261 2404961 2570931 2587747 2380248 1958682 1642423 1713070 1933900
38813 1933900 1834930 1419771 1157842 1283706 1524154 1558087 1367480 1077223 790061 642687
38803 642687 720871 864127 821701 622894 528361 615729 693326 632557 513541 427795 385430
38792 385430 413920 513204 547400 423492 310809 408756 577993 524970 289026 182204
38782 182204 266704 279990 120845 32120 192261 446003 576003 587608 599572 654404 728910
38771 728910 765313 652708 350543 36046 -59603 51219 174874 246446 331845 365999
38761 365999 189542 -135891 -333859 -282913 -131821 -11148 117077 274392 374811 386087
38751 386087 382863 398541 401306 412449 459350 451906 324672 236098 364009 575803 612133
38740 612133 531463 606656 818228 868842 718237 652766 740344 681944 363037 98678 105609
38729 105609 160340 65116 45251 317527 608304 536059 233680 139185 313468 412950 281864
38718 281864 141228 153048 179649 96909 42455 172356 372767 408424 253660 102883
38708 102883 88828 142146 158748 182738 318776 513880 569494 406880 191433 106736 120956
38697 120956 102955 62035 96606 179263 197442 168632 198592 243228 153011 -26263 -57128
38686 -57128 109291 207228 43912 -197455 -213018 16294 252139 334780 328715 374312 511324
38675 511324 642329 627845 445545 248355 193158 240285 241230 193391 235965 391008 500665
38664 500665 457188 312097 128901 -58622 -101217 183989 668021 906609 670547 273721
38654 273721 165440 370476 561229 541791 404311 292423 266475 371842 606375 810953
38644 810953 793608 592616 445715 464841 508869 438103 331872 338326 422752 420379 301622
38633 301622 225938 294838 391908 376329 328896 421250 575989 500825 137672 -168555 -131794
38622 -131794 53347 21110 -180565 -161591 189151 516029 505086 264302 60560 -50926
38612 -50926 -148348 -203628 -134728 20692 150173 198501 143068 -50350 -330964 -529305 -534075
38601 -534075 -412112 -270533 -116482 63897 226583 369394 561675 756307 731121 378069
38591 378069 -78086 -321372 -302485 -192473 -87631 39456 159758 170137 59558 -63712
38581 -63712 -126117 -155267 -188718 -214656 -209743 -166657 -91376 -20651 -8654 -49154 -57704 21882
38569 21882 146348 244400 288749 266749 177844 102229 152631 296572 360007 290988 271270
38558 271270 441278 652964 661631 463438 267625 205258 246865 364899 581805 836707
38548 836707 962483 858668 607191 382189 295581 338787 428226 494216 532883 554010 501502
38537 501502 312857 69357 -31178 83537 243510 244461 93731 -38937 -51247 5919
38527 5919 38300 24187 22289 92101 201140 238299 167032 111665 193193 336472 382940 340138
38515 340138 328540 322628 195944 29400 82014 372500 571080 439056 122728 -132357
38505 -132357 -299816 -429274 -440928 -287044 -111504 -34371 24536 108110 49261 -210273
38495 -210273 -366363 -133950 306041 572219 630729 721855 878694 922025 867076 923733
38485 923733 1081704 1075358 823374 567493 482605 443887 296482 111026 44753 128452 286940
38474 286940 432502 492229 474059 507206 670786 814076 728109 460488 257141 230918
38464 230918 313513 485866 771872 1011263 956052 657747 470103 571018 745963 760291
38454 760291 691654 734720 881116 971339 933718 830331 753781 761850 828973 828599 672981
38443 672981 474276 422588 509351 549527 476872 407303 393269 351637 283804 320575 461071
38432 461071 501835 342091 152972 121606 213737 307480 379556 431871 399606 263296 118847
38421 118847 40420 10220 44552 208314 430670 512391 417150 347255 414774 456951 323838
38410 323838 134637 71464 108285 130554 149204 200094 191260 56676 -75375 -69001 -6964
38399 -6964 -29410 -73207 10604 187092 310150 379099 495788 629472 653672 586363 579298
38388 579298 671132 733804 670236 517748 366287 306492 420152 671619 849415 785195
38378 785195 604423 579363 739680 819991 627518 287268 57057 41910 170867 338890
38368 338890 470204 511234 462389 400703 404587 452523 437825 299471 111727 7410 14958
38357 14958 27153 -39012 -120383 -115937 -49035 -9153 13218 80837 129572 25883 -177915
38346 -177915 -250125 -105655 71484 125190 146368 254624 345242 250955 35421 -80637
38336 -80637 -26736 60638 57891 -16623 -80632 -80898 -14569 68633 108953 123031 185207 283409
38324 283409 291823 146885 -56647 -211254 -315026 -369747 -309395 -141893 -18043 -24123 -39224
38313 -39224 55389 161879 134270 38366 43303 142616 188699 148070 125596 166578 211111 223592
38301 223592 211235 139096 -22013 -181650 -202567 -76446 81659 181842 203478 147806
38291 147806 54664 7453 25692 35025 31478 138504 369034 494038 347351 121670 119488
38280 119488 312752 414909 325210 222917 238765 302265 335058 351421 325631 178027 -50874
38269 -50874 -192301 -159451 -18858 146473 278214 269586 62190 -175564 -184254 34356 202276
38258 202276 150814 31417 80455 336531 643476 791687 637026 238272 -114203 -180787
38248 -180787 -83779 -135847 -360498 -443520 -224615 33058 11429 -232348 -384922 -297540
38238 -297540 -121796 -83925 -235734 -412646 -410419 -232517 -114161 -212985 -364809 -317381
38228 -317381 -126931 -78761 -244548 -398583 -396430 -343627 -316594 -211734 1669 149615
38218 149615 135264 116234 229593 358104 355096 300727 333500 405963 419039 439085 555509
38207 555509 656206 583230 416253 364609 437960 454936 358928 311191 441333 671067 840740
38196 840740 905249 946521 1033411 1105532 1020074 744579 458004 359986 409225 399117 285143
38185 285143 242309 358777 489724 509958 503178 564520 601384 496563 323219 234617 259111
38174 259111 343244 469643 592025 586847 421050 248109 199675 211248 186056 175638 242422
38163 242422 305985 306612 366070 588159 842012 944449 917501 863437 741358 500885 292225
38152 292225 292024 440622 578776 693873 798100 772107 631321 719371 1265512 2008950
38142 2008950 2758933 4041286 6391848 9015742 10064237 8661754 6012620 3997806
38134 3997806 3186294 2801042 2196895 1562518 1246216 1140630 969487 725546 562613
38125 562613 521103 559883 669822 795676 791719 596504 354021 255744 333042 469464 540458
38114 540458 491623 364234 292049 387043 582097 679604 606287 511718 539548 617188 591469
38103 591469 473555 382908 305128 112054 -160316 -266563 -84524 178355 261553 205460
38093 205460 237760 385468 434351 284168 116446 114843 196118 166896 43613 49934 309054
38082 309054 660018 823299 709171 524473 551980 831845 1128740 1246946 1265168 1351596
38072 1351596 1474790 1504634 1518563 1747795 2265120 3036455 4240015 6049290 7931464
38063 7931464 8676455 7580822 5356233 3444029 2583067 2422638 2350479 2175169 1986941
38054 1986941 1833917 1721766 1666485 1634554 1611439 1719896 2038799 2355171 2399558 2295958
38044 2295958 2425226 2834184 3166011 3236334 3279249 3509988 3840451 4184758 4656888 5271962
38034 5271962 5840544 6394933 7327870 8808949 10436456 11828913 13216424 15008886 17056989
38025 17056989 18828614 20115734 21045828 21514352 21167808 19980371 18369905 16660469
38017 16660469 14842955 12954820 11276516 9977756 8902655 7884969 6995707 6309170
38009 6309170 5687683 4993428 4306776 3760612 3342066 3012026 2831504 2802553 2760302 2600023
37999 2600023 2449674 2429065 2389635 2116342 1683986 1378327 1305927 1296212 1195245 1071400
37989 1071400 1072112 1194262 1274045 1177650 969641 865252 975339 1132197 1076587 810307
37979 810307 601189 594210 615276 483538 326100 373485 570826 643222 499883 330883
37969 330883 295318 338840 374134 443526 603942 790822 895158 883204 779431 632108
37959 632108 547223 632459 828191 911567 766070 537087 406135 326887 151876 -60380
37949 -60380 -80677 146678 398128 475053 448209 497582 641486 759010 792316 773579 695879
37938 695879 523736 344879 354318 612488 925802 1060660 1007054 931656 918983 884929 753503
37927 753503 598065 537563 560512 540476 411322 250420 168913 177305 203078 205966 211274
37916 211274 229957 221427 185527 234959 477137 819038 991732 835058 497555 272428
37906 272428 271280 356903 386106 391678 467460 576185 584634 458891 322534 309906 433260
37895 433260 608216 740667 761016 640434 427734 232695 125188 79032 51585 68907
37885 68907 165334 281465 322595 310908 369992 533210 677185 701021 665617 667327 671372
37874 671372 600044 513868 535299 616602 576749 403445 318883 442043 564787 434265 132678
37863 132678 -34328 34566 146476 152292 147033 259779 431999 519585 481777 364813 226328
37852 226328 182544 378043 746004 935050 696518 262775 95286 295453 536063 583695
37842 583695 574612 668701 742969 648603 535645 641650 900896 1045214 1004301 923861 838590
37831 838590 631299 332873 170233 237005 361945 398464 421121 528909 667362 769843
37821 769843 878745 1004940 1075202 1148544 1432969 1891881 2097887 1768819 1231299 993601
37811 993601 1021498 867225 439293 149034 223141 355850 257791 139421 327887 701040
37801 701040 877772 795833 721680 760460 721347 496887 263587 201834 244530 229825 142653
37790 142653 81466 101501 207727 414726 688983 877020 812780 512243 193581 76165
37780 76165 179802 329529 349472 247670 195262 308807 489374 541180 434275 344519
37770 344519 393303 463217 384593 223877 211751 390629 531500 480264 399720 504907 702599
37759 702599 728616 572395 485351 547566 520278 251424 -34049 -54714 109308 162983 34568
37748 34568 -89921 -100525 -76355 -82003 -79416 -52743 -28791 23826 130551 174598 42586
37737 42586 -122474 -76275 120225 150439 -56114 -199167 -92738 58887 46470 -1173
37727 -1173 97246 224632 193969 105954 160286 280740 257154 133128 119848 218524 265038
37716 265038 280690 424091 623181 623142 428394 342909 502397 704373 799827 913178 1121125
37705 1121125 1232916 1104383 916400 915636 1085124 1285627 1519098 1804179 1963046 1816382
37695 1816382 1492401 1284930 1272844 1313284 1337086 1389840 1422511 1325225 1188765 1263008 1585488
37684 1585488 1890760 1989171 2015330 2160529 2351142 2381284 2233039 2058086 1912351 1715047
37674 1715047 1454153 1236722 1098823 934507 690649 496422 488512 600905 657959 626471
37664 626471 635544 749236 859433 857712 803957 832315 951950 1044349 1041563 1014848 1069950
37653 1069950 1220452 1392210 1510755 1565047 1624243 1806142 2172650 2610893 2863075 2757074
37643 2757074 2418780 2189746 2291593 2608167 2842047 2845377 2720544 2619174 2566472 2530752
37633 2530752 2547812 2666675 2845681 3028688 3270768 3635288 3994480 4120977 4003938 3878792
37623 3878792 3867773 3788649 3457274 3005207 2699483 2564814 2410334 2172601 1995400 1960702
37613 1960702 1956887 1876675 1773072 1729485 1703412 1600375 1425696 1277146 1224758 1244750 1242354
37602 1242354 1126998 907778 710872 647368 683313 715949 744169 841687 971641 983230
37592 983230 837843 698910 722200 874063 1042561 1216104 1437399 1666186 1822529 1922339
37582 1922339 2040903 2160667 2185204 2119732 2112624 2252535 2412309 2394607 2204115 2071083
37572 2071083 2172337 2405005 2508858 2377793 2163925 2076689 2176654 2400742 2686998 2984932
37562 2984932 3207736 3290221 3287640 3329231 3462401 3604468 3656565 3611946 3537724 3487988 3456930
37551 3456930 3414333 3380042 3426129 3559402 3646707 3563768 3398764 3354962 3428670 3368037 3027872
37540 3027872 2575232 2227120 1985929 1799064 1766066 1940379 2096591 1987549 1714826 1546043
37530 1546043 1477660 1325260 1160449 1239152 1492156 1523857 1215572 921739 908763 979897
37520 979897 870261 673683 621794 722800 878064 1100669 1354882 1427007 1244209 1091855
37510 1091855 1202591 1349349 1205542 919204 903103 1160285 1278405 1103419 979070 1195449
37500 1195449 1563833 1736455 1690467 1669536 1789565 1907886 1847456 1624369 1432003 1424029
37490 1424029 1528644 1533902 1379504 1249864 1289401 1358582 1234808 951852 735075 661740
37480 661740 609485 521838 493430 557667 595583 529131 450718 481845 606104 696060 637682
37469 637682 423239 190054 129478 262147 364909 251246 55316 64891 322371 591085
37459 591085 692947 663125 566937 399071 221427 183585 306087 411653 372037 282370
37449 282370 292481 386824 436987 390889 322322 335168 455266 581450 565942 414395 350491
37438 350491 554828 888655 1045335 950592 818254 806407 833627 786272 702443 657447 628928
37427 628928 572179 505682 451027 399677 382359 453108 582772 699951 833502 1045410 1236975
37416 1236975 1250090 1177465 1297580 1621319 1785737 1543636 1106222 819809 727240 656830
37406 656830 553292 489897 489993 542354 675314 841373 868536 706424 564132 603718 670146
37395 670146 572648 464939 626363 967452 1102153 895520 618181 525477 576398 633046
37385 633046 665497 654553 523162 293183 132777 130022 166454 115997 27896 10283 65912
37374 65912 154850 302365 522897 728017 828184 856977 887968 892531 794283 621105 486258
37363 486258 431979 396655 347424 352829 479935 674083 799153 790998 731430 753713 899099
37352 899099 1099306 1286068 1456608 1608046 1672363 1582741 1375241 1157959 989671 846614
37342 846614 700674 568165 475245 426072 413648 423080 425225 405057 384380 369918 301043
37331 301043 124001 -84330 -156322 -31277 157726 241881 203824 147716 128238 94215 4556
37320 4556 -70870 -9275 220976 493200 600005 415174 16045 -348508 -455540 -308270
37310 -308270 -119233 -70751 -129449 -140878 -55323 36013 67149 70018 56202 -30455 -162988
37299 -162988 -171032 27575 234717 194707 -31907 -110068 139479 527989 766883 788275
37289 788275 712931 630872 536903 421906 324741 301781 378161 499736 532201 376183 94479
37278 94479 -150126 -286577 -368044 -412167 -350581 -187286 -64159 -72117 -107757 -30795 117863
37267 117863 175461 86365 -37787 -65125 34393 197516 326027 344817 261238 171848 177893
37256 177893 289168 416660 452529 368366 250538 209976 237790 216089 118247 93994 245145
37245 245145 417832 385083 167898 -14529 -60231 -33783 54759 255415 463437 490611
37235 490611 403677 495419 820049 1048124 921878 579688 269548 21233 -194130 -248942
37225 -248942 -62950 185163 299849 340441 420100 435616 265145 54190 15941 94290
37215 94290 105064 66870 101726 148460 86778 25964 150692 382517 509803 543490 608638
37204 608638 603895 361337 58823 39840 254660 330434 207501 220705 456298 525735 190470
37193 190470 -214954 -260728 11243 278793 414676 473076 430580 259292 114077 154399
37183 154399 262770 190876 -63125 -238596 -154821 102420 332615 424299 399834 353362
37173 353362 360492 403645 387391 239801 -22998 -319021 -538797 -590112 -480405 -331864
37163 -331864 -239477 -157017 -12507 132874 170320 123783 93404 73799 -10542 -146854 -283392
37152 -283392 -462251 -696142 -793142 -569864 -200525 -60499 -211415 -337756 -245295 -120529
37142 -120529 -179345 -323415 -320304 -152525 -20890 -84043 -295294 -459849 -434872 -300657
37132 -300657 -267922 -370461 -404821 -275744 -172639 -212524 -176247 105527 371348 318926
37122 318926 132958 169829 338347 321856 223774 384467 689724 720053 507762 452757
37112 452757 538021 383998 75393 109585 460503 564517 358331 407935 826200 1045402
37102 1045402 904782 921201 1227076 1443347 1916652 3613879 6314783 8786876 11691378
37093 11691378 17937571 27925421 36262993 36449559 28436026 18679167 12630292 10002009
37085 10002009 7963894 5821998 4618548 4295797 3749108 2824758 2294356 2234250 1974257
37076 1974257 1432337 1194250 1356242 1382729 1094965 876902 886549 856605 704880 653648
37066 653648 713966 652030 480143 439438 500579 392881 127635 15198 154141 334021
37056 334021 442358 564573 686311 675066 555280 470832 412347 299168 252980 439897
37046 439897 708727 746452 548464 393191 398923 446021 487304 579781 634578 486711 216918
37035 216918 85463 141583 192464 149803 115609 135128 149811 184916 313239 456714 485427
37024 485427 459815 497202 481832 239878 -65752 -92854 150697 319838 278807 232155 270027
37013 270027 215935 50386 68737 404759 736726 715368 427086 193249 116689 64527
37003 64527 -48688 -180530 -274454 -292879 -208792 -79360 -50640 -193262 -399827 -510291
36993 -510291 -474184 -357048 -263716 -264926 -314214 -257248 -30618 196681 226956 121668 96241
36982 96241 180693 224013 210480 286162 436925 438109 224410 37551 66506 182902 199565
36971 199565 174167 251177 364134 318486 93808 -112381 -111895 103495 374077 498134 416341
36960 416341 301795 366777 568784 657860 539871 398981 391380 426164 370512 282165 281806
36949 281806 346278 388950 420162 475973 503876 469379 465774 566032 668741 643306 529282
36938 529282 441742 389260 355720 445948 730300 1017660 1021760 737054 432796 271953 156898
36927 156898 -7138 -117031 -48667 129572 248680 252756 217706 221310 279920 367112 428420
36916 428420 418423 370377 371304 417286 375527 183533 10914 72344 298991 376121 165549
36905 165549 -81285 -61525 169812 328065 349632 447378 696777 849071 696664 401610
36895 401610 256235 273520 248615 123519 30860 12789 -42436 -155610 -180335 -42683 131858
36884 131858 215609 244871 300598 361903 379034 387115 451787 570904 691520 762706 747412
36873 747412 665994 634571 743100 883121 841909 602286 390246 366808 438928 461101 452967
36862 452967 490098 530297 508937 494260 575260 670181 621717 448696 340628 399252 522629
36851 522629 576718 574299 620931 734584 791054 674757 455830 345124 438587 590373 627930
36840 627930 603507 677043 819289 861290 837718 1008417 1434967 1778260 1696827 1281760
36830 1281760 912224 798626 843948 863626 769296 589767 446012 453364 552416 532982 334539
36819 334539 193997 337056 640255 800362 765540 782563 1033510 1416452 1704791 1777921
36809 1777921 1673689 1525101 1458948 1480634 1474605 1369913 1232967 1125984 990518 793291
36799 793291 662556 703850 779872 680415 445694 301814 311929 320659 245367 198643 281816
36788 281816 448844 626717 808918 985347 1125570 1262221 1450875 1638830 1735330 1815286
36778 1815286 2053410 2418099 2644271 2596463 2463092 2467541 2549714 2482902 2193681 1820177
36768 1820177 1522613 1362881 1335675 1415217 1561645 1711081 1760135 1606635 1284495 1017379
36758 1017379 1011859 1209178 1374861 1413414 1418290 1413123 1275259 992428 777365 794190 940260
36747 940260 1037345 1085683 1176002 1286453 1341364 1375299 1477710 1657116 1909873 2328753
36737 2328753 2955539 3576310 3853838 3675225 3246903 2857296 2646820 2567339 2442717 2105004
36727 2105004 1598624 1214180 1183804 1376477 1447193 1267054 1035575 960274 1008293 1035144
36717 1035144 1004021 980301 1006011 1066825 1129044 1165725 1204622 1362288 1732204 2206914 2523371
36706 2523371 2548633 2425644 2371083 2435005 2550830 2705152 2894341 2967035 2706741 2122343
36696 2122343 1521152 1207020 1182610 1231201 1232410 1285212 1518062 1880339 2186952 2327932
36686 2327932 2360996 2391351 2421390 2363640 2177454 1940241 1773004 1726032 1749953 1753787 1676444
36675 1676444 1524615 1362914 1256299 1211767 1194381 1203624 1288065 1453408 1606742 1657625
36665 1657625 1642918 1667964 1740028 1766531 1728413 1723908 1779772 1752339 1536683 1274725 1197128
36654 1197128 1311394 1418148 1424192 1467560 1710891 2168447 2762790 3375554 3788948 3774510
36644 3774510 3357281 2836342 2425835 2036620 1549127 1109240 925837 912857 808100 584559
36634 584559 464639 532686 609732 565338 504400 552583 677267 846023 1172316 1737165
36624 1737165 2380718 2817032 2890329 2630322 2150924 1601367 1138364 833625 645323 536151
36614 536151 541895 657512 751430 695692 520745 352438 249032 182102 128521 99152 106338
36603 106338 154750 225050 241729 137430 -10749 -12041 199132 447581 521200 402947 219487
36592 219487 63373 -19903 40403 278558 595352 839317 959130 992185 959406 873883
36582 873883 796942 767434 716410 567403 383419 292974 298955 287900 216946 166071 194619
36571 194619 254019 267349 218961 150882 124986 178421 262917 258608 115302 -51119 -75607
36560 -75607 67252 250529 335738 274969 125929 18135 38058 105323 66757 -37776 33594
36549 33594 360149 668229 681548 493945 371171 340569 261321 179620 277924 532381 769771
36538 769771 1034996 1515501 2076301 2293478 2065728 1785592 1727905 1671183 1373987 1034596
36528 1034596 925645 893228 641679 291437 200022 354882 396873 209911 62454 131179
36518 131179 266288 306342 287443 241562 100345 -75743 -58844 206092 472424 557473
36508 557473 601426 792116 1066582 1307908 1641354 2254921 3019116 3538430 3561434 3169811
36498 3169811 2609764 2109730 1820164 1738717 1679457 1453926 1088026 754939 536426 394694
36488 394694 340041 433998 609054 675649 577917 486107 543532 655066 645142 527025 473006
36477 473006 557389 662803 657226 569512 541094 641596 777090 791380 647163 482029 466077
36466 466077 621751 811699 885448 803859 645893 542559 576582 685200 694455 527454
36456 527454 333986 299575 373393 361391 277306 360663 664360 874482 728098 416485
36446 416485 324597 496705 641511 606339 545004 597196 686299 714750 708870 655622 424627
36435 424627 9491 -339921 -404265 -271401 -153885 -63755 130014 423440 690936 939896
36425 939896 1322932 1859975 2320638 2447847 2197059 1728212 1262728 972279 905423 968599
36415 968599 1020556 994431 896965 737164 541229 401303 399490 491179 561572 588059 642630
36404 642630 737671 782948 714724 574943 448246 401211 474133 628428 708179 582323 347940
36393 347940 267959 464196 782168 1006389 1098934 1157965 1235557 1289957 1282179 1259630 1342912
36382 1342912 1611218 1959040 2115435 1905915 1468755 1100500 922809 848094 832898 939608
36372 939608 1110546 1121398 884235 615267 558118 681235 785325 776569 684737 529789
36362 529789 336818 201387 189025 231565 242690 257293 341481 460889 561502 671672
36352 671672 788282 788598 620104 447199 416686 415625 296782 201490 347258 593645 597423
36341 597423 385102 362600 670871 936448 851336 641797 683550 930445 1059508 1002186
36331 1002186 976214 1065300 1098600 964494 783898 718246 794608 963657 1174174 1360857
36321 1360857 1500685 1694281 2039447 2413603 2560665 2436545 2282745 2277618 2300346 2169048
36311 2169048 1941905 1791565 1700446 1518843 1285531 1235664 1433111 1615073 1532156 1286670
36301 1286670 1171080 1270631 1403352 1403404 1280869 1105888 915793 774943 757418 799313 723782
36290 723782 507614 366925 440786 537178 394627 101372 10474 251982 567105 676478
36280 676478 599099 507020 447969 364250 270516 247880 301992 349309 333084 276252 233631
36269 233631 238723 269523 243593 108901 -37789 -26180 138775 230244 110807 -32351 63149
36258 63149 328058 426218 232709 26011 110556 420464 645657 643439 547861 503619 476577
36247 476577 392478 330040 439821 700508 884986 819694 601335 478984 557563 704988
36237 704988 748647 672987 592093 601559 704266 822362 831056 640032 311431 53430 18903
36226 18903 137698 222435 210334 205018 287650 395589 420889 343893 224136 127211 109567
36215 109567 211000 392612 523548 507093 408738 393062 529312 712846 789124 708571
36205 708571 544296 403710 351484 382418 429654 417662 341954 283726 313234 392667 415454
36194 415454 337120 224692 171259 198180 249231 252485 190341 137713 207296 401273 547455
36183 547455 477355 255858 111018 125941 157345 107570 82512 155464 172244 7486 -133831
36172 -133831 45929 465098 731411 686946 580456 628939 709546 636356 488261 457028
36162 457028 546367 620591 619364 547801 381084 159156 57583 171710 327057 295836 116112
36151 116112 -513 -1094 -13371 -73194 -40081 201195 593758 949576 1044407 770047 329961
36140 329961 151936 411186 770360 822031 634542 549166 583533 463535 194460 106827
36130 106827 256829 274199 599 -176105 82490 519824 689487 599402 560366 627606
36120 627606 616327 525231 521856 573659 485186 286329 226538 368760 516900 572139 637457
36109 637457 718455 646273 395652 183161 125805 73548 -77390 -165682 -40496 163687
36099 163687 228139 153007 69365 8443 -38501 26465 259838 473944 421873 150823 -39837
36088 -39837 15169 194187 331563 424613 538963 651280 671684 550824 319718 79384
36078 79384 -37939 27131 177200 248129 197357 131165 135108 166164 143456 57278 -62634
36067 -62634 -204312 -323862 -306645 -87369 208093 349024 258693 107186 93720 199374
36057 199374 241186 146477 62060 146067 337215 428269 343883 242683 312038 531371 693411
36046 693411 631329 383319 143604 74205 155619 216250 129835 -19922 -19472 214995 517676
36035 517676 654028 565024 366781 160739 -44687 -227962 -299591 -223914 -110148 -78497
36025 -78497 -74548 64023 346992 561768 532872 354238 249772 263307 240779 116190 33805
36014 33805 102578 184913 85319 -142130 -257698 -175115 -48605 -2837 34453 151011 264019
36003 264019 244618 121256 21676 -17333 -45002 -49298 38711 203485 342960 419926 492632
35992 492632 572411 580956 502430 453229 509610 568529 503910 392230 427159 623236 769835
35981 769835 730787 637384 664347 723149 560397 144020 -233633 -302344 -116993 88584
35971 88584 221155 338215 420810 360196 195135 153411 350401 600397 666940 582500 547420
35960 547420 591845 553119 382553 251293 276156 330554 257052 116397 54900 38168 -64125
35949 -64125 -179977 -77991 251514 508305 497483 411037 499278 644975 544578 215117
35939 215117 -10094 -260 -5512 -206592 -397800 -327012 -107081 -23765 -105018 -167525 -174344
35928 -174344 -238367 -326683 -273727 -90219 32306 51026 119279 262915 314911 252378 275172
35917 275172 415964 408629 154529 -2252 240050 644068 766787 587628 423120 364242
35907 364242 234551 59369 119562 453322 695527 576642 282655 142643 204157 309026
35897 309026 392770 496533 595151 589003 416231 90641 -286610 -506595 -388011 -16786
35887 -16786 286593 328526 237772 222049 297025 372403 434785 482766 423784 223065 49801
35876 49801 84077 253527 346851 328568 345520 446564 490692 363276 142275 8435 69754
35865 69754 272816 422816 337435 66392 -109633 -11519 186768 193127 13527 -70703 77808
35854 77808 279204 327890 253744 196291 178809 131098 31764 -85250 -191138 -234018 -121984
35843 -121984 157147 438319 502745 295172 -42878 -336568 -507484 -556172 -503843 -388916
35833 -388916 -269943 -178583 -86630 30730 108584 49217 -99309 -118464 112953 384595
35823 384595 358330 17451 -273144 -230296 4862 119410 57788 2475 40336 82246 72965
35812 72965 60619 60153 41496 49587 136119 174460 -23550 -370371 -530276 -367015 -120669
35801 -120669 -17511 47138 250564 490524 545420 438327 371790 388469 364736 293129 291651
35790 291651 325050 196097 -108161 -304898 -180289 117387 290403 249574 109212 -46336
35780 -46336 -200611 -280257 -197575 -23636 50227 -34695 -128074 -104059 -41074 -73012 -165731
35769 -165731 -178120 -92066 -25945 -14014 73578 320556 588269 655722 478883 217289 43789
35758 43789 20522 125360 280274 351258 241601 30828 -70780 32441 185879 159925
35748 159925 -79350 -337923 -413815 -295353 -139496 -94161 -165045 -246529 -248167 -155907 9667
35737 9667 213840 361024 328722 134411 -13349 46416 196570 199546 41213 -78600 -98852
35726 -98852 -200012 -461443 -643999 -502993 -170811 -7586 -139537 -357660 -457771 -471679
35716 -471679 -509612 -548253 -493643 -366402 -298309 -350712 -425914 -402385 -312300 -306213 -430538
35705 -430538 -532705 -460489 -274815 -141440 -75762 24134 116900 29720 -214240 -331654
35695 -331654 -179582 5716 -38200 -210073 -254613 -195566 -252296 -418199 -459375 -327583
35685 -327583 -254707 -377342 -548115 -607607 -586362 -527285 -357243 -89554 61517 -45284
35675 -45284 -253817 -341755 -332806 -385150 -490416 -504360 -409565 -330968 -311462 -273818 -226978
35664 -226978 -330150 -673561 -1099333 -1317387 -1167474 -750430 -335778 -137027 -144913 -194116
35654 -194116 -199525 -247856 -404168 -536195 -467292 -250564 -127345 -203771 -317242 -272888 -84056
35643 -84056 104338 230274 335753 423397 421630 311267 189739 154839 184294 198310 201091
35632 201091 263011 361215 353939 177465 -25606 -79952 -17193 -13626 -123985 -230895 -262409
35621 -262409 -287378 -336280 -291734 -71226 200286 328537 278390 147517 -5362 -168256
35611 -168256 -275272 -256441 -168495 -135742 -167479 -168531 -129679 -156883 -275106 -344465 -248017
35600 -248017 -63669 31828 -37019 -208102 -382916 -487200 -474455 -357935 -238574 -235863
35590 -235863 -366606 -519550 -567582 -492900 -389137 -350060 -382561 -436618 -478565 -486509 -407309
35579 -407309 -210080 11624 97715 26021 -44288 -1420 56057 -10866 -150490 -202585 -139081
35568 -139081 -63408 -24589 -8389 -69406 -260824 -446185 -421965 -254353 -224944 -362567 -334980
35557 -334980 16796 339239 257847 -27779 -35460 235770 291254 -78741 -454382 -407172
35547 -407172 -97574 32746 -96996 -213053 -183782 -149294 -191725 -208536 -162652 -175760 -276502
35536 -276502 -298160 -157303 -25355 -62164 -157452 -128969 -30127 -32241 -104585 -73761 42146
35525 42146 42266 -83358 -69473 219516 537320 582318 401410 268756 284828 313372 251734
35514 251734 147511 56878 -21240 -48323 49980 239876 371855 356966 237799 67598
35504 67598 -142159 -321925 -350727 -235129 -140401 -159286 -192599 -163489 -190950 -383490 -588986
35493 -588986 -568865 -356681 -211883 -230471 -243358 -145913 -81146 -167597 -253811 -143225 66758
35482 66758 96447 -117944 -357813 -459953 -509105 -623698 -733816 -705071 -561518 -428825
35472 -428825 -322044 -157343 34487 73456 -127264 -400488 -503775 -404534 -297468 -358410
35462 -358410 -561154 -744860 -790295 -689833 -494220 -266561 -95250 -75710 -207067 -328134
35452 -328134 -241302 70720 410856 580431 560421 441911 273315 76659 -62400 -70091
35442 -70091 -24903 -73408 -209476 -293814 -298987 -341997 -426216 -376873 -158830 -42790 -249506
35431 -249506 -587352 -689221 -508464 -316708 -266707 -247448 -184001 -186034 -302406 -375587 -284804
35420 -284804 -149237 -137084 -216115 -248442 -223237 -239360 -325380 -412936 -449809 -439638 -406152
35409 -406152 -388938 -425807 -487700 -499886 -464642 -456648 -454266 -331784 -110553 -36862 -242724
35398 -242724 -481641 -424816 -123479 70024 686 -123291 -85360 49997 83082 -55278
35388 -55278 -272782 -433828 -444922 -318761 -194787 -207950 -322303 -391641 -371782 -334453 -278522
35377 -278522 -110554 148258 322201 320935 244295 162800 -12225 -303098 -495537 -396250
35367 -396250 -142199 -39456 -158643 -291849 -274616 -150377 -20127 73672 78420 -74766
35357 -74766 -338400 -549488 -637518 -709648 -848129 -947710 -880678 -737157 -738281 -921862 -1066986
35346 -1066986 -985333 -772191 -664876 -712766 -723931 -552582 -303978 -164832 -131373 -59477
35336 -59477 47868 -7788 -315645 -655927 -733858 -528290 -275342 -156816 -145627 -144178 -126694
35325 -126694 -103035 -57503 1659 -1108 -126488 -321401 -463018 -499358 -498948 -538687 -574416
35314 -574416 -482674 -247575 -30408 29830 27783 155801 363405 356018 26542 -309374 -295379
35303 -295379 -10471 172417 116174 26392 37132 -6835 -252291 -570255 -746254 -766106
35293 -766106 -756182 -777751 -834413 -957122 -1108367 -1101569 -809227 -403940 -218279 -381524 -731331
35282 -731331 -1048671 -1227495 -1238873 -1105224 -937023 -849967 -806225 -656790 -373347 -117657
35272 -117657 -33610 -77265 -109632 -66717 23746 117210 173782 154225 57385 -57093 -114742
35261 -114742 -84904 -282 52234 -13758 -181314 -307020 -273338 -135633 -24633 61831 226862
35250 226862 431247 456122 192332 -160392 -296317 -137930 119457 243322 171637 32986
35240 32986 22912 222294 496905 623213 535680 374579 266757 174767 28715 -112133
35230 -112133 -143738 -83398 -31796 -19947 -4335 22599 22699 -6218 -23823 -8040 33463 74276
35218 74276 44937 -128932 -393704 -557103 -502458 -330599 -192224 -91085 7592 -928 -212307
35207 -212307 -456052 -439787 -155511 90482 90129 -46127 -139540 -182433 -219147 -201002 -117396
35196 -117396 -103140 -235515 -350309 -248981 -852 153085 141147 105905 124615 95756
35186 95756 -34723 -107464 60427 400057 635031 594563 385796 224361 176189 151881
35176 151881 111956 133766 229852 244278 58424 -198982 -314358 -294906 -307832 -347840 -223450
35165 -223450 78108 281078 207510 39655 17671 82806 51722 -21384 62902 290678 455886
35154 455886 501316 556941 634762 571161 337348 143305 115988 97996 -81618 -313891 -361210
35143 -361210 -183331 46934 166632 121520 -72917 -315771 -423605 -303820 -99834 -29851
35133 -29851 -106796 -160170 -117738 -88857 -128379 -96655 124118 389181 422275 150954 -221847
35122 -221847 -471383 -540290 -454667 -216437 105661 297105 196475 -49511 -115118 80046
35112 80046 253346 164317 -29988 -6265 241617 387817 245238 23978 24642 239372 399770
35101 399770 329853 108927 -77363 -120599 -28600 109149 168864 83989 -73931 -154983 -95446
35090 -95446 23212 96590 113344 107396 67123 -18069 -64953 22207 169650 174251 -8721
35079 -8721 -151672 -51011 169395 221732 54189 -122151 -189407 -260521 -398931 -447445 -287588
35068 -287588 -77037 -36639 -136498 -189619 -147459 -92195 -19153 143069 334197 403618 340066
35057 340066 264490 210301 114131 9372 557 38768 -32758 -176039 -161328 56505 229173
35046 229173 196890 122900 188900 292165 247427 99771 20416 38773 81579 143073 216251
35035 216251 190677 31276 -72846 32689 188895 159557 21210 11347 79863 -43420
35025 -43420 -344449 -469618 -259099 9446 55327 -29786 -30439 29883 10453 -58175 -63317
35014 -63317 -60982 -188333 -393847 -477786 -371476 -189177 -29932 85856 95308 -88435 -390810
35003 -390810 -580056 -541707 -428573 -447105 -586436 -665660 -596996 -480925 -428404 -387447 -219315
34992 -219315 85706 355030 427908 343875 276002 311798 381749 392629 332728 225137 79097
34981 79097 -58473 -90741 12745 145439 178456 95487 -42478 -192096 -305340 -292932
34971 -292932 -133516 31742 53857 575 71638 280616 386942 210131 -124468 -347380
34961 -347380 -350602 -230713 -111376 -48536 -69947 -175468 -280499 -254342 -62164 171213
34951 171213 274426 202390 88719 115375 313671 517486 564756 519175 585630 792991
34941 792991 907038 747424 460409 327590 389004 434913 335427 188319 122247 124491 115615
34930 115615 57677 -62914 -234689 -355666 -296765 -84867 102404 174971 225068 328516
34920 328516 413353 410960 371505 323003 191384 -5744 -75191 59996 164327 13660 -239613
34909 -239613 -290267 -142088 -43325 -48693 14160 165711 211425 97829 6231 15820 -18591
34898 -18591 -151836 -210609 -102808 10966 938 -39715 -38407 -107026 -278179 -342766 -169243
34887 -169243 57640 148192 214563 401281 546354 434579 203804 151026 264739 297033
34877 297033 203959 161200 195894 148576 -9015 -127069 -143257 -115190 -21528 167952 265452
34866 265452 55741 -293110 -380153 -166108 -31416 -162263 -284546 -166593 -777 -48352
34856 -48352 -223019 -299158 -285675 -317723 -368847 -336112 -269161 -278286 -328039 -323109 -290171 -296280
34844 -296280 -299918 -247782 -198473 -194632 -151870 -38833 -11058 -172168 -352917 -348108 -238961
34833 -238961 -234175 -294827 -185837 143019 469736 586184 480959 256774 41421 -41024
34823 -41024 30772 130030 157127 177977 244814 211780 -44657 -322958 -289661 62010 413100
34812 413100 565032 609938 635085 545984 279976 -34330 -243248 -318714 -266479 -73599
34802 -73599 157587 208966 11829 -221994 -251498 -78831 125031 250174 293802 271342
34792 271342 196417 98014 -17481 -171998 -338314 -425164 -383169 -257120 -103804 56172
34782 56172 174279 166258 24793 -144868 -252320 -305903 -332041 -308497 -235580 -185518 -210733
34771 -210733 -263782 -261616 -179851 -57317 31499 -189 -168535 -346609 -377633 -281401 -233307
34760 -233307 -308779 -381092 -329038 -213756 -166240 -210434 -283795 -332159 -302016 -148929 46467
34749 46467 81790 -115220 -319306 -242096 100512 390619 376102 127371 -90794 -121909
34739 -121909 -52339 -71197 -225307 -345252 -249384 11841 196986 149467 -67978 -314295
34729 -314295 -511311 -606904 -545786 -371114 -246426 -273933 -366221 -375973 -271566 -116189 26197
34718 26197 84424 -7092 -185829 -255942 -121271 66821 103100 -27504 -207199 -362377
34708 -362377 -440760 -339816 -50246 216197 239775 70984 -87273 -190282 -318757 -411820
34698 -411820 -322145 -135454 -134874 -373478 -551443 -436621 -173228 -27932 -38298 -89735 -162521
34687 -162521 -282037 -334886 -169669 141451 331065 254413 52960 -38212 34452 108228
34677 108228 21364 -170126 -237965 -73211 139313 147900 -15041 -82143 49214 180359
34667 180359 143731 50679 66338 131604 104535 30331 46968 121213 106577 3114 -56821
34656 -56821 -33530 22679 143720 365365 509608 333459 -77163 -348652 -320991 -219084
34646 -219084 -223793 -190381 15988 199434 126478 -75843 -121696 -11023 49103 54746 182253
34635 182253 397992 456345 323086 254609 360337 413450 255786 99455 203446 471031
34625 471031 611778 545355 406843 276713 149483 78310 98902 65265 -181233 -494317
34615 -494317 -535592 -245870 34648 3918 -242071 -392976 -299811 -45446 218071 359695
34605 359695 299673 100374 -30697 38695 177873 145954 -90832 -314823 -332915 -185587
34595 -185587 -47725 -11072 -26507 -14604 34931 76561 82363 75726 90647 114880 97149 15359
34583 15359 -84251 -132856 -112931 -68702 -45035 -33404 7473 80794 127549 99282 39313 42617
34571 42617 125321 186173 127697 -27940 -177378 -244461 -210827 -93525 45559 112235 75938
34560 75938 26343 67611 181492 256287 218642 76933 -116012 -270227 -291455 -199783 -146497
34549 -146497 -202328 -216787 -42359 193763 261064 209364 304081 568207 692258 495467
34539 495467 192189 46683 23243 -19365 -22637 119727 280439 261958 136927 141750 291107
34528 291107 373926 306794 221814 195395 149513 60736 18726 9251 -124128 -399362 -588391
34517 -588391 -520307 -316238 -183747 -135604 -74092 -23749 -87220 -235402 -319280 -272886 -169137
34506 -169137 -89438 -60600 -108514 -246475 -398147 -447249 -389145 -327807 -293978 -191601 4401
34495 4401 125757 31387 -121996 -23567 357956 672685 619100 319974 114051 92088 63585
34484 63585 -57464 -102597 35335 164942 47175 -246328 -409023 -283935 -23252 127703
34474 127703 97406 24147 75208 232804 275564 47357 -273450 -328998 -48210 228179
34464 228179 192832 -49427 -207781 -221285 -217346 -203774 -92492 39980 12044 -148857 -221107
34453 -221107 -140042 -80102 -143181 -211828 -184788 -129639 -105387 -34646 140035 336575 456253
34442 456253 475475 365063 105821 -154561 -175574 47187 234706 217082 156413 235873
34432 235873 346410 280138 61070 -130278 -230850 -289975 -301214 -240362 -186651 -223594 -296918
34421 -296918 -336124 -419677 -630508 -835093 -820833 -608769 -431546 -424444 -513529 -582721 -575010
34410 -575010 -445908 -196039 41406 103838 12828 -41225 52934 192949 186052 -53370 -398136
34399 -398136 -560452 -348706 60018 250984 87157 -95682 6709 183045 33311 -376364
34389 -376364 -582046 -405721 -162643 -130588 -206004 -228977 -291038 -494813 -681402 -647631
34379 -647631 -443097 -231685 -34414 166075 233678 59096 -171763 -157802 107654 337861
34369 337861 347719 236901 172316 188586 249410 338759 418445 414915 321045 230214 212326 219631
34357 219631 167648 64176 5676 56652 162375 195317 98985 -26248 -25352 113546 222949
34346 222949 152696 -51544 -211795 -208560 -58039 144724 289067 295520 177291 40484
34336 40484 -28967 -51464 -79632 -86433 -3933 154004 284584 299139 175805 -58046 -319398
34325 -319398 -473877 -443037 -308741 -229758 -253829 -294414 -291632 -289311 -320431 -321750 -235423 -125568
34313 -125568 -109305 -208626 -348458 -478592 -608874 -713778 -692122 -486799 -205919 -49929
34303 -49929 -109771 -288354 -434131 -487387 -449563 -281197 50411 424645 601924 483196
34293 483196 255255 179036 277830 345634 251473 108865 97831 221250 328013 324425 256186
34282 256186 182237 71427 -116451 -306670 -355726 -225927 -49215 10312 -86835 -262307
34272 -262307 -426309 -516895 -475982 -282988 -21831 166761 229648 234551 235056 184875 43852
34261 43852 -105569 -140203 -60930 7946 -33575 -183504 -376311 -509986 -466384 -232513 -6540
34250 -6540 -33798 -277846 -397878 -166827 202202 304073 49434 -258829 -346171 -266876
34240 -266876 -223095 -261162 -283526 -256353 -246046 -278269 -290155 -233852 -142928 -83490 -93033 -160520
34228 -160520 -221047 -198181 -105256 -60316 -128963 -208782 -172565 -72316 -61019 -141768 -160874
34217 -160874 -56428 59079 97737 103051 105739 61253 14956 126460 390851 526833 335303
34206 335303 17221 -88649 28865 93752 -25131 -182537 -237991 -219541 -184922 -143587
34196 -143587 -158243 -315826 -538723 -613605 -474604 -287834 -197094 -162362 -115165 -87395 -94094
34185 -94094 -58950 43833 128700 167065 246773 368373 370354 182365 -33832 -139517 -219017
34174 -219017 -350367 -385052 -197894 20123 12013 -125188 -92984 102930 146909 -74603
34164 -74603 -292348 -272779 -124708 -58801 -93255 -162024 -306850 -567155 -820603 -915242 -862832
34153 -862832 -755016 -597089 -388041 -262998 -349980 -525775 -518493 -271376 -32174 -26194
34143 -26194 -177756 -238365 -98838 119004 236688 201156 94744 16866 -19671 -78690 -195491
34132 -195491 -303020 -290511 -132354 72223 195692 194834 123123 62727 59862 97582 105670
34121 105670 20632 -128610 -210788 -115598 111378 306369 373782 379741 427482 502066 509603
34110 509603 429973 334812 260252 163906 35119 -47389 -22983 60380 124882 162150 176952
34099 176952 101450 -115057 -356831 -415508 -245655 -42693 -6034 -99368 -123747 15506
34089 15506 205307 285490 229339 124205 26132 -99666 -299103 -542080 -729683 -759477
34079 -759477 -586550 -271111 22929 143814 107483 78270 146431 200369 102631 -84043
34069 -84043 -176598 -131847 -69078 -39242 54753 261637 462664 527898 467018 346483 177764
34058 177764 -19814 -154736 -166042 -107399 -49310 3871 26254 -64210 -240599 -306494 -150430
34047 -150430 61316 114737 54025 61807 144114 176270 184482 295015 418354 291685 -96243
34036 -96243 -404248 -389340 -219821 -177517 -257108 -275033 -224017 -255543 -357018 -304779 -4943
34025 -4943 304806 329954 110482 -19187 123388 307872 197369 -166889 -386646 -235917
34015 -235917 48932 130298 17356 -58432 -55366 -114720 -213798 -156928 54366 149024 -14251
34004 -14251 -235641 -290623 -225959 -190203 -182180 -149247 -155789 -249308 -292194 -131590 151784
33993 151784 340704 352189 261579 144134 46730 31937 93142 105383 10629 -43953 76760
33982 76760 239720 210383 4225 -148170 -144346 -93503 -74627 -42847 172 -43627 -195697
33971 -195697 -352400 -450131 -514475 -521136 -398022 -210398 -142521 -218169 -235964 -87968 48249
33960 48249 -18309 -190223 -233121 -120276 -39064 -110968 -274504 -423898 -518039 -552582 -545823
33949 -545823 -564608 -665496 -790111 -794274 -606175 -314495 -94058 -64290 -189687 -287998
33939 -287998 -189541 57631 202000 85951 -135033 -186167 -41980 52834 -60627 -240316
33929 -240316 -253726 -73267 143978 278671 323327 283920 147784 -39822 -177075 -223687
33919 -223687 -247498 -316958 -402333 -419877 -329535 -153572 62384 265462 397699 422253 345929
33908 345929 208589 66598 -24043 -56649 -103991 -226640 -335263 -244781 68627 355537
33898 355537 346881 70745 -194690 -254892 -168592 -92961 -85475 -95256 -61472 21473 85076 29161
33886 29161 -152373 -302804 -256949 -67553 30741 -92714 -318145 -445796 -409095 -277638
33876 -277638 -151333 -106356 -158078 -228155 -230004 -214800 -319692 -529739 -630306 -480688 -211506
33865 -211506 -45493 -27374 -43070 -12433 58494 142755 196412 162299 65987 28514 88639
33854 88639 114781 9665 -113534 -109672 -42935 -62348 -130929 -104313 -24454 -83889 -290270
33843 -290270 -403405 -259404 40881 321012 510521 568411 432045 168711 12754 95595
33833 95595 247040 211266 -21691 -246285 -344018 -393594 -482589 -560728 -542004 -453982 -390314
33822 -390314 -352146 -243593 -52310 62581 -43546 -279537 -410702 -362533 -283641 -277508
33812 -277508 -246237 -91507 98716 208153 291176 433107 529940 420767 165181 -26643
33802 -26643 -87707 -101921 -70718 73900 232341 182565 -85867 -317105 -337369 -248779 -207549
33791 -207549 -218012 -233400 -266767 -304599 -280442 -215744 -216615 -265841 -215086 -61324 -13881 -178748
33779 -178748 -390481 -482883 -508972 -544954 -500910 -319135 -161995 -182002 -264385 -218418 -85956
33768 -85956 -37634 -83693 -112638 -115314 -151487 -186622 -178203 -230558 -430957 -609354 -509225
33757 -509225 -154307 189830 385209 510796 597318 533152 292190 47298 -35936 6549
33747 6549 9826 -131688 -362629 -498921 -403588 -186003 -123810 -296507 -440264 -309585 -22271
33736 -22271 153513 193146 238378 267884 162180 13387 32644 180298 218749 122918 98151
33725 98151 177218 159192 4421 -70425 17108 82662 46277 77247 222411 256173 92157
33714 92157 -19519 59063 74376 -147407 -299746 -55482 352621 454367 249714 127122
33704 127122 193898 181695 9472 -41893 168824 363716 252189 -63860 -270906 -229149
33694 -229149 -32973 146409 154684 -65862 -379412 -551937 -518132 -438089 -438208 -443771 -348899
33683 -348899 -212094 -170247 -249214 -355702 -396505 -343902 -242063 -187734 -240136 -330246 -337581
33672 -337581 -263290 -223993 -261755 -281800 -210353 -94409 -5688 37792 18106 -88677 -223685
33661 -223685 -282866 -286739 -364863 -520617 -587577 -502783 -430878 -488755 -540130 -442395 -319464
33650 -319464 -355282 -453397 -378753 -160873 -62115 -164299 -283522 -324854 -414717 -582657 -610295
33639 -610295 -380806 -136450 -150819 -320311 -349393 -229494 -235869 -470664 -697896 -696413 -534684
33628 -534684 -379222 -231409 -26624 138425 87161 -159323 -363688 -363292 -252441 -216959
33618 -216959 -281598 -311712 -227699 -122842 -141946 -296692 -451805 -483747 -407498 -331992 -326665
33607 -326665 -363323 -366162 -279256 -96900 127682 303028 370964 364791 359636 363204 303625 138802
33595 138802 -69666 -212575 -225305 -117225 33236 97954 -8603 -211022 -317530 -242996
33585 -242996 -119651 -109840 -178330 -161179 -16042 129328 174000 161717 179145 250742 370897
33574 370897 529178 648138 602567 385402 174090 134262 210164 209469 65827 -84742 -92198
33563 -92198 24150 106582 32002 -161125 -304151 -270707 -130169 -83472 -212789 -361966
33553 -361966 -340514 -182130 -75685 -67756 -437 205550 363331 243670 -101837 -390355
33543 -390355 -452382 -381761 -325497 -267986 -108497 137562 326035 347417 221267 41604
33533 41604 -94986 -111439 11220 185050 270288 224501 152417 163558 223992 215363 123251
33522 123251 86363 219039 422930 438889 118242 -377692 -699465 -651359 -370367 -133981
33512 -133981 -54865 -49826 -54241 -112388 -234720 -322448 -315404 -289554 -305938 -277727 -118966 69718
33500 69718 120405 34664 -66414 -174135 -375266 -617396 -707031 -586813 -423930 -353453
33490 -353453 -311694 -217227 -146220 -191789 -275493 -245073 -80244 117404 263320 309136 208033
33479 208033 -8306 -179508 -175007 -67034 -35474 -139092 -285809 -383951 -406488 -342734 -211852
33468 -211852 -108043 -117242 -195016 -224925 -182128 -140280 -137467 -144367 -151174 -171164 -158095 -29820
$$ [...]
##END NTUPLES=NMR SPECTRUM
##END=
