##TITLE=31Pdec_LR-668-RM2A
 CDCl3, 24 sc
 9.4.2019
##JCAMPDX= 6.0         $$ Bruker NMR JCAMP-DX V2.0
##DATA TYPE= NMR SPECTRUM
##DATA CLASS= NTUPLES
##ORIGIN= UXNMR, Bruker Analytische Messtechnik GmbH
##OWNER= root
$$ XWIN-NMR		Version 3.5
$$ Tue Apr  9 16:23:25 2019 Russian Standard Time (UT+4h)  she@DPX200
##.OBSERVE FREQUENCY= 81.013821
##.OBSERVE NUCLEUS= ^31P
##.ACQUISITION MODE= SIMULTANEOUS
##.ACQUISITION SCHEME= undefined
##.AVERAGES= 24
##.DIGITISER RES= 17
##SPECTROMETER/DATA SYSTEM= spect
##.PULSE SEQUENCE= zgpg30
##.SOLVENT NAME= CDCl3
##.SHIFT REFERENCE= (INTERNAL, CDCl3, 0, 182.463)
##AUDIT TRAIL= $$ (NUMBER, WHEN, WHO, WHERE, WHAT)
$$ ##TITLE= Audit trail, XWIN-NMR		Version 3.5
$$ ##JCAMPDX= 5.01
$$ ##ORIGIN= Bruker BioSpin GmbH
$$ ##OWNER= she
$$ F:/spectra/data/she/nmr/P31/1/pdata/1/auditp.txt
$$ ##AUDIT TRAIL=  $$ (NUMBER, WHEN, WHO, WHERE, WHAT)
(   1,<2019-04-09 16:21:30.75 +0400>,<she>,<DPX200>,
      <created by zg, POWCHK disabled, PULCHK disabled
       configuration hash MD5:
       00 E9 B6 7A A2 85 ED C7 34 08 36 98 17 FE 4E 26
       data hash MD5: 32K
       05 AC 67 14 9D C2 BA 74 D7 9D B7 B0 4C 65 D9 F1>)
(   2,<2019-04-09 16:21:34.87 +0400>,<she>,<DPX200>,
      <Start of raw data processing
       efp BC_mod = 2 LB = 1 FT_mod = 6 PKNL = 1 PHC0 = -1797.542 PHC1 = 71.19899 SI = 64K 
       data hash MD5: 64K
       B2 6C 75 35 F9 04 49 D1 52 2D 00 CF 91 62 FC E6>)
(   3,<2019-04-09 16:21:43.73 +0400>,<she>,<DPX200>,
      <pk PHC0 = -16.9986 PHC1 = 0 
       data hash MD5: 64K
       55 29 EA A4 F0 66 95 78 48 30 2A EF 3B C7 4D DF>)
$$ ##END=
$$ 
$$ hash MD5
$$ 5E AE 99 C2 17 77 66 E8 07 F3 4A 87 75 95 CA 4F
##$RELAX= 
##$RELAX= 
##$RELAX= 
##$RELAX= 
##$RELAX= 
##$RELAX= 
##$RELAX= 
##$RELAX= 
$$ Bruker specific parameters
$$ --------------------------
##$DU= <F:/spectra>
##$EXPNO= 1
##$NAME= <P31>
##$PROCNO= 1
##$TYPE= <nmr>
##$USER= <she>
##$AMP= (0..31)
100 100 100 100 100 100 100 100 100 100 100 100 100 100 100 100 100 100 
100 100 100 100 100 100 100 100 100 100 100 100 100 100 
##$AQSEQ= 0
##$AQ_mod= 1
##$AUNM= <au_zg>
##$AUTOPOS= <>
##$BF1= 81.014009
##$BF2= 200.13
##$BF3= 200.13
##$BF4= 200.13
##$BF5= 200.13
##$BF6= 200.13
##$BF7= 200.13
##$BF8= 200.13
##$BYTORDA= 1
##$CFDGTYP= 0
##$CFRGTYP= 5
##$CHEMSTR= <none>
##$CNST= (0..31)
1 1 145 1 1 1 1 1 1 1 1 1 1 1 1 1 1 1 1 1 1 1 1 1 1 1 1 1 1 1 1 1 
##$CPDPRG= <waltz16>
##$CPDPRG1= <>
##$CPDPRG2= <waltz16>
##$CPDPRG3= <>
##$CPDPRG4= <mlev>
##$CPDPRG5= <mlev>
##$CPDPRG6= <mlev>
##$CPDPRG7= <mlev>
##$CPDPRG8= <mlev>
##$CPDPRGB= <>
##$CPDPRGT= <>
##$D= (0..31)
0 1 0 0 0 0 0 0 0 0 0 0.03 2e-05 3e-06 0 0 0 0 0 0 0 0 0 0 0 0 0 0 0 0 
0 0 
##$DATE= 1554812490
##$DBL= (0..7)
120 120 120 11 120 120 24 19 
##$DBP= (0..7)
150 150 150 150 150 150 150 150 
##$DBP07= 0
##$DBPNAM0= <>
##$DBPNAM1= <>
##$DBPNAM2= <>
##$DBPNAM3= <>
##$DBPNAM4= <>
##$DBPNAM5= <>
##$DBPNAM6= <>
##$DBPNAM7= <>
##$DBPOAL= (0..7)
0.5 0.5 0.5 0.5 0.5 0.5 0.5 0.5 
##$DBPOFFS= (0..7)
0 0 0 0 0 0 0 0 
$$ [...]
##$SUBNAM2= <"">
##$SUBNAM3= <"">
##$SUBNAM4= <"">
##$SUBNAM5= <"">
##$SUBNAM6= <"">
##$SUBNAM7= <"">
##$SUBNAM8= <"">
##$SUBNAM9= <"">
##$SW= 369.568048894756
##$SWIBOX= (0..15)
0 1 3 0 0 0 0 0 0 0 0 0 0 0 0 0 
##$SW_h= 29940.119760479
##$TD= 32768
##$TD0= 1
##$TE= 0
##$TE2= 300
##$TE3= 300
##$TEG= 300
##$TL= (0..7)
0 120 53 12 22 120 120 120 
##$TP= (0..7)
150 150 150 150 150 150 150 150 
##$TP07= 0
##$TPNAME0= <>
##$TPNAME1= <>
##$TPNAME2= <>
##$TPNAME3= <>
##$TPNAME4= <>
##$TPNAME5= <>
##$TPNAME6= <>
##$TPNAME7= <>
##$TPOAL= (0..7)
0.5 0.5 0.5 0.5 0.5 0.5 0.5 0.5 
##$TPOFFS= (0..7)
0 0 0 0 0 0 0 0 
##$TUNHIN= 0
##$TUNHOUT= 0
##$TUNXOUT= 0
##$USERA1= <user>
##$USERA2= <user>
##$USERA3= <user>
##$USERA4= <user>
##$USERA5= <user>
##$V9= 5
##$VALIST= <valist>
##$VCLIST= <CCCCCCCCCCCCCCC>
##$VD= 0
##$VDLIST= <DDDDDDDDDDDDDDD>
##$VPLIST= <PPPPPPPPPPPPPPP>
##$VTLIST= <TTTTTTTTTTTTTTT>
##$WBST= 1024
##$WBSW= 4
##$XGAIN= (0..3)
0 0 0 0 
##$XL= 0
##$YL= 0
##$YMAX_a= 119254
##$YMIN_a= -235155
##$ZGOPTNS= <>
##$ZL1= 120
##$ZL2= 120
##$ZL3= 120
##$ZL4= 120
##$ABSF1= 0
##$ABSF2= 0
##$ABSG= 0
##$ABSL= 0
##$ALPHA= 0
##$AQORDER= 0
##$ASSFAC= 0
##$ASSFACI= 0
##$ASSFACX= 0
##$ASSWID= 0
##$AUNMP= <proc_1d>
##$AZFE= 0.1
##$AZFW= 0.5
##$BCFW= 0
##$BC_mod= 2
##$BYTORDP= 0
##$COROFFS= 0
##$CY= -3
##$DATMOD= 1
##$DC= 0
##$DFILT= <>
##$DTYPP= 0
##$F1P= 0
##$F2P= 0
##$FCOR= 1
##$FTSIZE= 65536
##$FT_mod= 6
##$GAMMA= 0
##$GB= 0
##$INTBC= 1
##$INTSCL= 5.30512e-09
##$ISEN= 30
##$LB= 1
##$LEV0= 0
##$LPBIN= 0
##$MAXI= 10000
##$MC2= 0
##$MEAN= 0
##$ME_mod= 0
##$MI= 50
##$NCOEF= 0
##$NC_proc= -2
##$NLEV= 6
##$NOISF1= 182.463
##$NOISF2= 159.3651
##$NSP= 0
##$NTH_PI= 0
##$NZP= 0
##$OFFSET= 182.463
##$PC= 4
##$PHC0= -1814.541
##$PHC1= 71.19899
##$PH_mod= 1
##$PKNL= yes
##$PPARMOD= 0
##$PSCAL= 0
##$PSIGN= 0
##$REVERSE= no
##$SF= 81.0140089999434
##$SI= 65536
##$SIGF1= 159.3651
##$SIGF2= -187.1042
##$SINO= 113.3802
##$SIOLD= 16384
##$SREGLST= <1H.CDCl3>
##$SSB= 0
##$STSI= 65536
##$STSR= 0
##$SW_p= 29940.119760479
##$SYMM= 0
##$S_DEV= 0
##$TDeff= 32768
##$TDoff= 0
##$TI= <>
##$TILT= no
##$TM1= 0
##$TM2= 0
##$TOPLEV= 0
##$USERP1= <user>
##$USERP2= <user>
##$USERP3= <user>
##$USERP4= <user>
##$USERP5= <user>
##$WDW= 1
##$XDIM= 65536
##$YMAX_p= 491153594
##$YMIN_p= -2432649
$$ End of Bruker specific parameters
$$ ---------------------------------
##NTUPLES= NMR SPECTRUM
##VAR_NAME=  FREQUENCY,     SPECTRUM/REAL,   SPECTRUM/IMAG
##SYMBOL=    X,             R,               I
##VAR_TYPE=  INDEPENDENT,   DEPENDENT,       DEPENDENT
##VAR_FORM=  AFFN,          ASDF,            ASDF
##VAR_DIM=   65536,         65536,           65536
##UNITS=     HZ,            ARBITRARY UNITS, ARBITRARY UNITS
##FACTOR=    0.456856943014862, 1,           1
##FIRST=     14782.0589164792, 0,            0
##LAST=      -15158.0608439998, 0,           0
##MIN=       -15158.0608439998, -2432649,    0
##MAX=       14782.0589164792, 491153594,    0
$$ Real data points
##PAGE= N=1
##DATA TABLE= (X++(R..R)), XYDATA
$$ [...]
##PAGE= N=2
##DATA TABLE= (X++(I..I)), XYDATA
43764 4473161 4601439 4668758 4784388 4959113 5065891 5109358 5235005 5403626 5414313 5324184
43754 5324184 5423885 5703830 5834311 5796172 5959378 6362560 6572409 6510607 6684648 7251175
43744 7251175 7666157 7728045 8066698 8981636 9779239 10065917 10622868 11949007 13138986
43735 13138986 13648233 14799593 17214685 17689385 11878851 568508 -9676801 -13468634
43727 -13468634 -11938611 -9687746 -8732660 -7829897 -6187204 -4820839 -4409361 -4224324 -3649372
43718 -3649372 -3078807 -2834998 -2524267 -1942538 -1536742 -1515751 -1407546 -910376 -401296 -221683
43708 -221683 -148178 75179 289973 323298 285995 206271 -106535 -588752 -827943 -681396
43698 -681396 -500225 -519002 -522400 -350004 -220705 -272108 -252984 12063 277893 316295 306278
43687 306278 461848 629270 598842 511659 611872 839919 985206 1031301 1068208 1058586 958015
43676 958015 898962 1017250 1239402 1427509 1574772 1701342 1747888 1731470 1799980 1961502
43666 1961502 1968201 1650721 1174039 793543 562508 449395 513000 744592 935202 928223
43656 928223 845706 865934 945097 964029 982178 1118141 1313325 1434946 1502269 1606539 1708372
43645 1708372 1711975 1657504 1661790 1738549 1825911 1914168 2014253 2087011 2125083 2207776 2361308
43634 2361308 2475218 2472022 2439117 2467022 2471897 2308223 1962196 1529224 1102382 770109
43624 770109 606385 581817 602651 681089 900809 1178826 1294557 1234547 1248529 1444175
43614 1444175 1606548 1586884 1578170 1771253 2004777 2039158 1952320 1956037 2010975 1956112 1872718
43603 1872718 1973211 2220420 2387827 2440186 2540734 2715431 2816025 2816969 2870228 3039821
43593 3039821 3216969 3313241 3318434 3160812 2735449 2106081 1493890 1044620 765163 668122
43583 668122 779103 992475 1112309 1072567 973744 902587 867443 900503 1051776 1264364
43573 1264364 1402429 1422357 1402279 1413583 1476706 1610763 1801467 1956942 2018250 2061536
43563 2061536 2164691 2248965 2203544 2084400 2013242 1957731 1812075 1631509 1569334 1622569
43553 1622569 1659838 1674273 1783382 1984559 2132431 2172728 2194550 2234922 2230059 2182545 2185365
43542 2185365 2249325 2280565 2254286 2247434 2285044 2316088 2347367 2437117 2555291 2615637 2639410
43531 2639410 2717064 2822144 2843256 2783099 2738477 2708841 2629426 2566239 2650345 2835822 2960755
43520 2960755 3025839 3138549 3188297 2902975 2296240 1749996 1538293 1538174 1526261 1489651 1498476
43509 1498476 1525793 1566732 1718332 1971116 2124288 2081751 2040778 2200608 2454707 2566878
43499 2566878 2507947 2422071 2378231 2349876 2356671 2448414 2596401 2731163 2838769 2925166 2951820
43488 2951820 2886305 2744679 2534884 2261379 2020842 1945608 1998129 1990888 1879932 1844794
43478 1844794 1978636 2112592 2096750 2054161 2163376 2354635 2437235 2406305 2407582 2480813 2536853
43467 2536853 2534283 2510198 2484559 2474069 2535236 2655655 2676362 2468962 2127617 1849379 1692426
43456 1692426 1592155 1546048 1622477 1818315 2040000 2207659 2291905 2297681 2289105 2356647 2485895
43445 2485895 2559600 2568090 2679839 2988338 3335732 3537963 3644490 3795514 3950471 3969477
43435 3969477 3867705 3765306 3648108 3400856 3047812 2756979 2617645 2585463 2617537 2686346
43425 2686346 2695783 2572162 2413857 2363844 2364407 2248144 2056876 2032601 2256422 2520314 2625784
43414 2625784 2605277 2553031 2425882 2154209 1823598 1596585 1512989 1480658 1433714 1413955
43404 1413955 1498612 1696545 1928909 2108690 2231505 2355464 2489494 2575627 2615302 2707670
43394 2707670 2872142 2930377 2702093 2260994 1856017 1620487 1506059 1469585 1547809 1729815
43384 1729815 1913237 2033880 2120977 2191470 2207315 2178462 2196965 2312510 2460070 2562657
43374 2562657 2632494 2717957 2807046 2837710 2777126 2653721 2513003 2351232 2112628 1794249
43364 1794249 1542126 1547911 1810497 2099295 2221789 2227469 2261041 2331418 2363923 2388262 2503522
43353 2503522 2702479 2892147 3061782 3275418 3513404 3677576 3760504 3868361 4053120 4233146
43343 4233146 4293799 4177396 3887005 3495152 3121493 2806202 2455321 2023561 1675788 1601886
43333 1601886 1719037 1743742 1546960 1264432 1066333 1002895 1081942 1301495 1563894 1727696
43323 1727696 1790363 1873994 2011941 2115059 2165920 2251550 2356575 2324592 2107685 1872630
43313 1872630 1759187 1697078 1576174 1451440 1447572 1568598 1723827 1862629 1985955 2095313
43303 2095313 2207180 2347526 2476092 2502052 2429106 2390575 2480731 2639111 2748659 2749462 2615661
43292 2615661 2345313 2036609 1848027 1801714 1742409 1575069 1421072 1432811 1564623 1656721
43282 1656721 1667795 1695502 1813783 2000163 2192405 2329337 2367080 2329429 2309917 2362270
43272 2362270 2429818 2442608 2433759 2485351 2595765 2679932 2691162 2681911 2736568 2874535 3027455
43261 3027455 3110678 3120059 3135800 3211629 3305107 3364622 3427930 3549035 3672994 3695755 3630400
43250 3630400 3602548 3684920 3838008 4005052 4161138 4281088 4366621 4485541 4671052 4819013
43240 4819013 4820942 4752465 4758450 4793792 4695736 4503039 4448847 4585070 4663594 4492208 4187062
43229 4187062 3949488 3801078 3691928 3682313 3825251 4002174 4069503 4086309 4225247 4512875
43219 4512875 4815501 5061357 5342962 5770854 6280452 6600842 6429380 5684481 4579889
43210 4579889 3407258 2303457 1316732 587864 252590 200776 172254 113456 210426 533369
43200 533369 898289 1156074 1371523 1609126 1781794 1853604 1978968 2280210 2660022 2974364
43190 2974364 3223843 3446055 3592958 3646856 3690775 3747095 3728473 3659177 3729634 3989206
43180 3989206 4201518 4171910 4018454 3953806 4006329 4129680 4359587 4643851 4725576 4448263
43170 4448263 4025640 3781953 3759171 3778709 3738828 3644306 3489212 3320705 3292687 3472660
43160 3472660 3722966 3920749 4128587 4401709 4628971 4730796 4803263 4902609 4927847 4891993
43150 4891993 5034886 5456933 5919160 6223656 6487188 6802421 6975725 6898226 6837810 7036303
43140 7036303 7345769 7586822 7900865 8393852 8829555 9069190 9390430 9950568 10421906
43131 10421906 10645907 11094340 12094210 13204118 14059194 15140290 16822075 18437699 19431344
43122 19431344 20494696 21741107 20412834 13048879 534795 -11258741 -17140674 -17370077
43114 -17370077 -15698444 -14422651 -13199828 -11525005 -9973840 -8978708 -8140698 -7162690
43106 -7162690 -6327838 -5759437 -5126990 -4343784 -3787102 -3603715 -3457354 -3148350 -2887954
43097 -2887954 -2795352 -2667498 -2401929 -2159251 -1979426 -1695493 -1332340 -1138527 -1111713 -930057
43087 -930057 -484376 -72769 79708 136600 337792 672898 995718 1222202 1332792 1376834
43077 1376834 1472378 1588935 1410324 708634 -210400 -760537 -731552 -391750 -39845 163257
43067 163257 11896 -608714 -1369177 -1716738 -1531271 -1189986 -946769 -672167 -284218 19374
43057 19374 132128 253887 536366 837269 1012632 1156787 1368254 1552003 1641200 1767535
43047 1767535 2022210 2260691 2326023 2291559 2326754 2470172 2658845 2849266 3015467 3144857
43037 3144857 3287100 3491159 3693645 3810700 3904506 4077800 4251334 4258587 4111977 3947023
43027 3947023 3770785 3530895 3363560 3467230 3774045 4049677 4261186 4524993 4775546
43018 4775546 4867671 4940577 5258197 5730774 6040057 6203312 6523179 6987629 7252054 7254752
43008 7254752 7308172 7520603 7690577 7849042 8302677 9025700 9627503 10050337 10649910 11465466
42998 11465466 12144863 12744296 13772383 15233229 16551313 17700780 19323363 21382214
42990 21382214 23028669 24299998 26077458 27045797 22712188 10179003 -6769602 -20080181
42982 -20080181 -25230303 -24551163 -22647936 -21166900 -19269009 -16867633 -15017962 -14006932
42974 -14006932 -13095571 -11995280 -11169107 -10726913 -10198782 -9449706 -8860710 -8531891 -8119691
42965 -8119691 -7536228 -7081755 -6804096 -6399105 -5844456 -5498649 -5436357 -5272935 -4820502 -4382406
42955 -4382406 -4194669 -4062926 -3786175 -3503503 -3355705 -3177842 -2813446 -2429823 -2237384
42946 -2237384 -2140376 -1939443 -1682943 -1547783 -1512509 -1398699 -1152106 -876347 -642520 -432569
42936 -432569 -239677 -103255 -64457 -146595 -323164 -469127 -443094 -268223 -119782 -77613
42926 -77613 -21532 152729 357974 469244 528115 655181 848973 1012332 1117623 1214376
42916 1214376 1312478 1373322 1389899 1379102 1318465 1167102 915110 550119 40308 -562826
42906 -562826 -1073024 -1331966 -1377480 -1346491 -1270604 -1101540 -891025 -771117 -743603 -649569
42896 -649569 -402767 -128340 -1256 -38222 -111043 -89604 83367 385432 718498 974798
42886 974798 1152310 1354911 1636465 1910345 2071094 2135488 2166720 2087965 1677399 787825
42876 787825 -462013 -1729926 -2671285 -3135908 -3196370 -3024768 -2760487 -2479420 -2221691
42867 -2221691 -1985299 -1719117 -1394824 -1075393 -836772 -636068 -365421 -51327 122411
42858 122411 45310 -173297 -358189 -467642 -552177 -611356 -609836 -571457 -534820 -454187 -260184
42847 -260184 4909 222202 358062 496897 715219 1000114 1284817 1498496 1596467 1597879
42837 1597879 1564404 1498569 1333861 1092766 954646 1046862 1252757 1372852 1404698 1490976
42827 1490976 1645689 1738559 1744951 1807650 2017297 2306568 2598186 2889377 3148722 3299364
42817 3299364 3363450 3471102 3672240 3887570 4088422 4355519 4699134 4991429 5141057 5143347
42807 5143347 4866183 4000836 2404478 370084 -1587693 -3116876 -4106013 -4548492 -4520309
42798 -4520309 -4214790 -3830620 -3439351 -3037182 -2653908 -2325452 -2035951 -1769181 -1543893
42789 -1543893 -1339591 -1085374 -782980 -532626 -379435 -254040 -115358 -9069 70937 217620
42779 217620 444020 652584 829415 1072525 1366785 1565506 1677010 1904676 2293860 2629152
42769 2629152 2819315 3067360 3484840 3878128 4136709 4479959 5055726 5649485 6075719
42760 6075719 6479498 6957031 7334121 7667280 8399669 9560405 10501303 11064672 12069272
42751 12069272 13403993 12452586 6438128 -3480826 -12295799 -16112336 -15685513 -14262590
42743 -14262590 -13443019 -12586820 -11195626 -9906588 -9214912 -8751197 -8153151 -7617216 -7273121
42734 -7273121 -6835852 -6192968 -5671310 -5434134 -5185146 -4736091 -4350019 -4246429 -4222138 -4045186
42724 -4045186 -3832406 -3758006 -3723198 -3583167 -3418632 -3334881 -3235628 -3021076 -2795397 -2676630
42714 -2676630 -2598584 -2484284 -2424803 -2500697 -2590377 -2533039 -2353470 -2183138 -2076918 -2021319
42704 -2021319 -2005562 -1990798 -1922093 -1831671 -1806879 -1833487 -1837321 -1892631 -2166939 -2616222 -2981911
42693 -2981911 -3165458 -3344919 -3614889 -3792626 -3747026 -3655894 -3722199 -3859279 -3895512 -3897242
42683 -3897242 -4016848 -4154899 -4052059 -3657676 -3181733 -2820007 -2607849 -2494656 -2394310
42674 -2394310 -2210474 -1957988 -1794278 -1795329 -1799282 -1634729 -1394838 -1281656 -1271223 -1174816
42664 -1174816 -982247 -881283 -925263 -933236 -787118 -612577 -560545 -578203 -523056 -389883
42654 -389883 -298760 -321627 -425679 -556580 -690241 -801423 -841399 -777599 -642544 -512834
42644 -512834 -420882 -317353 -169679 -64799 -114480 -259855 -302408 -174474 -39734 -41393
42634 -41393 -91414 -36973 89936 155939 166478 235131 367060 461261 500772 554108 596074
42623 596074 517579 332672 193021 154503 97600 -65028 -258884 -390414 -470747 -520127
42613 -520127 -489299 -370358 -265699 -245263 -232954 -128411 49626 230890 409595 590759
42603 590759 705769 697908 634836 630509 699466 776218 824345 833530 765215 606362 432967
42592 432967 317233 215211 55224 -105480 -139413 -40366 74419 148396 244093 408888
42582 408888 607450 810191 1030866 1247175 1401312 1517311 1698870 1959100 2171102 2257162
42572 2257162 2315295 2472185 2710757 2940223 3145594 3357417 3551679 3703820 3887595 4199036
42562 4199036 4617434 5041368 5416792 5740233 6015684 6323163 6823809 7535053 8215210
42553 8215210 8673297 9012252 9166285 8287817 5237414 34611 -5577918 -9490812 -11018508
42544 -11018508 -11041899 -10646361 -10170729 -9542255 -8877334 -8387547 -8022369 -7574968 -7023885
42535 -7023885 -6521928 -6131442 -5781163 -5438409 -5148395 -4917745 -4688323 -4419574 -4111650
42526 -4111650 -3774779 -3445856 -3189294 -3011741 -2832396 -2609444 -2426484 -2365171 -2360400 -2289029
42516 -2289029 -2151428 -2051128 -2024089 -1997752 -1911640 -1790687 -1702088 -1702884 -1810294 -1964373 -2051874
42505 -2051874 -2028018 -1972991 -1964152 -1950430 -1839886 -1658816 -1520114 -1466226 -1440595 -1387212 -1288102
42494 -1288102 -1135323 -959368 -850829 -859883 -913700 -924951 -917756 -928252 -859505 -605116 -266531
42483 -266531 -51283 27438 142715 341182 469654 466617 491255 653478 828968 890076
42473 890076 925227 1024932 988863 489646 -505710 -1662636 -2613075 -3212031 -3483407 -3491513
42463 -3491513 -3326654 -3108391 -2925121 -2792321 -2680706 -2561813 -2439240 -2355950 -2337742 -2317372
42453 -2317372 -2188654 -1970951 -1819472 -1799569 -1760422 -1551160 -1266614 -1118397 -1122338 -1099066
42443 -1099066 -969311 -853329 -838998 -831800 -722836 -566359 -478078 -448611 -370441 -199708
42433 -199708 2488 161839 252677 291018 323966 405403 530171 608061 549657 370894 180188
42422 180188 72421 61575 102480 148008 188156 251207 365500 518902 669428 792190
42412 792190 891422 970761 1028964 1088631 1186683 1322698 1454925 1560929 1662247 1775786
42402 1775786 1888396 2000148 2140829 2312752 2470628 2601286 2772311 3043684 3371905
42393 3371905 3668911 3926089 4204911 4523378 4837869 5139450 5476307 5848110 6156299
42384 6156299 6313479 6349892 6359725 6389282 6439727 6543402 6763249 7120022 7544911 7828742
42374 7828742 7530294 6052906 3100702 -806809 -4448778 -6755691 -7563456 -7463206 -7035241
42365 -7035241 -6428589 -5613515 -4718576 -3960662 -3408655 -2974455 -2554045 -2073995 -1491408
42356 -1491408 -851516 -260237 286480 934425 1738729 2547644 3252111 3980703 4859332
42347 4859332 5767562 6584144 7410562 8059838 7470479 4396294 -973503 -6598434 -10297784
42338 -10297784 -11659068 -11896244 -12152446 -12538348 -12708961 -12637754 -12514578 -12326318 -11931455
42329 -11931455 -11368417 -10810595 -10319474 -9845868 -9391290 -8996908 -8636767 -8264783 -7915594
42320 -7915594 -7644770 -7426583 -7211579 -7017443 -6861569 -6680562 -6433215 -6210969 -6111905 -6060721
42310 -6060721 -5901760 -5641936 -5449461 -5408188 -5415594 -5356635 -5255430 -5196997 -5190782 -5184292 -5162418
42299 -5162418 -5167393 -5227214 -5294741 -5268680 -5090452 -4827102 -4620451 -4525783 -4448883 -4292417 -4108819
42288 -4108819 -4022209 -4033156 -4007089 -3856830 -3637816 -3443613 -3299606 -3196548 -3145255 -3137409
42278 -3137409 -3105968 -2989485 -2815833 -2677188 -2627610 -2630219 -2604769 -2519971 -2435264 -2431205 -2489465
42267 -2489465 -2487759 -2356599 -2190898 -2126947 -2144618 -2103258 -1970292 -1882341 -1934127 -2032963 -2059509
42256 -2059509 -2085554 -2309044 -2807976 -3471028 -4160772 -4830503 -5454006 -5947341 -6238438 -6363298
42246 -6363298 -6414537 -6411511 -6295422 -6060992 -5817565 -5671371 -5595795 -5484490 -5307657 -5137830
42236 -5137830 -5024928 -4936073 -4845404 -4793105 -4799089 -4795477 -4720483 -4619174 -4568915 -4557184 -4522623
42225 -4522623 -4467253 -4424436 -4360132 -4228679 -4097052 -4076225 -4138307 -4145364 -4064397 -3997415 -3972179
42214 -3972179 -3874028 -3652974 -3441452 -3371611 -3407759 -3456238 -3508935 -3564115 -3535186 -3383472 -3240312
42203 -3240312 -3244122 -3335920 -3368487 -3342845 -3365805 -3428277 -3412830 -3302849 -3205684 -3164944 -3119795
42192 -3119795 -3068594 -3103723 -3239353 -3356717 -3379916 -3371770 -3390329 -3378560 -3280633 -3161276 -3113605
42181 -3113605 -3121168 -3096316 -3004544 -2886842 -2804592 -2807994 -2905151 -3021494 -3048136 -2968138 -2872838
42170 -2872838 -2824182 -2784415 -2724109 -2699404 -2746705 -2791083 -2760350 -2721983 -2788778 -2925660 -2974660
42159 -2974660 -2874872 -2749322 -2738268 -2823226 -2869502 -2806415 -2712463 -2715462 -2834466 -2951835 -2953702
42148 -2953702 -2865457 -2803557 -2813231 -2824514 -2776051 -2703049 -2664707 -2651451 -2619566 -2571101 -2542069
42137 -2542069 -2541021 -2547892 -2550946 -2545514 -2517960 -2464411 -2406389 -2366835 -2355205 -2383889 -2454999 -2521205
42125 -2521205 -2520679 -2470493 -2453817 -2484758 -2469811 -2352589 -2209025 -2128426 -2084724 -2017276 -1962679
42114 -1962679 -1989708 -2055862 -2058028 -2003383 -2002951 -2092570 -2176714 -2172314 -2108067 -2047238 -1996096 -1932887
42102 -1932887 -1867714 -1831245 -1837852 -1881176 -1939083 -1979563 -1990913 -1998042 -2018867 -2029310 -2012842 -2008084
42090 -2008084 -2047039 -2084109 -2064266 -2027230 -2046998 -2090117 -2047929 -1913390 -1813055 -1837969 -1940316
42079 -1940316 -2026366 -2059907 -2043093 -1986870 -1939181 -1959138 -2025736 -2049949 -2003134 -1942910 -1888936
42068 -1888936 -1790064 -1660387 -1616877 -1699445 -1773861 -1720735 -1615856 -1596341 -1638950 -1624768 -1564045
42057 -1564045 -1584575 -1706862 -1790681 -1734874 -1605735 -1527914 -1546231 -1630462 -1729149 -1782969 -1761603
42046 -1761603 -1719267 -1743206 -1824513 -1861425 -1819788 -1795830 -1862300 -1937457 -1893406 -1744688 -1639084
42035 -1639084 -1674603 -1794703 -1867296 -1821663 -1703714 -1624095 -1649660 -1732780 -1765806 -1714629 -1657970
42024 -1657970 -1668674 -1707372 -1688375 -1613024 -1564921 -1586201 -1631611 -1650725 -1648565 -1645761 -1636567 -1613829
42012 -1613829 -1589547 -1566006 -1531715 -1508388 -1545107 -1629113 -1665306 -1605675 -1543344 -1591481 -1704671
42001 -1704671 -1726687 -1610563 -1479679 -1445894 -1477121 -1500012 -1532551 -1625296 -1741066 -1794702 -1773460
41990 -1773460 -1725298 -1661239 -1570178 -1507646 -1553094 -1671991 -1731393 -1678466 -1600576 -1572786 -1553496
41979 -1553496 -1491566 -1435356 -1445992 -1479482 -1459102 -1413215 -1429729 -1499456 -1519003 -1454074 -1395038
41968 -1395038 -1417671 -1472661 -1465963 -1396058 -1355051 -1413795 -1546208 -1663283 -1700561 -1672182 -1646800
41957 -1646800 -1671922 -1728810 -1765909 -1758632 -1719518 -1668817 -1622504 -1596535 -1593700 -1594450 -1585158 -1579911
41945 -1579911 -1583741 -1554756 -1450675 -1306972 -1218207 -1232651 -1305797 -1368299 -1401302 -1429799 -1475859
41934 -1475859 -1538474 -1596070 -1614154 -1571528 -1490915 -1424681 -1401433 -1405066 -1411734 -1424933 -1463621 -1531473
41922 -1531473 -1604763 -1640140 -1599898 -1491243 -1380254 -1345847 -1414837 -1547703 -1672306 -1719614
41912 -1719614 -1661722 -1554375 -1513024 -1591502 -1701880 -1715107 -1626578 -1548865 -1547755 -1577768 -1595612
41901 -1595612 -1633647 -1708103 -1745640 -1683439 -1581195 -1543606 -1568071 -1560132 -1485507 -1419091 -1432665
41890 -1432665 -1503195 -1555107 -1545933 -1489580 -1429323 -1404919 -1423089 -1451199 -1457137 -1452863 -1475536 -1528026
41878 -1528026 -1563129 -1531405 -1434110 -1335314 -1324177 -1433217 -1572611 -1586302 -1420832 -1212233
41868 -1212233 -1149651 -1266432 -1421580 -1475589 -1417197 -1315554 -1226753 -1182794 -1213037 -1320901
41858 -1320901 -1457131 -1547455 -1540385 -1429306 -1262119 -1134591 -1124681 -1206007 -1263487 -1222361 -1127414
41847 -1127414 -1068236 -1067469 -1082439 -1080853 -1064781 -1044434 -1040028 -1090807 -1204753 -1307952 -1305417 -1199491
41835 -1199491 -1093929 -1069486 -1110050 -1167424 -1232543 -1301230 -1330846 -1300658 -1278435 -1344145 -1457713
41824 -1457713 -1490465 -1405198 -1318677 -1338529 -1413862 -1424871 -1368803 -1355240 -1428779 -1501884 -1492340
41813 -1492340 -1438611 -1422898 -1443586 -1433986 -1370664 -1292551 -1229845 -1182275 -1167072 -1221953 -1336810
41802 -1336810 -1429627 -1427126 -1350767 -1293742 -1314499 -1371414 -1374350 -1297933 -1221579 -1233409 -1311224 -1348529
41790 -1348529 -1302962 -1253665 -1275656 -1320273 -1286894 -1172417 -1070140 -1037611 -1043549 -1044008 -1037976 -1037358
41778 -1037358 -1043856 -1065549 -1100036 -1098772 -1013470 -884703 -814313 -837928 -897931 -953840 -1027550
41767 -1027550 -1108059 -1113854 -1017775 -927329 -954665 -1060397 -1110807 -1053459 -956529 -899051 -898193 -934069
41755 -934069 -980697 -1011002 -1013594 -999595 -971722 -919690 -872321 -897246 -997771 -1068921 -1028696
41744 -1028696 -943174 -934662 -1003820 -1040476 -988764 -899860 -827072 -770229 -735229 -755123 -826778
41733 -826778 -901190 -956229 -1009403 -1045659 -1011763 -908286 -814930 -791942 -815654 -837353 -847148
41722 -847148 -854662 -862890 -883186 -922023 -940993 -895871 -827753 -834718 -926854 -995376 -967915 -909643
41710 -909643 -909939 -943691 -922416 -831973 -742936 -715430 -757840 -853614 -967788 -1041336 -1030291 -949672
41698 -949672 -856792 -806539 -830454 -918972 -1006418 -1020611 -970699 -936461 -949347 -947601 -883436 -807133
41686 -807133 -794563 -847160 -911965 -946472 -920148 -816905 -688210 -634618 -675300 -711049 -686089
41675 -686089 -697859 -842176 -1023963 -1054734 -902660 -719148 -632894 -636478 -671318 -704060 -701946
41664 -701946 -640617 -570129 -588052 -710372 -832616 -848593 -760428 -656057 -619703 -669461 -748448
41653 -748448 -786443 -794445 -854396 -974570 -1029640 -928358 -768743 -708808 -741518 -740954 -687459
41642 -687459 -672438 -691006 -624794 -466635 -372471 -415627 -463828 -405122 -340998 -419529 -595793
41631 -595793 -706122 -698054 -643540 -584641 -511393 -461137 -500718 -607504 -678374 -671345 -652701
41620 -652701 -685741 -738981 -727533 -609428 -433357 -307946 -306347 -384379 -426071 -386660 -337869
41609 -337869 -345867 -376447 -373954 -364076 -401968 -469196 -502933 -492250 -470576 -443312 -396554 -353761
41597 -353761 -355461 -400528 -459749 -516069 -543039 -498106 -406893 -393712 -531795 -709583 -757645
41586 -757645 -679484 -634600 -700544 -780525 -770979 -703228 -665610 -671720 -669483 -630088 -575670 -543143
41574 -543143 -546983 -561415 -539386 -473507 -421349 -432164 -473680 -484431 -470320 -479240 -502533 -485033
41562 -485033 -422775 -364465 -320639 -263871 -220447 -256728 -353250 -397549 -342269 -273642 -270402 -284561
41550 -284561 -231433 -126232 -54159 -53969 -101382 -169290 -236431 -262859 -222279 -151865 -123917 -168923
41538 -168923 -250538 -305309 -290243 -209445 -110005 -39412 -10083 -27689 -127882 -323017 -525771
41527 -525771 -613812 -586728 -569647 -629254 -682275 -642556 -562257 -536338 -540634 -478621 -352238
41516 -352238 -270646 -290087 -342997 -345644 -298562 -249967 -218836 -194255 -178268 -192874 -251334 -337753
41504 -337753 -412624 -434588 -378270 -235580 -20222 206774 339033 305664 150833 -21342
41494 -21342 -181304 -378479 -598037 -717211 -668290 -557836 -531832 -584228 -599785 -538974 -466952
41483 -466952 -426792 -404404 -412359 -483761 -565253 -538801 -395297 -280008 -302859 -392099 -408640
41472 -408640 -331802 -248919 -215946 -217789 -234631 -260907 -270180 -236392 -189712 -189135 -238386 -285140
41460 -285140 -303035 -314125 -324727 -306918 -268447 -278485 -378530 -508875 -572212 -545149 -481302
41449 -481302 -423145 -363426 -293071 -238220 -229922 -263692 -306588 -330577 -330713 -322902 -328282 -349597
41437 -349597 -365111 -357598 -338308 -320888 -287835 -222179 -164421 -184207 -283556 -378670 -398224 -351317
41425 -351317 -276664 -185969 -99221 -75036 -141621 -240301 -302107 -339373 -390175 -416631 -353354
41414 -353354 -230199 -143545 -116743 -93885 -65326 -80040 -125600 -128808 -104066 -155487 -272988
41403 -272988 -279923 -87455 134575 177476 75427 10066 20135 -5953 -89077 -110708 -21921
41392 -21921 71455 77475 28684 -25221 -100666 -192883 -229118 -188867 -167138 -232430 -310742 -299990
41380 -299990 -222320 -169033 -159913 -154321 -146814 -150056 -125631 -38004 49036 34947 -67609 -140666
41368 -140666 -119680 -60013 -40913 -78853 -138893 -162848 -94650 43114 110958 -8987 -234330
41357 -234330 -353085 -291665 -194097 -197252 -258447 -280966 -284354 -329049 -359843 -267706 -72143
41346 -72143 83949 113979 65044 25320 40820 111626 189661 200535 147495 151771 283771
41335 283771 405902 337592 150926 107591 274220 409542 324225 157113 144777 271848
41325 271848 337531 268856 171871 125295 109901 119196 164039 170774 45687 -141064 -198241
41314 -198241 -77399 56391 67503 17941 22931 75060 109391 134145 184878 224612 197435
41303 197435 129989 84290 51761 -13287 -86023 -91311 -22932 38883 36423 -3209 -31320 -54423
41291 -54423 -117786 -230772 -337432 -377008 -367125 -392416 -490870 -594424 -628234 -622117 -646852
41280 -646852 -681135 -652923 -593250 -608252 -680221 -651960 -475705 -331346 -384709 -541539 -581150
41269 -581150 -464636 -365343 -419141 -572891 -685803 -680995 -576551 -437564 -326052 -268369
41259 -268369 -260656 -300788 -378685 -435694 -404357 -312020 -266645 -307639 -362450 -391668 -458328 -577075
41247 -577075 -620123 -493992 -311103 -249493 -318505 -400705 -452778 -509878 -547917 -510882 -444985
41236 -444985 -442000 -467641 -410246 -291578 -257403 -343518 -417070 -385574 -313407 -285865 -294291 -305633
41224 -305633 -322944 -328579 -279346 -199891 -175151 -219200 -259649 -270827 -297577 -327622 -285514 -190157
41212 -190157 -166338 -245790 -308941 -290732 -288644 -380747 -488333 -522796 -526360 -551871 -541733 -459750
41200 -459750 -412983 -485248 -557037 -463943 -256795 -129041 -137102 -166850 -151735 -153087 -214486
41189 -214486 -280592 -289183 -238358 -147214 -41565 18527 -10330 -74172 -80523 -34682 -21826 -53719
41177 -53719 -43661 39204 95421 33077 -91063 -135365 -44909 94203 162018 128418 61293
41166 61293 30919 35000 35007 37553 84512 163625 196011 139564 49922 7873 36344 114960 215122
41153 215122 285277 267467 177399 112042 132336 193803 230924 240151 235116 200077 144701 123190
41141 123190 136781 106534 13453 -36892 18651 76954 31436 -41391 -5202 106282 147245
41130 147245 92607 42625 31312 8884 2305 108182 302155 421764 381828 265693 165415
41119 165415 75322 -5682 -9516 84396 177819 175293 90453 -25609 -167045 -318524 -407074
41108 -407074 -388183 -318191 -274561 -256177 -216986 -147196 -70019 -2414 38657 32665 -8272 -38882
41096 -38882 -36070 -11250 34416 99728 124858 35317 -127665 -215661 -162108 -79459 -106493 -230318
41084 -230318 -328864 -332998 -275097 -217709 -200981 -233834 -280168 -271226 -176106 -48259 26145 11666
41072 11666 -57962 -118220 -117997 -55196 18386 47862 25016 -35673 -134921 -246406 -279725 -182902
41060 -182902 -61225 -75370 -215882 -306392 -258363 -185878 -208956 -278581 -292879 -273947 -307271
41049 -307271 -381376 -412418 -383804 -348447 -319514 -261695 -178049 -116373 -94956 -97176 -130304 -211641
41037 -211641 -295094 -289122 -173672 -47743 -26882 -114222 -199296 -188772 -124357 -136509 -261358
41026 -261358 -355136 -262586 -37890 109683 90555 29802 52745 109922 96118 27252 -12554
41015 -12554 -13906 -12747 14452 98530 168137 126101 13019 -33259 23317 78887 57758 2175
41003 2175 -29109 -43987 -59084 -50989 -15771 -4239 -44185 -82888 -59526 5517 42833 29422
40991 29422 8059 20749 53986 54798 -7012 -96812 -146699 -133189 -96696 -67097 -13335 86457
40979 86457 164973 134917 28056 -21943 45465 142454 175350 185319 267437 394765 428274
40968 428274 313665 176440 166180 266729 340307 331514 327176 395271 465864 444042 373240
40957 373240 386347 517289 654598 683789 597590 462117 354050 340322 434155 546655
40947 546655 558102 458925 341658 240522 88401 -125942 -278882 -273105 -180455 -125803 -109049
40936 -109049 -54730 22966 30680 -56952 -174760 -279666 -382012 -467254 -488534 -456596 -454298
40925 -454298 -529062 -623241 -636207 -526353 -347873 -209757 -184345 -232516 -248606 -205432 -201948
40914 -201948 -316052 -466311 -497913 -370466 -181855 -34744 38228 40064 -7640 -50100 -46883
40903 -46883 -36351 -85974 -183502 -247235 -243013 -223100 -245053 -309487 -376854 -394662 -322271 -187071
40891 -187071 -97342 -131364 -227704 -254588 -174621 -69910 -19661 -32009 -87784 -169135 -243476
40880 -243476 -291844 -349362 -446730 -526806 -506679 -415282 -374302 -438088 -547088 -650140 -771666
40869 -771666 -927727 -1066239 -1135283 -1146224 -1136883 -1130170 -1151712 -1225615 -1320120 -1338447 -1182377
40858 -1182377 -806488 -244747 356939 779774 910552 875058 896223 1025357 1119230 1077256
40848 1077256 969199 900929 882873 886006 918544 979764 1021278 1013777 984561 950122 889061
40837 889061 817023 798158 834479 832222 736137 618967 577533 607673 637927 626859 580100
40826 580100 529126 528904 612258 717576 734627 647715 551294 502659 460336 397933 361908 368326
40814 368326 362094 337981 375885 480843 520401 422424 311773 328552 418691 440949 389636
40803 389636 361749 372173 356542 316183 314278 350721 372582 395495 492106 659550 799619
40792 799619 832836 757988 620038 493315 459332 517725 559912 514234 459330 492776 556569
40781 556569 530110 445969 451310 568296 653160 612094 516957 472227 485876 510450 514483 483315
40769 483315 432665 431920 525837 636307 646029 575431 554693 616232 654690 617682 586732 614911
40757 614911 629638 579964 551572 628309 739684 763120 707112 676919 703848 719493 680799
40746 680799 626023 603637 611668 614191 578297 499247 416208 388019 432470 512742 597089 691919
40734 691919 796245 873200 898400 889470 854208 762626 615420 488457 449814 470200 475991
40723 475991 460316 475163 530255 567637 541053 469090 398568 352465 326620 312157 305814 305035
40711 305035 300041 281479 270316 323846 468649 626422 664323 547159 391208 330929 378148
40700 378148 456583 524308 591289 646977 656714 633263 639205 699186 767413 804863 834913 888672
40688 888672 939507 937215 882846 828080 813525 841896 898270 956159 968942 902093 787999
40677 787999 713541 732314 811838 881136 901935 875257 815031 752475 738251 790360 852315
40666 852315 852660 800331 768026 780615 782947 738284 697574 729168 821504 902251 929005 917836
40654 917836 896070 866140 816036 742091 659855 601034 595291 653563 771102 922713 1032483
40643 1032483 993974 794330 597774 605881 817819 1023616 1063916 992191 930310 882343 791303
40632 791303 689939 666379 721181 772384 783358 790973 821574 860881 892342 897764 850128 772983
40620 772983 758504 844597 933082 933786 925101 1032233 1194872 1228780 1110750 1023188 1084419
40609 1084419 1203610 1262453 1284288 1334057 1378426 1351113 1270729 1203549 1175112 1183177 1223882
40598 1223882 1246554 1168586 1004068 893020 926185 1020893 1052059 1025648 1026218 1062929 1077872
40587 1077872 1061049 1050137 1043907 1011224 966368 949822 951090 930573 903531 923980 992457 1052563
40575 1052563 1079686 1111118 1182521 1278876 1347343 1330813 1213388 1066103 1006356 1061316 1115825
40564 1115825 1061705 954163 930509 1002146 1038236 966392 884076 921101 1064576 1187222 1214330
40553 1214330 1194425 1199248 1207593 1137720 990436 896985 968117 1128276 1189599 1098933 1011166
40542 1011166 1068728 1203491 1246537 1166986 1089362 1102469 1163728 1198309 1196297 1183851 1169759
40531 1169759 1155527 1153963 1173943 1216331 1289088 1392238 1492406 1553859 1587719 1621048 1624977
40520 1624977 1538864 1375701 1237261 1196052 1216895 1231226 1238303 1277853 1333611 1336256 1274185
40509 1274185 1243135 1336718 1506519 1589593 1495003 1316106 1215770 1238902 1303617 1350338 1402700
40498 1402700 1471604 1505328 1485968 1487866 1570690 1682835 1741820 1746186 1734382 1707331 1687277
40487 1687277 1777042 2028154 2297830 2384101 2284270 2175882 2155558 2160840 2157237 2212457 2329402
40476 2329402 2390870 2365700 2400696 2584996 2781062 2842937 2858363 2986605 3179665 3291224
40466 3291224 3372350 3594678 3918260 4121280 4177830 4318016 4654852 5050335 5433779 5873881
40456 5873881 6122783 5503765 3707419 1483096 37578 -198394 229034 731289 1196202
40447 1196202 1460569 967645 -537726 -2359835 -3458967 -3558874 -3206312 -2874886 -2527946
40438 -2527946 -2059066 -1632151 -1399605 -1258511 -1094196 -983319 -964847 -864851 -562420 -225407
40428 -225407 -68994 -47036 11973 113378 157110 167691 239118 329778 321928 234487 190075
40417 190075 212300 228078 229809 262693 285222 218430 114313 99864 157969 139241 9489
40406 9489 -82968 -31604 80618 118068 66094 8795 14145 86113 173084 206275 181988 190665
40394 190665 290792 382134 309086 78764 -138152 -228706 -245167 -274123 -313440 -322282 -304504
40383 -304504 -295993 -324747 -399402 -483559 -493932 -398018 -290757 -277365 -304145 -230258 -57474
40372 -57474 61948 68417 85646 204525 324885 318590 241779 259855 417126 590103 649799
40361 649799 592474 515461 514475 606808 736333 854536 978205 1138133 1306876 1438528 1536836
40350 1536836 1582463 1425808 905338 107443 -624161 -1004858 -1044812 -931993 -800254 -683497
40340 -683497 -586844 -495508 -371338 -219361 -108323 -72568 -61412 -37609 -40065 -80226 -68566
40329 -68566 60259 223476 295432 278389 263693 275001 267531 250837 287945 373613 423246
40318 423246 401151 371032 394029 449174 484616 492000 499896 531433 590489 661507 708656 698456
40306 698456 634010 552663 490235 461168 463885 483101 491906 473794 443807 435030 465764 527021
40294 527021 594231 640507 642692 586828 481428 376166 351441 445383 581060 621295 531199
40283 531199 431336 437492 508285 530532 499074 501700 560461 616378 661980 750580 856111 863134
40271 863134 742362 610781 558390 532605 465602 404172 421417 490006 540911 579151 648802
40260 648802 739363 813539 881413 967354 1041982 1056919 1013276 940954 852458 768087 736540
40249 736540 773843 824545 829972 791396 735988 682918 670070 730539 807799 795005 705610 686583
40237 686583 792268 875192 806558 683293 679495 788627 864411 848721 806436 780247 757016
40226 757016 750781 788629 834046 834629 815178 821594 823335 784786 769775 839008 906403 859298
40214 859298 775368 840520 1069336 1282521 1356069 1320041 1217115 1057756 933300 968525
40204 968525 1109491 1152058 1050614 1005158 1144962 1314457 1311397 1181684 1116060 1169021 1246835
40193 1246835 1296874 1348131 1406048 1442564 1461154 1461459 1382537 1199256 1033191 1032028 1156685
40182 1156685 1225748 1173980 1125836 1180252 1260822 1254574 1190279 1173407 1209140 1206017 1136265 1084940
40170 1084940 1120065 1197694 1236262 1224129 1203316 1191628 1179521 1175135 1189832 1195264 1158294 1108626
40158 1108626 1102087 1118949 1078025 965724 872185 875766 968735 1118936 1309050 1474164 1507681
40147 1507681 1402364 1294828 1291142 1336844 1342275 1330905 1349785 1340305 1252716 1203954 1334147
40136 1334147 1551906 1621577 1496645 1370876 1379114 1443257 1464558 1475330 1510806 1501014 1408140
40125 1408140 1335156 1369849 1429535 1393096 1300443 1280888 1342126 1372489 1328043 1286074 1305021
40114 1305021 1337479 1312993 1239831 1195088 1247928 1398935 1566493 1639676 1578180 1456448 1383340
40103 1383340 1388873 1418367 1425365 1429842 1474251 1548060 1583381 1535346 1452628 1434354 1504063 1564534
40091 1564534 1514385 1379268 1277017 1273645 1332647 1394152 1436410 1456196 1456022 1468903 1538683
40080 1538683 1650893 1727753 1716262 1647554 1589701 1569783 1560728 1529057 1483198 1471444 1520244
40069 1520244 1585241 1607573 1615140 1690574 1819119 1872477 1800863 1727378 1756940 1806348 1759348
40058 1759348 1684909 1720574 1812505 1784651 1638928 1563703 1628165 1686749 1639469 1581212 1607939
40047 1607939 1656565 1641569 1598819 1590144 1599334 1618135 1699536 1824286 1852412 1728419 1611661
40036 1611661 1670074 1846767 1964616 1974010 1961592 1985866 2038501 2115462 2203212 2234961 2168147
40025 2168147 2068331 2024125 2023118 2000122 1957912 1945770 1959387 1950484 1903143 1831004 1740633 1656636
40013 1656636 1625024 1631844 1589485 1468939 1363921 1350136 1372928 1362763 1363432 1434098 1514657
40002 1514657 1517880 1482266 1497564 1536301 1498994 1388138 1304135 1291144 1304304 1311428 1324346
39991 1324346 1348032 1382164 1438527 1484853 1437547 1298645 1216487 1296550 1437558 1489697 1487023
39980 1487023 1556099 1667965 1680265 1592031 1552576 1613761 1662596 1624695 1563019 1539358 1533753
39969 1533753 1539216 1589874 1656431 1655059 1599443 1604520 1698908 1776591 1781275 1788832 1842863 1857549
39957 1857549 1772144 1671862 1657586 1708412 1770986 1872985 2029909 2132716 2066071 1887873
39947 1887873 1769230 1786236 1876220 1972500 2070856 2165462 2221786 2234951 2236033 2213086 2097255
39936 2097255 1875286 1665262 1611212 1711217 1814012 1806925 1750317 1774262 1885530 1964598
39926 1964598 1947053 1902845 1898870 1885786 1800540 1703139 1706104 1809108 1907433 1946076 1968118
39915 1968118 2013762 2062234 2085747 2086184 2062610 2005379 1939816 1923395 1977343 2050905 2067354 2000722
39903 2000722 1921362 1958321 2160077 2383807 2411788 2221276 2042034 2074969 2252620 2373980
39893 2373980 2373756 2325634 2267295 2190252 2152866 2225960 2339714 2349397 2255457 2201740 2245697 2291283
39881 2291283 2278993 2283421 2364762 2459366 2488536 2470479 2461025 2470685 2491423 2527084 2558280 2551900
39869 2551900 2531670 2561086 2638140 2690394 2687216 2666430 2639992 2574200 2479212 2415805 2395962
39858 2395962 2378942 2376567 2446766 2566871 2639924 2654264 2706003 2824878 2912905 2909878 2887242
39847 2887242 2908107 2917642 2854826 2765172 2717089 2701500 2698436 2752837 2890685 3029624 3063001
39836 3063001 2987773 2886892 2834272 2864553 2974161 3099096 3149376 3114861 3084511 3122103 3178932
39825 3178932 3165278 3056584 2905373 2800974 2823136 2967127 3114272 3155143 3132509 3165660
39815 3165660 3251136 3270668 3199126 3154009 3207483 3297103 3368770 3460467 3580795 3643516 3599177
39804 3599177 3513626 3452873 3410374 3401075 3485376 3629888 3690475 3620327 3556258 3607043 3696378
39793 3696378 3718185 3706776 3731908 3753954 3718897 3691459 3759423 3888889 3990223 4048240 4088848
39782 4088848 4107816 4128343 4228562 4410593 4542488 4528981 4436869 4362539 4303235 4261781 4329545
39771 4329545 4526074 4694371 4715575 4706246 4833622 5046448 5171705 5185877 5200566 5246925
39761 5246925 5259191 5230250 5225654 5280831 5408990 5643126 5945827 6171285 6259352 6362440
39751 6362440 6619592 6917895 7059767 7042367 6947287 6669336 6036897 5150875 4324322 3693751
39741 3693751 3152023 2670389 2409910 2454907 2678124 2949146 3269143 3625274 3912958 4091636
39731 4091636 4237056 4345919 4255550 3861227 3272690 2656860 2051910 1435680 868153 460614
39721 460614 267558 268815 393013 532161 623565 739604 993226 1340230 1605779 1736627
39711 1736627 1877458 2134834 2413226 2583715 2692944 2880285 3161984 3413770 3530991
39702 3530991 3516936 3433813 3333128 3222777 3056840 2762006 2295124 1671685 949170 210895
39692 210895 -448537 -965696 -1336468 -1582485 -1717112 -1765276 -1761483 -1693212 -1523113 -1316174
39682 -1316174 -1232736 -1298789 -1302496 -1067058 -726434 -545047 -538373 -491763 -322234 -179559 -162181
39671 -162181 -163510 -76935 40620 109891 178027 318029 495280 630700 710829 765459 815103
39660 815103 889034 1011939 1138050 1192674 1209432 1319853 1566764 1831484 1988923 2037034
39650 2037034 2034878 2014490 1998719 2015502 2056050 2097193 2173685 2328498 2493722 2552206 2526447
39639 2526447 2547630 2597345 2453455 1989208 1394135 985037 881081 952521 1015026 991684
39629 991684 935605 955161 1086473 1229302 1266017 1228011 1244978 1339060 1399062 1371213 1333677
39618 1333677 1346123 1365998 1367002 1406582 1508294 1596042 1616345 1622596 1674034 1748792 1815819
39607 1815819 1898580 2010653 2111932 2172545 2203020 2202646 2169133 2161993 2242838 2353935 2388061
39596 2388061 2373090 2427094 2529677 2532487 2428915 2404279 2547850 2713904 2759295 2730464 2711332
39585 2711332 2669020 2572638 2499971 2498816 2490795 2431597 2416205 2502046 2576861 2533193 2435628 2388767
39573 2388767 2377655 2361937 2381783 2442031 2443782 2367424 2363723 2513185 2661450 2664847 2630139
39562 2630139 2707811 2805766 2748278 2597755 2560795 2649390 2685374 2602571 2515380 2505631 2548573
39551 2548573 2640144 2803668 2970321 3030279 3007849 3028252 3115485 3180828 3207485 3283150 3434966
39540 3434966 3582839 3682506 3781007 3896482 3956666 3897225 3742153 3565231 3431959 3374837
39530 3374837 3362322 3301915 3128470 2873214 2614521 2411624 2317601 2368075 2497367 2563593
39520 2563593 2532577 2533957 2652289 2785866 2824542 2840049 2953816 3124408 3226641 3249865
39510 3249865 3251910 3200237 3038400 2847118 2760732 2770998 2781401 2803861 2921787 3097064 3199014
39499 3199014 3206942 3210527 3222227 3160332 3016861 2880861 2789775 2707361 2652896 2704134 2856487
39488 2856487 3007816 3093272 3124527 3109739 3057379 3040642 3125331 3248110 3299908 3312517 3414794
39477 3414794 3607798 3738140 3718117 3638169 3628133 3718181 3865527 4021619 4145341 4224822
39467 4224822 4301558 4420566 4570785 4720854 4866473 4984799 5011780 4937233 4835775 4717565
39457 4717565 4460776 4014359 3549339 3246041 3033478 2728983 2351248 2075405 1924648
39448 1924648 1739405 1459075 1226297 1172457 1265095 1408001 1558607 1716867 1907757 2183434
39438 2183434 2545057 2879111 3072444 3157943 3238814 3310212 3266421 3036313 2610534 2015126
39428 2015126 1379426 931236 772545 749134 691160 666095 813685 1062434 1242383 1373206
39418 1373206 1584218 1830817 1960992 2002396 2104653 2242208 2264070 2208904 2265804 2425828
39408 2425828 2485285 2420602 2446087 2641447 2824258 2875851 2908996 3011644 3094205 3109930 3178766
39397 3178766 3359417 3514970 3536087 3511540 3566367 3704679 3900496 4161133 4416540 4533071
39387 4533071 4522264 4550930 4662318 4675762 4450836 4073159 3702028 3416640 3281950 3364084
39377 3364084 3585277 3741394 3744222 3678286 3577706 3369944 3108161 3011414 3157522 3360329
39367 3360329 3479843 3634001 3944503 4264226 4339689 4120239 3768652 3473455 3345021 3370198
39357 3370198 3382211 3198071 2846422 2523704 2295302 2028642 1676086 1412695 1395622 1565396
39347 1565396 1772876 1932358 1982243 1888606 1768638 1817554 2029069 2175950 2138844 2051018
39337 2051018 2045166 2079858 2109533 2203312 2383566 2548252 2653674 2778677 2930468 3005006
39327 3005006 3014203 3108719 3288606 3353880 3250049 3190784 3305198 3433747 3427916 3390243 3446041
39316 3446041 3525508 3554296 3628674 3815215 3986193 4028629 4021319 4054626 4078523 4065054 4104863
39305 4104863 4216519 4289849 4326356 4469803 4690937 4756222 4646934 4661098 4917356 5123859
39295 5123859 5074186 5004497 5163821 5372557 5352763 5205691 5198462 5318601 5395595 5448823 5562181
39284 5562181 5605824 5434165 5199836 5140786 5203551 5188497 5116427 5134972 5196012 5137308 4980012
39273 4980012 4874040 4855268 4889052 5011792 5199272 5262013 5112727 4964287 5021611 5164884
39263 5164884 5185025 5130091 5152609 5214619 5218460 5235245 5335271 5392884 5321084 5279641 5386006
39252 5386006 5462536 5347691 5193651 5160379 5105776 4911028 4806466 4991830 5226243 5210237
39242 5210237 5095975 5179314 5359798 5384689 5376859 5605507 5942657 6071308 6052944 6161057
39232 6161057 6317095 6241841 6037000 6055768 6279936 6371621 6287622 6310830 6503893 6643490
39222 6643490 6680274 6775056 6893358 6841405 6695160 6730435 6933925 7028197 6964673 6954721 7039255
39211 7039255 7063126 7042461 7127491 7250241 7238869 7206816 7376616 7604549 7562872 7315435
39201 7315435 7213849 7297082 7310701 7251805 7352523 7569839 7640565 7610737 7761531 8040489
39191 8040489 8128218 8045098 8112091 8319952 8336139 8155999 8145497 8391021 8592228 8652725
39181 8652725 8796720 9040191 9120360 9015517 8980874 9028039 8930961 8765189 8847203 9121414
39171 9121414 9224024 9169170 9321853 9669829 9812569 9720278 9788542 10066329 10169686 10068442
39161 10068442 10198422 10639326 10936134 10920399 10963229 11214867 11345943 11269920 11372582 11767818
39151 11767818 12051599 12052658 12111579 12370237 12519540 12502741 12710267 13202905 13508111 13475373
39141 13475373 13556657 13940267 14206947 14161101 14166977 14300387 14032285 13195785 12438040 12235073
39131 12235073 12248459 12131320 12165802 12577790 12990521 13106632 13221862 13557855 13802840 13798401
39121 13798401 13940688 14413668 14781252 14824330 14995003 15541951 16001448 16080606 16210448 16674382
39111 16674382 17044595 17063852 17215289 17800110 18322080 18427960 18580784 19137762 19647542
39102 19647542 19750462 19888415 20421354 20933522 21115982 21416707 22111361 22691173 22887766
39093 22887766 23284756 24165299 24837042 24905335 25083897 25877020 26635931 26853947 27168990
39084 27168990 28062514 28826449 28935104 29168632 30180755 31233866 31617019 32011642 33109132
39075 33109132 34204587 34590514 35002861 36185003 37388782 37872226 38464409 39983511 41579092
39066 41579092 42405671 43389726 45442644 47545886 48662154 49859817 52324076 55019556
39058 55019556 56729117 58570676 61874924 65495198 68076490 70955001 75680341 80845686
39050 80845686 84838173 89354861 96280429 103683064 109423687 115918644 126064086 137539185
39042 137539185 147445335 159155799 176724314 196170573 212171699 228489539 245374763
39035 245374763 237198013 165488011 27459741 -123297038 -221560916 -249312024 -237623828
39028 -237623828 -220037895 -203917785 -184804032 -165674062 -152181602 -142242860 -131125970
39021 -131125970 -120160143 -112842936 -107604851 -100951015 -93726150 -88650615 -84917204 -80179614
39013 -80179614 -75177289 -71938022 -69658810 -66362476 -62687022 -60404625 -58907204 -56510701
39005 -56510701 -53717668 -52063845 -51076455 -49296556 -47127922 -45933118 -45351052 -44071753
38997 -44071753 -42338629 -41290951 -40681474 -39499793 -38064006 -37352671 -36998263 -35982570
38989 -35982570 -34634012 -33982429 -33781058 -33052547 -31987629 -31469029 -31271539 -30522075 -29450538
38980 -29450538 -28959517 -28897445 -28412135 -27605813 -27235374 -27151639 -26602677 -25748664 -25358743 -25309889
38970 -25309889 -24858518 -24118189 -23821178 -23858090 -23468762 -22683753 -22212170 -22072604 -21659272
38961 -21659272 -21014405 -20742231 -20782904 -20521848 -20006128 -19832096 -19925263 -19639746 -19000977 -18667805
38951 -18667805 -18699739 -18511694 -18035123 -17799871 -17851416 -17672463 -17210190 -16939213 -16877095 -16558137
38941 -16558137 -16013548 -15765926 -15807683 -15586140 -15063670 -14798649 -14885449 -14802064 -14450727 -14397083
38931 -14397083 -14879404 -15444990 -15757141 -15959311 -16087123 -15909758 -15510468 -15282481 -15227806
38922 -15227806 -14972657 -14534553 -14323723 -14344250 -14186094 -13862093 -13825882 -14071166 -14058145 -13671428
38912 -13671428 -13416032 -13490323 -13490187 -13242897 -13122021 -13277047 -13323888 -13088094 -12928987 -13028294
38902 -13028294 -13045812 -12785153 -12549000 -12531102 -12476233 -12238313 -12078501 -12121231 -12091269 -11867745
38892 -11867745 -11733502 -11805992 -11785499 -11543169 -11401383 -11541877 -11670775 -11561116 -11413159 -11392356
38882 -11392356 -11314780 -11078651 -10920888 -10958991 -10942891 -10731690 -10559822 -10575088 -10573515 -10441213
38872 -10441213 -10387531 -10482536 -10440440 -10139795 -9894536 -9919915 -9975890 -9829951 -9637377 -9569427
38862 -9569427 -9490563 -9303241 -9203295 -9297097 -9360708 -9263165 -9229807 -9398689 -9517625 -9385616
38852 -9385616 -9210584 -9221371 -9291690 -9250424 -9205317 -9259386 -9258751 -9118404 -9051056 -9180694 -9276329
38841 -9276329 -9158587 -9015229 -9015931 -8979238 -8744908 -8518176 -8492494 -8464410 -8195351 -7861036
38831 -7861036 -7770082 -7894490 -8029762 -8173500 -8398313 -8575358 -8561144 -8462163 -8419185 -8340495
38821 -8340495 -8130848 -7953975 -7969918 -8031897 -7941834 -7795418 -7778254 -7825575 -7783518 -7716871 -7758341
38810 -7758341 -7821220 -7745803 -7583111 -7481641 -7441927 -7407044 -7429113 -7529830 -7570550 -7467111
38800 -7467111 -7354251 -7351699 -7370018 -7323284 -7297520 -7323613 -7248352 -7038867 -6933944 -7056891 -7163599
38789 -7163599 -7038552 -6858888 -6873615 -6988567 -6983594 -6900379 -6894769 -6922813 -6887724 -6891214 -7029041
38778 -7029041 -7137542 -7049899 -6907943 -6916065 -6982680 -6913530 -6767395 -6708412 -6690078 -6592190 -6487633
38767 -6487633 -6474478 -6438909 -6287458 -6203783 -6353723 -6550365 -6550616 -6463958 -6502093 -6546763 -6377863
38756 -6377863 -6136749 -6119571 -6257665 -6250408 -6100623 -6068402 -6172696 -6186452 -6084949 -6066107
38746 -6066107 -6135773 -6083607 -5886452 -5757603 -5770903 -5782795 -5744747 -5762160 -5832592 -5844525 -5834084
38735 -5834084 -5924038 -6023372 -5927020 -5708657 -5658767 -5812210 -5894311 -5782827 -5672803 -5706693
38725 -5706693 -5771578 -5762225 -5743275 -5741327 -5652406 -5473856 -5383397 -5468388 -5583103 -5576590 -5481961
38714 -5481961 -5401712 -5371076 -5392286 -5452851 -5479228 -5412921 -5323752 -5300454 -5282096 -5181833 -5100629
38703 -5100629 -5181387 -5317865 -5284940 -5117097 -5057156 -5140844 -5150769 -5011193 -4908926 -4952737 -5014785
38692 -5014785 -5009329 -5049099 -5198520 -5314967 -5274043 -5155176 -5081129 -5045985 -5007344 -4989779 -5001661
38681 -5001661 -4988148 -4938977 -4914534 -4920476 -4889811 -4815413 -4760833 -4730857 -4681982 -4655457 -4730937
38670 -4730937 -4858019 -4916386 -4927669 -5005516 -5110647 -5083442 -4923668 -4800534 -4765507 -4698962
38660 -4698962 -4577162 -4540028 -4627379 -4682033 -4596225 -4448526 -4330586 -4243063 -4219835 -4336025
38650 -4336025 -4522070 -4584303 -4486142 -4402038 -4425939 -4449657 -4408315 -4407202 -4492457 -4522954 -4409312
38639 -4409312 -4281411 -4271414 -4306158 -4266050 -4196666 -4206249 -4271792 -4290127 -4234312 -4146635 -4052607
38628 -4052607 -3970655 -3941340 -3984769 -4081074 -4203881 -4301190 -4275180 -4101092 -3927024 -3900345 -3935467
38617 -3935467 -3843578 -3655217 -3579775 -3653246 -3689556 -3613679 -3569010 -3619503 -3614348 -3465759 -3321078
38606 -3321078 -3319703 -3385083 -3400083 -3408489 -3500640 -3647430 -3768545 -3837491 -3837707 -3757280 -3687761 -3761155
38594 -3761155 -3930708 -3999995 -3928259 -3896972 -4000238 -4099174 -4085240 -4052892 -4076745 -4042020 -3862629
38583 -3862629 -3678469 -3663274 -3785238 -3903060 -3958815 -3955005 -3891268 -3835911 -3902197 -4050826 -4088002
38572 -4088002 -3957720 -3842581 -3869032 -3928399 -3918309 -3932092 -4045019 -4130828 -4077498 -3989254 -3987083
38561 -3987083 -4001065 -3955140 -3963117 -4123169 -4295797 -4316808 -4271421 -4320849 -4404578 -4365205 -4246314
38550 -4246314 -4210609 -4252750 -4236718 -4150231 -4097860 -4097435 -4086630 -4076688 -4111044 -4130327 -4060096 -3972620
38538 -3972620 -3986537 -4067712 -4098172 -4074265 -4066432 -4054008 -3977941 -3895103 -3902063 -3954517 -3928466 -3818061
38526 -3818061 -3723888 -3691624 -3696130 -3726097 -3757603 -3717812 -3601884 -3539943 -3618722 -3733551 -3749649
38515 -3749649 -3699178 -3675698 -3657329 -3597624 -3567844 -3629841 -3685160 -3636050 -3577762 -3632743 -3710507
38504 -3710507 -3647332 -3481881 -3373731 -3344335 -3319363 -3328569 -3425770 -3499844 -3417012 -3279543 -3289170
38493 -3289170 -3414457 -3453195 -3375868 -3340354 -3396701 -3444836 -3470630 -3555974 -3648548 -3583614 -3365437
38482 -3365437 -3191850 -3167390 -3208128 -3249024 -3322314 -3403731 -3400854 -3331390 -3312109 -3345531 -3318741
38471 -3318741 -3231574 -3213857 -3290648 -3343552 -3335338 -3356621 -3411562 -3378182 -3237533 -3131331 -3126184
38460 -3126184 -3120589 -3057579 -3037977 -3137697 -3277545 -3351980 -3344964 -3265924 -3115096 -2954176 -2870895
38449 -2870895 -2848239 -2807098 -2770620 -2818311 -2897409 -2885576 -2831159 -2897976 -3063997 -3130903 -3063431
38438 -3063431 -3042896 -3121111 -3114457 -2955045 -2861391 -2993654 -3184454 -3202440 -3079790 -2984517 -2942665
38427 -2942665 -2886325 -2837338 -2850782 -2879692 -2857609 -2821202 -2816380 -2789984 -2708136 -2670948 -2767111
38416 -2767111 -2911653 -2967081 -2940683 -2932091 -2963894 -2987537 -2988466 -2975490 -2928725 -2849001 -2791544 -2777640
38404 -2777640 -2756089 -2717542 -2741414 -2851410 -2935117 -2895352 -2776601 -2657891 -2533436 -2388763
38394 -2388763 -2277635 -2224512 -2163317 -2070946 -2044129 -2139052 -2253348 -2281977 -2279136 -2350842 -2496624
38383 -2496624 -2671235 -2886516 -3128763 -3292967 -3334154 -3371612 -3502620 -3626853 -3610165 -3512134
38373 -3512134 -3477065 -3494481 -3455770 -3373156 -3344276 -3349166 -3283070 -3168875 -3142022 -3218448 -3257193
38362 -3257193 -3182579 -3086353 -3065623 -3093978 -3108662 -3116816 -3151158 -3194143 -3204103 -3175069 -3131937 -3087979
38350 -3087979 -3028649 -2936579 -2836545 -2799830 -2861204 -2942631 -2932933 -2844871 -2795934 -2817740 -2809867
38339 -2809867 -2729224 -2683837 -2749992 -2829429 -2810927 -2762699 -2818911 -2952672 -3008608 -2914246 -2734456
38328 -2734456 -2561241 -2463973 -2496167 -2628363 -2717179 -2660611 -2545371 -2526885 -2609831 -2671416 -2659308
38317 -2659308 -2631037 -2624598 -2626465 -2655498 -2746786 -2850262 -2864502 -2780588 -2690855 -2653911 -2650820 -2672741
38305 -2672741 -2744321 -2845811 -2906483 -2897370 -2858414 -2824191 -2789371 -2750434 -2719370 -2698775 -2697814 -2754107
38293 -2754107 -2876140 -2985578 -2989438 -2898792 -2812345 -2794296 -2824431 -2850991 -2838326 -2779443 -2704130
38282 -2704130 -2650450 -2603712 -2516308 -2411522 -2379962 -2426550 -2430092 -2334226 -2263855 -2336631 -2462066
38271 -2462066 -2472798 -2378208 -2329285 -2380298 -2442433 -2448208 -2415304 -2358252 -2268434 -2178984 -2141912
38260 -2141912 -2154888 -2199097 -2298922 -2439855 -2505172 -2438716 -2393326 -2533053 -2744849 -2765034 -2572565
38249 -2572565 -2417535 -2429522 -2441643 -2295260 -2103267 -2064949 -2173074 -2266036 -2279295 -2294743
38239 -2294743 -2377345 -2478596 -2504723 -2423835 -2306289 -2271817 -2367645 -2496100 -2507353 -2364513
38229 -2364513 -2168932 -2032047 -1982082 -1985782 -1993265 -1965701 -1917366 -1913019 -1967877 -1993121 -1917312
38218 -1917312 -1809303 -1779571 -1807154 -1780112 -1667914 -1534033 -1418967 -1334053 -1315366 -1342925
38208 -1342925 -1283493 -1103784 -1069748 -1479813 -2208599 -2780178 -2932439 -2849986 -2780193 -2712347
38198 -2712347 -2575711 -2481019 -2540789 -2631048 -2559044 -2355437 -2205477 -2178512 -2203079 -2239243 -2305471
38187 -2305471 -2375613 -2393217 -2367665 -2355055 -2372816 -2401359 -2415638 -2364887 -2212307 -2049057 -2042996
38176 -2042996 -2195679 -2295490 -2219080 -2118707 -2160361 -2236508 -2146055 -1937774 -1832228 -1866520
38166 -1866520 -1862118 -1733100 -1598310 -1561752 -1581592 -1605467 -1663411 -1762186 -1827940 -1822711 -1809536
38155 -1809536 -1842686 -1880789 -1857350 -1768125 -1656517 -1569333 -1536948 -1541722 -1516764 -1437144 -1380484
38144 -1380484 -1417831 -1488236 -1485333 -1423978 -1392434 -1374908 -1275444 -1108083 -1002565 -1007825 -1042745
38133 -1042745 -1057576 -1081485 -1084245 -968594 -750576 -571461 -470297 -332545 -135720 -21080
38123 -21080 -2789 130905 398825 342972 -482891 -1826456 -2889441 -3187111 -2960841 -2695587
38113 -2695587 -2553923 -2435687 -2308883 -2215893 -2095679 -1853248 -1556993 -1373220 -1330886 -1313718
38103 -1313718 -1261297 -1215676 -1177975 -1087238 -964441 -920039 -970983 -991338 -907036 -809058 -796488
38092 -796488 -832290 -852581 -898812 -1006699 -1056455 -901433 -607787 -400357 -365175 -356631 -235360
38081 -235360 -58932 39793 62365 133942 328032 582593 780875 870938 911076 1015726
38071 1015726 1239574 1509038 1701123 1795982 1903312 2117376 2395323 2614015 2706725 2697799
38061 2697799 2623090 2457139 2112845 1487230 516385 -782782 -2303883 -3873327 -5286632
38052 -5286632 -6365010 -7030667 -7338603 -7415003 -7368242 -7269296 -7171694 -7084460 -6941978 -6676439
38042 -6676439 -6328909 -6025004 -5831334 -5701836 -5577941 -5465546 -5383216 -5307597 -5217494 -5136559
38032 -5136559 -5085031 -5033626 -4946525 -4828525 -4693825 -4535202 -4365746 -4245633 -4218091 -4250023
38022 -4250023 -4273327 -4250277 -4168553 -4024338 -3858225 -3758394 -3764935 -3802591 -3768687 -3664428 -3581694
38011 -3581694 -3577181 -3615862 -3631000 -3591264 -3510602 -3429567 -3384869 -3371305 -3344738 -3284399 -3229476
38000 -3229476 -3225582 -3261853 -3297617 -3324464 -3353273 -3356568 -3282949 -3139477 -3015214 -2994661 -3063409
37989 -3063409 -3122708 -3098316 -3015627 -2949610 -2917654 -2870941 -2800192 -2778296 -2845443 -2919435 -2910602
37978 -2910602 -2875530 -2935362 -3065232 -3110773 -3029142 -2960721 -3005872 -3073644 -3039334 -2928359 -2836602
37967 -2836602 -2772821 -2701202 -2655294 -2678235 -2711774 -2675691 -2610677 -2612088 -2659587 -2650980 -2585993 -2573271
37955 -2573271 -2647093 -2711641 -2698687 -2664726 -2684965 -2743518 -2780408 -2777593 -2751178 -2711856 -2673446
37944 -2673446 -2660096 -2673991 -2686113 -2676543 -2655486 -2636190 -2616983 -2596266 -2581301 -2581282 -2603152 -2634552
37932 -2634552 -2621745 -2514321 -2362784 -2307584 -2411123 -2557960 -2593725 -2505290 -2379765 -2256055
37922 -2256055 -2140117 -2109056 -2233713 -2407112 -2423479 -2263455 -2140975 -2204700 -2344805 -2389735
37912 -2389735 -2355702 -2366042 -2423405 -2424808 -2360214 -2336451 -2394800 -2440449 -2398529 -2337567 -2369734
37901 -2369734 -2492818 -2604733 -2642318 -2633950 -2619948 -2587296 -2507276 -2393786 -2291366 -2231974 -2231312
37890 -2231312 -2295255 -2387490 -2421488 -2348600 -2242093 -2223236 -2303070 -2372777 -2359968 -2306642 -2266639
37879 -2266639 -2225434 -2175945 -2177063 -2254688 -2324784 -2312430 -2284390 -2356418 -2514568 -2638509 -2669852
37868 -2669852 -2646285 -2592503 -2497592 -2398405 -2367961 -2400086 -2402568 -2329578 -2238419 -2193611 -2191246 -2198657
37856 -2198657 -2197523 -2168113 -2097141 -2019159 -1990833 -2014194 -2043240 -2065390 -2107021 -2157299 -2164631 -2121994
37844 -2121994 -2084799 -2088150 -2108684 -2118358 -2116061 -2102269 -2082014 -2086890 -2126930 -2132339 -2023353 -1833862
37832 -1833862 -1686184 -1649010 -1698572 -1798678 -1916978 -1978241 -1924229 -1824557 -1806553 -1867019 -1886011
37821 -1886011 -1843321 -1866203 -2010001 -2143094 -2138125 -2054192 -2028257 -2083201 -2145971 -2178039 -2184192
37810 -2184192 -2147092 -2052055 -1950728 -1924846 -1992596 -2084895 -2102249 -1997848 -1843883 -1794006 -1909945
37799 -1909945 -2054554 -2056523 -1945744 -1884635 -1894968 -1847178 -1732093 -1710232 -1813243 -1830872 -1635998
37788 -1635998 -1416505 -1403298 -1538665 -1616897 -1609717 -1626736 -1665501 -1647613 -1635182 -1759413 -1954907
37777 -1954907 -2003426 -1858661 -1714615 -1714430 -1784963 -1815011 -1821905 -1862781 -1918991 -1947803 -1944815 -1897948
37765 -1897948 -1778307 -1624727 -1538824 -1547063 -1560581 -1519517 -1485122 -1533050 -1637260 -1720881 -1756724
37754 -1756724 -1759437 -1731007 -1670912 -1609320 -1589230 -1628143 -1703757 -1756965 -1728278 -1635159 -1587791
37743 -1587791 -1665305 -1799623 -1856612 -1809356 -1742000 -1701971 -1657590 -1599588 -1565658 -1545907 -1482645
37732 -1482645 -1399276 -1411884 -1555287 -1700218 -1713370 -1616930 -1522251 -1484048 -1494315 -1548246 -1626230
37721 -1626230 -1656841 -1584424 -1451026 -1345773 -1295988 -1267935 -1251434 -1277330 -1356032 -1452801 -1528885
37710 -1528885 -1569372 -1566222 -1505138 -1382661 -1225277 -1082279 -992435 -952875 -934106 -937317 -1009166
37699 -1009166 -1165756 -1328321 -1389921 -1337462 -1251751 -1191809 -1143097 -1083470 -1026427 -973287 -886232
37688 -886232 -747756 -604444 -520550 -520310 -591632 -706311 -822691 -913498 -1004982 -1140565 -1295035
37677 -1295035 -1383971 -1376328 -1332646 -1305300 -1273254 -1219437 -1201239 -1275862 -1404365 -1502776 -1557876
37666 -1557876 -1619247 -1691329 -1709476 -1639484 -1546622 -1530708 -1611862 -1711084 -1749319 -1742266 -1763257
37655 -1763257 -1814955 -1799935 -1664840 -1519145 -1522139 -1671898 -1807098 -1824788 -1790221 -1799687 -1845494
37644 -1845494 -1883530 -1938804 -2047406 -2155011 -2173912 -2109485 -2043652 -2017644 -2013869 -2031471 -2086125
37633 -2086125 -2136693 -2103827 -1982503 -1862660 -1812184 -1803229 -1782676 -1749470 -1714288 -1637336 -1479135
37622 -1479135 -1296269 -1215513 -1292456 -1438724 -1517404 -1484200 -1404010 -1349864 -1332572 -1330266 -1335790
37611 -1335790 -1350446 -1371874 -1420527 -1536991 -1705167 -1815755 -1775482 -1634983 -1533829 -1524327
37601 -1524327 -1531416 -1494963 -1459000 -1482476 -1543370 -1588141 -1615092 -1649751 -1685248 -1701553 -1701394 -1679925
37589 -1679925 -1609298 -1504613 -1444158 -1455400 -1443505 -1325186 -1180731 -1156873 -1247631 -1302211 -1250272
37578 -1250272 -1181632 -1169106 -1149150 -1054113 -950517 -939926 -995799 -1010195 -956662 -893898 -832546
37567 -832546 -719165 -561512 -456306 -452342 -478659 -464824 -455009 -528499 -663983 -771628 -830094
37556 -830094 -897394 -989050 -1042956 -1038262 -1066742 -1219031 -1443601 -1592990 -1604957 -1578859 -1654789
37545 -1654789 -1853154 -2058823 -2147397 -2102868 -2012555 -1969553 -1997626 -2059817 -2106997 -2106077 -2053113
37534 -2053113 -1988371 -1974458 -2022313 -2059463 -2017003 -1928059 -1880669 -1888547 -1886540 -1852960 -1841347 -1867103
37522 -1867103 -1864073 -1804727 -1764468 -1789404 -1791692 -1683135 -1543653 -1527340 -1633747 -1702899 -1635046
37511 -1635046 -1495901 -1388813 -1335639 -1322299 -1366093 -1477182 -1607908 -1687432 -1680248 -1601638 -1515054
37500 -1515054 -1507695 -1607002 -1720335 -1726406 -1635351 -1587685 -1679851 -1859935 -2013361 -2082484 -2080730
37489 -2080730 -2056334 -2065815 -2123518 -2166617 -2138944 -2108873 -2204547 -2413429 -2562738 -2549693 -2478662
37478 -2478662 -2494523 -2585290 -2654769 -2707891 -2831407 -3024654 -3174741 -3207494 -3171405 -3152112 -3168583
37467 -3168583 -3176148 -3130969 -3034491 -2934860 -2886011 -2893159 -2910719 -2902337 -2876073 -2847071 -2802415 -2728683
37455 -2728683 -2643656 -2574508 -2528143 -2498370 -2474328 -2434596 -2369929 -2313913 -2303471 -2312042 -2286817
37444 -2286817 -2249822 -2274416 -2350486 -2378850 -2332386 -2306319 -2349625 -2367421 -2283495 -2191224 -2221361
37433 -2221361 -2341780 -2423215 -2446875 -2503887 -2616164 -2697778 -2696763 -2656158 -2619992 -2579527 -2529812
37422 -2529812 -2490936 -2454719 -2387617 -2302810 -2260766 -2286150 -2345987 -2412614 -2482374 -2532826 -2536050
37411 -2536050 -2522171 -2556388 -2639344 -2699742 -2701847 -2690514 -2704942 -2712719 -2665398 -2571590 -2480237 -2424933
37399 -2424933 -2410675 -2427408 -2453088 -2460297 -2434947 -2384282 -2332835 -2317237 -2360109 -2428033 -2444575
37388 -2444575 -2375323 -2271571 -2198722 -2157317 -2112715 -2060828 -2015519 -1971354 -1931826 -1930978 -1969259
37377 -1969259 -1980184 -1932822 -1910983 -1996985 -2125628 -2165325 -2109025 -2059122 -2042593 -1982801 -1865686
37366 -1865686 -1791847 -1819792 -1878091 -1888171 -1868095 -1853329 -1815036 -1735353 -1681810 -1717407 -1792642
37355 -1792642 -1814477 -1787965 -1806756 -1914847 -2046102 -2107243 -2076134 -2007813 -1969813 -1981989 -2009837
37344 -2009837 -2008465 -1967407 -1915317 -1900091 -1966609 -2115455 -2264502 -2301849 -2218379 -2136978 -2153317
37333 -2153317 -2203346 -2171072 -2077238 -2046979 -2111047 -2163479 -2126946 -2042982 -1968099 -1889924 -1798174
37322 -1798174 -1749759 -1799117 -1919046 -2036355 -2101829 -2100556 -2047164 -1992755 -1980914 -1980712 -1925174
37311 -1925174 -1828945 -1793549 -1870532 -1987587 -2037377 -1980781 -1850581 -1723166 -1693274 -1790533 -1907517
37300 -1907517 -1904651 -1801829 -1756033 -1824353 -1882041 -1832291 -1759456 -1777808 -1847108 -1863296 -1844515
37289 -1844515 -1886216 -1978957 -2007528 -1922539 -1803456 -1742714 -1748010 -1769171 -1760874 -1710148 -1642989
37278 -1642989 -1605081 -1612625 -1636767 -1649655 -1651376 -1639188 -1604228 -1577882 -1610738 -1673180 -1660585 -1550330
37266 -1550330 -1464963 -1500561 -1572826 -1536420 -1399319 -1305633 -1336581 -1435967 -1521003 -1570751 -1603242
37255 -1603242 -1642300 -1707753 -1777573 -1775904 -1665948 -1532002 -1488976 -1527957 -1543260 -1507078 -1512610
37244 -1512610 -1618900 -1748672 -1793863 -1756129 -1720582 -1729642 -1746426 -1733532 -1714224 -1733892 -1784165
37233 -1784165 -1799268 -1741212 -1666125 -1668420 -1759016 -1843853 -1845286 -1804689 -1823687 -1924602 -2014625
37222 -2014625 -1991507 -1855432 -1703704 -1626938 -1627091 -1646167 -1658824 -1695521 -1762775 -1790452 -1694801
37211 -1694801 -1450489 -1063026 -540024 33132 460331 603384 554961 519581 545602 517378
37201 517378 399900 310579 306156 271981 111703 -86769 -172602 -121877 -26206 26955 6500
37190 6500 -49290 -40620 86495 249389 365868 528708 836726 1114302 1132108 1102652 1468617
37179 1468617 1999606 1633001 -291383 -2955571 -4787314 -5126694 -4650378 -4234504 -4029753
37170 -4029753 -3786326 -3493823 -3324123 -3271357 -3204735 -3116487 -3070103 -3030130 -2935791 -2834290
37160 -2834290 -2791803 -2778738 -2756710 -2754537 -2757062 -2665082 -2476910 -2357379 -2403098 -2488922 -2476762
37149 -2476762 -2420908 -2416213 -2396161 -2265224 -2110183 -2083291 -2156998 -2178592 -2109446 -2041224 -2021026
37138 -2021026 -2018289 -2030907 -2080212 -2126286 -2113904 -2074773 -2073079 -2088393 -2061369 -2007885 -1975539 -1942249
37126 -1942249 -1882778 -1880403 -2026501 -2240213 -2333010 -2245319 -2096245 -2008219 -1997199 -2023182 -2035845
37115 -2035845 -1982426 -1876719 -1835826 -1934594 -2058312 -2038907 -1913467 -1884875 -2017789 -2140699
37105 -2140699 -2095254 -1936464 -1820913 -1819075 -1907740 -2038700 -2134842 -2107095 -1959726 -1817814
37095 -1817814 -1784337 -1827928 -1867841 -1898830 -1953319 -1994561 -1944104 -1803092 -1667958 -1612933 -1608011
37084 -1608011 -1575362 -1499656 -1453240 -1505588 -1623942 -1694903 -1654989 -1565182 -1528279 -1566731 -1623119
37073 -1623119 -1647811 -1632177 -1584845 -1539469 -1559270 -1656874 -1730044 -1667912 -1514013 -1424807 -1461204
37062 -1461204 -1529897 -1552497 -1571092 -1633316 -1692279 -1707927 -1747815 -1873843 -1998909 -1983284 -1839317
37051 -1839317 -1719297 -1711676 -1761696 -1792811 -1789555 -1740443 -1618459 -1470385 -1421511 -1515184 -1626427
37040 -1626427 -1619012 -1523045 -1461015 -1453515 -1421868 -1360270 -1363925 -1459330 -1536016 -1511102 -1455028 -1466819
37028 -1466819 -1513348 -1507007 -1483750 -1565749 -1756949 -1908111 -1916023 -1849359 -1825700 -1851608 -1852952
37017 -1852952 -1801892 -1736956 -1687116 -1642645 -1593373 -1548318 -1516763 -1498529 -1492245 -1498274 -1518523 -1554973
37005 -1554973 -1591611 -1585366 -1513383 -1430523 -1428529 -1519958 -1612282 -1623859 -1577283 -1543789 -1544183 -1553369
36993 -1553369 -1564072 -1586249 -1601510 -1574541 -1510371 -1460230 -1463649 -1506811 -1539466 -1520422 -1451594
36982 -1451594 -1375416 -1331516 -1317479 -1307672 -1300038 -1311819 -1336683 -1350835 -1361622 -1398851 -1450285 -1459610
36970 -1459610 -1403213 -1318907 -1246983 -1196706 -1178584 -1202575 -1230111 -1202976 -1141351 -1132032 -1191881
36959 -1191881 -1235006 -1216810 -1211075 -1281486 -1372012 -1404426 -1400159 -1417448 -1444510 -1450418 -1471977 -1546304
36947 -1546304 -1615191 -1600969 -1527601 -1466166 -1413597 -1333452 -1264357 -1266620 -1300946 -1283940 -1232508
36936 -1232508 -1228430 -1267968 -1279496 -1271858 -1325666 -1439550 -1520632 -1535067 -1538844 -1551434 -1532497 -1497979
36924 -1497979 -1520240 -1586263 -1593975 -1524531 -1477599 -1489344 -1462437 -1348247 -1260189 -1310670 -1448492
36913 -1448492 -1556555 -1611571 -1644431 -1632841 -1550910 -1462205 -1448282 -1482664 -1474627 -1409631 -1358222
36902 -1358222 -1366657 -1417070 -1480399 -1538506 -1562573 -1530088 -1464124 -1417839 -1424930 -1484289 -1569065 -1631957
36890 -1631957 -1635536 -1596263 -1559564 -1521891 -1439702 -1335745 -1315086 -1425261 -1571117 -1632086 -1606599
36879 -1606599 -1574697 -1570255 -1564663 -1539440 -1502727 -1457718 -1413362 -1401809 -1435029 -1473677 -1483472 -1481426
36867 -1481426 -1478803 -1434630 -1334421 -1260268 -1291435 -1372510 -1383655 -1326333 -1329019 -1452403 -1589041
36856 -1589041 -1602256 -1493356 -1373306 -1311059 -1273482 -1210571 -1148897 -1166969 -1285732 -1421097
36846 -1421097 -1474375 -1448238 -1425571 -1443229 -1454726 -1431289 -1419583 -1451495 -1465874 -1391874 -1264820
36835 -1264820 -1182521 -1174726 -1193631 -1218799 -1288490 -1413492 -1524986 -1539910 -1449466 -1326771 -1261940
36824 -1261940 -1289409 -1364403 -1414709 -1417616 -1402995 -1382540 -1330777 -1260786 -1256167 -1372285 -1548190
36813 -1548190 -1674006 -1709741 -1680505 -1597726 -1464822 -1336410 -1286252 -1316891 -1368261 -1410900 -1463053
36802 -1463053 -1521401 -1551383 -1552915 -1561151 -1566978 -1511272 -1387859 -1287708 -1299152 -1405861 -1514233
36791 -1514233 -1544717 -1475230 -1341478 -1226852 -1211329 -1292210 -1383150 -1419110 -1424976 -1444031 -1443348
36780 -1443348 -1360864 -1235178 -1208436 -1362537 -1600258 -1744987 -1744548 -1719809 -1800617 -1970217 -2113850
36769 -2113850 -2176970 -2201600 -2217918 -2191574 -2115421 -2075864 -2150950 -2277805 -2305112 -2180505 -2018200
36758 -2018200 -1957978 -2009431 -2074445 -2089771 -2090615 -2128941 -2180879 -2180450 -2127826 -2104032 -2158258 -2234280
36746 -2234280 -2252452 -2218863 -2189720 -2166175 -2113119 -2062274 -2086560 -2159985 -2156915 -2032244 -1898231
36735 -1898231 -1865638 -1908536 -1957221 -2021871 -2123178 -2186992 -2131290 -2002042 -1903081 -1837072 -1740237
36724 -1740237 -1634960 -1606422 -1644980 -1660434 -1659995 -1758647 -1971295 -2135623 -2114161 -1964353 -1831691
36713 -1831691 -1767342 -1736305 -1727504 -1753566 -1782907 -1765115 -1710635 -1676287 -1678734 -1678999 -1652571 -1627844
36701 -1627844 -1642912 -1690050 -1716733 -1678134 -1585550 -1494623 -1440921 -1408820 -1382162 -1391704 -1469055
36690 -1469055 -1580155 -1658913 -1685433 -1672799 -1609410 -1500730 -1442046 -1530351 -1696694 -1754213 -1649536
36679 -1649536 -1537843 -1546787 -1599708 -1575036 -1519731 -1556416 -1656797 -1677827 -1597790 -1550425 -1605451
36668 -1605451 -1661337 -1606841 -1471537 -1351012 -1278595 -1247612 -1283783 -1402498 -1535973 -1591271
36658 -1591271 -1568255 -1551907 -1593041 -1655319 -1680437 -1652139 -1588706 -1519760 -1482772 -1499767 -1539206
36647 -1539206 -1536035 -1469193 -1389771 -1355499 -1368680 -1396694 -1415583 -1405396 -1344407 -1254687 -1221784
36636 -1221784 -1310590 -1475713 -1609249 -1663953 -1669703 -1643774 -1568458 -1466984 -1412608 -1425207 -1434117
36625 -1434117 -1389256 -1337038 -1328125 -1320167 -1252283 -1164425 -1151784 -1229520 -1329584 -1412932 -1496847
36614 -1496847 -1578512 -1621889 -1631308 -1657786 -1711870 -1738924 -1702693 -1630209 -1551682 -1460406 -1364504
36603 -1364504 -1319621 -1364717 -1461450 -1534253 -1546003 -1512517 -1472119 -1460328 -1482962 -1495187 -1438499
36592 -1438499 -1315144 -1192426 -1119577 -1085032 -1079414 -1145338 -1307008 -1478907 -1517189 -1380756
36582 -1380756 -1198091 -1140168 -1241458 -1378313 -1421895 -1368593 -1292151 -1214852 -1104703 -992660
36572 -992660 -990904 -1144254 -1341365 -1446951 -1464746 -1485920 -1524956 -1513164 -1435971 -1368049 -1362894
36561 -1362894 -1398187 -1443404 -1495199 -1528804 -1502422 -1439535 -1426115 -1489077 -1550792 -1546526 -1519475
36550 -1519475 -1547010 -1624395 -1675867 -1650032 -1564613 -1480017 -1452841 -1490050 -1532856 -1510239 -1413025
36539 -1413025 -1289947 -1185661 -1125139 -1134202 -1207128 -1269884 -1256849 -1217011 -1254955 -1368866 -1448973
36528 -1448973 -1444589 -1419169 -1416758 -1396995 -1347908 -1339509 -1396033 -1426807 -1367856 -1293121 -1291760 -1322505
36516 -1322505 -1292241 -1207396 -1141942 -1112478 -1089541 -1086779 -1133757 -1189902 -1183341 -1121535 -1085203 -1124203
36504 -1124203 -1217434 -1310985 -1345185 -1285102 -1181015 -1149720 -1231925 -1321642 -1308368 -1229722 -1194214
36493 -1194214 -1206378 -1176553 -1076845 -984919 -979913 -1072524 -1221394 -1346251 -1351217 -1216535 -1049971
36482 -1049971 -976637 -1003096 -1057624 -1119558 -1213745 -1308104 -1324790 -1252482 -1163617 -1122271 -1142964
36471 -1142964 -1221515 -1330228 -1399957 -1382663 -1317534 -1274020 -1263374 -1270849 -1318998 -1410718 -1468383
36460 -1468383 -1436849 -1391017 -1418553 -1451166 -1359931 -1179344 -1072994 -1092222 -1134010 -1134959 -1135714 -1143688
36448 -1143688 -1112705 -1087477 -1181330 -1358116 -1422697 -1304668 -1172299 -1169183 -1213922 -1184427 -1136057
36437 -1136057 -1177987 -1260116 -1255039 -1170004 -1123777 -1173359 -1290856 -1442019 -1561749 -1532895 -1336112
36426 -1336112 -1151793 -1157342 -1281731 -1323611 -1253693 -1207529 -1217584 -1181761 -1112742 -1177382 -1403976
36415 -1403976 -1564655 -1486146 -1309506 -1274352 -1367415 -1373806 -1210536 -1019519 -941928 -968210 -1033134
36404 -1033134 -1112297 -1175064 -1163324 -1086318 -1048501 -1116425 -1228966 -1298214 -1322873 -1330625 -1288502
36393 -1288502 -1173829 -1076789 -1108276 -1226674 -1276496 -1200202 -1097790 -1063935 -1083442 -1118320 -1178858
36382 -1178858 -1252247 -1267260 -1201750 -1136753 -1132574 -1135902 -1083728 -1011816 -976534 -958327 -938252 -975626
36370 -975626 -1089309 -1150497 -1043153 -868053 -825946 -937264 -1041448 -1047476 -1009577 -962301 -871852
36359 -871852 -781871 -821887 -1002936 -1162347 -1192186 -1185449 -1268375 -1411645 -1507756 -1535881 -1549069
36348 -1549069 -1573641 -1610712 -1675368 -1757762 -1800136 -1775666 -1737786 -1742239 -1776474 -1802676 -1802973 -1752254
36336 -1752254 -1630690 -1498231 -1462013 -1526559 -1573336 -1531532 -1459932 -1412334 -1351728 -1271419 -1268428
36325 -1268428 -1393177 -1537169 -1576279 -1526381 -1459397 -1378760 -1291554 -1284242 -1385176 -1457042 -1383172
36314 -1383172 -1271597 -1306116 -1468604 -1587681 -1607361 -1619106 -1656294 -1644845 -1559298 -1462319 -1381869
36303 -1381869 -1301026 -1272089 -1381289 -1581744 -1713313 -1715894 -1681248 -1667850 -1614777 -1484469 -1349039
36292 -1349039 -1273535 -1235479 -1220252 -1279476 -1425134 -1567513 -1630747 -1645332 -1661669 -1654677 -1586927
36281 -1586927 -1501785 -1480353 -1539763 -1619116 -1641150 -1576194 -1483047 -1475010 -1583661 -1679946 -1624077
36270 -1624077 -1474559 -1422611 -1516071 -1597351 -1555533 -1485699 -1513571 -1594145 -1599968 -1518051 -1441985
36259 -1441985 -1427173 -1456548 -1507131 -1559967 -1574575 -1528565 -1457976 -1404340 -1359178 -1310951 -1297128
36248 -1297128 -1348034 -1421551 -1453193 -1432807 -1381373 -1301409 -1208191 -1158207 -1178256 -1210129 -1194838
36237 -1194838 -1170892 -1215931 -1325200 -1421782 -1459836 -1448450 -1404384 -1359157 -1386422 -1529645 -1702866
36226 -1702866 -1748524 -1616130 -1423379 -1316794 -1317681 -1332139 -1284827 -1212323 -1215356 -1318052 -1400742
36215 -1400742 -1323948 -1120392 -989588 -1062319 -1238241 -1319527 -1250621 -1148873 -1137781 -1235719
36205 -1235719 -1387946 -1521490 -1569224 -1512892 -1409172 -1320878 -1236022 -1117920 -1011990 -1008970
36195 -1008970 -1098582 -1159517 -1128810 -1094520 -1165598 -1315894 -1424467 -1430808 -1382829 -1346724 -1329238
36184 -1329238 -1298349 -1243871 -1197335 -1198459 -1249806 -1311882 -1349378 -1369946 -1397339 -1417289 -1383383
36173 -1383383 -1279030 -1145300 -1046531 -1036742 -1148089 -1354160 -1532393 -1532855 -1338197 -1115386
36163 -1115386 -1047827 -1134275 -1210606 -1159403 -1032102 -953930 -974789 -1053685 -1144368 -1238004 -1330917
36152 -1330917 -1396983 -1404885 -1345306 -1240845 -1142448 -1105669 -1145395 -1214036 -1242805 -1204039 -1123435
36141 -1123435 -1048944 -1029255 -1094876 -1213180 -1279445 -1217390 -1092311 -1056318 -1162443 -1303046
36131 -1303046 -1364339 -1364737 -1381903 -1414070 -1402014 -1346261 -1306899 -1302381 -1294836 -1271544 -1260371 -1262135
36119 -1262135 -1245398 -1216188 -1217361 -1247653 -1258810 -1250024 -1283709 -1377827 -1461035 -1475294 -1451094 -1434159
36107 -1434159 -1407320 -1344293 -1281282 -1267107 -1286196 -1295888 -1299385 -1310735 -1282143 -1152699 -963520
36096 -963520 -845967 -879259 -1016174 -1165294 -1291857 -1404729 -1483767 -1474217 -1360690 -1217406
36086 -1217406 -1155469 -1211815 -1305976 -1324906 -1242506 -1135022 -1088835 -1125213 -1211704 -1303818 -1360244
36075 -1360244 -1353002 -1289318 -1208002 -1140696 -1089820 -1048238 -1023239 -1038863 -1123289 -1273834 -1413476
36064 -1413476 -1422432 -1269576 -1085029 -1028861 -1100764 -1159311 -1120228 -1037625 -981519 -948033 -928495
36053 -928495 -957798 -1030391 -1061847 -1011663 -969478 -1038699 -1194483 -1332867 -1404777 -1426773 -1414762
36042 -1414762 -1388241 -1393655 -1444614 -1479803 -1449534 -1392793 -1357061 -1309867 -1224678 -1184844 -1275350
36031 -1275350 -1417380 -1451943 -1367950 -1301170 -1304579 -1275231 -1151573 -1040387 -1064275 -1183944 -1266157
36020 -1266157 -1265682 -1250441 -1278089 -1325814 -1339242 -1298264 -1225285 -1157387 -1124208 -1144638 -1226920 -1350572
36008 -1350572 -1451036 -1459758 -1377394 -1273590 -1198336 -1141548 -1101499 -1120639 -1202179 -1265656 -1260885
35997 -1260885 -1256085 -1318233 -1374494 -1317234 -1196872 -1162641 -1231531 -1272107 -1227794 -1201300 -1277177
35986 -1277177 -1397837 -1469389 -1471370 -1411661 -1294035 -1187348 -1201755 -1323065 -1389454 -1313704 -1208518
35975 -1208518 -1196417 -1222015 -1181937 -1128059 -1175948 -1283501 -1299071 -1202335 -1129660 -1158111 -1217411
35964 -1217411 -1236991 -1235843 -1223532 -1144205 -987803 -853989 -828763 -873706 -907580 -928578 -978595
35953 -978595 -1043053 -1073932 -1080514 -1114265 -1178364 -1228242 -1257405 -1307596 -1382300 -1419294 -1376999 -1292835
35941 -1292835 -1221965 -1165990 -1104474 -1056416 -1056232 -1093903 -1135229 -1184391 -1262553 -1329625 -1302761 -1176124
35929 -1176124 -1057945 -1047894 -1124168 -1194973 -1222255 -1242952 -1291271 -1351401 -1384135 -1370014 -1329565
35918 -1329565 -1311116 -1336755 -1355032 -1291539 -1162899 -1082272 -1118055 -1208915 -1264416 -1280733 -1292988
35907 -1292988 -1287070 -1251276 -1253273 -1350087 -1459479 -1443492 -1303434 -1173472 -1129938 -1129951 -1137977 -1177580
35895 -1177580 -1234349 -1239231 -1190735 -1175039 -1217645 -1231774 -1171562 -1123889 -1176545 -1292109 -1383118
35884 -1383118 -1422667 -1415896 -1359096 -1299357 -1332545 -1453885 -1507301 -1383943 -1184832 -1082207 -1105577
35873 -1105577 -1181524 -1297429 -1475278 -1639046 -1671646 -1592157 -1536246 -1558317 -1577489 -1526906 -1438142
35862 -1438142 -1360918 -1308660 -1307022 -1392394 -1525176 -1591238 -1532744 -1416019 -1341330 -1341193 -1386568
35851 -1386568 -1436623 -1462829 -1469996 -1500025 -1569996 -1618397 -1576087 -1479308 -1433083 -1461169 -1475834
35840 -1475834 -1409567 -1295401 -1197028 -1141053 -1146612 -1238811 -1385457 -1486735 -1480687 -1413659 -1366950
35829 -1366950 -1359544 -1360932 -1353476 -1337241 -1307916 -1271828 -1258284 -1283994 -1324479 -1341814 -1319536 -1260194
35817 -1260194 -1181543 -1126681 -1136999 -1194837 -1229112 -1195985 -1117434 -1026942 -927625 -832166 -793478
35806 -793478 -847930 -956169 -1042355 -1074561 -1073206 -1058253 -1025484 -971592 -917213 -900363 -949407
35795 -949407 -1050995 -1144513 -1170558 -1130413 -1075032 -1033807 -988941 -932070 -906233 -957915 -1066085
35784 -1066085 -1152113 -1161349 -1118158 -1094993 -1131617 -1192752 -1215464 -1191444 -1173747 -1198165 -1242080
35773 -1242080 -1282902 -1341009 -1414546 -1426170 -1316520 -1159264 -1088603 -1121767 -1150849 -1115639 -1078424
35762 -1078424 -1097351 -1129392 -1117408 -1090989 -1109475 -1161128 -1184352 -1148615 -1065407 -965323 -910492
35751 -910492 -972358 -1135216 -1271551 -1281212 -1212485 -1175384 -1180001 -1150102 -1069590 -1013872 -1030090
35740 -1030090 -1073717 -1089297 -1087335 -1107404 -1148583 -1167736 -1126873 -1032426 -944013 -933948 -1009035
35729 -1009035 -1087547 -1092383 -1049097 -1039516 -1073869 -1080844 -1029978 -985545 -1005201 -1049998 -1046792 -997079
35717 -997079 -968047 -998519 -1064367 -1126771 -1170628 -1196237 -1209127 -1223206 -1248527 -1272701 -1274394 -1253417
35705 -1253417 -1225665 -1192212 -1142511 -1090054 -1070897 -1094552 -1129746 -1159543 -1214331 -1310952 -1387772
35694 -1387772 -1361206 -1245429 -1153563 -1158550 -1207972 -1213385 -1173404 -1150226 -1158172 -1150835 -1115202 -1105594
35682 -1105594 -1160689 -1240270 -1276707 -1253837 -1206281 -1169538 -1158604 -1172488 -1192404 -1191351 -1165034
35671 -1165034 -1136180 -1114949 -1083760 -1043795 -1044681 -1128983 -1262772 -1357869 -1357130 -1272119 -1151230 -1045337
35659 -1045337 -995017 -1009316 -1050798 -1072322 -1073530 -1093371 -1146456 -1202518 -1235204 -1249870 -1246268 -1199788
35647 -1199788 -1115896 -1062974 -1094045 -1157311 -1153431 -1082325 -1056585 -1138527 -1235385 -1216700 -1083947
35636 -1083947 -945667 -857913 -786854 -725167 -735607 -839589 -955106 -1009335 -1040043 -1106729 -1160172
35625 -1160172 -1101900 -950050 -844263 -874239 -981043 -1048268 -1029136 -962261 -914218 -930247 -1002967
35614 -1002967 -1073730 -1095626 -1094577 -1128111 -1193216 -1234936 -1244957 -1275202 -1331374 -1330092 -1212331
35603 -1212331 -1047173 -966371 -1021783 -1147392 -1239591 -1241822 -1170091 -1085307 -1032130 -996906 -944300
35592 -944300 -888429 -883143 -937202 -993079 -1007647 -1001646 -1007083 -1019203 -1027885 -1043234 -1059594 -1048031
35580 -1048031 -1015045 -1007797 -1025786 -1000365 -915214 -869199 -938163 -1038528 -1032978 -936839 -907344
35569 -907344 -1026893 -1192576 -1243937 -1132740 -944249 -802947 -777789 -842173 -910013 -927646
35559 -927646 -920445 -930029 -941559 -919837 -884456 -884545 -917645 -940366 -947141 -969511 -1006087 -1028694 -1056923
35546 -1056923 -1144031 -1274070 -1353537 -1335120 -1280489 -1265715 -1287775 -1304423 -1308000 -1310727 -1302924 -1275890
35534 -1275890 -1250994 -1240150 -1209661 -1131120 -1042286 -1008166 -1038195 -1086543 -1120208 -1140928 -1148613
35523 -1148613 -1131760 -1096780 -1063546 -1023950 -946627 -837805 -755898 -738468 -752694 -760339 -799606
35512 -799606 -933605 -1120128 -1214328 -1142200 -1007748 -962781 -1016860 -1061218 -1052198 -1059341 -1120183
35501 -1120183 -1164335 -1136966 -1099252 -1121693 -1148959 -1071857 -896524 -746811 -714081 -784346 -899254
35490 -899254 -1009265 -1073805 -1084668 -1087272 -1115593 -1127352 -1083794 -1064686 -1186794 -1407199 -1538257
35479 -1538257 -1494557 -1400600 -1390754 -1421036 -1376203 -1268976 -1207722 -1216165 -1210227 -1143122 -1068198 -1047619
35467 -1047619 -1080489 -1135049 -1183396 -1191673 -1142506 -1086270 -1105878 -1199601 -1254818 -1182186 -1037328
35456 -1037328 -962037 -1027179 -1177240 -1313441 -1379909 -1366208 -1279667 -1148912 -1027104 -953092
35446 -953092 -915638 -884634 -870264 -912106 -1002237 -1062310 -1028805 -936789 -883512 -919375 -1006215
35435 -1006215 -1077345 -1106915 -1117713 -1147025 -1211457 -1286512 -1315150 -1251786 -1107528 -951517 -867166
35424 -867166 -894404 -990555 -1053305 -1022410 -963016 -992689 -1108448 -1163802 -1070966 -946534 -961640
35413 -961640 -1103929 -1208601 -1198357 -1156451 -1156246 -1162375 -1147249 -1171959 -1268723 -1348803 -1328504 -1269246
35401 -1269246 -1283548 -1355196 -1367792 -1288232 -1211434 -1216234 -1265727 -1272672 -1200059 -1074206 -943342
35390 -943342 -838937 -741869 -577219 -277891 128959 514340 734924 733157 575281 402650
35380 402650 315979 287717 216356 74462 -55672 -119860 -184667 -323859 -483368 -560883 -572814
35369 -572814 -619878 -704751 -719279 -632623 -560247 -590356 -654702 -651725 -607566 -615746 -678005 -714308
35357 -714308 -705655 -724058 -813202 -918238 -956736 -908440 -816363 -734935 -689489 -662282 -616723
35346 -616723 -554335 -531849 -590685 -689848 -753076 -766090 -773814 -793627 -796904 -776212 -758866 -742123
35334 -742123 -693420 -642001 -682824 -830754 -946508 -893144 -719981 -601711 -622461 -711482 -779044
35323 -779044 -815707 -842418 -855099 -859676 -895386 -978248 -1066567 -1117567 -1139348 -1159241 -1180188 -1192983
35311 -1192983 -1190243 -1146055 -1031306 -879690 -787665 -806379 -872903 -888648 -830514 -748663 -694172
35300 -694172 -689342 -731204 -780750 -782086 -732044 -696960 -727217 -799258 -875364 -958786 -1038906 -1051372
35288 -1051372 -969758 -880660 -879975 -938896 -965012 -955842 -984420 -1054783 -1084539 -1033104 -949277 -883888
35276 -883888 -844113 -841768 -898810 -989909 -1055895 -1084052 -1104476 -1110183 -1064663 -991017 -966482 -1017991
35264 -1017991 -1099458 -1170019 -1211123 -1178603 -1043417 -879871 -803303 -815550 -825601 -820708 -875724
35253 -875724 -976714 -996409 -897706 -809828 -829894 -890152 -905335 -912361 -961169 -995363 -961518
35242 -961518 -929597 -980197 -1061753 -1080046 -1047561 -1026046 -1001164 -937648 -883810 -890656 -893101 -808629
35230 -808629 -701772 -710544 -843304 -979520 -1045961 -1066386 -1056457 -995451 -902347 -835249 -811623
35219 -811623 -808494 -826901 -880051 -942514 -984267 -1019458 -1051370 -1025072 -919449 -823429 -822635 -873717
35207 -873717 -895224 -908795 -964537 -999528 -921516 -781195 -706692 -706723 -692850 -660206 -684155 -763858
35195 -763858 -831022 -892239 -1000861 -1109904 -1119317 -1046972 -984615 -922388 -810812 -751698 -885464
35184 -885464 -1103240 -1141259 -987094 -910163 -1027606 -1135431 -1080781 -1007118 -1063477 -1138333 -1088817
35173 -1088817 -1001568 -995779 -970921 -804169 -628457 -640877 -764646 -781692 -703577 -718966 -829138
35162 -829138 -834713 -684832 -563280 -587210 -663257 -701837 -752168 -842792 -883682 -827873 -772016
35151 -772016 -796852 -842044 -834056 -816474 -855068 -918373 -950401 -970313 -1002604 -992492 -897404 -794787
35139 -794787 -785013 -833503 -826075 -755880 -732448 -796555 -844124 -784738 -687462 -691065 -816575 -952002
35127 -952002 -1007668 -1003784 -991838 -972266 -938598 -938869 -1018274 -1132196 -1189225 -1164026 -1100325 -1023402
35115 -1023402 -933487 -872774 -895429 -958505 -946975 -838343 -742647 -737919 -768101 -760856 -744662
35104 -744662 -770281 -803396 -786027 -737246 -706919 -690357 -671886 -691826 -782749 -895247 -971345
35093 -971345 -1030432 -1094058 -1098539 -995571 -876764 -866002 -929803 -932278 -853917 -812481 -866612
35082 -866612 -935742 -937423 -886123 -826194 -770550 -738743 -764296 -829237 -867297 -858864 -853440 -880323
35070 -880323 -907967 -907429 -885908 -845161 -778714 -720832 -721903 -761972 -767137 -727843 -718075 -771668
35058 -771668 -823426 -815263 -789676 -822365 -906229 -953538 -897531 -766004 -658827 -649671 -703115
35047 -703115 -718520 -672342 -656964 -731467 -809566 -785170 -705546 -701448 -786874 -859753 -876780 -885151
35035 -885151 -888423 -834300 -751030 -739229 -789078 -758725 -596221 -441654 -431502 -528258 -627570
35024 -627570 -713306 -808993 -882648 -907094 -930535 -991168 -1042148 -1047694 -1058876 -1095968 -1061287 -896988
35012 -896988 -733380 -723579 -802156 -784254 -662630 -612213 -697101 -769876 -718863 -643480 -684590
35001 -684590 -810342 -891128 -900191 -910303 -936432 -911717 -821295 -751114 -768652 -831701 -863013
34990 -863013 -862021 -885377 -947521 -1003137 -1020889 -1015284 -997135 -949828 -878318 -827911 -816752 -797806
34978 -797806 -737350 -687191 -713437 -785479 -812703 -775470 -738494 -737593 -739458 -727447 -740803 -793920
34966 -793920 -830156 -803049 -748954 -733125 -765330 -807420 -825656 -800210 -722275 -621732 -566362
34955 -566362 -594268 -668053 -724846 -748936 -767579 -797369 -826884 -844482 -859587 -889132 -921604
34944 -921604 -901093 -777303 -587746 -450933 -440694 -504646 -553426 -584462 -648867 -738762 -798231
34933 -798231 -820564 -839950 -844609 -796243 -720060 -671651 -633308 -563004 -527502 -636242 -835450
34922 -835450 -931986 -860530 -767242 -771885 -809883 -793144 -769925 -810472 -863036 -848276 -797562 -783968
34910 -783968 -801590 -810733 -814664 -805914 -740479 -651928 -665519 -792649 -849836 -720128 -561099
34899 -561099 -585607 -754067 -873743 -902416 -938892 -981824 -929010 -793677 -706946 -702995 -695368
34888 -695368 -672316 -720534 -831124 -874177 -816121 -788915 -876354 -981533 -983236 -901460 -832134
34877 -832134 -814371 -828175 -849718 -862490 -869758 -907274 -981277 -1013622 -938502 -826133 -796080
34866 -796080 -833687 -827881 -771081 -761241 -804265 -789181 -691626 -633116 -684793 -766679 -802303 -827209
34854 -827209 -876994 -904843 -881014 -850329 -831536 -786184 -736339 -767526 -857755 -863838 -750578
34843 -750578 -665401 -696315 -735229 -697290 -689170 -801785 -908125 -864475 -774372 -829752 -985395
34832 -985395 -1025349 -904770 -798190 -812521 -857627 -831504 -762086 -717160 -707408 -726959 -786329
34821 -786329 -864816 -908578 -898685 -859780 -806892 -750676 -731669 -765521 -779362 -699446 -584973
34810 -584973 -573792 -702426 -874192 -994128 -1036024 -988119 -848177 -684969 -601523 -613430
34800 -613430 -641932 -632353 -597751 -552696 -503332 -503888 -614076 -784274 -888203 -891883 -885949 -924223
34788 -924223 -943763 -893246 -834481 -846091 -905912 -939442 -925783 -894525 -866554 -849489 -849128 -846924
34776 -846924 -813206 -773550 -801954 -907949 -991932 -963653 -852429 -747431 -678101 -613347 -541595
34765 -541595 -490038 -483097 -525497 -608206 -700370 -760825 -780948 -780697 -746488 -636268 -483067 -415326
34753 -415326 -497749 -611953 -596480 -474008 -426835 -545872 -717595 -795892 -783569 -772089 -776978
34742 -776978 -734489 -635193 -558845 -557719 -584339 -577145 -559333 -592475 -667070 -710701 -697106 -676354
34730 -676354 -684852 -696662 -698987 -748848 -888748 -1045174 -1088924 -992391 -865327 -826965 -890687
34719 -890687 -982499 -1026699 -997785 -927156 -880612 -904441 -976769 -1027797 -1014491 -959798 -919012
34708 -919012 -925917 -967710 -992722 -951224 -852201 -768582 -759662 -802220 -826916 -800934 -736461 -645532
34696 -645532 -544501 -485229 -511893 -587203 -626696 -610998 -601557 -641978 -712156 -785443 -854300
34685 -854300 -887872 -851285 -791529 -812035 -923486 -1013441 -1013060 -990988 -1009883 -998258 -876587
34674 -876587 -724378 -682432 -740147 -767109 -732597 -738400 -820845 -872137 -812524 -716706 -693273
34663 -693273 -730095 -740135 -696073 -643330 -623442 -648194 -715765 -802449 -871052 -922694 -992723
34652 -992723 -1061548 -1042041 -918339 -823828 -884686 -1033696 -1088127 -988520 -848240 -772829 -751416
34641 -751416 -750639 -796668 -901246 -993345 -999916 -942387 -891038 -865294 -833922 -778640 -709064 -645594
34629 -645594 -623331 -670336 -746182 -759739 -697516 -668501 -751695 -866027 -887816 -841837 -854061
34618 -854061 -945316 -1008831 -993190 -967462 -974063 -952237 -867794 -799463 -815292 -861419 -862960 -849187
34606 -849187 -876495 -899416 -838298 -732552 -704296 -782278 -870176 -890705 -861515 -815928 -744604
34595 -744604 -650873 -590180 -609470 -689409 -774331 -825576 -831800 -805217 -782181 -794554 -831603 -858914
34583 -858914 -871490 -892076 -925869 -961869 -1007025 -1060597 -1064067 -954363 -778720 -675318 -704767
34572 -704767 -770544 -751850 -653915 -570942 -551102 -565436 -580341 -594608 -615030 -646974 -703488
34561 -703488 -783333 -849354 -866085 -846043 -820566 -783533 -714354 -642823 -627514 -667285 -700976
34550 -700976 -711837 -760346 -872393 -962585 -939539 -843554 -793257 -813671 -812196 -734082 -642336
34539 -642336 -601102 -570587 -492381 -412617 -426381 -534367 -646337 -709598 -746563 -775140 -783658
34528 -783658 -786643 -814749 -841154 -809973 -747380 -740657 -788052 -788093 -715892 -679468 -733421 -768204
34516 -768204 -687211 -581286 -602217 -747758 -897529 -988180 -1025040 -991934 -892391 -822883 -857488
34505 -857488 -909435 -858611 -762681 -766214 -845523 -851867 -792936 -837905 -1008039 -1097010 -985614
34494 -985614 -826396 -796865 -850547 -853839 -817640 -832535 -882721 -880241 -814308 -741787 -692915 -687970
34482 -687970 -769736 -916226 -1003075 -960051 -883087 -882875 -913658 -875927 -796270 -758449 -734715 -649578
34470 -649578 -554368 -565827 -661971 -708199 -675308 -668177 -731230 -781378 -760909 -720324 -714234 -730930
34458 -730930 -756816 -807242 -867509 -897041 -905220 -927777 -927554 -832088 -677922 -594206 -620410 -663329
34446 -663329 -666427 -693740 -792777 -891121 -898590 -821817 -719384 -628876 -589512 -644082 -754898
34435 -754898 -800392 -721581 -602938 -553084 -577767 -623387 -665957 -694731 -685522 -659822 -698905
34424 -698905 -827377 -951017 -985445 -978543 -1019046 -1084283 -1079378 -990519 -899947 -862048 -847579
34413 -847579 -810163 -746462 -689757 -682848 -743523 -828191 -861151 -827736 -789069 -770514 -708470 -572353
34401 -572353 -465582 -506163 -652267 -751601 -738323 -676290 -623353 -571248 -533428 -574549 -698019
34390 -698019 -787923 -733870 -573408 -454456 -474478 -593942 -697993 -715905 -678661 -669356 -724761
34379 -724761 -801646 -844787 -855460 -864054 -866094 -834277 -778197 -737187 -715055 -676220 -618717 -601317
34367 -601317 -670639 -792886 -886430 -905581 -870415 -825478 -793511 -774133 -769654 -787458 -810688
34356 -810688 -795350 -729444 -677467 -714967 -818020 -876375 -834607 -760476 -739806 -760597 -749124
34345 -749124 -675556 -574925 -503512 -516511 -635504 -785810 -829899 -734678 -638890 -661301 -713851
34334 -713851 -641132 -495052 -490482 -677644 -844159 -813813 -683129 -647788 -716039 -737417 -647319
34323 -647319 -539133 -512878 -569359 -656706 -729556 -753097 -723562 -696367 -733815 -818986 -876660
34312 -876660 -879946 -875468 -896503 -913593 -889477 -829744 -758831 -694838 -668843 -716290 -814636 -873407
34300 -873407 -829792 -725288 -647670 -625432 -629406 -657230 -745389 -882522 -973771 -940446 -826258
34289 -826258 -749975 -756052 -766190 -699850 -595670 -565460 -649286 -772519 -849524 -875688 -893175
34278 -893175 -910474 -896655 -831974 -727785 -612812 -531908 -537258 -635900 -754613 -801472 -761119
34267 -761119 -689444 -622728 -550606 -485747 -489654 -589354 -720287 -802863 -839142 -878064 -912728
34256 -912728 -881351 -769271 -648395 -596945 -621443 -673748 -707973 -702690 -662711 -626115 -645343
34245 -645343 -732521 -834226 -880326 -852116 -793190 -763124 -784802 -822151 -808404 -719813 -623438
34234 -623438 -615903 -700509 -766733 -723834 -618227 -568892 -607199 -641764 -588610 -482411 -428209
34223 -428209 -472388 -558365 -606325 -606442 -612951 -655287 -690039 -666717 -616070 -619264 -687859 -739695
34211 -739695 -725558 -716358 -801287 -941444 -1004023 -927862 -781379 -661629 -613835 -655895 -790556
34200 -790556 -952122 -1016670 -930956 -790641 -732183 -773398 -814511 -778326 -692396 -631602 -627811
34189 -627811 -655616 -680269 -693157 -700010 -692829 -658139 -619094 -635863 -727980 -817791 -805613 -699127
34177 -699127 -610524 -615030 -673922 -721974 -765269 -841030 -926813 -954535 -901913 -823256 -789578 -820802
34165 -820802 -870387 -869096 -803518 -749242 -785787 -879132 -911773 -843827 -766324 -759762 -787023 -787621
34153 -787621 -789683 -835267 -868540 -819554 -754764 -808491 -971282 -1075235 -1013261 -866203 -778283
34142 -778283 -795655 -864073 -907393 -870502 -753302 -638303 -624647 -706588 -776074 -763873 -707179
34131 -707179 -657532 -609269 -560535 -560261 -633390 -724887 -776355 -798948 -815739 -797760 -726455 -663409
34119 -663409 -680512 -758029 -816972 -814626 -750292 -629423 -496548 -452232 -543536 -669646 -690813
34108 -690813 -610217 -553963 -585909 -644118 -663358 -661660 -684927 -746854 -841602 -941337 -972104 -878816
34096 -878816 -730707 -666484 -702991 -698043 -556012 -374407 -309082 -371587 -453207 -495560 -535983
$$ [...]
##END NTUPLES=NMR SPECTRUM
##END=
