##TITLE=31Pdec_LR-668-RM1
 , 24 sc
 8.4.2019
##JCAMPDX= 6.0         $$ Bruker NMR JCAMP-DX V2.0
##DATA TYPE= NMR SPECTRUM
##DATA CLASS= NTUPLES
##ORIGIN= UXNMR, Bruker Analytische Messtechnik GmbH
##OWNER= root
$$ XWIN-NMR		Version 3.5
$$ Mon Apr  8 15:53:15 2019 Russian Standard Time (UT+4h)  she@DPX200
##.OBSERVE FREQUENCY= 81.013821
##.OBSERVE NUCLEUS= ^31P
##.ACQUISITION MODE= SIMULTANEOUS
##.ACQUISITION SCHEME= undefined
##.AVERAGES= 24
##.DIGITISER RES= 17
##SPECTROMETER/DATA SYSTEM= spect
##.PULSE SEQUENCE= zgpg30
##.SOLVENT NAME= CDCl3
##.SHIFT REFERENCE= (INTERNAL, CDCl3, 0, 182.463)
##AUDIT TRAIL= $$ (NUMBER, WHEN, WHO, WHERE, WHAT)
$$ ##TITLE= Audit trail, XWIN-NMR		Version 3.5
$$ ##JCAMPDX= 5.01
$$ ##ORIGIN= Bruker BioSpin GmbH
$$ ##OWNER= she
$$ F:/spectra/data/she/nmr/P31/1/pdata/1/auditp.txt
$$ ##AUDIT TRAIL=  $$ (NUMBER, WHEN, WHO, WHERE, WHAT)
(   1,<2019-04-08 15:51:53.20 +0400>,<she>,<DPX200>,
      <created by zg, POWCHK disabled, PULCHK disabled
       configuration hash MD5:
       00 E9 B6 7A A2 85 ED C7 34 08 36 98 17 FE 4E 26
       data hash MD5: 32K
       F4 E7 22 33 84 50 42 65 EF CD F3 D4 73 74 23 50>)
(   2,<2019-04-08 15:51:55.59 +0400>,<she>,<DPX200>,
      <Start of raw data processing
       efp BC_mod = 2 LB = 1 FT_mod = 6 PKNL = 1 PHC0 = -1816.332 PHC1 = 98.999 SI = 64K 
       data hash MD5: 64K
       14 32 87 33 2D AD 8C 51 BA 64 7E 94 B2 52 07 CF>)
(   3,<2019-04-08 15:52:19.56 +0400>,<she>,<DPX200>,
      <pk PHC0 = -22.81486 PHC1 = 33 
       data hash MD5: 64K
       22 13 94 BA 55 B2 E6 EB 96 14 1B FB 66 4B D5 B2>)
$$ ##END=
$$ 
$$ hash MD5
$$ 6F 45 AA 97 B1 48 DA 06 6B 15 1E A6 6E 29 A2 15
##$RELAX= 
##$RELAX= 
##$RELAX= 
##$RELAX= 
##$RELAX= 
##$RELAX= 
##$RELAX= 
##$RELAX= 
$$ Bruker specific parameters
$$ --------------------------
##$DU= <F:/spectra>
##$EXPNO= 1
##$NAME= <P31>
##$PROCNO= 1
##$TYPE= <nmr>
##$USER= <she>
##$AMP= (0..31)
100 100 100 100 100 100 100 100 100 100 100 100 100 100 100 100 100 100 
100 100 100 100 100 100 100 100 100 100 100 100 100 100 
##$AQSEQ= 0
##$AQ_mod= 1
##$AUNM= <au_zg>
##$AUTOPOS= <>
##$BF1= 81.014009
##$BF2= 200.13
##$BF3= 200.13
##$BF4= 200.13
##$BF5= 200.13
##$BF6= 200.13
##$BF7= 200.13
##$BF8= 200.13
##$BYTORDA= 1
##$CFDGTYP= 0
##$CFRGTYP= 5
##$CHEMSTR= <none>
##$CNST= (0..31)
1 1 145 1 1 1 1 1 1 1 1 1 1 1 1 1 1 1 1 1 1 1 1 1 1 1 1 1 1 1 1 1 
##$CPDPRG= <waltz16>
##$CPDPRG1= <>
##$CPDPRG2= <waltz16>
##$CPDPRG3= <>
##$CPDPRG4= <mlev>
##$CPDPRG5= <mlev>
##$CPDPRG6= <mlev>
##$CPDPRG7= <mlev>
##$CPDPRG8= <mlev>
##$CPDPRGB= <>
##$CPDPRGT= <>
##$D= (0..31)
0 1 0 0 0 0 0 0 0 0 0 0.03 2e-05 3e-06 0 0 0 0 0 0 0 0 0 0 0 0 0 0 0 0 
0 0 
##$DATE= 1554724312
##$DBL= (0..7)
120 120 120 11 120 120 24 19 
##$DBP= (0..7)
150 150 150 150 150 150 150 150 
##$DBP07= 0
##$DBPNAM0= <>
##$DBPNAM1= <>
##$DBPNAM2= <>
##$DBPNAM3= <>
##$DBPNAM4= <>
##$DBPNAM5= <>
##$DBPNAM6= <>
##$DBPNAM7= <>
##$DBPOAL= (0..7)
0.5 0.5 0.5 0.5 0.5 0.5 0.5 0.5 
##$DBPOFFS= (0..7)
0 0 0 0 0 0 0 0 
$$ [...]
##$SUBNAM2= <"">
##$SUBNAM3= <"">
##$SUBNAM4= <"">
##$SUBNAM5= <"">
##$SUBNAM6= <"">
##$SUBNAM7= <"">
##$SUBNAM8= <"">
##$SUBNAM9= <"">
##$SW= 369.568048894756
##$SWIBOX= (0..15)
0 1 3 0 0 0 0 0 0 0 0 0 0 0 0 0 
##$SW_h= 29940.119760479
##$TD= 32768
##$TD0= 1
##$TE= 0
##$TE2= 300
##$TE3= 300
##$TEG= 300
##$TL= (0..7)
0 120 53 12 22 120 120 120 
##$TP= (0..7)
150 150 150 150 150 150 150 150 
##$TP07= 0
##$TPNAME0= <>
##$TPNAME1= <>
##$TPNAME2= <>
##$TPNAME3= <>
##$TPNAME4= <>
##$TPNAME5= <>
##$TPNAME6= <>
##$TPNAME7= <>
##$TPOAL= (0..7)
0.5 0.5 0.5 0.5 0.5 0.5 0.5 0.5 
##$TPOFFS= (0..7)
0 0 0 0 0 0 0 0 
##$TUNHIN= 0
##$TUNHOUT= 0
##$TUNXOUT= 0
##$USERA1= <user>
##$USERA2= <user>
##$USERA3= <user>
##$USERA4= <user>
##$USERA5= <user>
##$V9= 5
##$VALIST= <valist>
##$VCLIST= <CCCCCCCCCCCCCCC>
##$VD= 0
##$VDLIST= <DDDDDDDDDDDDDDD>
##$VPLIST= <PPPPPPPPPPPPPPP>
##$VTLIST= <TTTTTTTTTTTTTTT>
##$WBST= 1024
##$WBSW= 4
##$XGAIN= (0..3)
0 0 0 0 
##$XL= 0
##$YL= 0
##$YMAX_a= 137246
##$YMIN_a= -248160
##$ZGOPTNS= <>
##$ZL1= 120
##$ZL2= 120
##$ZL3= 120
##$ZL4= 120
##$ABSF1= 0
##$ABSF2= 0
##$ABSG= 0
##$ABSL= 0
##$ALPHA= 0
##$AQORDER= 0
##$ASSFAC= 0
##$ASSFACI= 0
##$ASSFACX= 0
##$ASSWID= 0
##$AUNMP= <proc_1d>
##$AZFE= 0.1
##$AZFW= 0.5
##$BCFW= 0
##$BC_mod= 2
##$BYTORDP= 0
##$COROFFS= 0
##$CY= -3
##$DATMOD= 1
##$DC= 0
##$DFILT= <>
##$DTYPP= 0
##$F1P= 0
##$F2P= 0
##$FCOR= 1
##$FTSIZE= 65536
##$FT_mod= 6
##$GAMMA= 0
##$GB= 0
##$INTBC= 1
##$INTSCL= 5.30512e-09
##$ISEN= 30
##$LB= 1
##$LEV0= 0
##$LPBIN= 0
##$MAXI= 10000
##$MC2= 0
##$MEAN= 0
##$ME_mod= 0
##$MI= 50
##$NCOEF= 0
##$NC_proc= -1
##$NLEV= 6
##$NOISF1= 182.463
##$NOISF2= 159.3651
##$NSP= 0
##$NTH_PI= 0
##$NZP= 0
##$OFFSET= 182.463
##$PC= 4
##$PHC0= -1839.147
##$PHC1= 131.999
##$PH_mod= 1
##$PKNL= yes
##$PPARMOD= 0
##$PSCAL= 0
##$PSIGN= 0
##$REVERSE= no
##$SF= 81.0140089999434
##$SI= 65536
##$SIGF1= 159.3651
##$SIGF2= -187.1042
##$SINO= 113.3802
##$SIOLD= 16384
##$SREGLST= <1H.CDCl3>
##$SSB= 0
##$STSI= 65536
##$STSR= 0
##$SW_p= 29940.119760479
##$SYMM= 0
##$S_DEV= 0
##$TDeff= 32768
##$TDoff= 0
##$TI= <>
##$TILT= no
##$TM1= 0
##$TM2= 0
##$TOPLEV= 0
##$USERP1= <user>
##$USERP2= <user>
##$USERP3= <user>
##$USERP4= <user>
##$USERP5= <user>
##$WDW= 1
##$XDIM= 65536
##$YMAX_p= 320495919
##$YMIN_p= -1615351
$$ End of Bruker specific parameters
$$ ---------------------------------
##NTUPLES= NMR SPECTRUM
##VAR_NAME=  FREQUENCY,     SPECTRUM/REAL,   SPECTRUM/IMAG
##SYMBOL=    X,             R,               I
##VAR_TYPE=  INDEPENDENT,   DEPENDENT,       DEPENDENT
##VAR_FORM=  AFFN,          ASDF,            ASDF
##VAR_DIM=   65536,         65536,           65536
##UNITS=     HZ,            ARBITRARY UNITS, ARBITRARY UNITS
##FACTOR=    0.456856943014862, 1,           1
##FIRST=     14782.0589164792, 0,            0
##LAST=      -15158.0608439998, 0,           0
##MIN=       -15158.0608439998, -1615351,    0
##MAX=       14782.0589164792, 320495919,    0
$$ Real data points
##PAGE= N=1
##DATA TABLE= (X++(R..R)), XYDATA
$$ [...]
44808 -35075 -23956 46501 117922 110510 23509 -53956 -53025 -7258 7098 -23766 -51446 -44982
44796 -44982 -17314 17472 62484 112127 148877 168113 171861 143568 72223 -710 -9714 49300
44784 49300 109965 127381 130325 157404 189961 189243 165375 161157 183887 196984 175176 133393
44772 133393 99920 88299 100460 137072 195467 263991 321619 346085 332867 306398 296203
44761 296203 299418 287933 256732 236125 243633 255326 245550 224134 206831 179309 126825 74459
44749 74459 56308 64455 71840 85259 122052 149715 115945 40562 7893 50201 105751 121882
44737 121882 131647 179689 232169 228529 182894 159154 167644 163729 140742 143151 176640 185366 151174
44724 151174 145343 230092 359054 434502 431704 408876 414715 444856 481050 514615 525083 487374
44712 487374 417475 372296 384903 427484 451978 441524 410884 382813 375174 385553 379593 323530
44700 323530 237251 181024 177452 186121 174838 171569 212529 277698 320605 333543 339974 345946
44688 345946 343172 340559 349146 354561 347692 360214 420018 494303 534329 553818 593899 630333
44676 630333 603918 541366 547303 651840 758630 785681 774313 807063 895693 1013570 1167008
44665 1167008 1356658 1525504 1631722 1735547 1934512 2246331 2634879 3117295 3755809
44656 3755809 4568833 5538656 6666013 7879051 8884696 9271470 8855425 7854852 6665612
44647 6665612 5534683 4504938 3577448 2799386 2209183 1793394 1515926 1339858 1220299
44638 1220299 1122256 1047456 1008081 982332 937085 886879 881407 929925 985009 1016903 1063358
44627 1063358 1179999 1370952 1601166 1860570 2174567 2537609 2859093 3003332 2893219
44618 2893219 2569063 2144566 1719722 1346247 1052906 859875 755991 693214 627754 554074
44608 554074 486446 427523 373778 332859 311041 296171 276327 263087 270166 279178 257057 203484
44596 203484 150768 117283 93356 77526 90362 135259 176473 182419 169662 174508 195380 197935
44584 197935 173612 155677 166187 180190 166902 142890 149680 187306 208561 186807 154952 156683
44572 156683 185073 197784 177109 143880 119738 107159 105484 115555 124334 114907 99479 111970
44560 111970 154779 183091 162181 114191 83734 79809 80841 78980 85075 98685 106864 111115 125790
44547 125790 148308 158529 151760 147228 158113 176734 195771 220172 249102 269708 280942 300941
44535 300941 335551 360939 356587 337013 329583 338642 356844 393948 459455 529780 580839 655992
44523 655992 842984 1146405 1422455 1496641 1341771 1099016 924834 859833 853746 864253
44513 864253 890592 940051 1013438 1125047 1301254 1549579 1850341 2180305 2515192 2797285
44503 2797285 2932371 2854601 2593764 2257348 1941976 1674716 1440057 1239366 1100005 1030153
44493 1030153 991232 932346 841968 748013 672475 608490 544896 489124 452740 432556 421947
44482 421947 426633 453063 493657 538914 590032 643639 683144 707898 749740 826855 895924 889753
44470 889753 796445 663512 530530 402952 290207 213833 163498 98332 17842 -16962 30477
44459 30477 104214 116231 49458 -37267 -84655 -76351 -27638 28214 53650 42045 30702 51536
44447 51536 85352 95640 85953 83328 84052 65455 39973 41671 59664 42708 -17795 -63228 -47864
44434 -47864 3082 42180 63637 83594 92038 68896 30204 16881 41195 73006 76666 41065
44422 41065 -18796 -67155 -62313 6269 95018 143175 135822 112039 110444 129606 148403 161211
44410 161211 175454 188633 188223 171181 149179 134854 132448 139615 148425 148229 141057 151690 203606
44397 203606 280486 330728 321198 271726 225930 205028 204163 213872 223017 217939 204727 214552 254897
44384 254897 274962 225209 139492 101666 129758 155149 130875 94852 94183 108840 98186 72270
44372 72270 60974 52910 25051 18 10217 31472 20053 -5102 8518 47696 45071 -5865
44360 -5865 -29879 13696 68250 69183 34373 22766 50016 88108 112666 111830 78650 30616 11367
44347 11367 41270 88272 111860 109122 94644 68771 36049 21507 31822 30246 -8763 -46697
44335 -46697 -30273 25338 54668 36222 16935 37014 77041 97862 97542 101665 116127 119228
44323 119228 102197 96940 144419 235020 302308 296907 252829 246794 293995 326316 287684 209687
44311 209687 164705 177157 216391 252694 279337 290227 273323 228208 169413 115130 83594
44300 83594 84948 102051 100579 76134 65148 86725 107111 96057 83817 113146 161406 170106
44288 170106 138149 122599 148848 183667 206140 241520 301542 347137 343857 311552 285847 267538
44276 267538 244990 233469 252242 285751 304652 306527 301169 276678 223249 176780 188830 251443
44264 251443 297301 285896 249138 233285 234232 222350 204209 217507 271774 331308 362419 370469
44252 370469 383083 419855 484448 559465 597628 548616 419074 283802 210763 194125 188520
44241 188520 183120 197153 220167 215906 187540 181558 212315 236470 225171 210511 228995 265367
44229 265367 289526 306500 328105 335647 319223 317254 362370 420939 448129 474841 568752 728516
44217 728516 897379 1074176 1315259 1600549 1784131 1736267 1488905 1192589 960773 796983
44207 796983 648869 488096 337785 243885 223109 241111 252224 247327 236582 205640 140095
44196 140095 83591 102573 181022 221406 179628 128944 144160 190025 192407 167196 191230 268928
44184 268928 316569 283677 215416 174854 164080 152733 139396 146069 174163 198261 197638 176619
44172 176619 156659 156558 177848 206927 232495 255648 279399 299645 315559 336000 362400 377980
44160 377980 369616 347952 329304 313134 300154 318054 397798 528427 665482 789032 930657
44149 930657 1133577 1393736 1636925 1748073 1644457 1350782 999101 729138 584510 516118
44139 516118 467349 421179 372069 300432 198415 97401 46506 67632 136937 203690 228728
44128 228728 215499 200965 206933 211994 188434 150405 134872 144710 149258 140675 147486 181485 211753
44115 211753 211900 198442 195726 192256 165668 131910 132399 177333 232199 262625 269085 270956 273450
44102 273450 261648 223096 169775 132593 129243 142375 142428 130643 140126 187558 243111 262183
44090 262183 234254 187700 157453 159394 184898 208359 210829 205469 223489 263291 276987 231778
44078 231778 165696 148666 196578 258377 286550 284354 277224 273640 271217 272029 269876 246061 203606
44065 203606 186810 234828 323230 381759 370744 314905 259887 222719 195219 171833 154928
44054 154928 144901 140963 144504 152050 155788 160821 186166 233328 271717 279468 283161 322782 384815
44041 384815 411749 383216 346587 353570 406761 486972 586080 679948 718317 696244 696705 790855
44029 790855 918976 954890 886203 837734 892000 979956 1005130 997101 1060008 1218213 1402684
44018 1402684 1569045 1744815 1960114 2200375 2430719 2605793 2655684 2531599 2279657 2009640
44008 2009640 1779266 1571675 1394070 1311019 1341329 1403245 1424764 1447478 1554215 1746171
43998 1746171 1966602 2200699 2460060 2688892 2779014 2684967 2455744 2154223 1818348 1502936
43988 1502936 1273726 1131320 1006760 859737 722152 622725 537511 450246 394679 389186
43978 389186 387189 345988 294796 278540 281319 268003 258692 289481 331919 330113 297319 293351
43966 293351 313592 285737 188110 94328 77017 131347 217122 310496 378569 365067 257900
43955 257900 136846 101948 168509 266734 328716 344060 342745 353261 374004 370672 312487 220451
43943 220451 157996 157776 181738 175754 140515 119466 134262 164804 183939 182200 164519 150674
43931 150674 172796 239765 304780 305986 251294 225758 286008 373835 377529 272407 153383
43920 153383 114758 143655 166884 163206 169593 196288 212988 228784 304346 444133 547144
43909 547144 526915 426756 346161 301768 248023 197207 210357 280257 336821 378591 480745
43898 480745 636749 708884 604390 407750 260947 192866 152226 132361 152587 165812 106536
43887 106536 15540 6104 100930 198995 219417 190427 171361 168209 165987 178617 217039 250519
43875 250519 244358 210370 187780 194876 223789 263833 308338 351291 391632 432075 470073 500792
43863 500792 524175 533740 511256 457080 409373 397690 392553 347636 282759 267847 319977 375167
43851 375167 379328 351447 330190 310464 272146 231074 215956 218919 209432 182077 157335 147218
43839 147218 148462 158304 170861 167734 137290 97274 78062 88992 117425 153012 195163 240998
43827 240998 280512 302685 301027 280427 261605 264776 282903 287206 266618 242648 234512 231678
43815 231678 218727 206625 213196 225320 210530 164830 122812 113595 126396 130830 117136 99778
43803 99778 86699 66396 35558 22470 57983 126198 174362 182677 193328 245846 311695 331438
43791 331438 298440 257559 228507 189391 147502 161206 248528 322563 283553 158375 81294
43780 81294 126477 219368 244755 192845 144478 140386 137856 104385 82924 120894 182900 193996
43768 193996 146492 102950 100564 111750 103250 78016 47174 13139 -5259 17025 60609 75771
43756 75771 63250 78230 131112 156291 117089 68658 66095 81643 75446 78852 130186 187722
43744 187722 193083 173561 193575 244815 272395 272850 276861 271022 231338 202141 243433 326607
43732 326607 378841 400830 438099 467980 431765 359147 343060 400716 466160 502584 516036
43721 516036 489601 422070 393649 463980 552061 561336 561430 669831 819940 860887 829912 878036
43709 878036 975488 980045 962115 1125955 1423451 1637207 1853619 2378947 3140729 3794596
43699 3794596 4610021 6445817 9261022 11328208 10859900 8156756 5267572 3622977
43691 3622977 2898588 2252465 1644733 1444985 1512364 1389016 1041195 803326 777145 770795
43681 770795 707933 679136 663498 558210 437975 477396 652446 790577 876266 1042687
43671 1042687 1287816 1454942 1488723 1473780 1418013 1231415 945581 735682 673134 641267
43661 641267 547999 452302 421440 418608 402617 406810 446075 457038 403247 347982 353627 383528
43649 383528 368984 316980 292065 326212 389495 431261 431547 426228 476536 593901 719422 810619
43637 810619 910419 1074478 1261864 1364587 1327601 1182723 990154 808439 692012 645839
43627 645839 602959 511635 415306 378054 372559 331445 275263 283957 356531 405089 388332 353063
43615 353063 337772 328150 317866 325340 338234 323096 298456 316564 366839 383668 358102 351995
43603 351995 389026 425350 449416 517839 660623 833746 995720 1149648 1279250 1328396
43593 1328396 1284208 1203216 1115323 979767 782497 600590 509314 482764 444123 369319 290732
43582 290732 236555 211219 208214 213434 222059 259703 343334 420508 412804 331793 279006 309221
43570 309221 370017 404496 429354 467928 490766 485147 512951 630114 804243 975981 1145577
43559 1145577 1327035 1467010 1493272 1416544 1310016 1205279 1074587 904732 727753 579138
43549 579138 469595 395598 345845 305940 280425 292164 339265 380365 386533 375781 371554 365388
43537 365388 349921 345840 359570 357441 323946 302789 331802 377559 389193 381776 405932 460552
43525 460552 496807 494499 480714 480784 493209 503876 493506 449674 398590 393233 438705 471668
43513 471668 454160 436122 466738 495815 443661 333759 266508 277538 309709 320529 329550
43502 329550 350465 359519 354666 375284 433057 480318 477741 449086 444244 486148 570300 674618
43490 674618 750847 745835 653956 522617 400239 311833 280998 319146 379431 380239 304740 229127
43478 229127 218890 243651 238162 206827 208597 257453 300020 297906 282497 305730 368602 427968
43466 427968 458549 475267 492549 494507 467726 441066 454931 495890 505366 464637 427029 439467
43454 439467 474319 482009 477814 516960 595574 638975 600250 521893 477876 488569 516524 523103
43442 523103 504637 482664 478189 498040 538445 592169 643614 664589 637567 584954 548513 535263
43430 535263 518858 501821 523859 582027 601528 536051 446348 415750 433402 439776 447266 511728
43418 511728 600204 604892 508867 429002 449519 507053 501370 439329 392452 372876 339996 296727
43406 296727 291495 331419 368377 383301 427302 553991 741333 902133 963526 932146 885172
43395 885172 890428 933815 944586 896036 847195 864679 937166 1001330 1027154 1037980 1064020 1119709
43383 1119709 1215782 1342391 1434444 1403759 1234023 1017027 867054 812936 796117 760745
43373 760745 711784 679832 663536 637978 605989 598835 615147 600343 522468 443058 461867 591966
43361 591966 735972 798270 779587 739973 708712 670575 620386 586013 591671 625056 652036
43350 652036 652491 634432 617803 610988 607388 604876 619841 674129 774356 911150 1067807 1219462
43338 1219462 1341193 1436235 1536689 1646733 1703898 1639936 1472730 1291086 1148271 1020702
43328 1020702 879402 746102 654393 603520 582714 601650 661929 731132 780362 820802 872399
43317 872399 927509 984068 1087406 1289648 1572916 1847456 2025871 2083693 2062700 2033084
43307 2033084 2031047 2012816 1896257 1671416 1435951 1285540 1202137 1098110 945654 805756
43297 805756 738672 739917 767499 788633 793812 799522 841982 942811 1083566 1231905 1370096
43286 1370096 1468054 1464940 1336910 1162618 1052432 1017207 973875 878407 775223 703571 640908
43275 640908 574357 549571 594399 655825 672760 661467 667405 679961 669119 671213 751831 895344
43263 895344 1014782 1076656 1137569 1235941 1317679 1306550 1196848 1038068 870191 715763
43253 715763 601769 540779 505965 463339 417241 391434 380260 357819 327917 322887 349677
43242 349677 375081 374350 360986 354277 348653 336176 332557 351380 367954 341143 270741 208829
43230 208829 206193 258742 312076 314991 268819 225063 228620 264401 275188 236235 189483 188453
43218 188453 231886 278988 313716 357075 419770 481655 528037 574426 638675 711766 772563
43207 772563 812906 835217 848462 885119 995676 1190009 1392943 1495275 1457304 1338411
43197 1338411 1219919 1128221 1047872 976196 925475 884723 827214 764756 750188 802822 873964
43186 873964 925402 1001671 1165657 1399875 1663782 2030251 2621698 3347246 3832341 3751436
43176 3751436 3188144 2541803 2098174 1819051 1549243 1266413 1047724 908140 792420
43167 792420 681848 610177 586262 572705 539719 490788 439561 400063 390355 409853 423376
43156 423376 401929 369741 378749 444061 532691 608253 661884 706203 758192 819051 859049 841291
43144 841291 773936 714273 705597 738514 788594 850110 905899 911512 855246 797994 801451 841666
43132 841666 844699 787631 711924 651720 604448 569198 562589 586021 611017 607006 567039 510107
43120 510107 472653 485772 545860 620841 690821 757820 815182 850105 881993 943613 1012930
43109 1012930 1028932 991610 970324 994204 1028570 1084338 1225009 1411880 1487951 1408921 1345801
43098 1345801 1438935 1600591 1711345 1851150 2138495 2497714 2830013 3265862 3960846 4814846
43088 4814846 5791070 7335523 9828640 12519889 13703085 12406354 9510356 6762120
43080 6762120 5017686 3925960 3000678 2273574 1882194 1665703 1432200 1240245 1177690
43071 1177690 1135305 1002627 867329 835256 835123 770368 703761 723963 760765 694118 546463
43060 546463 427361 372832 358353 384440 434900 431816 342529 257192 259300 296769 282396 241495
43048 241495 248123 285723 288282 264668 270301 300913 318042 337241 392589 456343 490723 535733
43036 535733 644163 766927 805110 746253 653417 551823 427525 311258 257586 252992 239157
43025 239157 215565 229807 279757 314579 322304 333125 350912 364301 403607 494763 576816 564711
43013 564711 481316 427031 429116 426522 398216 392825 421375 430571 404345 394114 425223 461760
43001 461760 481717 501997 519034 513585 519085 587640 682886 711200 666104 630135 627341 600350
42989 600350 548048 544928 591078 587916 511823 468111 511778 557908 542463 530585 582497 650476
42977 650476 698492 784949 929375 1037331 1061408 1092332 1182971 1243433 1235371 1291986 1491697
42966 1491697 1700398 1822657 2012034 2410159 2886132 3308465 3859376 4746006 5848276
42957 5848276 7121477 9092443 12183455 15466943 16914563 15381688 11887975 8485517
42949 8485517 6250649 4868713 3776151 2920048 2402118 2072667 1764206 1548219 1513512
42940 1513512 1532425 1436931 1245324 1065122 921874 805307 747083 739866 695732 580069
42930 580069 480190 462620 472733 451261 435399 460616 472867 431821 402059 442521 490376
42919 490376 455240 358912 287312 265931 271891 308521 374622 411361 373490 313679 310218 348932
42907 348932 362375 350910 372902 435250 481742 484806 476164 489149 529749 595804 669615 704815
42895 704815 675322 622534 601091 597863 562228 495422 445090 427195 421422 433620 492045 583286
42883 583286 659928 715841 790321 892749 987625 1064157 1157465 1284883 1417839 1529771 1613031
42872 1613031 1636228 1555666 1398887 1270694 1233160 1233250 1192817 1116081 1051623 995621 908581
42861 908581 807920 768140 821731 916723 987183 1020688 1037479 1042290 1026910 999313 982151
42850 982151 989493 1023522 1089891 1202005 1371130 1599107 1871576 2142331 2328779 2348193
42840 2348193 2177011 1872442 1530317 1226061 994384 841620 753060 696250 645301 607692
42830 607692 608035 642202 670593 666157 646926 646461 670825 701568 724004 731558 715015 671163 616287
42817 616287 570751 533692 491226 446784 424005 436617 469188 492400 491247 478516 483930 523900
42805 523900 576346 594255 553813 483439 438071 450690 512006 584406 627695 623959 587909 545242
42793 545242 500231 443296 391729 389480 447911 517231 546421 549238 577075 642658 708888 747251
42781 747251 770224 801389 841226 870224 870210 842663 817987 836670 903927 976856 1019456 1053798
42769 1053798 1124631 1227347 1313444 1364724 1418365 1511584 1643762 1809315 2029481 2324331
42759 2324331 2676780 3045977 3393014 3667898 3793102 3702168 3404529 2994501 2587656 2251786
42749 2251786 1992260 1783692 1603482 1442411 1300044 1179931 1085857 1014833 954141 892202
42739 892202 832446 789139 769110 765336 769055 779803 801063 830368 853290 848837 814583 789977
42727 789977 829224 934017 1040497 1097760 1127092 1171438 1232783 1315364 1480036 1774612 2165210
42716 2165210 2651553 3378366 4412312 5389283 5653392 4925013 3671511 2627490 2067963
42707 2067963 1750409 1438982 1175554 1035373 925652 757631 616151 609524 681186 703216
42697 703216 662083 631372 631584 627602 616101 621614 640984 662822 703017 761364 790638 768111
42685 768111 746540 773256 812431 812579 795767 805980 819094 785458 724114 696075 713965 749060
42673 749060 794732 849941 873665 835476 785025 792223 842153 869858 875553 913465 977243 993269
42661 993269 937412 872368 849487 847810 833734 814479 803447 786702 752161 708634 652277 551721
42649 551721 388113 183367 -19986 -179367 -255069 -233798 -156920 -89768 -54673 -23383 25077
42638 25077 75458 108905 129546 149125 169087 181609 172095 129516 71884 42058 55053 76579
42626 76579 83136 105891 169948 229389 225796 182324 168575 192114 201132 182852 177412 193932
42614 193932 194234 170988 165935 193699 217993 221705 232310 258055 267027 252964 256467 295772 338197
42601 338197 361476 377713 377141 325891 251206 247540 349951 472961 527836 533993 557827 606612
42589 606612 649616 687643 729837 747657 722449 697027 708992 713576 651204 558027 523057 554686
42577 554686 575246 540356 481091 426625 367020 307631 285846 306842 322866 305245 287019
42566 287019 306312 352601 398358 442044 484655 498590 462589 408904 394915 431557 471353
42555 471353 471003 440880 420648 422037 416997 383565 342154 327486 335682 329088 297195 281182 321538
42542 321538 408080 503526 589887 659831 684597 636544 542016 471332 465074 497843 524899 538895
42530 538895 564554 615907 679406 734709 778435 824507 883998 946417 985980 992734 995580 1048602
42518 1048602 1198039 1471319 1890721 2464257 3127165 3693821 3920233 3677805 3080115
42509 3080115 2403139 1860555 1478997 1190560 975108 853614 792992 713793 594870 494398
42499 494398 451787 435192 407434 380370 373703 375246 372586 371055 352353 278760 177390 150592
42487 150592 241970 351909 359934 283364 232942 249346 278587 291160 323676 390796 444374
42476 444374 450171 438776 448786 472042 484588 486884 484288 465261 426931 392600 380406 379282
42464 379282 373526 366890 367330 371521 377676 391680 410679 422754 428641 437998 439336 405066 336957
42451 336957 276772 258509 275618 304352 329089 332642 295690 227478 170536 152481 154114 144086
42439 144086 123169 113692 126225 159723 216240 289748 353372 383696 391183 405067 433545 459403
42427 459403 472243 485536 520384 588007 690476 822488 961619 1063567 1080670 995350 840057
42416 840057 682087 579686 543161 535079 510658 461130 416681 404656 411807 402510 372667 357540
42404 357540 369908 361673 285570 175123 110956 113319 128095 126505 148697 218385 281954 284033
42392 284033 250612 238712 248858 252230 263069 306529 344805 321940 266760 261206 309405 332562
42380 332562 305804 301453 361114 416660 397206 343574 346012 414843 482114 503168 492244 470776
42368 470776 438053 396686 366981 365378 387057 412690 424832 423855 430294 459031 494438 513246
42356 513246 526349 564227 623387 670079 700720 749800 828483 909677 989338 1100360 1238302
42345 1238302 1340428 1383650 1442524 1594476 1822816 2076206 2362865 2690420 2947090 2957623
42335 2957623 2675814 2242873 1834426 1515061 1261875 1057624 910906 823156 780197 762456
42325 762456 744248 703314 646736 607092 600855 611469 622482 643633 695117 790860 944957
42314 944957 1165255 1432334 1722932 2068714 2535577 3089932 3518637 3564113 3166709 2534950
42304 2534950 1955638 1565364 1320620 1132239 960975 798895 639227 498941 421711 416678
42294 416678 427267 402773 370953 387987 440827 466379 460184 490241 588149 700808 783159
42283 783159 867958 988789 1091171 1092901 1001065 896904 820067 738479 631440 533479 477604
42272 477604 448525 417607 386265 370756 371883 379538 384682 371941 323437 247108 183105 165921
42260 165921 191961 232354 260777 259666 220061 153887 94711 68664 68741 68785 57681 48913 59496
42247 59496 90267 128769 164512 196275 226251 253157 274279 288291 288486 260188 201478 146382
42235 146382 145927 214149 306653 365010 372174 354899 346275 361556 399717 449257 494612 529899
42223 529899 565338 613078 671970 732364 786992 828656 846443 835318 803968 763994 714076
42212 714076 639791 528692 389811 263274 198282 205019 239281 255712 260952 282267 301486
42201 301486 272355 200692 147585 140561 140978 121449 114205 146850 185827 187738 158500 117153
42189 117153 52046 -32882 -77452 -37750 37355 70033 62534 71747 102372 104810 65653 22439
42177 22439 -7182 -37132 -54298 -22534 45496 87516 76236 47210 33681 31705 38713 67536
42165 67536 109572 137719 154278 182458 208448 194621 154561 144623 169293 168607 119100 72836
42153 72836 68657 77081 66734 55256 55395 38515 -3395 -22319 11543 58053 75713 81922 95076
42140 95076 80331 15598 -45182 -45037 -13449 -11321 -28431 -12841 30779 53814 53374 68038 93655
42127 93655 82398 29748 -7351 8197 51108 84961 105647 119122 119445 106980 97035 97317 101006
42114 101006 108316 131237 170691 206243 211991 175695 111835 61818 58954 81719 72050 16976
42102 16976 -27001 -17738 10167 9734 4498 46600 121002 158291 131699 82216 52004 45091 51388
42089 51388 63147 69783 73748 99105 147506 171555 141025 104868 122758 163024 149451 92046
42077 92046 76691 123143 152618 119322 79639 90362 122828 130898 130880 150723 159052 115668 52967
42064 52967 38354 78567 119979 127844 113633 95918 81819 80418 92447 90050 44152 -27684
42052 -27684 -72308 -63632 -31073 -21659 -48958 -81077 -71848 -8981 64857 90876 57672 8784
42040 8784 -15866 -19560 -21002 -19996 -12812 -13867 -32902 -49491 -39771 -15931 -11039 -31733 -50163
42027 -50163 -39483 1175 52968 91820 99072 71377 22125 -29101 -64418 -70242 -48418 -23878
42015 -23878 -21097 -31838 -28180 -6065 13733 27794 53424 82086 75800 30442 -3176 8691
42003 8691 33725 35134 39021 86236 148173 154563 94308 30317 13847 34300 57801 69180
41991 69180 67346 59140 66022 100986 135797 132271 109618 129692 200097 246535 213441 143780
41979 143780 113053 121138 106595 47820 -11876 -37485 -40740 -32932 3812 68233 110095 93801
41967 93801 61793 83421 155546 206381 194723 151080 112410 73636 28737 5192 14950 14234
41955 14234 -34454 -90435 -83399 -14846 50155 81826 109749 146740 158662 129539 94996 82383
41943 82383 71098 45343 37378 78171 142880 183905 187530 166977 134735 113828 136453 192106
41931 192106 216214 175129 124712 133502 182547 198858 158522 95093 31879 -25598 -48257 -7421
41919 -7421 67387 121950 158850 212270 251707 203427 80259 -4191 14872 73122 89483 78787
41907 78787 93238 121195 118941 94375 82079 68729 20961 -31856 -20321 60315 134376 143777
41895 143777 107908 74137 56293 40246 15212 -17517 -43189 -34602 20035 88091 120713 113179
41883 113179 104807 113057 104743 49511 -29282 -80226 -79626 -42153 5359 39490 43550 17469 -20182
41870 -20182 -51935 -74704 -85178 -69703 -27525 9738 7881 -23898 -40590 -17415 23156 47275
41858 47275 52632 61717 86216 116272 139378 151410 147210 117204 64212 15719 6396 44338
41846 44338 97093 114556 71695 -5026 -55964 -42314 16920 69649 89142 90623 89254 71676
41834 71676 29507 -5266 4162 39138 43131 3313 -27130 -4701 43421 61111 37686 7796
41822 7796 -3921 -3001 -616 -2705 -18158 -45690 -56545 -25831 18261 16776 -37500 -79713 -57126
41809 -57126 1864 34501 30030 26924 40933 45326 24151 -189 -6425 -3840 -2301 13252 49527
41796 49527 73210 50131 1083 -21249 -5998 5350 -14631 -43566 -54532 -58729 -76359 -93856
41784 -93856 -83222 -46381 -8413 21035 47785 64056 54159 26846 8673 3883 -6434 -22714
41772 -22714 -21568 -1723 3237 -22889 -49420 -47785 -37944 -50938 -70351 -54582 -5278 31617
41760 31617 33822 29924 47302 68872 63724 36662 20311 28127 39509 32316 12093 754 6024
41747 6024 14430 13523 7011 -124 -17139 -47724 -62378 -21927 63187 126899 119722 63682 14188
41734 14188 -8078 -17097 -15430 9175 47157 67204 56796 31666 4307 -24112 -39663 -21925
41722 -21925 17545 40334 36526 36612 51793 44351 -12726 -80783 -97605 -53332 9115 51822 67931
41709 67931 66320 64936 88139 136635 168251 143099 83163 51487 70835 96901 80096 25546
41697 25546 -20499 -25009 774 13539 -19400 -79119 -106025 -69602 -13715 -3675 -39173 -58537
41685 -58537 -27324 21470 44583 41622 30610 10346 -20809 -36236 -7339 53712 105054 120714
41673 120714 105084 73600 41230 22047 19157 18658 8286 -3428 1481 27610 64024 93499
41661 93499 96149 63054 20135 16355 65799 119566 120744 72246 23348 4010 4229 6684 3644
41648 3644 -13267 -43907 -61658 -40764 -2690 2688 -32937 -64997 -64125 -52797 -56711 -63990 -61575
41635 -61575 -71187 -108403 -138107 -119638 -75360 -60905 -77282 -70213 -20797 21752 18543 -259
41623 -259 9655 34424 31358 4648 -1113 24444 39718 15988 -21255 -32442 -14343 8895 22246
41610 22246 28694 37584 56885 81599 84289 42176 -18820 -41944 -18174 -6585 -48020 -102331
41598 -102331 -114774 -100668 -101243 -92215 -20559 84524 132531 108198 89038 104993 86314 -190
41586 -190 -67680 -41755 11566 -7894 -67720 -61728 5694 24596 -39117 -92746 -66709 -5284
41574 -5284 26350 29171 22152 -5668 -43701 -36279 32570 94577 93143 63894 61149 63999 27290
41561 27290 -22791 -26229 7798 17529 -4867 -1197 54707 112821 116254 67451 10647 -17813
41549 -17813 -12860 -375 -14905 -57113 -83601 -63756 -29137 -32003 -70934 -99140 -96197 -87305
41537 -87305 -94927 -113759 -134760 -155350 -163226 -145377 -115533 -100731 -102004 -101171 -101389 -121161 -149310
41524 -149310 -149298 -115073 -83398 -81574 -97976 -111835 -116730 -106415 -73412 -32962 -16102 -29114
41512 -29114 -49629 -66823 -89510 -109889 -101861 -66386 -35621 -17444 18913 81406 125634 116233
41500 116233 76454 42326 6564 -48736 -95076 -85950 -29989 10846 -3213 -48873 -75214 -54716
41488 -54716 -381 45141 38690 -23914 -95642 -120882 -91559 -50398 -40486 -61435 -74450 -45288
41476 -45288 16362 62197 58874 31781 36102 83212 120324 94160 15269 -54494 -65189 -19776
41464 -19776 36414 60932 57421 69616 119373 166581 160295 113426 80380 69952 41812 -6366
41452 -6366 -21821 7428 13790 -45040 -107294 -95875 -32975 6577 14403 37447 73506 68743
41440 68743 17430 -19985 -12636 -509 -17585 -36599 -20255 21958 57484 71679 61081 23351
41428 23351 -21641 -33385 3241 58693 98651 114054 103940 68417 32430 32704 59840 56173
41416 56173 -3398 -71895 -101664 -109683 -130509 -146424 -118522 -58765 -14313 2705 15553 25498
41404 25498 10612 -21265 -33286 -18361 -7067 -9407 146 25777 31468 4655 -9560 25060
41392 25060 72706 72073 20573 -31451 -53045 -54963 -50277 -39338 -34730 -56629 -91753 -94422 -46788
41379 -46788 11009 30396 10245 -16887 -32549 -41537 -48212 -50105 -49089 -48415 -43929 -36068 -43253
41366 -43253 -82182 -138457 -177635 -184430 -171315 -149059 -111182 -52845 14016 72452 113688 133370
41354 133370 128432 103234 66418 17727 -48685 -123759 -181140 -202378 -193398 -171577 -148876 -131755
41342 -131755 -123025 -116400 -101526 -81770 -76031 -95403 -126759 -145728 -140365 -120102 -106212 -109604
41330 -109604 -111657 -78339 -7332 53204 55775 11447 -29977 -43369 -37242 -15861 16678 20908
41318 20908 -47450 -160412 -231373 -225898 -200486 -206698 -221736 -212260 -201049 -215152 -225100 -200256
41306 -200256 -174998 -188482 -203376 -166668 -115189 -126990 -188280 -206620 -150262 -75476 -11305
41295 -11305 76743 183845 232144 188820 129909 128933 159235 170731 188602 251204 306520 270681
41283 270681 165562 103753 137694 206595 246267 275597 339636 422671 466319 449815 412300
41272 412300 400104 417698 434133 423753 393716 376030 399108 467250 558763 636971 673080
41261 673080 673430 677807 712849 753890 756240 717211 674972 648390 618503 576597 545940 536994
41249 536994 523151 487055 451466 432506 401716 336027 270965 253376 266085 255001 215351
41238 215351 190902 191245 172335 112752 55433 49468 92283 155071 226696 297352 328141 282883
41226 282883 184673 104581 87813 114474 139792 150721 166530 196217 218343 207558 166745
41215 166745 123695 104117 115493 146299 167476 146115 80872 19685 15557 61986 99587 93511
41203 93511 73656 83697 121572 154753 168600 169431 158787 137531 123441 133255 155142 167292
41191 167292 174090 192314 210740 201690 171017 156570 171209 186029 180517 169054 159545 127804
41179 127804 65489 18316 31052 75031 81256 39286 9566 28708 57297 50733 34513 60318
41167 60318 116839 143656 124477 104932 110036 106446 73160 51799 81286 127308 132873 107530
41155 107530 104237 127993 135159 115003 100100 91549 49130 -23728 -58656 -23534 19458 7071
41143 7071 -27128 -9361 56287 92136 53703 -23974 -81473 -91157 -60893 -19875 -672 -7747
41131 -7747 -9591 15576 43137 39739 17283 11650 24041 27187 21552 40339 96591 162086 202790
41118 202790 207280 183376 156166 162721 214840 272262 288046 274089 280591 314039 324857 286055
41106 286055 236777 225566 246884 260864 250701 233132 225742 226258 220191 197270 162223 131869
41094 131869 118152 118388 128548 155530 203238 257233 298883 323846 331339 312562 272332 243775
41082 243775 250493 267626 255332 222677 220849 272234 338706 366725 342297 298410 281470 305271
41070 305271 331034 312772 270071 276248 350929 414912 397040 336500 314548 328208 315521 277130
41058 277130 274252 311189 318913 270393 222903 221368 240182 247557 249979 243358 198079 128640 102801
41045 102801 140394 174653 156746 125584 125776 131327 109763 91178 105702 115637 82063 41562
41033 41562 41260 52234 29523 7307 41552 97915 97327 48657 33924 71310 93513 67943
41021 67943 43644 58727 84386 90701 98568 130496 162256 157938 118282 72693 52157 78914
41009 78914 150349 226119 259696 242287 191865 119521 46847 28444 93366 179059 194337 142277
40997 142277 105655 112009 102082 50004 21567 68507 142478 171352 160384 156267 157985 128824
40985 128824 68409 14568 -10586 -11981 4503 30117 40511 20553 -9905 -21402 -9566 15932
40973 15932 49371 69525 35724 -57587 -147762 -165874 -111606 -30463 54726 139847 191231 167219
40961 167219 88569 30286 31093 55949 59838 44290 32350 27779 25601 33616 55492 72246 65475
40948 65475 45133 33356 32844 31799 30974 44715 77951 118123 148734 159359 146135 115184 83222
40935 83222 62517 47081 25651 5048 4686 28372 60542 93433 134301 174778 180889 140603
40923 140603 100905 117774 174719 195585 148514 92995 96593 141247 153406 106463 46795 22451
40911 22451 30566 45807 64397 97632 141263 171786 166532 118815 42558 -29159 -56977 -17446
40899 -17446 80351 192166 253826 222009 120409 32593 23614 73539 109747 94971 53721
40888 53721 19875 -615 -9302 819 22118 25299 -1559 -30109 -27338 6716 52456 95834
40876 95834 119928 100579 41740 -5939 3234 52875 91966 106147 121145 140482 128520 71739
40864 71739 17904 23364 80174 124983 114334 66753 28376 18423 22070 26160 40464 75339
40852 75339 112463 118489 89368 60838 61324 68878 37584 -35274 -91690 -73487 12921 105382
40840 105382 151617 150323 128859 100755 59928 6988 -41511 -77860 -122765 -205741 -330910
40829 -330910 -475724 -623201 -782408 -971759 -1189113 -1401771 -1559415 -1615351 -1548559 -1380665
40819 -1380665 -1172042 -987978 -856291 -756145 -651964 -536856 -435926 -368044 -320045 -270451
40809 -270451 -226189 -213240 -232417 -248404 -230784 -186763 -143093 -114158 -101836 -109586 -136662 -167660
40797 -167660 -184585 -182750 -163239 -122102 -63925 -15742 -6722 -35644 -70864 -79754 -53368 -13901
40785 -13901 -2896 -41499 -91765 -83653 18 91826 118269 83886 45979 32873 29205 21375
40773 21375 8558 -20576 -73318 -120056 -122372 -90963 -69780 -66220 -47807 -9121 11695 -8857
40761 -8857 -54714 -110191 -172076 -213802 -196240 -130810 -75977 -54736 -35728 -12364 -25459 -74061
40749 -74061 -83351 -16102 54575 50894 6155 -3062 15058 1359 -32405 -23261 16479 4287
40737 4287 -68647 -104392 -47387 23812 12416 -57178 -87674 -55767 -35106 -81526 -157770 -185872
40725 -185872 -135655 -44563 25934 36812 -8994 -71930 -103029 -83867 -46575 -42737 -83813 -124844
40713 -124844 -120899 -84312 -60412 -59003 -48928 -18796 5443 17224 52345 124114 181211 175866
40701 175866 140433 143188 188803 218058 198390 162159 151488 168312 186778 181997 141974 79271
40689 79271 30795 19403 21861 5029 -17112 -2859 46180 78853 63372 20004 -23198 -65595
40677 -65595 -110196 -141142 -144768 -128871 -108832 -95729 -100549 -121352 -124845 -77308 -624 42386
40665 42386 31541 16947 42250 80845 81837 49441 36115 69254 119146 138190 107996 46147
40653 46147 -16079 -56068 -67299 -53469 -23698 5521 17910 16112 16409 12628 -27823 -105250
40641 -105250 -155201 -121199 -40089 2157 -10719 -18345 1410 -10130 -88539 -169574 -169915 -98912
40629 -98912 -35210 -21859 -35042 -36981 -14414 23444 49651 35210 -10539 -33906 -1729 49844
40617 49844 65621 45304 23837 456 -55960 -136034 -181558 -161693 -115519 -100638 -128524 -165601
40605 -165601 -174547 -140439 -74261 -4389 43056 59406 45518 723 -64187 -116068 -127704 -110622
40593 -110622 -93231 -73016 -24409 45240 85963 66147 13822 -21972 -29199 -31594 -44716 -55487
40581 -55487 -42443 -3707 34886 37782 -5936 -63674 -86142 -57623 -8454 26063 43804 64543
40569 64543 96481 130782 161983 195727 233801 263371 268338 248593 222797 209237 205193 191719
40557 191719 163401 146269 173370 241846 306716 323785 290635 238406 191464 147860 98124
40546 98124 49166 20146 18780 30323 31482 10790 -24438 -54036 -55752 -20652 33021 69312
40534 69312 71769 67444 97024 160740 213513 220344 196332 178334 176329 175560 173657 184459 204527
40521 204527 206711 180738 157108 168451 199042 197866 142794 71345 38727 58013 93589 107384
40509 107384 98818 98172 129331 183589 227370 233189 203233 162686 132116 112163 95872 85123
40497 85123 85927 95214 103978 108488 107487 96877 83381 93536 143421 203809 226879 210068 198863
40484 198863 218290 241488 243354 241048 249854 241500 192811 141326 134073 143970 105428 26406 -8769
40471 -8769 36406 90570 71730 -6120 -62930 -53176 2174 58391 84276 72250 42927 33041
40459 33041 60345 109409 159429 202717 224169 196456 123562 61827 61360 101508 118621 89214
40447 89214 53649 60032 112538 178458 226562 252660 274134 297875 297797 246508 173908 158256
40435 158256 233854 339824 398351 417631 467829 571951 683346 775661 892487 1087121
40425 1087121 1374478 1777491 2346174 3038704 3615195 3774987 3454431 2920577 2515304
40416 2515304 2369836 2440822 2737418 3327853 4084560 4596559 4492650 3812770 2949363 2245826
40406 2245826 1756503 1376615 1055271 816720 671913 599500 577125 575698 554870 508149
40396 508149 481101 506101 551380 572182 578660 611182 675528 741594 783030 787020 754045 717694
40384 717694 727119 774299 781617 706256 612078 581597 599545 593530 555449 539520 557322 561752
40372 561752 536663 521774 535413 545776 540111 556170 616571 688455 738142 774955 809176 815293
40360 815293 777712 736340 743510 796631 847068 858144 825972 760905 680022 609685 568735 549238
40348 549238 528437 496253 459560 423434 379755 317427 242549 184805 172393 194197 202122 166994
40336 166994 118872 109655 145025 179346 175342 145249 131452 163046 230549 293413 322257 341946
40324 341946 410584 543872 700711 875405 1150201 1577834 2030113 2254897 2113741 1710893
40314 1710893 1268372 927363 695776 528357 397482 301089 243743 217222 195264 159083
40304 159083 124648 117892 124536 102338 48420 8752 3417 -9960 -66067 -125938 -126170 -69077
40292 -69077 -15524 2026 11709 41952 71316 63032 25742 6516 24708 43029 21065 -24437
40280 -24437 -42647 -20954 4832 12198 15791 15994 -20205 -91093 -125810 -75055 1839 7941 -55877
40267 -55877 -97585 -66693 -9098 14658 -391 -29459 -57211 -71287 -59356 -27176 11971 62409
40255 62409 121912 147723 103513 29927 1963 21333 25917 6139 23536 94866 147069 125093
40243 125093 67690 33850 23607 15443 14733 16316 -18121 -92642 -142536 -118231 -52992 -2209
40231 -2209 28303 46743 32040 -14672 -34558 7165 57430 61290 58088 113175 198828 230492
40219 230492 192863 146170 125880 114771 102228 97499 90088 61417 29079 22233 25816 6438
40207 6438 -23757 -30408 -24861 -41317 -62521 -41254 13684 46775 45046 42352 37461 -8886 -85701
40194 -85701 -124704 -105301 -89080 -116422 -141226 -114638 -72124 -78151 -124674 -145556 -112078 -58755
40182 -58755 -17497 24483 82930 124610 94086 -4630 -85084 -67605 21553 82079 70999 49152
40170 49152 77533 126888 135136 104338 78686 61427 24927 -14194 -1934 70668 150784 193214
40158 193214 196938 172998 128422 87928 83721 112198 135887 132945 115112 101581 105878 136776
40146 136776 178174 186020 144890 105603 120034 162890 172852 146068 123853 110779 82400 60678
40134 60678 95076 165979 191201 142806 81676 61343 73161 103578 164162 234521 251569 196526
40122 196526 131042 109553 112233 98915 72474 52020 35771 25711 38738 61851 50656 6031
40110 6031 -5289 53745 130729 163394 163071 167373 163508 123498 77429 83162 141663 199169 221996
40097 221996 222429 220478 222575 234095 259084 286758 297372 278891 233162 180917 159697 187357
40085 187357 225913 218734 166473 121275 102988 79861 42981 28412 38341 16076 -55229 -101759
40073 -101759 -68254 -12972 -17451 -53785 -31352 54752 114124 92467 31309 -8715 -13828 6222
40061 6222 45297 82767 85701 53080 25160 31293 55633 68882 69518 76851 98301 117479 109536
40048 109536 64140 -2816 -60976 -90878 -93205 -75205 -41770 -1711 33204 59317 77566 81481
40036 81481 68016 55161 62809 81142 87705 87023 94995 95859 67704 43996 82838 169679 225362
40023 225362 229154 253099 339962 429189 456976 454233 476894 503238 481011 429777 412793 436302
40011 436302 453310 446228 434960 419820 383666 339105 313301 297853 269213 242557 248357 273098
39999 273098 282283 282685 296370 292263 222082 119609 82303 139305 207545 201711 130132 58538
39987 58538 30905 53077 109621 164094 173306 132634 92231 108224 184936 271965 310523 283332
39975 283332 227327 193617 193306 198382 194627 198303 210180 199501 160570 138728 162158 192565
39963 192565 188694 173092 180234 182797 138426 75131 54681 75015 84580 74407 78079 95537
39951 95537 99622 109094 166728 243716 257824 201782 164848 200183 254951 269063 263459 277820
39939 277820 286985 245615 175738 145765 177873 223550 227138 183446 132778 114457 125931 128849
39927 128849 101687 71692 73639 93869 89424 52696 20093 22194 60059 123031 193066 239249
39915 239249 244826 231105 222793 210958 189127 192814 244627 290645 265746 201269 183353 215512
39903 215512 216838 160805 116619 129244 152858 142684 128334 145091 162570 138301 89634 61018
39891 61018 61178 74314 94474 112705 108378 86166 85220 123594 169209 187723 180552 159288 128429
39878 128429 108873 125577 154319 139406 84655 60879 95683 128210 113401 97729 134466
39867 134466 187157 186081 135709 98492 101610 118664 122999 112249 98521 107545 161287 234490
39855 234490 265254 236719 203910 208845 221740 205583 181333 176951 166365 121780 79908 87504
39843 87504 119029 120149 103234 124885 186198 227746 218524 187716 168218 161451 160499 165058 170900
39830 170900 174607 182229 190210 178235 147701 138137 171350 210894 216079 202377 203681 210406 197737
39817 197737 181557 186458 187914 152025 108174 110419 144001 147659 122167 134782 205790 268529
39805 268529 269179 241870 248209 290614 325402 329674 317403 305586 294288 276441 251678 230366
39793 230366 226482 242929 266373 281039 281784 271582 258430 255572 264921 259800 214369 154470 138845
39780 138845 177157 214413 220101 238575 309255 386156 394999 338719 287845 286210 319934 364608
39768 364608 411293 452730 485835 521163 558804 571652 542753 495147 454361 415767 384646
39757 384646 401015 469856 513025 463012 370033 336948 375853 418198 447966 519548 635353
39746 635353 709914 693167 647528 655728 715253 772198 808310 841415 872620 883500 872731 861822
39734 861822 871748 912785 985698 1076255 1157556 1210825 1241582 1273959 1333269 1427864 1541165
39723 1541165 1653198 1777393 1955074 2200441 2480657 2775954 3130703 3610316 4230217
39714 4230217 4960683 5771423 6618914 7401153 7975386 8231261 8135418 7733347 7142489 6515762
39704 6515762 5961104 5499595 5122431 4856413 4738875 4768101 4929182 5235918 5693260 6248261
39694 6248261 6829757 7398307 7897028 8200100 8195743 7897158 7398891 6760026 6018088 5276148
39684 5276148 4651974 4143867 3659971 3186272 2811830 2572266 2388610 2199646 2044420
39675 2044420 1960713 1900437 1810574 1717351 1664345 1634855 1599145 1579226 1604081 1650633 1685936
39664 1685936 1721285 1771644 1809927 1819400 1848609 1952640 2111554 2265004 2402761 2565417
39654 2565417 2772368 3000842 3231051 3473288 3750474 4075523 4438517 4801250 5115472
39645 5115472 5354053 5509247 5564826 5501820 5331204 5082327 4758841 4353346 3909618 3512935
39635 3512935 3200303 2930728 2662065 2404744 2180286 1984789 1821336 1711765 1642126 1550667
39625 1550667 1410337 1274893 1200413 1164997 1111692 1032414 960827 911409 872508 839982 817204
39614 817204 794371 758571 715571 683864 678574 707561 765671 836863 929022 1088559 1325838
39603 1325838 1536231 1572425 1412931 1190190 1030246 936824 860783 797751 759544 718989
39593 718989 655268 607866 617425 646532 624332 549574 492344 502301 557931 602122 599782 564376
39581 564376 538741 539485 528400 469391 397918 378605 403280 404842 374411 376009 425428 451615
39569 451615 419347 394815 429253 464120 426946 349798 311897 321415 333154 336205 348076 360752
39557 360752 361387 370699 400933 416624 394363 374650 395958 430505 448440 485371 570338 646214
39545 646214 650351 623181 641730 690437 700764 681306 694381 723683 684390 569207 476073
39534 476073 469702 506734 524896 526759 539600 553918 542431 507198 482783 506769 584682 667920
39522 667920 688084 638734 591204 596198 612595 581274 522082 492290 489280 470720 442182 445262
39510 445262 477615 501613 519041 564114 633392 692019 737406 788955 830554 835643 834694 882123
39498 882123 968156 1041138 1106529 1218973 1375262 1496020 1523010 1466858 1357784 1220321
39488 1220321 1097267 1024008 973129 894087 809068 793848 857982 922907 933721 919315 924351
39477 924351 952412 997318 1062936 1125033 1131790 1070500 989553 937729 923397 939134 977567 1015940
39465 1015940 1031549 1035210 1045997 1043672 1001670 953363 955697 992827 992061 939439 902641 926768
39453 926768 980751 1023959 1055005 1073136 1059230 1022992 1010812 1040302 1077628 1099647 1126678
39442 1126678 1172852 1212725 1219422 1197454 1166088 1147410 1170319 1238803 1297329 1282720 1215966
39431 1215966 1190246 1261886 1402782 1563194 1728288 1904622 2095996 2297773 2480767 2593700
39421 2593700 2621432 2616075 2622127 2605669 2519072 2393929 2290325 2195613 2071296 1964144 1952765
39410 1952765 2001708 1994152 1907692 1829946 1791090 1718092 1587786 1492431 1497329 1546970 1576055
39399 1576055 1616680 1732226 1931280 2206727 2573081 2989987 3313018 3395497 3210377 2841633
39389 2841633 2406788 2013052 1721418 1508343 1305692 1100412 946852 875424 855124 852796
39379 852796 855916 832817 755553 669887 650707 678318 658098 573661 509892 506536 509241 492234
39367 492234 499445 524076 485245 383820 344347 423402 505917 487119 439649 490170 627370
39356 627370 745690 802180 824287 830991 848790 946622 1155769 1397473 1565525 1631844 1612130
39345 1612130 1503099 1331522 1192962 1155430 1183616 1230430 1328918 1508796 1695397 1789350
39335 1789350 1791286 1762137 1720938 1670984 1666381 1756197 1909978 2080339 2278823 2500110 2638436
39324 2638436 2593241 2417579 2258095 2181027 2151595 2144093 2160755 2158625 2062214 1856352 1598419
39313 1598419 1346179 1131639 984529 915547 887226 851990 804635 762709 726808 695149 677736
39302 677736 663061 617908 549257 507892 502495 482459 437834 429281 474535 498483 452920 393849
39290 393849 377564 372531 340035 307891 296760 272672 240916 276083 381223 437031 381178
39279 381178 312291 312911 305744 215449 138381 189468 291034 290385 203855 168059 213116 255988
39267 255988 269997 296449 322860 299081 245805 220440 218666 226747 301543 464142 592297
39256 592297 573817 494939 510563 596899 615290 562718 559828 624426 656344 634769 641952 692078
39244 692078 714030 707606 747907 828432 860586 834355 824876 838870 809996 747050 730174 756523
39232 756523 743038 684741 658259 668722 647980 603873 612230 658205 646780 577796 549863 580532
39220 580532 583001 535631 517823 561649 618093 679003 778342 866462 844171 733027 654058
39209 654058 630973 578335 490071 463802 520122 569766 580619 607719 641761 607846 539129
39198 539129 568200 709414 825005 844427 845028 879432 897868 882584 889149 914874 892386 843696
39186 843696 866176 939148 932327 839741 808239 888465 956671 939028 914385 929143 907514 823387
39174 823387 775226 808442 835445 805079 781824 792201 768545 709805 717493 802995 837708 762201
39162 762201 667717 610777 536102 445832 444427 538130 584687 522885 463307 477992 495874 480671
39150 480671 508499 587660 604975 534530 497855 539400 553102 508623 526489 642011 721593
39139 721593 704232 696470 739542 726369 644655 644379 754769 799267 713229 674454 782327 884331
39127 884331 873633 879860 993545 1076432 1031897 996846 1071013 1119789 1049054 1012687 1129243
39116 1129243 1246271 1212362 1140100 1170785 1215951 1163319 1107579 1148073 1187110 1151783 1178001
39105 1178001 1352652 1524836 1599019 1739596 2029727 2210691 2053241 1727707 1504744 1342588
39095 1342588 1086485 830946 743260 736714 646420 534735 515511 482158 320256 181867
39085 181867 237788 365081 383334 376952 473595 544023 453963 375122 501234 688075 719887
39074 719887 692308 779381 872586 818569 760254 863907 968130 891505 816355 962426 1160893
39063 1160893 1175096 1152962 1316570 1503350 1487217 1450399 1637832 1848775 1794851 1655314
39053 1655314 1729725 1853031 1733993 1558969 1647933 1822339 1754748 1634974 1816869 2110873
39043 2110873 2126874 2011494 2119631 2276678 2136245 1941743 2116583 2428591 2419403 2316069
39033 2316069 2594456 2995125 2974790 2787412 3041302 3519503 3592499 3477655 3853988 4534351
39023 4534351 4835792 4966812 5638208 6601731 7104337 7490201 8686275 10411731 11744626
39014 11744626 13140196 15794225 19313057 22419576 25730053 31091388 38391218 46332664
39006 46332664 56339799 71789852 93404892 120721239 158543628 213201502 276510600
38999 276510600 320495919 318649116 272332650 209210877 155903889 119001899 92194878
38992 92194878 71405183 57003113 47654339 39954660 32920593 27911835 24755217 21611388
38984 21611388 18133403 15596984 14159826 12627781 10764897 9517537 9006220 8315093
38976 8315093 7265223 6606840 6434391 6024119 5282271 4882945 4910692 4714027 4174574
38967 4174574 3874424 3925014 3791428 3367965 3141429 3188937 3034855 2608988 2383636 2445483
38957 2445483 2345066 1992611 1834566 1998038 2075576 1910550 1829631 1940742 1924747 1687431
38947 1687431 1544873 1604660 1592931 1434775 1399553 1537451 1557098 1392960 1332379 1454113
38937 1454113 1484067 1330971 1239987 1295051 1277805 1136934 1102371 1218840 1245434 1125111
38927 1125111 1082525 1157491 1118334 943852 911899 1084514 1172036 1048690 955942 1045948 1150388
38916 1150388 1153612 1186316 1295939 1313091 1193434 1125255 1168453 1150360 1033358 1010574 1121149
38905 1121149 1152778 1050091 1036781 1201864 1352162 1418176 1611075 2000845 2313386 2341758
38895 2341758 2217652 2091351 1883553 1551785 1276094 1168182 1087335 936240 851249 913562
38885 913562 960788 877091 791892 803241 783922 655566 575983 647702 709509 632722 564081
38874 564081 645626 739043 673222 548595 546793 623871 633406 594184 607553 644936 625010 584321
38862 584321 592530 610541 582734 550516 546748 513895 444443 448057 559730 644911 616181 572269
38850 572269 598726 614343 552458 510299 568123 634612 622894 608862 662608 694046 624596
38839 624596 546838 553127 566150 499908 429808 440096 459017 410522 374689 428344 478936 431906
38827 431906 376504 425822 511497 518884 493195 527251 570823 539793 500047 555021 651152 673163
38815 673163 637981 627631 628663 601564 605077 682515 727316 636500 503692 486608 573009 650556
38803 650556 718802 850350 1019715 1158529 1329013 1669946 2196974 2778254 3250297 3452174
38793 3452174 3252295 2696659 2053281 1565492 1232990 951175 740230 668494 662461 593456
38783 593456 482056 432105 426467 371782 290484 283719 341614 362622 331300 318619 335387 333296
38771 333296 320576 339221 363788 350712 338705 373564 396946 345228 286924 313644 367923
38760 367923 341078 273064 281151 348898 367299 338894 356237 410823 407003 346356 323202 349462
38748 349462 350136 321796 333935 380353 383960 342619 323992 328007 298488 253414 258161 291367
38736 291367 285462 272087 327543 399847 363130 233105 155440 179311 210593 196805 192841 225833
38724 225833 248861 248611 259731 263814 210320 134667 115449 128361 93835 47247 88112 176784
38712 176784 177109 103077 113496 233775 297259 221851 140734 173306 249620 263782 243028 254839
38700 254839 276090 259635 227382 211083 192515 167719 177028 219281 234952 216520 226506 267497
38688 267497 257419 181097 137740 179465 228904 222652 212320 247865 276487 240824 179527 153609
38676 153609 158592 169708 185768 180798 113359 29773 44561 166177 262647 258845 238898 281562
38664 281562 328673 309333 268904 268765 270338 229417 202005 240183 276823 233833 160093 139643
38652 139643 142761 99919 55024 101009 205825 244555 187579 129984 136285 168111 175281 162734
38640 162734 148741 131546 116825 124517 157406 200825 248181 290842 299757 260046 207513 186419
38628 186419 184544 154268 89498 39660 45938 93333 131645 129673 104795 97862 117941 131501
38616 131501 121470 122499 158934 185641 153039 100976 108474 168027 198712 177692 163626 183950
38604 183950 194556 166879 125701 87395 51212 58436 154437 278340 307612 238575 200515
38593 200515 254208 306918 282105 240604 253771 275515 236325 168913 146156 172261 215977
38582 215977 273549 325197 314017 244233 212897 265810 314961 284492 239324 266159 321953
38571 321953 321619 297311 339543 437550 507443 538712 590333 668063 718068 726304 727143 727600 707510
38558 707510 679128 673743 689811 714371 759577 818828 837735 795555 756180 762786 749567 651062
38546 651062 533755 508146 560374 588653 571534 580745 644844 711177 738451 732562 695107 619553
38534 619553 532376 467965 419378 376347 376832 448235 537393 578233 587506 611658 628306 594771
38522 594771 545813 538202 541633 495951 436376 440426 480723 456952 356330 260077 205698 166932
38510 166932 157572 221482 316450 338901 280317 240107 267686 309897 332940 373379 434793 447800
38498 447800 378002 281069 213987 175556 159951 180598 215099 213197 183222 186198 227577 246100
38486 246100 225984 220490 242471 236254 188551 161711 177873 174380 122120 87833 122080 177472
38474 177472 199218 210684 241924 251427 195092 114699 85944 118359 161865 177806 163155 139957
38462 139957 147650 203705 255856 229589 138714 81370 105793 154961 171579 176424 202062 226706
38450 226706 224449 215350 217719 211092 188586 184044 207766 220692 210599 221728 266540 286193
38438 286193 249528 211232 211929 202372 140593 87200 114819 184456 207115 181947 176896 204784
38426 204784 214756 191310 174453 184529 200407 212308 232080 249139 233784 190585 161972 173012
38414 173012 208438 243579 264543 259914 223406 166404 109874 69979 61369 92958 143941 169837
38402 169837 154690 133900 144250 176425 199010 203970 204904 212147 229249 254167 272943 276601
38390 276601 286772 327660 371075 360038 296070 244335 234833 224581 187475 170574 210348 253392
38378 253392 225918 143639 89331 102719 145599 164552 148640 131158 155064 224965 289515
38367 289515 299179 276986 284165 319855 325474 298154 314127 407108 507741 551567 569282 615583
38355 615583 684454 756874 857781 993925 1104020 1147696 1179059 1250213 1306252 1268617 1164729
38344 1164729 1073252 989734 856911 693055 575726 516118 457506 388256 352129 349749 331419
38333 331419 292616 281722 304869 313395 294658 285502 284547 244362 171326 141512 184845 235418
38321 235418 233925 204964 191943 184254 157820 132320 136255 152399 141441 96268 46156 28918
38309 28918 69639 155653 225754 222424 161869 113396 109564 126481 151805 204530 270870 290872
38297 290872 244181 191103 187825 210805 208856 184970 175682 183955 186956 188603 210543 239887 236264
38284 236264 196604 172939 208631 280760 326547 318390 293170 303034 353985 410295 447397 468340
38272 468340 469129 433534 381272 371894 420330 451818 398008 304426 270526 301019 300190 219459
38260 219459 127618 104777 135974 154761 141504 127753 133750 148093 154849 147101 123436 95147
38248 95147 87129 112331 153782 185303 199659 204919 204459 193701 171523 146754 132898 133505 132063
38235 132063 109912 80728 84818 131917 175186 170505 137745 126044 139135 141185 122936 110598
38223 110598 113994 117760 124399 151902 180781 159710 85088 26808 44565 112393 155333 137839
38211 137839 92042 74724 113809 185786 235223 223918 162755 92076 45237 40488 78552 122321
38199 122321 113539 50739 16093 69421 148004 144732 63544 9654 30942 65129 59149 43932
38187 43932 54719 65870 56436 64287 113655 151492 122769 60828 36533 55824 73143 76618
38175 76618 93473 128231 156365 171733 190094 211912 226177 244073 284368 327728 328239 276517
38163 276517 218267 201053 225070 252391 247780 206217 153050 122522 132625 177857 236964 277771
38151 277771 269376 216321 171888 182532 222674 226136 182824 152568 170087 192330 169644 119584
38139 119584 89633 85192 78833 62859 49081 36285 18076 8610 24026 48125 48316 19775
38127 19775 -10691 -18210 2306 43914 95410 144863 183383 201658 189539 155375 132956 139269
38115 139269 139408 97060 46663 54237 109140 128904 85490 48150 72092 123487 156490 186156
38103 186156 229980 251894 231953 223722 265693 297626 251518 172426 155252 206748 268814 334626
38091 334626 427272 501332 509713 561846 848224 1347225 1741941 1730373 1345447 884907 586892
38080 586892 464477 413200 364828 314714 274842 250870 246957 263705 288804 300154 286325
38069 286325 263498 260183 278521 286751 264346 236177 239304 273209 310282 337386 352807 340192
38057 340192 289979 236827 228875 263831 301502 334253 389873 461821 498303 479551 451181 454740
38045 454740 473712 478115 476505 486794 496317 496196 525571 631495 798381 961278 1084616 1191553
38033 1191553 1318248 1476672 1670160 1912382 2209453 2539010 2868220 3188892 3516280
38024 3516280 3846492 4128756 4295975 4319240 4216222 4009944 3708132 3333677 2943590 2587886
38014 2587886 2266394 1956773 1674032 1466975 1353574 1288304 1203809 1072360 924708 817427
38004 817427 777326 771615 743915 681993 623593 587355 540967 466243 410055 420319 465520 477453
37992 477453 448995 424220 411426 382240 348162 352248 376465 345999 252397 186919 207574 251469
37980 251469 239489 201007 217432 287037 329531 304516 247939 195593 142676 91530 76961
37969 76961 113271 155285 146592 89871 43046 49843 92752 120684 113357 101973 119911 151534
37957 151534 154241 121906 92350 90664 104353 126812 182145 276407 357290 362805 294990 212816
37945 212816 165138 161088 191241 237295 262825 233732 159858 90553 57191 40189 6097 -39032
37933 -39032 -53008 -12128 53040 86338 67108 30913 24124 50038 74115 73645 60524 55841
37921 55841 64330 78448 88108 81615 57129 38523 58049 115408 174975 210715 230236 246512
37909 246512 254444 249830 242838 232900 197443 130159 66408 42135 46724 44823 26657 6040 -13558
37896 -13558 -33517 -33143 8255 63232 73620 28039 -14097 4133 66746 111323 107973 85656
37884 85656 87035 122310 171806 214711 242192 251708 245378 234811 231792 226971 194794 136841 104431
37871 104431 144505 223175 243696 162456 54810 28564 91187 150761 147364 127057 156467
37860 156467 210582 204651 123931 55530 71906 137862 173113 164037 155701 159398 139919 92930
37848 92930 63119 69304 79317 85430 134307 239737 333784 362046 363023 381123 365333 253012
37836 253012 106159 43224 55891 24966 -74455 -121965 -48894 42263 32206 -44322 -76942
37825 -76942 -52753 -45373 -75762 -87706 -48669 8629 46232 61583 68142 80551 111182 144118
37813 144118 132212 60608 -12938 -28574 -6861 -4353 -13786 20279 97658 149843 139547 107826
37801 107826 103254 117660 115802 86945 43138 -1759 -30422 -25215 8001 37135 38435 20476
37789 20476 6257 4429 5345 -1299 -8663 4347 42448 71377 52131 315 -24957 -3548 17063
37776 17063 -2504 -37335 -51804 -58410 -73985 -65981 -7833 50660 43896 -5066 -21120 -612
37764 -612 -9796 -62143 -89476 -53704 -3484 11816 11307 26255 37858 18876 -9927 -12576 5829
37751 5829 16353 14790 18923 36544 62937 94122 123309 138527 134904 115665 83143 51639
37739 51639 57740 117275 179526 178174 130066 121022 178579 226604 199876 140823 131109 173906
37727 173906 203758 186850 154799 147833 169129 196459 210011 206372 199493 204293 214733 211196
37715 211196 190637 167955 146678 115427 73923 31045 -19425 -79235 -105776 -49552 59423
37704 59423 125352 107046 62320 47578 43738 22215 12705 44365 76707 57356 6582 -20258
37692 -20258 -17096 -11110 441 30644 53705 43854 32277 55166 78466 53616 16195 35696
37680 35696 89051 89528 35835 18935 63883 78891 4298 -88065 -102446 -42590 35864 120671
37668 120671 213761 266804 235222 164881 142932 177025 196035 165747 135679 161279 234071
37657 234071 306773 350591 373130 405824 480783 596366 702903 746949 732486 715545 737437
37646 737437 787290 831136 850050 843120 819198 797728 797394 812954 821833 822876 844974 899624
37634 899624 947246 940172 889003 852857 859970 869303 828068 744341 676153 659619 677487 697795
37622 697795 711359 719341 714864 703635 720497 786581 855731 846464 741676 623165 582027 617003
37610 617003 650877 631804 579524 530528 479457 400826 305273 238184 222540 231237 227526 213346
37598 213346 219087 254350 289945 292826 265645 242577 249159 272272 273368 233732 182753 170111
37586 170111 208144 258323 283210 288522 290974 269127 192618 95472 64760 134361 233709 274665
37574 274665 254222 231224 230648 224512 197285 175306 181408 201587 212231 210673 205321 200684 203776
37561 203776 222428 248116 264550 281194 328420 405233 463714 469317 450061 456669 496034 539553
37549 539553 582001 648589 742351 824229 861183 868868 890133 946793 1023758 1085518 1098160 1052260
37537 1052260 978212 923711 900103 867319 793957 715356 695341 733762 755864 709400 632352
37526 632352 592965 595228 590522 563806 547636 546624 512600 427725 360227 383009 464731 501843
37514 501843 451155 371879 329076 315329 296973 286919 320376 383560 421665 415680 404173 418137
37502 418137 435373 423140 395504 395069 433507 485084 534686 596043 673630 739863 772895 794166
37490 794166 838069 895764 924137 912861 908006 950892 1017997 1049766 1029812 1005952 1026185 1076536
37478 1076536 1101361 1077058 1042187 1044343 1073371 1071572 1010946 933955 900810 915319 928467 904347
37466 904347 851150 789001 722564 656331 605601 573045 538694 494413 465884 473460 489303 467516
37454 467516 409869 366728 368079 383563 365255 310605 264770 267096 308848 345539 345563 322278
37442 322278 315799 346106 392464 420586 419860 408109 408408 428243 455475 471647 476910 499049 558834
37429 558834 625018 632753 561368 465575 405926 375755 330990 267699 220612 194663 156297 104358
37417 104358 93804 155490 233364 248450 205378 186358 240945 326993 374850 371614 353014 338727
37405 338727 318477 296282 301549 337177 352045 299127 202240 127827 97932 70601 10841 -57341
37393 -57341 -86298 -63411 -14257 32577 64290 80961 89140 90822 76231 42692 16746 28619
37381 28619 64000 78567 66702 69786 100244 110612 71039 27591 37176 84914 117226 121965
37369 121965 120348 111490 88679 86509 141747 218552 238980 182372 94013 7328 -71404 -110188
37357 -110188 -69939 12617 44815 6023 -21200 21114 83926 98859 75996 58262 38743
37346 38743 -10977 -72004 -99998 -86945 -50332 7670 78632 117598 92807 42794 26849 37036
37334 37036 17729 -40183 -84650 -78635 -35517 21947 82429 118293 93382 21460 -26545 -2472
37322 -2472 61280 98990 91299 69691 60726 60689 61783 69256 79670 68064 23207 -16931 125
37309 125 68171 121423 122609 110301 126099 139041 100241 39608 29373 63878 66032 22764
37297 22764 16542 86117 150956 136706 93860 109200 163268 172334 129497 100007 95491 57869
37285 57869 -25052 -81810 -60440 4257 55016 80952 90585 71771 20318 -27516 -30587 6788
37273 6788 45019 56545 47235 40949 50784 60156 39795 -4909 -22746 20842 88045 110117 70205
37260 70205 7511 -44423 -76809 -77129 -39714 -2977 -16141 -60510 -62585 -2035 50728 31848
37248 31848 -30738 -63309 -39021 10835 49920 66453 65152 55562 43434 27015 11967 21524
37236 21524 64827 103568 89855 36097 3418 17668 44710 55072 58613 60599 40819 1036
37224 1036 -21457 -17804 -31000 -77899 -100547 -44695 54987 120879 130772 117494 97708 58922
37212 58922 4482 -40586 -65488 -75286 -61965 -12929 51273 81078 47324 -30266 -103651 -135432
37200 -135432 -124973 -103078 -91101 -70351 -17609 37906 41180 -2065 -26935 -16206 -36289 -128548
37188 -128548 -233828 -281062 -288430 -308999 -335392 -343658 -383372 -522210 -726937 -903373 -1042848
37177 -1042848 -1218355 -1423497 -1524053 -1413263 -1138165 -829600 -568375 -358923 -180774
37168 -180774 -22284 107624 182144 199388 216342 288111 379860 407564 365202 330726 341244
37157 341244 358668 375999 444959 557769 620203 606270 621505 732756 870424 1022609 1379684
37146 1379684 2068656 2809674 3087849 2710312 2005400 1414095 1064447 835192 651252
37137 651252 538904 483785 418362 338946 305193 319058 306362 230252 139597 89014 78914
37126 78914 88520 106373 112305 85862 52017 68732 148153 233761 275641 285894 296246 301833
37114 301833 279162 230669 180381 144904 131343 141874 157202 138783 76591 17390 14809 62018
37102 62018 103477 106914 92731 90203 93545 75896 32089 -8423 -10879 28809 80243 110024
37090 110024 111870 101104 87597 67996 41092 13487 -9915 -23236 -9436 41279 99596 115449
37078 115449 81225 45059 41537 42603 9079 -37363 -37711 21541 92271 130786 143410 160809
37066 160809 195921 234937 250763 225120 174965 148725 171940 207429 201961 162680 144324 162721
37054 162721 172219 141743 102331 91587 93861 73658 37498 19551 23121 18233 -7558 -30412
37042 -30412 -23231 18520 84024 154730 200505 191901 130136 54489 8247 -840 -553 -14989 -32677
37029 -32677 -23971 10672 30459 8281 -24120 -16727 21877 29580 -20610 -78651 -84528 -42533
37017 -42533 -1340 11893 6044 -3978 -8109 4327 29988 41751 22067 -4206 -196 27874
37005 27874 37959 11831 -22770 -30712 -3024 49819 110452 153039 152873 110812 57275 26040
36993 26040 30220 59721 90346 100072 88741 75159 64522 35575 -19269 -59898 -38619 33758
36981 33758 97120 114352 98959 71978 34728 -4600 -19266 -2132 15726 9212 -3525 6403
36969 6403 31039 40097 29255 25012 46650 86044 122698 141384 137278 117306 93869 69503
36957 69503 37350 5637 4628 50328 114707 155740 167786 175189 182180 164571 119290 88134
36945 88134 107837 155009 168682 124099 62118 40288 68653 102844 96228 51746 18968 39987
36933 39987 103884 162883 190267 205250 233952 266127 272076 250913 233013 234397 238144 229890
36921 229890 222757 229261 234984 227926 234321 288233 370460 413988 379170 298631 237230 225454
36909 225454 241311 243533 213479 171011 150427 156530 155523 121852 76951 57897 65337 77036
36897 77036 96884 142213 189519 192091 160495 164882 234923 314800 347484 345717 339514 314021
36885 314021 258969 228256 272443 341194 334143 240292 152195 137868 166390 174429 148170 118171
36873 118171 116738 156583 215148 233331 171640 74586 34271 80906 156507 206884 242520 283574
36861 283574 301751 262776 190785 143031 137841 144872 136112 116352 107918 125604 163250 195218
36849 195218 199536 183864 174457 179006 182846 183402 197338 223898 233484 210307 179236 170593 180840
36836 180840 186723 177659 156372 127243 102183 100676 126495 157791 172885 172667 169390 169218 172484
36823 172484 174894 165674 142438 125155 131849 147530 149287 152728 188412 237072 245809 215759 210300
36810 210300 255335 295003 280084 241643 233656 253344 266034 265259 260256 244634 226053 245296
36798 245296 311552 358075 323783 247032 214337 241953 274467 280154 277360 275885 260523 235332
36786 235332 228718 251666 294364 354829 424672 463425 442489 398346 381695 372858 321495 256171
36774 256171 263898 353644 430974 432823 403257 400352 408585 393868 376605 388697 408274 397488
36762 397488 367484 350263 338191 307010 274329 280313 324659 370491 399299 417778 420758 394558
36750 394558 356688 349487 385919 434505 468321 501541 561840 644773 715561 753341 777208 816139
36738 816139 858420 854587 784415 696708 649783 627888 564264 448339 356107 352033 407594 452128
36726 452128 466696 480898 499294 485368 421754 345392 305660 308832 320843 316003 305475 310413
36714 310413 318669 293255 231310 183619 187272 206354 184927 138680 131100 163275 162836 99947
36702 99947 36429 20764 9229 -47415 -102950 -83369 -13746 12958 -24999 -60417 -58128 -65599
36690 -65599 -121836 -191658 -225609 -226349 -217979 -198863 -166416 -148957 -168176 -196988 -195196 -166055
36678 -166055 -140705 -127026 -114138 -111441 -137244 -173087 -174037 -130839 -84238 -68077 -74461 -89486
36666 -89486 -123846 -178196 -209480 -174277 -91214 -17282 32018 90773 164572 199328 159772 95631
36654 95631 81142 114099 128603 95483 50756 22116 -9437 -52206 -66343 -25525 26319 29211
36642 29211 -11040 -46383 -68269 -103558 -137191 -109970 -11965 82731 108651 87232 69588 45904
36630 45904 -23553 -111150 -135846 -85392 -50486 -98127 -170063 -166957 -93955 -47013 -68280 -97174
36618 -97174 -79319 -45785 -44755 -60140 -56036 -53369 -92872 -151235 -167069 -137626 -119100 -132730
36606 -132730 -140330 -121114 -104072 -104710 -93552 -54685 -17334 1817 30902 80562 105826 78100
36594 78100 45197 62505 104637 108578 74217 53120 53902 30144 -34276 -88960 -83233 -27864
36582 -27864 24513 34026 2899 -28180 -15197 38514 78573 67615 33870 20065 13897 -19354
36570 -19354 -57550 -42219 24205 69292 52918 19082 21991 51762 64319 45434 13918 -8764
36558 -8764 -5805 30899 80021 98429 70703 28124 1284 -18356 -48531 -76459 -78410 -59872
36546 -59872 -47776 -52621 -58266 -40772 13973 96464 167258 184800 152992 120760 121378 135576
36534 135576 128702 95914 50625 -1028 -45961 -53665 -17172 17422 3661 -38398 -52152 -31785
36522 -31785 -29656 -73255 -124821 -141535 -133148 -130717 -129514 -99898 -39769 18412 49605 57154 50801
36509 50801 30441 1172 -16900 -10888 4045 3435 -11271 -12897 14497 53519 75058 71344 57728
36496 57728 47993 40072 27358 14588 14512 29157 42262 38431 25685 23040 22969 -8307 -73736 -114922
36482 -114922 -79197 -4259 17507 -35544 -83133 -61202 -12183 -10835 -48695 -57176 -16932 26556
36470 26556 44925 53383 53167 18461 -40181 -62325 -19137 40689 59550 42911 27281 15830
36458 15830 -8871 -34462 -30526 -2499 7255 -23185 -62927 -60580 2336 91428 148835 147942 119193
36445 119193 111601 134350 156950 160924 158414 158370 153740 151939 175160 212329 215875 174098 141386
36432 141386 156948 175767 133511 48038 -7120 -12877 -19090 -48668 -56846 -9391 55299 80673
36420 80673 70693 69720 83579 68029 72 -76196 -97333 -57728 -12828 -5323 -14580 3907 49146
36407 49146 75847 59310 24097 1033 -10518 -20614 -19562 2765 28968 33665 19833 12368
36395 12368 23361 42095 51846 42595 17125 -5122 -5252 5324 -4666 -34378 -40770 -2832 37733
36382 37733 34842 8724 13878 54154 78679 58548 23546 16427 43962 81077 100139 92289
36370 92289 76326 82606 113812 134084 113616 64733 13860 -34349 -76011 -84966 -53454 -23966
36358 -23966 -27302 -19376 51950 139813 142636 53035 -25504 -26455 1167 -6548 -31802 -30289 -15729
36345 -15729 -26684 -55064 -67307 -62967 -58307 -39554 16451 96593 170294 231586 282290 301164
36333 301164 276557 245531 251194 281522 299421 311764 352848 416193 463444 490556 520722 535828
36321 535828 487191 386582 316120 319588 344526 328967 292300 291702 326612 340442 299095 222958
36309 222958 150830 108946 107637 133494 147350 120121 70943 45824 61120 92430 115929 131899
36297 131899 144528 146471 133558 114450 97320 84650 85796 112257 152958 179534 187676 203497
36285 203497 228851 214913 129456 25600 -11342 19855 32787 -20174 -77979 -64577 -3173
36274 -3173 21183 -12805 -39991 -10882 43870 70500 67119 70619 96846 124710 126419 92599
36262 92599 39061 4112 23827 91271 152760 163223 134502 110969 109891 109407 87978 49735
36250 49735 10263 -20350 -36061 -34973 -27231 -28552 -40337 -48503 -46332 -44394 -50389 -52693 -36276
36237 -36276 -6784 14498 16587 7854 -500 -8531 -21358 -38294 -55258 -72279 -90227 -103594
36225 -103594 -106541 -105260 -111717 -120428 -103684 -41781 46637 114807 127933 88377 26569 -24375
36213 -24375 -49161 -56628 -66495 -84485 -94027 -78524 -44706 -13730 4161 13161 16197 11922 4552
36200 4552 477 -3554 -12942 -18381 -5962 15874 21607 5778 -6702 3694 24419 31473 19904
36187 19904 276 -21301 -43942 -61469 -65812 -57596 -42915 -20766 18292 76194 128819 131224
36175 131224 61128 -36327 -74352 -19898 59159 78181 46951 44191 89406 108590 46118 -53545
36163 -53545 -112746 -114942 -85499 -27593 58640 124263 111291 38021 -16856 -17285 -1843 -7364
36151 -7364 -17565 -7113 11468 13198 -1913 -23706 -55417 -94698 -114860 -96238 -62618 -57044
36139 -57044 -85943 -111028 -97693 -54247 -19682 -23476 -60522 -97976 -103037 -69034 -20728 4338
36127 4338 -14725 -62216 -93333 -70250 2900 84117 133020 139045 113473 72343 34347 16932
36115 16932 20777 31172 43580 67453 91324 72079 -11733 -114770 -166711 -148558 -96328 -42213
36103 -42213 7120 38397 25407 -30972 -90459 -117407 -112351 -88854 -47706 7545 52657 64074
36091 64074 48254 32986 35194 48546 59624 68602 90929 134601 177657 184869 154566 126581
36079 126581 126172 126427 96582 61661 67978 104633 113849 77976 42079 42416 64548 85678 106721
36066 106721 121999 106025 56336 6811 -24877 -57314 -88553 -73859 206 69105 68036 17816
36054 17816 -17597 -23769 -30071 -41845 -41452 -39438 -63301 -102703 -119132 -103357 -74484 -33046 31072
36041 31072 92667 110512 89575 69320 56070 28373 4238 28290 84080 98997 59036 37689
36029 37689 72868 96214 44913 -25448 -19216 53684 95768 63728 10697 -9807 -8415 -14851
36017 -14851 -26354 -22878 4133 52058 105451 129128 97055 33547 -8567 -15152 -18747 -34197
36005 -34197 -31864 6298 45544 42465 814 -44831 -76064 -92128 -85900 -51740 -6792 22805
35993 22805 30407 25177 13826 7243 27383 77200 116347 101986 49049 15496 28278 59088
35981 59088 77224 88593 108714 130490 138940 133127 116208 88419 66425 79111 118942 127911
35969 127911 67734 -20223 -67584 -72207 -86264 -119979 -121343 -66719 -11638 -15099 -56859 -74402
35957 -74402 -52518 -28011 -21985 -16518 4013 30714 52623 65131 52816 2526 -57096 -68596
35945 -68596 -16992 45178 65038 48324 25429 -3643 -46150 -66291 -19021 68313 106969 56485
35933 56485 -23956 -57943 -42209 -19798 -1349 34109 77711 88471 58607 32486 41335 57008
35921 57008 36876 -14499 -60290 -87272 -109160 -122866 -102793 -47809 391 7794 -4114 12886
35909 12886 66812 113903 114748 77991 39336 17508 7516 3504 6379 14158 25736 51602 97158
35896 97158 134771 122592 62734 11117 9101 32691 36740 21216 12195 -1329 -54427 -131794
35884 -131794 -166238 -130182 -77756 -66263 -78414 -61019 -8868 34411 41855 28187 15550 7266
35872 7266 -4333 -24812 -49656 -59071 -35563 3692 19129 10062 27758 98606 173223 194143
35860 194143 176726 168202 160919 117561 60055 49453 80997 85883 49439 39306 86469 124276
35848 124276 96189 50534 62650 117852 143003 117648 84877 75545 85911 115480 166556 211449
35836 211449 211915 171023 125891 94745 68339 43223 23254 -2058 -40328 -68222 -62073 -43371
35824 -43371 -46991 -57736 -35253 4657 -669 -61650 -111225 -100669 -62298 -45235 -41191 -17828
35812 -17828 13017 11896 -21490 -42954 -22236 23815 56212 51478 16129 -20785 -30790 -10826
35800 -10826 18052 38539 50747 52816 26272 -42299 -132114 -195717 -199415 -155809 -116730 -127263
35788 -127263 -180630 -228416 -243051 -249256 -273236 -287749 -250485 -181902 -148747 -166985 -178409 -140990
35776 -140990 -87161 -63310 -63311 -63465 -77986 -125814 -173683 -171989 -132085 -111492 -127751 -140218 -119952
35763 -119952 -87610 -70831 -67397 -67312 -75585 -93912 -107470 -107328 -103348 -101227 -89027 -59242 -22729
35750 -22729 10089 38493 51864 29956 -20374 -57703 -58197 -48593 -60144 -76616 -65348 -40477
35738 -40477 -49617 -101377 -147633 -144204 -98083 -49281 -32688 -58640 -101373 -107237 -49611 23202
35726 23202 36358 -10874 -43977 -26545 -13089 -53700 -106912 -105341 -60435 -30172 -15639 27070
35714 27070 86211 94477 38215 -15660 -24549 -26990 -62328 -103814 -115809 -116304 -130102 -131587 -92735
35701 -92735 -46445 -39583 -54626 -42801 -13808 -25669 -91514 -156237 -170131 -138765 -95452 -64744
35689 -64744 -58581 -75019 -94765 -100481 -95132 -84534 -61200 -29721 -21346 -49278 -77443 -73533 -61836
35676 -61836 -74975 -87874 -63674 -36045 -66696 -134427 -150380 -86505 -10267 18485 10058 -8565
35664 -8565 -32973 -45836 -16389 35719 43269 -11946 -69100 -83036 -82182 -99567 -114982 -106720 -97180
35651 -97180 -103812 -104686 -93690 -105225 -139744 -135421 -68468 -9542 -14317 -29376 12559 70424 66127
35638 66127 26225 40039 103780 121726 61305 584 2228 30713 27292 -3783 -22197 -15414
35626 -15414 -1362 2616 -7605 -21652 -20801 -3090 7149 -3143 -9594 7260 20963 3119
35614 3119 -20087 -9199 15426 5554 -26329 -20846 28287 55866 16357 -61708 -121735 -133355
35602 -133355 -98353 -47241 -28589 -59368 -94428 -87963 -63738 -68982 -86225 -65802 -25699 -30017
35590 -30017 -74193 -86384 -50288 -30544 -56987 -78467 -61541 -44189 -54309 -62213 -56421 -79183
35578 -79183 -135616 -153746 -98131 -44128 -66132 -121349 -124935 -82529 -62312 -79322 -93801 -94735
35566 -94735 -103465 -112594 -94522 -60055 -47070 -61433 -81087 -101644 -126893 -135616 -112067 -87326
35554 -87326 -93527 -100436 -62020 -7322 -12304 -85770 -153904 -165998 -152586 -162116 -191848 -203968
35542 -203968 -175906 -119896 -75854 -84036 -137648 -171232 -130865 -47497 -1563 -21929 -62933 -77969
35530 -77969 -68769 -56230 -45388 -32290 -14580 12873 47834 67424 54143 31247 38116 72016
35518 72016 90435 72407 40778 19272 3981 -13760 -29648 -43486 -65566 -92518 -98758 -65116
35506 -65116 -3406 52306 69942 41062 -7650 -34500 -31300 -37806 -86266 -148737 -168960 -133512
35494 -133512 -80382 -48289 -49070 -78862 -121355 -145318 -129167 -83983 -33214 11586 33729 5716
35482 5716 -60680 -96356 -61035 -13694 -31314 -88203 -97710 -52952 -28686 -45568 -39928 7827
35470 7827 20660 -49289 -132298 -143744 -103521 -81404 -81204 -58852 -17335 -3225 -25505 -46499
35458 -46499 -47804 -49067 -63057 -78601 -87958 -93723 -91713 -79906 -77369 -101170 -131650 -133864 -107944
35445 -107944 -85847 -82357 -81243 -69335 -55590 -54465 -72878 -112179 -161514 -192196 -180871 -137610
35433 -137610 -93575 -65494 -49292 -38678 -26216 5535 63857 117404 118097 59387 -11500 -49890
35421 -49890 -61164 -77685 -105518 -115863 -85732 -29406 15148 20985 -11096 -59958 -98415 -107639
35409 -107639 -91538 -73923 -67721 -54768 -20725 -1900 -51421 -148045 -195373 -149648 -94751 -127251
35397 -127251 -208335 -216130 -128404 -54977 -74699 -135252 -154637 -139186 -141362 -164419 -178655 -189174
35385 -189174 -218064 -246824 -241223 -215513 -211839 -226786 -215510 -166043 -118697 -109050 -134265 -178439
35373 -178439 -231395 -276136 -291884 -279553 -263101 -264824 -296551 -364060 -453672 -524851 -547437 -541338
35361 -541338 -551696 -591945 -639712 -679349 -715675 -753294 -796551 -860583 -938854 -961540 -838628
35350 -838628 -566800 -259780 -47368 38002 61257 95465 155925 211947 238479 244238 252039
35339 252039 264492 264998 250730 241562 248266 256531 256979 264073 283248 286632 252095 203010 173887
35326 173887 157375 126687 93834 96821 134665 162894 156176 132512 110697 86739 62392 55903
35314 55903 67094 65108 30340 -15782 -38082 -23954 17993 73243 122962 148902 149255 138582
35302 138582 128020 117476 105964 94634 82494 73569 79282 95898 94964 63416 37864 62509
35290 62509 122150 156907 139789 99753 69918 56074 59096 83608 113968 119969 96214 63324
35278 63324 30605 -1083 -3282 55649 141177 170080 120039 62203 53493 56846 14630 -51713
35266 -51713 -76360 -49918 -23702 -29288 -46776 -45923 -15903 39015 95539 111838 70971 17421
35254 17421 10114 41070 42997 -14614 -77219 -74294 -9897 43986 35906 -9066 -29821 -9022
35242 -9022 10241 -10455 -49777 -58743 -29808 -715 2777 -10062 -29666 -62122 -99059 -110308
35230 -110308 -84840 -47521 -19953 2316 20323 20217 10688 26846 68559 81601 39064 -3709
35218 -3709 13270 60171 62290 13661 -22423 -15915 -4397 -19798 -43284 -51213 -53941 -63552 -63957
35205 -63957 -42277 -20141 -24404 -47102 -62526 -70876 -95377 -135858 -149724 -93899 21469 135383
35193 135383 194364 195815 167189 122989 66829 20433 9527 19069 3996 -43836 -80176 -77131
35181 -77131 -64909 -79021 -107506 -124333 -135425 -149240 -137397 -75205 4978 52895 72245 101468
35169 101468 141410 159295 153188 152652 157912 137163 90598 62796 77406 103397 99348 54988
35157 54988 -17319 -93695 -135438 -114841 -54378 -7019 6100 4461 -1242 -22026 -52348 -67875
35145 -67875 -70025 -85244 -108670 -97059 -34914 36270 71668 64454 21235 -53510 -127314 -144702
35133 -144702 -94831 -35748 -22041 -42817 -55897 -45458 -18425 18700 49611 49581 25677 20548
35121 20548 48061 63243 28712 -26678 -51656 -39742 -15651 9682 29790 23157 -11633 -31955
35109 -31955 -8554 23005 16609 -10391 -13840 -3895 -21117 -50132 -34453 22025 43418 -9844
35097 -9844 -83931 -109420 -84227 -47987 -18011 9951 26668 17736 -2204 3583 48295 99863
35085 99863 112947 79171 38154 30576 45452 35340 -12357 -51399 -43745 -17303 -21300 -50927
35073 -50927 -62726 -46988 -31153 -19099 13352 56313 59063 7040 -44763 -44372 -7904 17868
35061 17868 20509 14714 2948 -15620 -20196 4684 31733 22879 -9038 -13649 21554 53136 50761
35048 50761 42423 63962 95664 89588 46403 19774 37331 58981 40196 6315 21383 92990
35036 92990 154619 152736 110744 84159 87691 101376 122395 163304 205973 205127 149245 82043
35024 82043 45215 27181 -7619 -56372 -74331 -34321 31554 63585 43360 16117 34947 93049
35012 93049 132505 119702 84450 72489 86278 94430 76758 33380 -28836 -84653 -83943 -992
35000 -992 114920 179817 166386 117559 71755 22217 -40345 -93469 -114537 -110002 -90164 -47903
34988 -47903 13109 60183 70466 63423 66321 69120 43965 -6410 -49597 -63894 -54112 -34209
34976 -34209 -12939 9229 39857 80373 107594 92972 49811 29249 50158 68825 49140 27211
34964 27211 60084 134514 180260 163739 116145 70555 24296 -26319 -61743 -69347 -62375 -51706
34952 -51706 -30667 -3502 5103 -9814 -15227 11269 40360 29224 -16818 -51585 -46380 -13290
34940 -13290 22834 48469 58428 51957 35676 16049 -10870 -49730 -90498 -118750 -137383 -159262
34928 -159262 -179802 -178415 -151309 -122166 -111556 -113761 -114833 -115384 -118199 -107679 -66312 -8757 23325
34915 23325 6784 -37218 -69165 -71994 -61025 -63926 -95706 -141898 -160351 -114116 -14951 77066
34903 77066 112183 100938 90804 104242 123380 129402 124980 111581 76944 23975 -13095 -7249
34891 -7249 23062 41491 47255 68604 107332 126894 105834 71269 59629 67231 63967 40580
34879 40580 15558 2364 -3428 -4216 8048 34738 64938 93413 124178 147594 137609 90327
34867 90327 45178 40524 60005 54248 11846 -25988 -27225 -9983 -4717 -7192 3129 21227 27874
34854 27874 29895 51231 85814 96785 71721 46006 53676 80092 86119 62637 36084 27785
34842 27785 32720 40563 56757 90323 129049 140121 100390 23876 -44421 -63521 -25961 41703
34830 41703 98202 109621 71619 22100 16534 70349 133592 143933 98578 48190 23259 1392
34818 1392 -41803 -83508 -82091 -36346 11785 28621 21756 21078 40291 60557 49880 3149 -38346
34805 -38346 -23275 46105 103383 86646 6888 -68517 -91824 -73957 -49881 -29146 3663 48369
34793 48369 71454 43543 -13576 -41859 -16549 24626 41127 49957 87901 134208 127903 62491
34781 62491 3644 -3995 10129 9617 11477 35116 45490 9274 -32067 -16907 33543 43363 3321
34768 3321 -15273 23700 67292 59731 17161 -18107 -42337 -67087 -75746 -51978 -22135 -22081 -40095
34755 -40095 -37055 -13186 -11095 -49320 -88503 -78967 -23708 21856 10446 -45169 -87537 -81344
34743 -81344 -49877 -32749 -26559 1876 54091 93497 102648 102713 103992 83732 36908 3692 10777
34730 10777 24441 5753 -20589 -5083 42063 63927 44262 22580 21511 19042 5602 9193
34718 9193 35226 34599 -22120 -74855 -35598 90255 195592 192791 104283 16884 -20172 -22628
34706 -22628 -17931 -6409 18486 44485 57683 67713 90300 115030 120196 115908 135281 173685
34694 173685 177459 119916 54033 47595 87411 98810 54143 7343 9681 43229 64484 68487
34682 68487 68360 46064 -19475 -87652 -80754 12523 105782 114119 50661 -7550 -22176 -18568 -20572
34669 -20572 -11424 27058 75031 99806 96715 79419 48539 1097 -39597 -39887 -5005 19256
34657 19256 5730 -19699 -20093 -1344 1870 -17718 -27702 -3321 36299 51973 31178 -4971
34645 -4971 -36037 -63667 -91145 -99073 -64244 -19 47893 55957 50611 64393 85551 78593 40489
34632 40489 2808 -15894 -24254 -25972 -13504 -681 -18256 -57971 -62608 -2931 69327 84167
34620 84167 44222 9647 8823 13110 -2446 -22335 -26618 -23116 -22035 -8287 34288 88813 120600
34607 120600 116683 88167 41364 -25139 -90955 -111085 -65274 4553 34547 14002 -9554 -4969
34595 -4969 675 -22592 -47782 -30624 13586 27779 1129 -18438 -5428 9010 1637 -3328
34583 -3328 11319 18260 2510 2957 46262 85569 65649 12684 -6841 10656 13081 -16040 -44858
34570 -44858 -60353 -75301 -73727 -27020 29861 17199 -74826 -161057 -175018 -140816 -105471 -70379
34558 -70379 -29238 -8561 -20275 -28026 -11896 -16298 -76037 -139335 -130462 -57551 8464 39389
34546 39389 64240 89000 75014 10547 -52952 -60467 -15148 37314 61225 54390 37039 27960
34534 27960 25012 11672 -11890 -20355 -691 20777 11687 -21973 -49984 -60639 -60420 -45551 -8994
34521 -8994 30512 40444 16554 -12874 -23587 -13032 14264 53662 93353 120711 133210 127717
34509 127717 90700 20872 -50591 -87955 -89485 -75134 -51385 -18567 1588 -16047 -59312 -89578
34497 -89578 -89054 -67183 -29441 23452 71591 90747 89726 96263 108764 100639 68517 33262 -2730
34484 -2730 -48233 -72790 -25314 78616 145602 112926 24880 -30648 -22684 18219 57832 79601
34472 79601 74239 48750 32219 42790 62166 65187 54739 43468 25514 -2024 -11702 21123
34460 21123 70580 85657 59281 34300 37323 43042 19703 -17496 -24617 8433 39638 28926
34448 28926 -6203 -12812 21640 47812 26142 -12522 -14880 10911 12618 -15183 -22675 3277
34436 3277 7615 -40329 -84382 -62514 -3929 16110 -10600 -22683 11011 52086 59824 44438
34424 44438 33257 22904 -5867 -44752 -57554 -25572 20747 28583 -15721 -65883 -71870 -42560
34412 -42560 -23327 -23183 -11067 13695 5743 -49063 -96632 -91950 -64054 -58593 -61622 -37064 -2164
34399 -2164 185 -20096 -16749 10711 15448 -19657 -58981 -66026 -30605 45352 136683 182118 142372
34386 142372 64218 27638 38705 40396 18400 15089 36805 34977 -3504 -31786 -32725 -47000
34374 -47000 -79521 -68957 -50 42445 613 -52927 -21408 65985 102070 60076 12333 11784
34362 11784 39838 65040 79173 74555 48215 29382 47766 77256 65233 14482 -19271 -10306
34350 -10306 12215 24430 36312 50122 42474 5599 -33027 -46842 -35627 -10539 15043 21948
34338 21948 6989 882 24341 39931 2530 -51290 -33808 66270 157299 166185 118903 72316
34326 72316 36604 9449 21074 82054 133343 116124 61149 44560 78038 108080 108611 104437
34314 104437 104573 82077 34786 5031 14153 28932 22923 23510 57483 89543 68489 12160 -12153
34301 -12153 12650 31653 6885 -28714 -36078 -38311 -74062 -116925 -105932 -44786 -2820 -9873
34289 -9873 -18152 6824 24439 -6396 -48385 -45125 -18029 -29922 -75068 -84714 -37765 10892
34277 10892 21924 18394 20472 2703 -48016 -88010 -72028 -12695 48295 88898 97272 60487
34265 60487 2349 -10491 51993 130406 148600 109806 74806 73882 90932 109579 120564 102422
34253 102422 49973 8001 22609 71515 97160 94413 101283 112191 77884 1302 -44214 -21356
34241 -21356 14381 4452 -24869 -15923 24396 42556 25477 8563 6120 -8860 -48286 -80653
34229 -80653 -79462 -64595 -65849 -66014 -17771 81591 166079 172170 114048 59837 44746 45350 38167
34216 38167 33962 35189 11138 -43699 -69758 -18147 63200 85639 45234 18188 35143 44055
34204 44055 17073 9899 68594 144703 163499 129541 101897 98623 90971 71627 62373 58806 28561
34191 28561 -26726 -58662 -38389 3691 25108 28154 44977 83970 116390 113104 77370 36818
34179 36818 13576 13205 38751 93472 156289 177958 135322 78276 79579 136683 171192 137415
34167 137415 78808 51873 49627 43764 52189 101772 156237 151779 93065 48955 54099 75018
34155 75018 78716 75189 76642 68979 48268 41069 61155 81872 78128 64529 64212 67210 50426
34142 50426 19378 -420 -2215 -1060 -3347 3515 28610 59298 71805 57041 32891 26399 42428
34129 42428 59968 65332 72703 96928 123928 132214 128192 129347 125201 92903 44891 18790 19552
34116 19552 15288 -3446 -5948 22963 53361 58082 52827 63648 85565 97966 95285 82182 63378
34103 63378 53662 68370 89706 78446 35974 12241 28086 36662 -2463 -55926 -68130 -40328
34091 -40328 -7417 27445 75280 108056 91921 57471 66301 112144 125078 79242 27067 9688
34079 9688 118 -33203 -62794 -44788 12705 65193 90949 99303 97943 83519 54907 14089
34067 14089 -35539 -76352 -78635 -35499 17532 38003 22850 2866 -165 6667 6311 -4501 -13009
34054 -13009 -7141 6792 7615 -13532 -37964 -44888 -42088 -49016 -58116 -45859 -21802 -25959 -62918
34041 -62918 -77078 -21915 72680 134310 133345 103733 87726 89839 87453 65600 33247 11815
34029 11815 9744 11682 3702 5466 51963 135103 193144 181262 131391 113877 152551 205535
34017 205535 222403 193747 147437 119585 128970 161353 180609 170199 155714 168356 198679 213788
34005 213788 210442 214494 227856 217366 170997 128721 130248 155757 149963 95191 32618 10988
33993 10988 34836 68683 80307 72877 75543 102580 126978 108318 49855 8446 31764 98698
33981 98698 142846 128282 79655 40016 25418 28435 42103 63139 85114 104763 127127 152575
33969 152575 168372 166263 158370 159506 162054 146164 107693 56535 -4914 -76392 -137282 -159955
33957 -159955 -148654 -135592 -133457 -124939 -107883 -109971 -137336 -149353 -118677 -81795 -87299 -121447
33945 -121447 -134150 -118158 -106607 -103489 -78071 -30147 85 -144 4527 30974 44901 21689
33933 21689 -12028 -31504 -58354 -107272 -133071 -89515 -12957 15207 -20690 -54492 -34259 16390
33921 16390 45786 43806 42984 69594 108505 113247 56172 -25011 -50937 8007 84320 89412 21744
33908 21744 -39814 -41653 -8897 10546 10198 13309 27610 36193 21200 -16122 -51811 -55336 -21314
33895 -21314 19939 39847 49398 74088 101462 91628 41372 -2834 -9849 -7090 -36498 -91674
33883 -91674 -123834 -99610 -36223 16188 21150 -9882 -32227 -24022 -12606 -26250 -42908 -27320
33871 -27320 -1999 -21665 -75075 -80775 -7235 65407 49857 -29864 -80697 -69161 -46088 -56878
33859 -56878 -86072 -94371 -64848 -5098 58750 82361 33723 -60586 -124786 -106711 -28857 39798
33847 39798 48899 -562 -70912 -122155 -136751 -118958 -77093 -17731 41238 71309 61804 33727
33835 33727 9871 -13572 -46879 -76914 -86037 -86201 -97414 -99584 -51327 34724 81590 41756
33823 41756 -30063 -37001 39828 120811 131603 91822 77482 116636 158377 147143 92905 46661
33811 46661 32091 34930 44240 59724 59968 15170 -51626 -66045 1262 80643 88456 32308 -18999
33798 -18999 -41370 -65875 -96208 -90076 -36006 16283 29731 31020 53962 77744 65409 31269
33786 31269 21517 44294 63646 57362 42194 39727 48694 57566 60445 53209 33472 12377 9719
33773 9719 26599 35217 10138 -34277 -51904 -16337 43368 69476 37321 -22430 -66084 -82717
33761 -82717 -84042 -68739 -27091 25421 52609 41037 11069 -21461 -63026 -109209 -127534 -98668
33749 -98668 -49969 -19860 -8357 7003 23296 17204 -9476 -26750 -20733 -7869 697 15771
33737 15771 38023 39496 -1070 -64748 -116058 -144195 -158435 -157607 -133358 -96796 -70450 -54029
33725 -54029 -31703 -18483 -56608 -141777 -194481 -151734 -62774 -35130 -92635 -151779 -149289 -122111
33713 -122111 -125145 -137085 -111666 -74341 -86659 -135642 -142422 -81784 -14575 13427 28961 58665
33701 58665 70623 35828 -8009 -10262 14191 16378 -5135 -10261 11157 25670 7565 -37624
33689 -37624 -94115 -142815 -154974 -116790 -56820 -17181 -4036 3552 8271 -5254 -34562 -61868
33677 -61868 -85107 -109078 -116371 -91992 -69036 -96139 -156494 -175265 -123178 -61062 -55273 -91154
33665 -91154 -102512 -57336 15605 64451 54705 -9860 -86415 -125974 -117979 -87992 -52346 -5740
33653 -5740 42176 60186 45078 38865 67338 93815 69147 3886 -46207 -50448 -23450 13223
33641 13223 50910 74564 58065 -4659 -77863 -109346 -82645 -41111 -47294 -108959 -162026 -148706
33629 -148706 -92812 -58014 -47608 -7402 69159 113475 89132 55270 70391 93990 54796
33618 54796 -26996 -67705 -46914 -22596 -25818 -23072 4464 19821 -3425 -33522 -32460 -9165
33606 -9165 10654 27485 47716 53969 30969 -1863 -14409 -5616 5179 10570 16323 24930 38616
33593 38616 65621 103541 127536 115177 76901 45136 35728 32347 9926 -31861 -61215 -45850
33581 -45850 4817 41492 30787 -5081 -22810 -16203 -12950 -27886 -54127 -89759 -132181 -152770
33569 -152770 -125381 -80559 -79235 -124546 -154545 -137005 -111778 -112905 -110170 -70298 -22171 -6563
33557 -6563 -2249 37092 98959 124980 95007 47632 24448 35401 69822 103216 103193 63321 18690
33544 18690 -421 -5637 -9802 10511 60776 79278 16455 -65521 -60007 30592 102643 111856
33532 111856 122097 175989 230409 269036 367514 561789 739683 771600 692985 642803 654849
33521 654849 634718 539264 446917 411191 362248 232139 92878 67058 142712 183456 119717
33510 119717 32914 22735 74071 110222 117211 139422 180286 188676 147221 103094 90176 82160
33498 82160 55125 39358 60442 74896 26425 -61764 -114244 -105920 -73701 -38201 12706 59348
33486 59348 48299 -18573 -60393 -21436 53211 85199 59487 12448 -31164 -59253 -47445 9056
33474 9056 59775 48825 -10550 -56465 -62135 -54422 -56951 -60558 -50850 -26817 9648 50121 67015
33461 67015 37885 -17002 -51373 -47212 -25495 -7563 4000 10979 19100 48094 106078 155467
33449 155467 144601 79072 23240 20643 49070 67557 70880 75463 81496 77622 66595 61560 64440
33436 64440 65125 58426 51669 56613 75442 92278 85101 54018 27028 24668 32312 25089 3440
33423 3440 -19414 -43211 -58594 -23379 84146 198165 217758 137140 60315 62559 99645 94016
33411 94016 53072 40338 64840 69844 24567 -33233 -55875 -41341 -14265 12969 37009 44642
33399 44642 25581 -1998 -3613 26334 49462 31312 -6099 -8937 28156 43601 -6282 -77886
33387 -77886 -94744 -46554 14532 58642 99068 132830 128307 89054 70133 102674 149554 162951
33375 162951 142891 114822 94204 96832 133907 169251 136880 36431 -46346 -55619 -39202 -53204
33363 -53204 -61223 -5786 75779 100656 69474 49257 51699 31143 -5265 6132 65570 88534
33351 88534 37129 -15308 5140 69499 100002 69549 2945 -70413 -121227 -120260 -74408 -28787
33339 -28787 -4299 25644 69101 79086 26440 -35892 -34189 29854 92427 114553 110532 104809
33327 104809 100974 87950 52184 -6963 -61787 -78553 -64989 -60819 -69286 -47764 9387 37450
33315 37450 -4982 -62670 -61636 -15171 14122 20238 44841 85991 96934 70053 48314 51527
33303 51527 58159 61836 77259 85082 44126 -27499 -57278 -27528 -6686 -38174 -70938 -49774
33291 -49774 -9042 -11358 -42978 -44678 -15259 -5700 -21261 -5196 69740 156091 200155 208082
33279 208082 215973 229258 224316 191425 146201 103186 59240 7038 -44263 -68501 -47379 2200
33267 2200 34819 21677 -16838 -37101 -24658 -1518 15499 35824 64627 77513 49567 -2969
33255 -2969 -35431 -26986 1116 21147 30956 41117 48834 43174 28763 25450 42029 62524 63523
33242 63523 38064 -1788 -40568 -71412 -92322 -95149 -67043 -11154 39239 46041 13414 -8519
33230 -8519 16914 65259 84675 63005 29629 -75 -37858 -74022 -64957 2515 72101 82713
33218 82713 48010 28852 41679 42610 2845 -47068 -64952 -54125 -48112 -58831 -66154 -52777
33206 -52777 -28475 -14067 -10843 2560 37293 67614 57759 18515 8613 59010 119738 115607
33194 115607 41193 -37981 -72493 -72383 -57868 -16277 62827 142967 170345 138316 93590 78968
33182 78968 88581 82866 39107 -16377 -31385 8640 50022 28547 -43457 -81700 -34627 50215
33170 50215 90240 70289 44721 53246 75980 72229 29586 -32734 -82803 -90617 -48938 8979
33158 8979 33556 14012 -8505 3536 35044 45927 31717 25261 40498 48296 22575 -15077
33146 -15077 -22034 5996 28952 15499 -20262 -40213 -22366 25931 76530 94412 63535 12778
33134 12778 -2342 37540 86257 86521 40205 -834 -3640 15723 26793 18244 -6662 -40014
33122 -40014 -65969 -69445 -55987 -45131 -40730 -28048 -2029 25308 47808 67705 71601 38478
33110 38478 -15951 -38107 -1464 56504 85700 83612 76217 65439 33215 -16588 -57062 -74485
33098 -74485 -76943 -70794 -54327 -32492 -15905 -7844 -9821 -31561 -73939 -110281 -109330 -73118 -31307
33085 -31307 -4118 8052 7339 -3276 -11086 -9587 -16189 -44201 -64197 -31106 47424 107084 102083
33072 102083 53071 8375 -12221 -19400 -27047 -41954 -60928 -64786 -37524 -4586 -23111 -109460
33060 -109460 -199138 -210200 -136129 -48996 -17384 -46139 -93054 -118358 -112314 -92185 -80019 -76747
33048 -76747 -61299 -25661 -1072 -24399 -76505 -84184 -5782 101842 133913 59022 -37120 -45390
33036 -45390 48738 165355 233637 255296 261009 251861 218374 185204 186328 205860 195390 155367
33024 155367 147036 201306 263077 265937 228314 223077 266074 292518 253770 187500 162200 185372
33012 185372 206879 199152 189432 203637 215766 182486 111117 58996 63441 101134 128933 140705
33000 140705 161716 201650 240499 258527 256544 242321 215314 172329 117096 59825 15114 -1912
32988 -1912 9664 26991 23755 731 -18271 -19731 -11960 -3202 10895 32880 54846 69808 76420
32975 76420 72086 60805 64661 97905 127898 99706 12795 -63854 -73770 -35752 -2438 3826
32963 3826 -19154 -84033 -180056 -237837 -194490 -87353 -21499 -39512 -80518 -79724 -50681 -42905
$$ [...]
0e20
##END NTUPLES=NMR SPECTRUM
##END=
