##TITLE=31Pdec_LR-665-RM1
 THF, 24 sc
 2.4.2019
##JCAMPDX= 6.0         $$ Bruker NMR JCAMP-DX V2.0
##DATA TYPE= NMR SPECTRUM
##DATA CLASS= NTUPLES
##ORIGIN= UXNMR, Bruker Analytische Messtechnik GmbH
##OWNER= root
$$ XWIN-NMR		Version 3.5
$$ Tue Apr  2 15:38:51 2019 Russian Standard Time (UT+4h)  she@DPX200
##.OBSERVE FREQUENCY= 81.013821
##.OBSERVE NUCLEUS= ^31P
##.ACQUISITION MODE= SIMULTANEOUS
##.ACQUISITION SCHEME= undefined
##.AVERAGES= 24
##.DIGITISER RES= 17
##SPECTROMETER/DATA SYSTEM= spect
##.PULSE SEQUENCE= zgpg30
##.SOLVENT NAME= CDCl3
##.SHIFT REFERENCE= (INTERNAL, CDCl3, 0, 182.463)
##AUDIT TRAIL= $$ (NUMBER, WHEN, WHO, WHERE, WHAT)
$$ ##TITLE= Audit trail, XWIN-NMR		Version 3.5
$$ ##JCAMPDX= 5.01
$$ ##ORIGIN= Bruker BioSpin GmbH
$$ ##OWNER= she
$$ F:/spectra/data/she/nmr/P31/1/pdata/1/auditp.txt
$$ ##AUDIT TRAIL=  $$ (NUMBER, WHEN, WHO, WHERE, WHAT)
(   1,<2019-04-02 15:37:36.12 +0400>,<she>,<DPX200>,
      <created by zg, POWCHK disabled, PULCHK disabled
       configuration hash MD5:
       00 E9 B6 7A A2 85 ED C7 34 08 36 98 17 FE 4E 26
       data hash MD5: 32K
       7D B1 8C 9A BF 6E D3 E3 93 87 CB 04 60 4C 42 E8>)
(   2,<2019-04-02 15:37:44.70 +0400>,<she>,<DPX200>,
      <Start of raw data processing
       efp BC_mod = 2 LB = 1 FT_mod = 6 PKNL = 1 PHC0 = -1797.404 PHC1 = 40.39897 SI = 64K 
       data hash MD5: 64K
       7E 93 03 5F 35 F1 B5 12 12 27 7B CD 7B 8D FF 83>)
(   3,<2019-04-02 15:38:16.90 +0400>,<she>,<DPX200>,
      <pk PHC0 = -13.46605 PHC1 = 16.6 
       data hash MD5: 64K
       19 A8 7A 9C 49 53 7A 6C B9 FB 0A E5 A6 AB E5 E0>)
(   4,<2019-04-02 15:38:19.87 +0400>,<she>,<DPX200>,
      <abs ABSG = 5 
       data hash MD5: 64K
       B6 EA 37 72 4C 64 42 E7 81 A0 DB E8 F3 21 90 8F>)
$$ ##END=
$$ 
$$ hash MD5
$$ C9 5F A7 52 18 2D FC EB 4A D1 E0 D2 BA 38 4B DB
##$RELAX= 
##$RELAX= 
##$RELAX= 
##$RELAX= 
##$RELAX= 
##$RELAX= 
##$RELAX= 
##$RELAX= 
$$ Bruker specific parameters
$$ --------------------------
##$DU= <F:/spectra>
##$EXPNO= 1
##$NAME= <P31>
##$PROCNO= 1
##$TYPE= <nmr>
##$USER= <she>
##$AMP= (0..31)
100 100 100 100 100 100 100 100 100 100 100 100 100 100 100 100 100 100 
100 100 100 100 100 100 100 100 100 100 100 100 100 100 
##$AQSEQ= 0
##$AQ_mod= 1
##$AUNM= <au_zg>
##$AUTOPOS= <>
##$BF1= 81.014009
##$BF2= 200.13
##$BF3= 200.13
##$BF4= 200.13
##$BF5= 200.13
##$BF6= 200.13
##$BF7= 200.13
##$BF8= 200.13
##$BYTORDA= 1
##$CFDGTYP= 0
##$CFRGTYP= 5
##$CHEMSTR= <none>
##$CNST= (0..31)
1 1 145 1 1 1 1 1 1 1 1 1 1 1 1 1 1 1 1 1 1 1 1 1 1 1 1 1 1 1 1 1 
##$CPDPRG= <waltz16>
##$CPDPRG1= <>
##$CPDPRG2= <waltz16>
##$CPDPRG3= <>
##$CPDPRG4= <mlev>
##$CPDPRG5= <mlev>
##$CPDPRG6= <mlev>
##$CPDPRG7= <mlev>
##$CPDPRG8= <mlev>
##$CPDPRGB= <>
##$CPDPRGT= <>
##$D= (0..31)
0 1 0 0 0 0 0 0 0 0 0 0.03 2e-05 3e-06 0 0 0 0 0 0 0 0 0 0 0 0 0 0 0 0 
0 0 
##$DATE= 1554205055
##$DBL= (0..7)
120 120 120 11 120 120 24 19 
##$DBP= (0..7)
150 150 150 150 150 150 150 150 
##$DBP07= 0
##$DBPNAM0= <>
##$DBPNAM1= <>
##$DBPNAM2= <>
$$ [...]
##$SUBNAM3= <"">
##$SUBNAM4= <"">
##$SUBNAM5= <"">
##$SUBNAM6= <"">
##$SUBNAM7= <"">
##$SUBNAM8= <"">
##$SUBNAM9= <"">
##$SW= 369.568048894756
##$SWIBOX= (0..15)
0 1 3 0 0 0 0 0 0 0 0 0 0 0 0 0 
##$SW_h= 29940.119760479
##$TD= 32768
##$TD0= 1
##$TE= 0
##$TE2= 300
##$TE3= 300
##$TEG= 300
##$TL= (0..7)
0 120 53 12 22 120 120 120 
##$TP= (0..7)
150 150 150 150 150 150 150 150 
##$TP07= 0
##$TPNAME0= <>
##$TPNAME1= <>
##$TPNAME2= <>
##$TPNAME3= <>
##$TPNAME4= <>
##$TPNAME5= <>
##$TPNAME6= <>
##$TPNAME7= <>
##$TPOAL= (0..7)
0.5 0.5 0.5 0.5 0.5 0.5 0.5 0.5 
##$TPOFFS= (0..7)
0 0 0 0 0 0 0 0 
##$TUNHIN= 0
##$TUNHOUT= 0
##$TUNXOUT= 0
##$USERA1= <user>
##$USERA2= <user>
##$USERA3= <user>
##$USERA4= <user>
##$USERA5= <user>
##$V9= 5
##$VALIST= <valist>
##$VCLIST= <CCCCCCCCCCCCCCC>
##$VD= 0
##$VDLIST= <DDDDDDDDDDDDDDD>
##$VPLIST= <PPPPPPPPPPPPPPP>
##$VTLIST= <TTTTTTTTTTTTTTT>
##$WBST= 1024
##$WBSW= 4
##$XGAIN= (0..3)
0 0 0 0 
##$XL= 0
##$YL= 0
##$YMAX_a= 10070
##$YMIN_a= -12816
##$ZGOPTNS= <>
##$ZL1= 120
##$ZL2= 120
##$ZL3= 120
##$ZL4= 120
##$ABSF1= 182.463
##$ABSF2= -187.1042
##$ABSG= 5
##$ABSL= 3
##$ALPHA= 0
##$AQORDER= 0
##$ASSFAC= 0
##$ASSFACI= 0
##$ASSFACX= 0
##$ASSWID= 0
##$AUNMP= <proc_1d>
##$AZFE= 0.1
##$AZFW= 0.5
##$BCFW= 0
##$BC_mod= 2
##$BYTORDP= 0
##$COROFFS= 0
##$CY= -3
##$DATMOD= 1
##$DC= 0
##$DFILT= <>
##$DTYPP= 0
##$F1P= 0
##$F2P= 0
##$FCOR= 1
##$FTSIZE= 65536
##$FT_mod= 6
##$GAMMA= 0
##$GB= 0
##$INTBC= 1
##$INTSCL= 5.30512e-09
##$ISEN= 30
##$LB= 1
##$LEV0= 0
##$LPBIN= 0
##$MAXI= 10000
##$MC2= 0
##$MEAN= 0
##$ME_mod= 0
##$MI= 50
##$NCOEF= 0
##$NC_proc= -5
##$NLEV= 6
##$NOISF1= 182.463
##$NOISF2= 159.3651
##$NSP= 0
##$NTH_PI= 0
##$NZP= 0
##$OFFSET= 182.463
##$PC= 4
##$PHC0= -1810.87
##$PHC1= 56.99897
##$PH_mod= 1
##$PKNL= yes
##$PPARMOD= 0
##$PSCAL= 0
##$PSIGN= 0
##$REVERSE= no
##$SF= 81.0140089999434
##$SI= 65536
##$SIGF1= 159.3651
##$SIGF2= -187.1042
##$SINO= 113.3802
##$SIOLD= 16384
##$SREGLST= <1H.CDCl3>
##$SSB= 0
##$STSI= 65536
##$STSR= 0
##$SW_p= 29940.119760479
##$SYMM= 0
##$S_DEV= 0
##$TDeff= 32768
##$TDoff= 0
##$TI= <>
##$TILT= no
##$TM1= 0
##$TM2= 0
##$TOPLEV= 0
##$USERP1= <user>
##$USERP2= <user>
##$USERP3= <user>
##$USERP4= <user>
##$USERP5= <user>
##$WDW= 1
##$XDIM= 65536
##$YMAX_p= 334350765
##$YMIN_p= -14374714
$$ End of Bruker specific parameters
$$ ---------------------------------
##NTUPLES= NMR SPECTRUM
##VAR_NAME=  FREQUENCY,     SPECTRUM/REAL,   SPECTRUM/IMAG
##SYMBOL=    X,             R,               I
##VAR_TYPE=  INDEPENDENT,   DEPENDENT,       DEPENDENT
##VAR_FORM=  AFFN,          ASDF,            ASDF
##VAR_DIM=   65536,         65536,           65536
##UNITS=     HZ,            ARBITRARY UNITS, ARBITRARY UNITS
##FACTOR=    0.456856943014862, 1,           1
##FIRST=     14782.0589164792, 0,            0
##LAST=      -15158.0608439998, 0,           0
##MIN=       -15158.0608439998, -14374714,   0
##MAX=       14782.0589164792, 334350765,    0
$$ Real data points
##PAGE= N=1
##DATA TABLE= (X++(R..R)), XYDATA
$$ [...]
60497g12552K69376O32061l97395j533847j116023M66229J362890R55219L37193
60488B63151P7055o22365j876243k081709k76865J849226K009304N18185l55230
60479d95491K41096R09387N23236k56978m49485j95624m3058m168n2369m92374
60469c15828j093269q72187M02468J434524J108698J40004q6681M09273N60394
60460A687396J22164k35891m05655q97918j435469j005909L61446J244222P89664
60451B24050j52670m77906l03420k49592k52280j3263J76170K9303m164M02832
60441f20940N14764l76040j413193j088382M79918J547030J142422J74791k18967
60432A41403j90496l62259n14008p0377O78418Q53390L07748j65301j538M10577
$$ plain form
60497 -712552 -443176 188885 -208510 -1742357 -2858380 -2392151 -1029261 -74042 263151
60488 263151 340206 -282159 -2158402 -4240111 -4516976 -2667750 -658446 -140261 -495491
60479 -495491 -254395 654992 1178228 921250 471765 276141 233083 228915 176546 -315828
60469 -315828 -1409097 -2281284 -1878816 -444292 664406 804410 717729 1127002 1687396
60460 1687396 1809560 1573669 1168014 270096 -1165373 -2171282 -1809836 -565614 224050
60451 224050 71380 -406526 -709946 -959538 -1211818 -1225081 -1048911 -1019608 -1023772 -620940
60441 -620940 -106176 -482216 -1895409 -2983791 -2503873 -956843 185579 360370 141403
60432 141403 -49093 -411352 -925360 -995737 -317319 536071 843819 678518 676980 1087557
60422A087557L96413o3251l97653k66326L6289O7580j30126j70438j3872p7056
60412D69117m77413o41812j19825N76448N96586K7306k28657J42528M31346J30730
60402I06354k41041o6203L18681K14554k69459m42957j73742J4860r0430j25974
60392D4643O4926J41518k802O2405M63834N35965j83333r40562n97719O70391
60382B59266J397154P23312n13802j010973o48704k51684j76156k0680L69371
60373A27104N16230J66981j85435m9460L19051L72704Q2620j84784l14598m66693
60363C83720o01082m41422Q5814O60135Q25159L57442m53635q65251l94246M26752
60353a6614N36598j90801o57047j50173N42057L92277k17588j93827M19924N92124
$$ plain form
60422 1087557 1483970 1420719 1023066 756740 793029 860609 730483 560045 546173 469117
60412 469117 -8296 -650108 -769933 -193485 403101 430407 201750 344278 775624 906354
60402 906354 665313 599110 917791 1132345 862886 419929 246187 261047 170617 44643
60392 44643 109569 251087 248285 310690 774524 1310489 1127156 186594 -411125 259266
60382 259266 1656420 2379732 1865930 854957 206253 -45431 -221587 -242267 127104
60373 127104 643334 810315 624880 575420 894471 1267175 1349795 1165011 850413 383720
60363 383720 -217362 -658784 -572970 87165 912324 1269766 816131 -49120 -443366 -16614
60353 -16614 519984 329183 -327864 -478037 64020 456297 238709 44882 464806 1056930
60343A056930J10337j48360J26855J33766n11110r71509o15436j53764m58624
60334a430915j071415r05227O9083Q07714O31205j05711o58791n96981L0296P24330
60324b506412Q47657L14644j84217j1528N84164Q50266N02831j12139o02999p83439
60314a101172m80735L61890J320880J630249Q93402m42234j406330j344671n10168
60305a078889K38152M12884L59438N08767N63282M0751o45399n51423L26617Q89341
60295A063521M79391l06699o98152p42680p46781n95391k30404l2198j03676P5313
60285a837756O54301Q84360L03406l80097m14955j83608l07714m27874q892M17367
60275a301462J23164l53655n8635N89615M36860l21059l94888L43983O26248J924
$$ plain form
60343 1056930 1167267 1018907 1145762 1279528 768418 -203091 -818527 -972291 -1430915
60334 -1430915 -2502330 -3407557 -3338474 -2530760 -1899555 -2005266 -2664057 -3261038 -3230742 -2506412
60324 -2506412 -1658755 -1344111 -1528328 -1539856 -955692 -105426 397405 285266 -317733 -1101172
60314 -1101172 -1581907 -1220017 100863 1731112 2624514 2182280 775950 -568721 -1078889
60305 -1078889 -840737 -427853 -68415 440352 1003634 1044385 398986 -152437 174180 1063521
60295 1063521 1542912 1236213 538061 -204619 -951400 -1546791 -1777195 -1809393 -1913069 -1837756
60285 -1837756 -1183455 -299095 4311 -375786 -790741 -974349 -1282063 -1709937 -1718829 -1301462
60275 -1301462 -1178298 -1531953 -1590588 -1000973 -564113 -885172 -1280060 -936077 -309829 -307905
60265c07905m32596j7088L65825p1667o47764m18073K99791N81844L04794J2608
60255c30231m4854J9597J74420L72010L83424J60425l4544j22407k96898m22332
60245a41390o3013N97567O86116p8031q30914q09994l66580j47800o4323J95201
60235a023161L38796K6259k90129L0812P33991R95050N67953j02759o49897r62387
60225c35472q29777j44105O24311P80511K44582l92519n84101k58447K94690O28842
60215B8515M42289j2504r6193L37621O11540J66066n76587p84187l00450L47790
60205A63900O98510N94021J8034p30508r99631n09152J52842L17233J77070K82220
60195A64539M53363P6349o86402r33599l65148K74305L43500J58805L17285P31047
$$ plain form
60265 -307905 -740501 -757589 -391764 -463431 -1111195 -1529268 -1229477 -647633 -342839 -330231
60255 -330231 -375085 -355488 -181068 190942 574366 734791 700247 577840 280942 -141390
60245 -141390 -204403 393164 1079280 1001249 170335 -639659 -1006239 -1154039 -1218362 -1023161
60235 -1023161 -684365 -658106 -948235 -917423 -183432 811618 1379571 1276812 626915 -335472
60225 -335472 -1165249 -1309354 -685043 95468 340050 -52469 -636570 -895017 -600327 28515
60215 28515 470804 458300 362107 699728 1311268 1477334 900747 116560 -183890 163900
60205 163900 862410 1456431 1474465 743957 -255674 -764826 -611984 -294751 -117681 164539
60195 164539 617902 694251 7849 -925750 -1290898 -1016593 -673093 -514288 -197003 534044
60185E34044Q09335K95072m73267r87166r85102n24847J46865P37099R70088O53264
60175A175385j04117p57575p50855j99072J94653O8956j71407j06530M4539m5221
60165f51244j32564J29341M50474L56559R6379K88002P95294Q05200P4293o87290
60155A524444q48128n81374l24784j31321J31916M11581N79721N58956J96183
60146A517194n49280j172119r48032K7263O78500K57812o26207p93848o182Q54588
60136g60311R62963L64877l80828q53850q76998l79720M58522J068759Q96043
60127D99457N6823o64834o75179k40077k9343j53476j01449L39454O44535L48821
60117B4732j28345L0293Q65911J453691R97377j84656r64853o45311K31050M54156
$$ plain form
60185 534044 1343379 1638451 1165184 178018 -807084 -1331931 -1185066 -447967 522121 1175385
60175 1175385 1071268 313693 -437162 -636234 -441581 -372625 -544032 -650562 -606023 -651244
60165 -651244 -783808 -654467 -203993 152566 248945 536947 1332241 2137441 2211734 1524444
60155 1524444 676316 94942 -229842 -361163 -229247 182334 762055 1321011 1517194
60146 1517194 967914 -204205 -1152237 -1124974 -446474 -188662 -814869 -1608717 -1614899 -760311
60136 -760311 202652 567529 186701 -667149 -1544147 -1923867 -1465345 -396586 499457
60127 499457 556280 -108554 -783733 -1023810 -1053153 -1206629 -1308078 -968624 -324089 24732
60117 24732 -103613 -73320 792591 2246282 3243659 3059003 2094150 1448839 1679889 2134045
60107B134045m01832j362367j238256k05306M44784J20880l41634r2502M63675
60098d78513M89863J13876P4287L81680L49871j63217n12635l40979l3115J01531
60088a7351L11190P25771Q70334L43154m52213p44647l49137K06606M00638K31468
60078A525813n525j96126m42609o54771m39003K96600Q69534N36320l61760p07861
60068D20612k24378J12242k94396o07262J8729Q40876N84083m58685p81484N7625
60058c32038Q96625Q15622K43335j01138k33832l94456m42828k92987k28136l52006
60048d21839l61673j77386j26840k37429q6258L56346N25320K47489J13973M44977
60038B76680O90218L67911j47576l13029j94358m1585J97238L99511O4981p83930
$$ plain form
60107 2134045 1732213 369846 -868410 -1073716 -628932 -508052 -849686 -942188 -478513
60098 -478513 11350 125226 199513 581193 931064 767847 255212 -85767 -118882 -17351
60088 -17351 293839 1019610 1889944 2233098 1780885 1036238 687101 893707 1294345 1525813
60078 1525813 1520288 1324162 881553 226782 -212221 84379 953913 1490233 1128473 420612
60068 420612 196234 308476 14080 -593182 -574453 266423 850506 391821 -389663 -332038
60058 -332038 564587 1380209 1623544 1522406 1288574 894118 451290 158303 -69833 -421839
60048 -421839 -783512 -960898 -1087738 -1325167 -1411425 -1055079 -529759 -282270 -168297 276680
60038 276680 966898 1334809 1187233 874204 679846 638261 835499 1235010 1299991 516061
60028E16061j246362p98519j88012k81478p03995n47535J35210N54651N05882
60019b054097M63912N89899N62118K84468L05j74188j96146J52200P76522Q96238
60009A301231j2202j201006j487507q60204k68288m313N39776J436836J739930
60000A184253Q65326m38130j027042o70083j6700K45546j04185p22078q97315
59991a580408k64500N98980P96472L49369J22130M16190N08220m7283n28813j35525
59981B34832O88723Q62400K40879k82495j77353K0324l73880j144549j453541
59972a384660r28357r0471L27097K23304Q7114K30710M22896M17558M52143P92603
59962E49937J032323M95797o11507j144013m72896N26891N29652m75310j157843
$$ plain form
60028 516061 -730301 -1528820 -1716832 -1998310 -2702305 -3249840 -3114630 -2559979 -2054097
60019 -2054097 -1590185 -1000286 -438168 -153700 -153395 -327583 -523729 -371529 404993 1301231
60009 1301231 1289029 88023 -1399484 -2259688 -2527976 -2532289 -1992513 -555677 1184253
60000 1184253 2049579 1611449 584407 -85676 -102376 143170 38985 -683093 -1580408
59991 -1580408 -1844908 -1245928 -449456 -100087 22043 438233 946453 899170 370357 234832
59981 234832 923555 1785955 2026834 1744339 1566986 1587310 1213430 68881 -1384660
59972 -1384660 -2313017 -2403488 -2076391 -1853087 -1765973 -1535263 -1112367 -694809 -242666 549937
59962 549937 1582260 2078057 1466550 322537 -150359 376532 906184 430874 -726969
59953g26969o27333M19979P17418J41505k53212J47250O13526K05982p43026j045071
59943a149951l64912L78407M74224L63628O13809P98626K92213m03880k84860
59934G17304M07527L30690q24037j553237n90908J172913J806115Q79115j73216
59925B172266j64783L78050K32195p55189j547900j302619k82384O42773R51955
59916C24364P14813K04451l35133o16645m22285O8504L57482K25523k639k3010
59906D95425q2732n22019r75576o43286N23413J467894J236310J78558n33632
59897A144355l97525k2273m8629k40284l1662M50251N29936L0371m72766n63239
59887C78535n23344o47580o25342j63895K62654N0930m31149k61958N76317J075507
$$ plain form
59953 -726969 -1354302 -934323 -216905 -75400 -328612 -181362 432164 638146 -104880 -1149951
59943 -1149951 -1514863 -1136456 -662232 -298604 315205 1113831 1406044 1002164 717304
59934 717304 1124831 1455521 631484 -921753 -1512661 -339748 1466367 2345482 2172266
59925 2172266 2007483 2385533 2617728 1862539 314639 -987980 -1270364 -627591 324364
59916 324364 1039177 1243628 908495 291850 -130435 -61931 295551 521074 518435 495425
59906 495425 412693 -109326 -1084902 -1728188 -1204775 263119 1499429 1677987 1144355
59897 1144355 746830 724557 675928 435644 403982 854233 1384169 1414540 941774 378535
59887 378535 -144809 -792389 -1417731 -1581626 -1318972 -1268042 -1699191 -1961149 -1384832 -309325
59877c09325O91197O4347q0318P8994Q0681N1885L04456O04728N34761K04560
59867B225966j5384j50045m27704p24451p56436n63462l05195J01477O24439P78941
59857G88146K65474m02468n72409m17578m90994o36294k34093O06594J018679
59848g4943O04159p7516l63132j80392J98680N04246M86738J07321k61032k70770
59838F73359j27337j94004l10516j34309J11696O951j93459N2663N00922M40969
59828H26935j9101j04149J93903O2268n75588p39893m5959N55952K96989k53703
59818A97654k53505J62399M26218M38391J90964n90259j586860j586968r0702
59809b692668J523796J583165L23213o25998n09138J4707L07275M11152K74808
$$ plain form
59877 -309325 381872 446219 365901 444895 525576 577461 881917 1486645 2021406 2225966
59867 2225966 2210582 2060537 1632833 908382 151946 -411516 -716711 -615234 9205 788146
59857 788146 1053620 651152 78743 -338835 -829829 -1466123 -1700216 -1093622 -74943
59848 -74943 529216 451700 88568 -91824 106856 611102 1097840 1205161 944129 673359
59838 673359 546022 352018 41502 -92807 18889 25840 -167619 -114956 385966 826935
59828 826935 807834 703685 897588 959856 384268 -355625 -401584 154368 451357 197654
59818 197654 -55851 106548 532766 971157 1162121 571862 -1014998 -2601966 -2692668
59809 -2692668 -1168872 414293 737506 111508 -397630 -382923 -75648 335504 610312
59800F10312m02248j228893j119591J91393J414906J173233k47029j261984r11877
59791a781778J89643Q67663P87448M61293J97989k34018p64195o47046L93025
59782e29976J215418N09839j189380j909547q38881O46768J018960N26766L04943
59773b45090N11867M46783l8396l65331k70505r1014l3516J02749L98357N45765
59763I61669K27555n04973j222681j392402q64692j34469K25225L42658O88924
59754a673186J018739N94415l87259p18124K5504P54122N79095Q9236O5955J08974
59744D57471l38071o76054j94523M86234M32092L3822J31005L01228k65207q63204
59734d95207j92523J223769J571331N56028l29283l59054l22744n19322j70777
$$ plain form
59800 610312 208064 -1020829 -2140420 -1949027 -534121 639112 392083 -869901 -1781778
59791 -1781778 -1592135 -724472 62976 524269 722258 488240 -275955 -923001 -529976
59782 -529976 685442 1195281 5901 -1903646 -2742527 -2095759 -1076799 -550033 -245090
59773 -245090 266777 713560 675164 309833 39328 -51686 -85202 17547 415904 961669
59763 961669 1189224 684251 -538430 -1930832 -2795524 -2929993 -2704768 -2362110 -1673186
59754 -1673186 -654447 -60032 -447291 -1165415 -1139911 -385789 193306 282542 348497 457471
59744 457471 119400 -556654 -751177 -264943 167149 200971 331976 633204 367997 -495207
59734 -495207 -687730 536039 2107370 2663398 2334115 1975061 1652317 1132995 962218
59725I62218O39156N56571o88994j466932p77887K04796K57714L1632M83526R46597
59715A148397L75916o87787j024203o68540m20408k51399K85273P76249N92938
59706A26436K07689L80053O04683m9791j022721r01929K30947Q28653K96294k92057
59696D08257j65369N8443j98868l89279K8549M97181L05426j82948j39913M21338
59686F42817P56104M79766j12614o10912q30234p11130l18972R9631L39611M46114
59676A80181N18729M69786K03115j22952k82023l28061m57544n54415k39664M65116
59666a47732Q58159L41493o45055r93998l43643M23828M22534m2117r8893L06477
59656H1053M62418J11632k69186l92908m85427n92020m34666j18535q7145j98531
$$ plain form
59725 962218 1601374 2157945 1468951 2019 -775868 -571072 -313358 -281726 201800 1148397
59715 1148397 1524313 836526 -187677 -856217 -1276625 -1528024 -1242751 -466502 126436
59706 126436 334125 714178 1318861 1269070 246349 -655580 -424633 404020 700314 408257
59696 408257 242888 301331 102463 -286816 -258267 238914 544340 361392 221479 642817
59686 642817 1398921 1878687 1766073 1155161 324927 -386203 -705175 -605544 -265933 180181
59676 180181 698910 1168696 1371811 1248859 966836 638775 181231 -373184 -612848 -147732
59666 -147732 710427 1051920 406865 -587133 -930776 -506948 -84414 -126531 -225424 81053
59656 81053 543471 655103 385917 -6991 -492418 -1084438 -1519104 -1637639 -1724784 -1923315
59646a923315J45521P04610M34681p00696j246763l73550P72549Q74700M19910
59637h92353N43036R38629N65653k79669l96221J65080J84972n15155p03466J47209
59627b42285R75868Q78995L59860J87516J82082j13030m73090m67601k29719j17505
59617I41091j19961p7067l8770o3186p8416j22815k55166k12962K08806N00852
59607F82406K2451p50118o14927N12705J280510Q40351K424j53405K02789K80537
59597B305723m4219m00140o91684r08938p52772j84477J88298m2350l81412k19976
59587a131947K24514M04402L06529J62000j01162m15960k42411N20371R37419
59578F63755K76052p41738r22326l11703J44809J70752J89531J59691k97516p83764
$$ plain form
59646 -1923315 -1777794 -1073184 -638503 -1339199 -2585962 -2959512 -2186963 -1312263 -892353
59637 -892353 -349317 589312 1154965 875296 479075 644155 829127 313972 -389494 -242285
59627 -242285 733583 1612578 1972438 2159954 2342036 2229006 1755916 1288315 1058596 941091
59617 941091 821130 744063 705293 642107 563691 440876 185710 -27252 181554 682406
59607 682406 704857 -45261 -660188 -147483 1133027 1973378 1975802 1822397 2025186 2305723
59597 2305723 2261504 1861364 1169680 260742 -492030 -676507 -488209 -530559 -911971 -1131947
59587 -1131947 -907433 -503031 -196502 -34502 -135664 -551624 -794035 -273664 663755
59578 663755 939807 198069 -724257 -1035960 -891151 -720399 -530868 -371177 -668693 -1452457
59568a452457n08297J94085J17906q04225j126766n6205J229637J211126N4593
59559a140603q58871p90814j58616M26815Q02912J001878R58022N98937K181n64465
59549B77376p37421l63017K61125O72757P70508P73605P06088L40504k87739p41406
59539A672380p10418l52905n129J43121M5360j79888k06087J36446M63853K73552
59529A280285k29600l32131O3399J92586l83813r82264p16578J95861O59435J17997
59519a34823p41325q07195J54814J167946J070494j40898j224008j113915j18155
59510a887065O77402Q40509P80523P28818M14014j51728m26745k11650n1923l56526
59500C55629p17978n64482Q708M98622O55885M90588L4575n05208p21357m75661
$$ plain form
59568 -1452457 -1960754 -1766669 -1648763 -2452988 -3579754 -3635959 -2406322 -1195196 -1140603
59559 -1140603 -1999474 -2790288 -2948904 -2522089 -1719177 -717299 240723 839660 841841 277376
59549 277376 -460045 -823062 -561937 110820 881328 1654933 2361021 2701525 2413786 1672380
59539 1672380 961962 609057 603928 747049 792409 612521 406434 542880 1006733 1280285
59529 1280285 1050685 718554 781953 974539 590726 -391538 -1108116 -912255 -252820 -134823
59519 -134823 -876148 -1683343 -1528529 -360583 709911 569013 -654995 -1768910 -1887065
59510 -1887065 -1209663 -369154 411369 1140187 1554201 1402473 975728 764078 712155 355629
59500 355629 -362349 -926831 -918123 -419501 236384 726972 761547 256339 -465018 -940679
59490i40679n8808L15842O91853Q69351M25119m22255p40745k02947K94096r1
59480B30736m76537k23114L86444L03590l97383n68661K24079J075116J063727
59471A617997L20327m45166p62906n50202l2883L12453J94411q6567q9835N6242
59461E33871n4958l08860k54040N1836J27598q4303k07931j76868j97291j03261
59451f74207L46817O68068K19386m89442l21551N65381P56616j20284o96758j55386
59441I8640L68474j91912q38203j08987J322772J469452l512j363924j320902
59432e68102m19254K63329M68219M04946J38516j57482j11486K52850M24750J80003
59422H76289j15216j51745m3949P8314K11584J11503m80657j081498p69994M20023
$$ plain form
59490 -940679 -999487 -683645 8208 877559 1302678 880423 139678 -63269 230827 230736
59480 230736 -245801 -468915 -82471 221119 -176264 -744925 -520846 554270 1617997
59471 1617997 1938324 1493158 730252 180050 147167 459620 654031 567464 477629 533871
59461 533871 478913 170053 -83987 -32151 95447 11144 -196787 -373655 -570946 -674207
59451 -674207 -327390 340678 560064 70622 -250929 314452 1071068 950784 254026 98640
59441 98640 467114 275202 -563001 -671988 650784 2120236 2116724 752800 -568102
59432 -568102 -987356 -724027 -255808 149138 287654 130172 18686 271536 696286 876289
59422 876289 761073 609328 565379 643693 855277 966780 486123 -595375 -1365369 -945346
59412i45346J232730Q06651j74255n34742j56108K35964K95237K48776J90439
59403A199346p083k02901j15879J04978N2289k34248l33112j97493k10756m12023
59393c56882l28147J95434O01449M14567o9407l13285l33309m38492m93990r8548
59383a220610O00203R35770O87641M16013N42090O14551q844j058851j540651
59374c2688r93995m0399M63878L86794J78994J11618M6283j50930l39663l25808
59364f95916j24793J15219L20928M84658N11301K62354j76261m38248k95771m7124
59354h3653j68799n55100n33314J33880P17054M66071k61286m73726L6671N23004
59344a99198N12094L40673K72278m154n38494o54422l3794M62956j9517q58148
$$ plain form
59412 -945346 287384 1094035 919780 385038 228930 464894 760131 1008907 1199346
59403 1199346 1192263 989362 873483 978461 1030750 796502 463390 265897 55141 -356882
59393 -356882 -685029 -489595 111854 526421 457014 143729 -189580 -628072 -1122062 -1220610
59383 -1220610 -620407 315363 1003004 1419017 1961107 2575658 2566814 1507963 -32688
59374 -32688 -1026683 -1067082 -603204 -216410 -37416 74202 120485 -30445 -370108 -695916
59364 -695916 -820709 -705490 -384562 100096 611397 873751 697490 259242 -36529 -83653
59354 -83653 -252452 -807552 -1340866 -1206986 -489932 -23861 -285147 -758873 -722202 -199198
59344 -199198 312896 653569 925847 921693 383199 -271223 -305017 157939 138422 -719726
59334g19726p46449K97714Q90717L28121m40224k88737N17028Q61756L40136l83591
59324F56745n53108j46361K57212J55723l64055p34693n63785r7504J45275P5380
59314a169171M9321K42553M01475K91269O2013M0520L40878P11306O68305l2130
59304A606339q68074q64204J43629R70005N09817o10518p73055L15125J160207
59295A589271O13164o01238j067727n32836J68133M13803K42680j01511l49560
59286C74179j87333L39043O16055J92296n00692o62075j55609M46654O51014L99440
59276A512972j56708p37441r27860n59214l036K78695K92280K53958P5132l62276
59266c33498o69044l54206L22875N82452K47529j9248K27010N40836L32234j77443
$$ plain form
59334 -719726 -1466175 -1168461 -277744 50377 -389847 -678584 -161556 700200 1040336 656745
59324 656745 103637 -42724 214488 370211 6156 -728537 -1292322 -1389826 -1244551 -1169171
59314 -1169171 -1119850 -877297 -475822 -184553 -122540 -82020 258858 970164 1638469 1606339
59304 1606339 738265 -125939 17690 987695 1497512 886994 113939 429064 1589271
59295 1589271 2202435 1601197 533470 634 168767 582570 825250 723739 374179
59286 374179 186846 525889 1141944 1334240 833548 171473 15864 462518 1113532 1512972
59276 1512972 1356264 618823 -309037 -868251 -871287 -592592 -300312 -46354 28778 -333498
59266 -333498 -1002542 -1356748 -1033873 -451421 -203892 -223140 3870 544706 876940 699497
59256F99497k57711K43042O12507K15100n97011q61366k68664L68590K07222m10732
59246d9526m39112K69800O37047p6989j093850j104568o80J045322J041719J47679
59236C76842p49168r49208m21421K87336N77130L86157J86925L28125O22206O94265
59226A339189M20485j12509p05329r80125o99588k81435l69001p19499l71410
59217b479222P12309J197021K97326q43720p40253K80277P55396L25554r6002
59208e91314n3907k0828k02842k01195L9588J22193J35865N72919J193919J115681
59198B110079K12189o50496r29652q71984n88362R0155O78093L46375n14786m99427
59188f17816N71301J146064L89815m44300j21876N71878L02122n54193o96207
$$ plain form
59256 699497 441786 684828 1297335 1512435 915424 54058 -214606 153984 361206 -49526
59246 -49526 -488638 -218838 418209 341220 -752630 -1857198 -1857878 -812556 229163 376842
59236 376842 -372326 -1321534 -1742955 -1455619 -878489 -492332 -305407 22718 644924 1339189
59226 1339189 1759674 1647165 941836 -38289 -737877 -1019312 -1388313 -2107812 -2479222
59217 -2479222 -1766913 -569892 -272566 -1116286 -1856539 -1576262 -820866 -495312 -591314
59208 -591314 -645221 -666049 -868891 -1070086 -1030498 -908305 -772440 -199521 994398 2110079
59198 2110079 2322268 1671772 742120 -129864 -718226 -628071 50022 396397 -118389 -617816
59188 -617816 -46515 1099549 1489364 1045064 923188 1495066 1797188 1242995 546788
59179E46788r7937K03157j3554m7088K21921J78884k35804l79697j16477l3426
59169B26767l08461l71010P5572N34978M95218R3404k12196j75267J24863L60912
59159H44780K30037p0470L0956N05809M42526n94044j513913j008564M77568J227706
59149E72391N66443m68700q19661o00302l04184R6089O95460J084070Q49375J98613
59139A869594l46882n24545l45800N3847L54088K42756j25132k41588K9366K57318
59129A223022J33070r5589j01002M415j01570m66622q25801q78767n20395L1418
59119a597821L46766K29177j8743K155K77908N54698P68530Q89294O15205j99459
59109A867710r97940j048348m31435J21477K82513L37730M23123L43928K02071
$$ plain form
59179 546788 448851 652008 638454 591366 813287 992171 756367 376670 260193 226767
59169 226767 -81694 -452704 -377132 157846 653064 746468 534272 359005 483868 844780
59159 844780 1074817 1004347 1035303 1541112 1983638 1389594 -124319 -1132883 -655315 572391
59149 572391 1138834 670134 -149527 -749829 -1054013 -957924 -262464 821606 1670981 1869594
59139 1869594 1522712 998167 652367 706214 1060302 1303058 1177926 936338 965704 1223022
59129 1223022 1356092 1260503 1159501 1163916 1062346 595724 -230077 -1108844 -1629239 -1597821
59119 -1597821 -1251055 -1021878 -1040621 -1038466 -760558 -205860 562670 1451964 2067169 1867710
59109 1867710 869770 -178578 -610013 -488536 -206023 131707 554830 898758 1100829
59100A100829L78671P09771M72231n07878j421989j485667p92306J02386Q24169
59091f19783J112198P53784j092m67573l27926L2942K13014K51488J72448k32228
59081H87272p75820p27249J62044J045109R81578J13008o90687r20545o28295
59072e53585R039O85620Q67327L51615k79283l32180N3381J64849k49090p34129
59062a6436q14518m38338J95103Q18278J125737R72726N52418J70605o8893k11618
59052B285064k91672l87155n79397p10189n22250j80027j62080m25190l25409
59043a298305K36029L57141m59800j148468l83141J345800K169766J337973J06020
59034B263015j66636K42825K00058n17469j052219p85233j18358J29869k83938
$$ plain form
59100 1100829 1479500 2189271 2661502 2153624 731635 -754032 -1546338 -1443952 -619783
59091 -619783 492415 1246199 1245107 777534 449608 482550 695564 947052 1119500 887272
59081 887272 111452 -615797 -453753 591356 1572934 1685942 995255 74710 -553585
59072 -553585 -544546 141074 1008401 1360016 1080733 748553 801934 966783 717693 -16436
59062 -16436 -830954 -1269292 -1074189 -255911 869826 1842552 2394970 2565575 2496682 2285064
59052 2285064 1993392 1606237 1026840 316651 -205599 -385626 -547706 -972896 -1298305
59043 -1298305 -1062276 -705135 -1164935 -2313403 -2696544 -1350744 819022 2156995 2263015
59034 2263015 2096379 2339204 2539262 2021793 969574 184341 65983 195852 -88086
59025h8086q13628q00036k43148K15583J17644k23031j86792K78749O35513N51550
59015e55682K89065K00038K20892R1304j75861k94721p7809L50130O59058N67349
59005A273763P3089n01341p59469n74069j46930K57438N42487P21880P42595M97137
58995B126580L6819l47284m10193k78478k53154k67601O7736O72843P54062j07141
58985A994189j026546q05538L10966Q39313J33756p71196p90246k55858o6390
58976d37550k15029j01817K48407K81489m6847k21017l2888K46802M59144O46811
58966H27505O64437L40558p3945k09037j79160l05724m62176l48607j69901k88781
58956b04831m24130l5438O45840Q60104N12256K15357J96625J15802l9177R3576
$$ plain form
59025 -88086 -901714 -1701750 -1944898 -1729315 -1611671 -1834702 -2021494 -1742745 -1107232 -555682
59015 -555682 -266617 -66579 154313 245617 69756 -224965 -302774 47356 706414 1273763
59005 1273763 1346852 845511 86042 -488027 -634957 -377519 164968 886848 1629443 2126580
58995 2126580 2163399 1816115 1405922 1127444 874290 606689 674425 1347268 2101330 1994189
58985 1994189 967643 162105 473071 1312384 1446140 674944 -115302 -371160 -437550
58976 -437550 -652579 -754396 -505989 -224500 -271347 -492364 -525252 -278450 180694 827505
58966 827505 1491942 1832500 1758555 1549518 1370358 1064634 602458 253851 83950 -204831
58956 -204831 -628961 -664399 -18559 841545 1353801 1569158 1765783 1881585 1842408 1935984
58946A935984L38480J08238m29871m66808l4359r8154q03710j014446k22721M78887
58936b08480K27770j65025K12379O01651q7515j115099q81071M46529J107078
58927A38217M44253l23818k40959J24317P8777J1227L75067O02149L3533q17612
58917D25151r30892k75048K51336J65504r3450M466L68711N75382M80737L10614
58907A282511K59213J87876j65173p01002r25230n80193p0605Q3816J4682K37371
58897c76734P37900R37234O04701J71658k8930j96440m57513m68186o2027K59542
58887A121205M4406l36257k55510J47038J95408k30878n16363k26904L67201P48019
58877A057365O44630L5799q28336j321577r00544J27094P70005N42834M1448J5114
$$ plain form
58946 1935984 2274464 2382702 1952831 1486023 1451664 1353510 549800 -464646 -687367 -208480
58936 -208480 19290 -145735 66644 668295 580780 -534319 -1415390 -968861 138217
58927 138217 582470 258652 17693 142010 220787 232014 607081 1209230 1242763 425151
58917 425151 -505741 -780789 -529453 -363949 -457399 -452933 -84222 491160 971897 1282511
58907 1282511 1541724 1729600 1564427 863425 -61805 -641998 -712603 -628787 -614105 -376734
58897 -376734 361166 1298400 1903101 2074759 2045829 1849389 1391876 923690 861663 1121205
58887 1121205 1165611 829354 573844 720882 916290 685412 169049 -57855 309346 1057365
58877 1057365 1701995 1737794 909458 -412119 -1312663 -1185569 -415564 127270 168718 183832
58867A83832L15294K58383k63212o26670l89612J48962M03834J64550l29976p10631
58857h45246p27314l68519J26372M72438O12503O80247P02869N45738K09320m6922
58847A361486k7162J18109J06766q9493k55302k56572j66104p6784M0271K41099
58837I96314M72560N85351M51302O5704m33326q55746j086953j099376q63122
58828a767292l72531J90742M84133L50849N2102j5259K15756M62118M95108L74691
58818D70417K73030K40200J86412k2571m33992q20570p07228J02850J008453J037458
58808A334459M0712q99528o83025L89000R43462K85261p53803r65633k77662L66572
58798b20185L61530N7181M089J72451K19528J24298J16715J67059j29l95633o50818
$$ plain form
58867 183832 499126 757509 494297 -132373 -521985 -373023 30811 195361 -134615 -845246
58857 -845246 -1572560 -1941079 -1814707 -1342269 -729766 -49519 653350 1199088 1408408 1361486
58847 1361486 1334324 1452433 1559199 1469706 1214404 957832 791728 714944 755215 996314
58837 996314 1468874 2054225 2505527 2571231 2137905 1282159 195206 -904170 -1767292
58828 -1767292 -2139823 -1949081 -1464948 -1114099 -1061997 -1077256 -861500 -399382 95726 470417
58818 470417 743447 983647 1170059 1147488 713496 -107074 -814302 -711452 297001 1334459
58808 1334459 1375171 475643 -207382 181618 1125080 1410341 656538 -309095 -586757 -220185
58798 -220185 141345 198526 202615 375066 594594 718892 835607 1002666 1002537 606904 -43914
58787d3914m90855l2345M52821P66149P02510J28365o51474r76011o06344j09439
58777h60537n2114j12904L91807J243368J382941M42229n44735m88804K42530
58768A643781L92789l78546j098425r43346k96268L2558J2915K05205O90086Q82788
58758A143537M23989l01285p06421o70030m49615k27400J1753L25210P20190J082596
58748A352524J109731N44009l95900j082624j152008q24727l89004J98151Q32840
58739A92992Q86694p909j073414j110730q9982P76414O78945J36971q724K34457
58729F15714L34334J20020k15999n48740p25061m43517K45828P12900N61245K68862
58719I25586M18827P20021N42168N7343o1458J32162n5672o53982q57034l80652
$$ plain form
58787 -43914 -534769 -567114 -114293 651856 1354366 1482731 831257 -144754 -751098 -860537
58777 -860537 -912651 -1025555 -633748 609620 1992561 2434790 1890055 1401251 1643781
58768 1643781 2036570 1658024 559599 -383747 -680015 -647457 -634542 -429337 260749 1143537
58758 1143537 1567526 1266241 559820 -110210 -559825 -787225 -775472 -450262 269928 1352524
58748 1352524 2462255 3006264 2610364 1527740 375732 -448995 -837999 -639848 192992
58739 192992 1079686 1071777 -1637 -1112367 -1202349 -425935 253010 389981 381257 615714
58729 615714 950048 1070068 854069 305329 -419732 -863249 -617421 95479 656724 925586
58719 925586 1344413 2064434 2606602 2663945 2602487 2734649 2678977 2024995 1167961 787309
58709G87309J8680j79751l71997J30620Q85980R47459K63690l58911m71503l84124
58699A267452l77343k39932J81369M99290K33620m94438j046985r87431m73852
58690a438250N9622L63936M08668K14408m8856L3919O45365J166581O95803o18570
58680A482626j405256p46420N24615R23935K88553k67387j38494J05416o2381
58671G05207k85898j05736K52973L80320L35889L11222J73973j67845m05751k97763
58661H96591r9025j11855j91074q6491J11480K45996M06533N84981M55197o9647
58651B142686m80033l47763J0817K7108k99516n30284m24116m9865L85562M81348
58641I15944r2352q70794p59483M91068J606101J341707J54162n71262m59354
$$ plain form
58709 787309 805989 626238 254241 384861 1270841 2218300 2481990 2123079 1651576 1267452
58699 1267452 890109 650177 831546 1330836 1564456 1070018 23033 -964398 -1438250
58690 -1438250 -1378628 -1014692 -606024 -391616 -440472 -406553 238812 1405393 2101196 1482626
58680 1482626 77370 -669050 -144435 779500 1068053 800666 662172 767588 705207
58671 705207 419309 313573 566546 946866 1282755 1593977 1767950 1600105 1194354 896591
58661 896591 797566 685711 494637 408146 519626 765622 1172155 1757136 2212333 2142686
58651 2142686 1662653 1314890 1325707 1352815 1053299 523015 98899 49034 434596 915944
58641 915944 823592 -47202 -806685 -315617 1290484 2632191 2786353 2215091 1755737
58632A755737k63190l87220m64322l31665l19161m58814l64984l2288J27505J41143
58622e97259M57857R58810R44085L19980j63362j41348j27052m18671n30964k21032
58612D81044q3125m58504o80027k00997L57366K04437k92410k98283O1704P8859
58602h29936j80557r8161J86586j9921n00142k18674Q62981J382037N72488m76033
58592F80668m11939M17574O47908l8506o66991n48856q504M86436Q98188J079805
58582B535783N99068m20029j029242o44334N7498Q6527m74554p91245o33172m99449
58572a213149n07054j44636O67298J171472Q73008L39687L44368P23470P00158
58563B954622K4455p75902j109959q44057k44652K47975L19372R7749j9547J2821
$$ plain form
58632 1755737 1492547 1105327 641005 309340 -9821 -468635 -833619 -865907 -738402 -597259
58622 -597259 -139402 819408 1763493 2083473 1920111 1778763 1651711 1233040 702076 481044
58612 481044 397919 -60585 -740612 -941609 -584243 -379806 -672216 -970499 -908795 -829936
58602 -829936 -1010493 -1108654 -922068 -941989 -1442131 -1660805 -797824 584213 1156701 680668
58592 680668 268729 686303 1334211 1295705 628714 79858 71354 557790 1455978 2535783
58582 2535783 3134851 2714822 1685580 1041246 1098744 1185271 710717 -80528 -713700 -1213149
58572 -1213149 -1720203 -1864839 -1197541 -26069 846939 1186626 1530994 2254464 2954622
58563 2954622 2979077 2203175 1093216 249159 4507 252482 571854 669603 650056 662877
58553F62877j61638n37338n19085J24460O79136M71251q2079j43358K51870L98195
58543A144291R5741k55626n14198q35529r76356m85522M12472R71397R63136P68417
58533A288223N23908Q9102k34210j0906L14559j06060r48772r38927P9066P24499
58523G80482K66685k31245K03808Q03645M43872m54434p35642l67595j34414j36602
58513D38560L6237J53399k45061o58497k57804N25100M76783l96343p98553k06825
58503i33004M24094L57147J10053K25872K38462l12048p91401l77690N31035P63101
58493B35621j1771q66395q01999J29454R61030Q68283N2408m85249j58049M56579
58483C79912M46414j33925m25657q0571L83579N67477O65119P59329N16521o2323
$$ plain form
58553 662877 501239 -36099 -555184 -430724 248412 719663 637584 494226 746096 1144291
58543 1144291 1240032 984406 470208 -365321 -1341677 -1827199 -1414727 -443330 519806 1288223
58533 1288223 1812131 1901233 1667023 1656117 1970676 1864616 915844 -23083 55983 780482
58523 780482 1047167 815922 1019730 1823375 2267247 1812813 1077171 709576 575162 438560
58513 438560 474797 628196 383135 -275362 -533166 -8066 468717 72374 -726179 -933004
58503 -933004 -508910 -151763 -41710 184162 422624 110576 -680825 -1058515 -527480 235621
58493 235621 223850 -642545 -1444544 -1315090 -354060 514223 566631 81382 -76667 379912
58483 379912 826326 692401 266744 186173 569752 1137229 1802348 2561677 3078198 3015875
58473C015875m08392l39088m31631r09720r99961j48973Q46368Q43701k2196o52118
58463G93865n43325j16146K26043M06315K19755m71021j142146j102698n31144
58454b260502j19635J90394R67144J754216J213101o74918j914362r83851J004436
58445h23977J793765Q86997l11593p48871o79626m92553k5869O21043P69283J86181
58435A174780m38601n32644l78817l37977j55020L20704M84682j22996q46600
58426h32489p57011n7205K96479Q7517n4361J00418R9900j53612j43641K18179
58416a195826K88312j34988k63697M32542J220962J113322K77801l75973n62963
58407G99492o84574q14417n74281j629L09892J01737j87255j57240J2924O42j48717
$$ plain form
58473 3015875 2607483 2268395 1836764 927044 -72917 -221890 624478 1468179 1445983 793865
58463 793865 250540 134394 360437 766752 986507 515486 -626660 -1729358 -2260502
58454 -2260502 -2380137 -2189743 -1222599 531617 1744718 1069800 -844562 -1828413 -823977
58445 -823977 969788 1856785 1545192 796321 116695 -375858 -401727 219316 988599 1174780
58435 1174780 736179 203535 -175282 -513259 -668279 -347575 137107 14111 -832489
58426 -832489 -1589500 -1646705 -1350226 -1262709 -1317070 -1216652 -1116752 -1270364 -1414005 -1195826
58416 -1195826 -907514 -1042502 -1306199 -873657 347305 1460627 1738428 1362455 799492
58407 799492 114918 -699499 -1273780 -1275409 -965517 -863780 -1051035 -1208275 -1195351 -1194709 -1343426
58396a343426k04695r7508J27918L99631N02840K06242l08681m66726M093O37826
58386e42486P48925K25131m11998o21613l41651M6457J21586j60309m07167k16790
58376a559915L64331R29525J169419J015199M44867m39959j127301r96747j50291
58367c50872M85128K38809m52447o83658k94308P5843K256k37354k58312j23407
58357a598322o1278j1638K24269N84193P88776O88524L47748j35555o70989j059755
58347i04027j043398n44022K09839Q14284R42154N66612K8588k04060K2166L86140
58337B74276M70691K19327j13660l49863m93206n07451k76758J48816N01395N92010
58327D65577M97506L90257L46007L52324L11543K3030n72870j101267j047296
$$ plain form
58396 -1343426 -1548121 -1645629 -1517711 -1118080 -615240 -408998 -717679 -1184405 -1180312 -542486
58386 -542486 206439 431570 19572 -602041 -943692 -897235 -775649 -935958 -1343125 -1559915
58376 -1559915 -1195584 -266059 903360 1918559 2363426 1923467 796166 -200581 -350872
58367 -350872 134256 373065 -79382 -763040 -1057348 -981505 -979249 -1216603 -1474915 -1598322
58357 -1598322 -1659600 -1671238 -1446969 -862776 -74000 614524 962272 826717 155728 -904027
58347 -904027 -1947425 -2491447 -2281608 -1467324 -525170 41442 70030 -134030 -111864 274276
58337 274276 744967 964294 850634 500771 7565 -499886 -776644 -627828 -126433 465577
58327 465577 963083 1353340 1699347 2051671 2363214 2386244 1813374 712107 -335189
58318c35189m58674J2573n1812l43173m03610k54289q8130K09502O99265R13107
58308a00430M12165l80385o09033j87034J34296m8210k38068R7984P02452R00299
58298F84036M18818m34465j131609j292107r49261n41254l97190k83576J83960
58289c742648P97407R63728O20218L13934L04612K63006J7316j10206J7985L3602
58279e21046k15963k79224J28673N66955N65303L30653K52848K34979P6220K4365
58269A163763L08757N27519J76245m93142p77379m84728k3562K96790N05779O21841
58259A821883N56031L42828J30087k3406j51051k97705n02086o31615l24911M20987
58249A341042P59574o3197j275746j245123J14442R37389J22962r23245m36622
$$ plain form
58318 -335189 -793863 -781290 -833102 -1176275 -1579885 -1834174 -1922304 -1712802 -1013537 -100430
58308 -100430 311735 -68650 -677683 -864717 -730421 -778631 -1016699 -918715 -216263 684036
58298 684036 1102854 668389 -463220 -1755327 -2704588 -3245842 -3643032 -3926608 -3742648
58289 -3742648 -2945241 -1981513 -1361295 -1047361 -742749 -479743 -462427 -572633 -554648 -521046
58279 -521046 -737009 -1016233 -887560 -320605 244698 575351 828199 1063178 1139398 1163763
58269 1163763 1472520 2000039 2176284 1683142 905763 421035 397473 694263 1200042 1821883
58259 1821883 2377914 2720742 2850829 2827423 2676372 2378667 1876581 1244966 920055 1341042
58249 1341042 2100616 2037419 761673 -483450 -369008 568381 691343 -231902 -668524
58240f68524J009529J501869O57851k06094l24040j96690k06031j12717o635l27097
58230A121421p86029n89669J07728K73197k83567n80642j61596J95588p1960l87676
58220a163205j54352K81204M15844L98414M28919K17169l15648n58143q0239O29047
58210I9010Q41570M69762j40158p09963r56731o27196K7015L68733K46645J58367
58200b22946L50812M54239K30036m9000j86228k81672j96383L58940J011442R27160
58190B396400P1303o65727q16702p85505p51457l49709K17858R4957o77986q88148
58180b154716r9280N14245J23777l64763N8792Q00047Q20956L54425J45615K9142
58170B28240l65381m71776J84950P15778J68059p13654o58165m2012q7223n07154
$$ plain form
58240 -668524 341005 1842874 2500725 2294631 1970591 1773901 1567870 1455153 1448518 1121421
58230 1121421 335392 -254277 -146549 126648 -156919 -737561 -899157 -703569 -775529 -1163205
58220 -1163205 -1317557 -1036353 -620509 -222095 206824 423993 108345 -449798 -530037 99010
58210 99010 940580 1410342 1270184 560221 -396510 -1023706 -996691 -627958 -381313 -222946
58200 -222946 127866 582105 812141 763141 576913 295241 98858 457798 1469240 2396400
58190 2396400 2467703 1801976 985274 199769 -551688 -901397 -683539 -588582 -1266568 -2154716
58180 -2154716 -2253996 -1739751 -1615974 -1980737 -1921945 -1121898 -300942 53483 199098 228240
58170 228240 -137141 -608917 -423967 291811 459870 -253784 -911949 -953961 -1041184 -1548338
58160a548338l644J155209J206021k53097j437334r60898L71211J035318P26177
58151B90625J09586k96276l06226O6581M12951K44601k16773k67395J32308K90890
58141D60872J2937p3260L13285N82706L29200J5178J06334L00950J58611j48890
58131B057923k43024j74382j82364k43391k45430k48592k84191k47387j88349
58122H13l20229n79155o06808l30702j16602j73122k49694j15876R3493K35875
58112b162007M62458Q66143J097892O60903m29663j423050j405292k59390J025344
58103a566662J361327Q58295N59089Q33040Q74407J44530o48248o96164l45549
58094A374065l18747m55404k36119J28521K04081K49550M89584K36805q86949
$$ plain form
58160 -1548338 -1551982 -396773 809248 556151 -881183 -1842081 -1470870 -435552 290625
58151 290625 400211 103935 -202291 -135710 277241 521842 305069 37674 169982 460872
58141 460872 473809 400549 713834 1296540 1625740 1640918 1747252 2048202 2206813 2057923
58131 2057923 1814899 1640517 1458153 1214762 969332 720740 436549 189162 813
58122 813 -319416 -898571 -1505379 -1836081 -1952683 -2125805 -2375499 -2491375 -2397882 -2162007
58112 -2162007 -1699549 -833406 264486 925389 495726 -927324 -2332616 -2592006 -1566662
58103 -1566662 -205335 652960 1212049 2045089 2919496 3064026 2415778 1719614 1374065
58094 1374065 1055318 599914 363795 492316 696397 945947 1435531 1672336 785387
58085G85387j623426o73235R59407J142495j91159j080602o55562k5149J10985
58076a250859M21520R79718O49157o50052j205275k15547P42763L11420m59398
58067f76553j29633O22412M15832k85004j28684N92160M92725m01081p16848l7451
58057b52125O60637P59110N74006K39566m52811j071452q43485m2850K59603o3013
58047b32814n9195N14274O92637J2896o06344l52435K25851K40614j35030j63551
58037A36903J65839K30984j35546m18987k31268K02778M39096L55329J75600R9292
58027A020020M3599j64025l88553k57303K14511M02892j19557p93998o65370K69277
58017d38507R24152N40428l05680n23572K5381M51984J63239l31177k23386L94954
$$ plain form
58085 785387 -838039 -1511274 -551867 590628 399469 -681133 -1336695 -1361844 -1250859
58076 -1250859 -829339 150379 799536 149484 -1055791 -1271338 -528575 -217155 -676553
58067 -676553 -806186 -183774 232058 -52946 -181630 410530 903255 502174 -214674 -252125
58057 -252125 408512 1167622 1741628 1981194 1528383 456931 -386554 -429404 -169801 -232814
58047 -232814 -292009 222265 914902 927798 321454 -30981 194870 435484 300454 136903
58037 136903 302742 533726 398180 -20807 -252075 -49297 389799 745128 920728 1020020
58027 1020020 1063619 899594 511041 253738 468249 871141 751584 -42414 -707784 -438507
58017 -438507 485645 1026073 720393 196821 222202 674186 837425 506248 282862 677816
58007F77816O83885K96705j67897j59409q408k69391o96901n93476L2818M23428
57997B19170J86757k35407l34786j51042N0065J75487K12986J92108L03782N99342
57987A218462O43262Q0790n62410m64964J54983K86195k15434l80184J65945N21935
57977A448580J30237k00033K17892N99013N303r16874q90914o7170L22146P841
57967F56021r8271L21084M44148j52058o62001l55875K23106J23116n33471p40047
57957g74248q9447O44087N69526j51326n91548l12684J97701M08622M42247N11890
57947H54820L07308l44728p51062k76597M03292K05834m62358k40512P48058Q22216
57937A266271m11591j084282R518J302307Q31550p03896j155895k22246N10125
$$ plain form
58007 677816 1361701 1658406 1490509 1331100 1322692 1053301 356400 -237076 -204258 219170
57997 219170 405927 170520 -164266 -315308 -265243 -89756 123230 315338 619120 1218462
57987 1218462 1861724 1942514 1380104 915140 1070123 1356318 1140884 760700 926645 1448580
57977 1448580 1578817 1378784 1596676 2195689 2200992 1284118 393204 326034 648180 656021
57967 656021 557750 878834 1322982 1170924 508923 153048 376154 499270 -34201 -774248
57957 -774248 -863695 -219608 349918 198592 -392956 -705640 -507939 -99317 342930 854820
57947 854820 1162128 817400 66338 -210259 193033 398867 -63491 -304003 444055 1266271
57937 1266271 854680 -229602 -220084 1082223 1913773 1209877 53982 -168264 341861
57928C41861L21305J22147M68063O33256O6549o28478o99386k63508R2329L5197
57918D89335l96695q14530o09032L40884J201697J081027K36410k88367n3202
57909A187527M39113N84200J76774o64595j385497j163443M5905J029568P43027
57900I92579k01659m40004J59522N30529J52459m15291o35529n33401j72774M06027
57890a57542P61312M72882j12701l96368m98402p81277q34415j22383P31281O79200
57880b58413J6576o1421M83239N31989r5499k64929M18500Q29550J92296p08488
57870A083400q80682m53354K0426M41208O65783K23517p32577j156451n27377
57861a316107L06197L80782p4439k50049L3681L73915M63040K06608l09068o28159
$$ plain form
57928 341861 663166 785313 1253376 1886632 1953181 1324703 625317 361809 454138 489335
57918 489335 92640 -721890 -1330922 -990038 211659 1292686 1529096 1240729 1187527
57909 1187527 1626640 2210840 2387614 1723019 337522 -825921 -780016 249552 992579
57900 992579 790920 350916 510438 1040967 1193426 778135 142606 -390795 -563569 -157542
57890 -157542 603770 1076652 963951 567583 69181 -712096 -1546511 -1668894 -937613 -258413
57880 -258413 -241837 -303258 179981 711970 616471 351542 770042 1599592 1791888 1083400
57870 1083400 202718 -250636 -230210 210998 876781 1100298 367721 -788730 -1316107
57861 -1316107 -1009910 -629128 -703567 -953616 -919935 -546020 -82980 123628 -185440 -813599
57851h13599l01876L18515L93071j00969k48645L32521Q46831N59738k10621p91555
57841a6589r85448p52301M2405J016224J232170L83620o41453q73540l23734M00990
57831e17656Q12473N68123l64881j210817r56931J66163P35539J36700n34139
57822a165426j94396O63851R83086P68816O92218P75601N47196P0324j58188r5979
57812B887103j41343l88266n36258m25842j72728J06233L26099L39487R7522k27657
57802A864350m35408m53496k98807j25866k04984n05333n09637P3218O78846N91018
57792F73901r002m10353m47212l63032k7686O27411Q03783j75020j320667r85542
57782a633419N98807J423160N56808p34943j133448q94826o95162l67859L25844
$$ plain form
57851 -813599 -1115475 -796960 -403889 -504858 -753503 -420982 425849 985587 774966 -16589
57841 -16589 -1002037 -1754338 -1711933 -695709 536461 920081 278628 -594912 -918646 -517656
57831 -517656 294817 862940 498059 -712758 -1669689 -1503526 -767987 -631287 -1165426
57822 -1165426 -1359822 -695971 287115 1055931 1748149 2523750 3070946 3141270 2983082 2887103
57812 2887103 2745760 2357494 1821236 1395394 1222666 1328899 1654998 1994485 2092007 1864350
57802 1864350 1428942 975446 676639 550773 345789 -159544 -669181 -595963 82883 673901
57792 673901 664899 254546 -192666 -555698 -583384 44027 847810 672790 -647877 -1633419
57782 -1633419 -1034612 388548 945356 210413 -923035 -1817861 -2513023 -2880882 -2555038
57773b555038Q59043P33439K26527k25991n21127m30461K99784J095410R59637
57764D41223K6319n10018k53195k8791k01839j21989L53385L94948j94546m82056
57754e76559r5186J48103j12317j09172M37932O64326J89392k07598j72078l59650
57744a92807q35006o77898J78239N90182L00868L56840Q21272L90494r10746j187672
57734a166234R6902R77434L81257n5376Q01580J310000L3397j534360j498531
57725f53931n62236k12360o4158O42222R78716J91339l44186N36063J407048O57568
57715B576085o61151q68116n57686q96461j031392N8297J078395O19314r9420
57706B17865M31841R67715r5328j327541o66849O79903L15854j056864j078512
$$ plain form
57773 -2555038 -1695995 -962556 -736029 -962020 -1483147 -1913608 -1613824 -518414 441223
57764 441223 467542 -42476 -295671 -324462 -526301 -648290 -294905 100043 -94503 -576559
57754 -576559 -671745 -523642 -635959 -745131 -307199 357127 546519 338921 166843 -192807
57744 -192807 -1027813 -1705711 -1527472 -937290 -636422 -279582 541690 932184 21438 -1166234
57734 -1166234 -1069332 -91898 289359 233983 1035563 2345563 2378960 844600 -653931
57725 -653931 -1216167 -1428527 -1492685 -850463 128253 319592 -24594 511469 1918517 2576085
57715 2576085 1914934 1046818 489132 -407329 -1438721 -1380424 -302029 317285 217865
57706 217865 649706 1617421 1522093 194552 -472297 207606 523460 -533404 -1611916
57697a611916O3367N07518L30787O65964P34912n16850j404511l1053J748205
57688D86423J000826j168262j487023m3054N78752L12779R90244J867623P38141
57679C276449j355953j440340J11949M53526m27422k10694Q45411N96891l09875
57670A539942L39975J514216P38883o38285K03050J578086J35292k088907p45087
57661B577165K361331K005536o83922j71120K872393K796575J77436R64705M501323
57652A7401422M167824N11412R20678N213922N878123M161290R126208J8117834
57644F5498713J9055624J8064467L8384289P6307145Q5218867L1821660m9196618
57637B85154147q9692808o9577628l1428508j6087700j8665273j6453131p869773
$$ plain form
57697 -1611916 -1548549 -1041031 -710244 -44280 690632 173782 -1230729 -1261782 486423
57688 486423 1487249 318987 -1168036 -1211090 -632338 -319559 670685 2538308 3276449
57679 3276449 1920496 480156 592105 1045631 618209 407515 1252926 1849817 1539942
57670 1539942 1879917 3394133 4133016 3494731 3697781 5275867 5411159 3322252 2577165
57661 2577165 4938496 6944032 6260110 6088990 8961383 11757958 11935394 12900099 17401422
57652 17401422 21569246 22080658 23001336 28215258 34093381 38254671 47380879 65498713
57644 65498713 84554337 102618804 141003093 217310238 302529105 334350765 285154147
57637 285154147 195461339 125883711 94455203 78367503 59702230 43249099 35379326
57630C5379326m491745n988342m285566p82394j857113m970414l563828K49520
57622I689444J60472k382010j757888Q04270J51822k569900k313161K40655M58413
57613B482117j284267q94027J161445R17666j195467j132382J052161J390947
57605B498193n99022j325346J78840J004224P754p05634k57377j35682n97056
57596F8894k69099N36329J31119j005445q38762L11182K96895p28312n86428P43545
57586a340082J104932K62723K01606J206738J347212J77063n47834k49701l06491
57577A856166r94145q43486L59999R06135J42073n84581n38099n64137r07024
57568a167099n73311N10653J030072N65144K11321M40744M07684j78102m66321
$$ plain form
57630 35379326 30887581 24899239 20613673 19831279 17974166 13003752 9439924 9689444
57622 9689444 9849916 7467906 5710018 6514288 6666110 4096210 1783049 2023704 2482117
57613 2482117 1197850 303823 1465268 2382934 1187467 55085 1107246 2498193
57605 2498193 1899171 573825 752665 1756889 1764643 1059009 801632 665950 68894
57596 68894 -200205 336124 467243 -538202 -1376964 -1065782 -768887 -1497199 -2083627 -1340082
57586 -1340082 -235150 27573 229179 1435917 2783129 2960192 2412358 2162657 1856166
57577 1856166 862021 18535 378534 1284669 1426742 842161 304062 -260075 -1167099
57568 -1167099 -1740410 -1229757 -199685 365459 576780 1017524 1425208 1247106 780785
57559G80785j66631j6739k75249m42808n14924p79104n91988O70797J778898J045533
57549A488570o85457r87483K83202Q33671j30828p56752j6432N60857j78136r27849
57539e16637l10836P66344P84295k3340n12554m77547k73774K18036R70237J184218
57529A808442M59025l17856k75905J18900L4611k85656j15805L70676L74693k21294
57519A949831p03165n72864j53344j08099n82384q92910k93433Q14332J015344
57510D73308k18408j442934j041321M47028J090388L41168m43864k73641K22905
57501h45371K13713n885K12676P09579Q39367M11447j77269m31120j88345J92587
57491I31379J77853j69749j83865K66122L48022l45532q44763k67199N99164M97341
$$ plain form
57559 780785 614154 597415 322166 -120642 -635566 -1414670 -2006658 -1335861 443037 1488570
57549 1488570 803113 -184370 98832 932503 801675 44923 28491 589348 411212 -516637
57539 -516637 -827473 -61129 723166 699826 187272 -290275 -564049 -346013 624224 1808442
57529 1808442 2267467 1949611 1673706 1792606 1827217 1541561 1425756 1796432 2171125 1949831
57519 1949831 1246666 673802 520458 412359 -170025 -1062935 -1356368 -542036 473308
57510 473308 254900 -1188034 -2229355 -1782327 -691939 -350771 -794635 -1068276 -845371
57501 -845371 -631658 -637543 -424867 284712 1124079 1535526 1358257 927137 738792 931379
57491 931379 1109232 939483 755618 1021740 1369762 1024230 179467 -87732 511432 1008773
57481A008773k38193l78146J1518j54586q24047q03117Q0339O19828K75211q9585
57471d92005J22473L55264J36585j34493q4391Q7818K45989M28811K58348n65454
57461C58945j215963n88558P86404J221721L75113l75073k84945k07816p22114
57452f52286j031352m78685L22086O32977N85399M08367m3221m33432J0540J006908
57442C27301J186699K06244n61928k08081L18104p6799q88905j063406o20398
57433a381169j76996J57002M41027L76636l0923j78208O4106K651m80450l93003
57423a599327O38088J339542O01574p30591j065262k44950O11160P81027M26382
57414G57643o1672l37401j58015K49676L96929L95104P62021J153725N51459q43284
$$ plain form
57481 1008773 770580 392434 403952 249366 -574681 -1377798 -1297459 -677631 -402420 -492005
57471 -492005 -369532 -14268 122317 -12176 -96567 -8749 237240 666051 924399 358945
57461 358945 -857018 -1445576 -659172 562549 937662 562589 277644 69828 -652286
57452 -652286 -1683638 -2162323 -1840237 -1207260 -621861 -213494 -256715 -690147 -679607 327301
57442 327301 1514000 1720244 1158316 950235 1268339 1191540 302635 -760771 -1381169
57433 -1381169 -1558165 -1401163 -960136 -583500 -614423 -792631 -728525 -725874 -1206324 -1599327
57423 -1599327 -961239 378303 979877 249286 -815976 -1060926 -449766 331261 757643
57414 757643 695971 358570 200555 450231 847160 1242264 2004285 3158010 3709469 2866185
57404B866185j390454m52783M67368O9795p55101o00145J36540J74262m29270
57395H6397n99209q6363M59425P01764O71133K02692n63661q10931k38038K00220
57385B3429j63720m42866K28629R40759M37055o48388p95231j06174R5019l55155
57375g86643m43538l7293p952l98905l28219K50801M63581K70343N47815J240293
57365G70283J193325J64508o85223p19815o01629o73534k86486N79528P35919
57356D76876k05054q05211j164J021515O10081p38293j183897l61567L00911m2207
57346i28010n32034k09976N02574O22712J09087k66462j68833j3736o4495L4792
57336i14381N15023Q64474N44463k8785K0824O45814Q40898J67699n42532m39449
$$ plain form
57404 2866185 1475731 1022948 1490316 1560111 805010 204865 341405 515667 86397
57395 86397 -512812 -599175 -139750 562014 1233147 1435839 872178 61247 -176791 23429
57385 23429 -140291 -583157 -354528 586231 1023286 374898 -420333 -526507 -431488 -786643
57375 -786643 -1230181 -1267474 -1275426 -1674331 -2002550 -1751749 -1288168 -1017825 -470010 770283
57365 770283 1963608 2128116 1442893 723078 121449 -552085 -838571 -259043 476876
57356 476876 271822 -533389 -534553 486962 1097043 358750 -825147 -1186714 -885803 -928010
57346 -928010 -1460044 -1670020 -1167446 -544734 -435647 -702109 -870942 -884678 -949173 -914381
57336 -914381 -399358 465116 1009579 980794 1001618 1647432 2488330 2656029 2113497 1674048
57326A674048J47524L52435m821m98713q71384j015949o45301K47541R36810P36819
57316A059009k1757m84625m68358m28395m90399l36519M5203K73522K47199K56572
57306c48548L89254L73233O4014l16105m30514r5314N19106Q02747K56444o62093
57296E52224q77845k01316L40117J62122O2882O58061R97418N9441j269711j344849
57286h61456l37698J03714m53051p10255K8424P73442O15843O9182p5759K486
57276h45128j20255j32052L70469R23114P38367j24479p74564n55070K57943P84055
57266E22400M97529j22402j63646L67239L83684o19907j539387j209079k51353
57257b134922q0297n70426l33763Q00929J326527M31123p16833p17196K50170
$$ plain form
57326 1674048 1821572 2174007 2169186 1670473 799089 -216860 -862161 -614620 322190 1059009
57316 1059009 1037252 552627 84269 -344126 -834525 -1171044 -1125841 -852319 -605120 -348548
57306 -348548 40706 413939 477953 161848 -268666 -363980 155126 957873 1214317 552224
57296 552224 -325621 -526937 -186820 -24698 38184 696245 1693663 1753104 483393 -861456
57286 -861456 -1199154 -1095440 -1548491 -2258746 -2230322 -1456880 -841037 -771855 -847614 -845128
57276 -845128 -965383 -1097435 -726966 196148 934515 810036 35472 -519598 -261655 522400
57266 522400 1019929 897527 733881 1101120 1484804 864897 -674490 -1883569 -2134922
57257 -2134922 -2215219 -2785645 -3119408 -2318479 -991952 -560829 -1277662 -1994858 -1744688
57248a744688J074619J195327P54044O7552m43662m19593o2693R7187R0297L93478
57238A001868Q39582O27416l42385j152796j210304r14749o77643l14506K03175
57229a940342M39220L64461N08605Q37833N91036l00750q08144l90231J82573
57220e15739K21237J24559K69177J47188m89761q16166k77293L52199L05118J13278
57210e66203M06106N39983j82126r10758m71186N38644N57706m62268j053230
57201a603332n44212J74426K75909K5431n6645M2523J90542M00184N50324M49968
57191i4882K21800Q3740r6496m57219o41511l06447J85629K96840J78546K48406
57181c81594L09876m6288n41959o22292m06245l11980j57893L48130O84282K55033
$$ plain form
57248 -1744688 -670069 525258 1279302 1346854 903192 483599 420906 518093 608390 1001868
57238 1001868 1841450 2468866 2126481 973685 -236619 -1151368 -1829011 -2143517 -1940342
57229 -1940342 -1501122 -1136661 -628056 209777 800813 500063 -308081 -698312 -515739
57220 -515739 -294502 -169943 99234 246422 -243339 -1059505 -1336798 -984599 -679481 -566203
57210 -566203 -160097 379886 197760 -712998 -1184184 -645540 -87834 -550102 -1603332
57201 -1603332 -2147544 -1973118 -1697209 -1671778 -1728423 -1685900 -1495358 -1095174 -544850 -94882
57191 -94882 126918 210658 114162 -343057 -984568 -1291015 -1105386 -808546 -630000 -381594
57181 -381594 -71718 -118006 -659965 -1282257 -1688502 -2000482 -2158375 -1810245 -1125963 -870930
57171h70930l66610k57128J73052j57782q93267n72367Q19757J497050N85932
57162d2293n49642n26299Q0735R1413k47857M2333Q03151R59671K24894n80642
57152B55464p76317n12110k61913k58438l92775k95659K93011R75691R29654L7893
57142e499p15075m62455M06149Q83915O71795K13017j97556n53717o15826r6927
57132d72179O03098O05725k70426j093538q96210J68877J049545R83161J98629
57123H76682n13281o86897n01002l11320j50404J27924M20062M42181J81503p1492
57113a86044j57879j77491j60007P646K54420L13818J33984p7170k60212m89798
57103g98733n17454K5580P86605Q05565j09942q41329m08437O43223J052642N55943
$$ plain form
57171 -870930 -1237540 -1494668 -1321616 -1479398 -2372665 -2945032 -2125275 -628225 -42293
57162 -42293 -591935 -1118234 -1037499 -946086 -1193943 -1151610 -348459 611212 836106 255464
57152 255464 -520853 -1032963 -1294876 -1553314 -1946089 -2241748 -1948737 -973046 -43392 -5499
57142 -5499 -720574 -1183029 -776880 107035 778830 991847 794291 240574 -375252 -472179
57132 -472179 130919 736644 466218 -627320 -1523530 -1354653 -305108 678053 876682
57123 876682 363401 -323496 -824498 -1135818 -1286222 -1158298 -738236 -296055 -114552 -186044
57113 -186044 -343923 -521414 -681421 -673775 -419355 -105537 28447 -48723 -308935 -798733
57103 -798733 -1316187 -1290607 -504002 301563 191621 -649708 -1058145 -414922 637720 1193663
57093A193663o1747k77077k57071j57891M7486P0977m11487r06585n14746N79433
57083f95045J045485K77549o50471n65109J50563L80414N8079L691L53550L61387
57073G20093k32992p32879o32168l09768j99645p5911L18744N99069L29179j77651
57063c93929l13257j23881j40393m16151l99922J81353Q53314R82404M82142k23563
57053D88117o82366p08535l79180R3114N02099P13452O51097L44887n246k05762
57043H11677l41319o10124q49826o37836l5062K67746q5664m76021j65285N80103
57033a541611Q64613M12361k35425o04453o59372l83641K54064Q73034R34380
57024h6050N27950K56873K70926J32206k53530l86105r4749J04441n3061o9510
$$ plain form
57093 1193663 1131916 854839 597768 439877 487363 558340 146853 -759732 -1274478 -695045
57083 -695045 350440 627989 -22482 -587591 -437028 -56614 1465 5156 358706 720093
57073 720093 487101 -245778 -877946 -1187714 -1387359 -1463270 -1144526 -545457 -216278 -393929
57063 -393929 -707186 -831067 -971460 -1387611 -1787533 -1606180 -752866 229538 711680 488117
57053 488117 -194249 -902784 -1281964 -1188850 -686751 26701 677798 1022685 1017439 811677
57043 811677 470358 -139766 -989592 -1627428 -1662490 -1394744 -1480408 -1956429 -2121714 -1541611
57033 -1541611 -676998 -264637 -500062 -1104515 -1763887 -2147528 -1893464 -1020430 -86050
57024 -86050 441900 698773 969699 1101905 848375 462270 367521 471962 418901 349391
57014C49391L91341P88358N28637p5270l37720k30774k08516l43906l14498o6990
57004D80053P2668j17420n22124q13065o05604J93073R86515R14759o75o76256
56994h8076l72090K88551K97229k72352n37129j76996K95038M62009M22331L14200
56984F32715J04734r4325o4795Q8995J6433k95883m07579p677O20244Q05552J51053
56973A549467q97185j247475l54381Q38093Q54883k70856q53200R4362J385536
56964A099244J384527K87276m93246n44087o31659r71423q24466L3677P39419
56955G9262O36887J50427p1953p1263j74025l19730k64939n2843O5775n7839l58329
56944d38570n39032k55882L89481P62154M84380j0507j93931k52636n05437n42265
$$ plain form
57014 349391 740732 1529090 2057727 1982457 1644737 1413963 1205447 861541 547043 480053
57004 480053 552721 435301 -86823 -899888 -1505492 -1312419 -325904 588855 588180 -88076
56994 -88076 -460166 -171615 125614 -146738 -683867 -860863 -565825 -103816 318515 632715
56984 632715 737449 643124 578329 667324 683757 387874 -19705 -27382 592862 1398414 1549467
56973 1549467 652282 -595193 -949574 -111481 743402 472546 -380654 -286292 1099244
56964 1099244 2483771 2771047 2277801 1733714 1102055 130632 -693834 -660157 79262
56955 79262 716149 866576 794623 723360 549335 229605 -35334 -88177 -22402 -80241 -438570
56944 -438570 -977602 -1233484 -844003 -81849 402531 392024 198093 -54543 -559980 -1102245
56934a102245P8190O97235L40978n62649n87046N15201J375205J033205J41360
56925A929434l08208l01582k61257j86062N189O0436r5867j18741P0404Q4256
56915H78002j11074m7994K22139l899p03900p80332J65499Q71717K72287p09539
56905E2906n39776N12423Q51167O8323n80638k79023J99795q0991p38186p60976
56895a294976o2352M52481K05844k94263k10707M43485P89842K79930n26876p35773
56885i53365l31206j8394k3710J45010O32737P79770J54944o17587o41121N3592
56875h19330O31064N42043N5329k03631K0854L39338J79249l89644n77570K7642
56865a94656P00528N83010L9886K7537M05305J67950o69247r05616j92171K78440
$$ plain form
56934 -1102245 -1024055 -326820 14158 -548491 -1135537 -620336 754869 1788074 1929434
56925 1929434 1621226 1319644 1058387 872325 877514 937950 842083 723342 793746 878002
56915 878002 766928 718934 941073 937174 233274 -547058 -381559 490158 762445 52906
56905 52906 -486870 25553 876720 945043 364405 85382 285177 204186 -534000 -1294976
56895 -1294976 -1357328 -904847 -699003 -993266 -1203973 -760488 29354 309284 -217592 -953365
56885 -953365 -1284571 -1302965 -1326675 -1181665 -548928 230842 385786 -231801 -872922 -819330
56875 -819330 -188266 353777 409106 205475 226329 565667 744916 355272 -222298 -194656
56865 -194656 505872 1088882 1128768 1156305 1561610 1729560 1060313 154697 -37474 240966
56855B40966k47908q41954n03139K55602M60051K00707K5952j74521n48257m97083
56845a629584K83260Q65851M44906k31594j15533L08352l2523p53489o19641K86599
56835a193396P46681M73503K77699L17922o1211p10197o49485Q6197K54340n13685
56825i71632j002192l67940O09586R23687P17651N06395J58499m84336q87942
56816g98224n88286K273K55045J96133J48461J13125L8295J15301L22172K51057
56806E5352j84802m88057m09691l42137m49239k00386O23665J220604Q42653m905
56796F63057k79959J03797L54751J17863j49142r5647k0047k66844n74552l81818
56786e28541L50730R20358O71122p8355k96614L56461Q85648K93985q62645j154713
$$ plain form
56855 240966 -6942 -848896 -1352035 -1096433 -636382 -435675 -409723 -584244 -1132501 -1629584
56845 -1629584 -1346324 -480473 -35567 -267161 -382694 -74342 -106865 -860354 -1479995 -1193396
56835 -1193396 -446715 26788 304487 622409 561198 -148999 -798484 -712287 -457947 -971632
56825 -971632 -1973824 -2341764 -1732178 -808491 -90840 415555 574054 89718 -798224
56816 -798224 -1386510 -1384237 -1129192 -933059 -784598 -671473 -633178 -517877 -195705 55352
56806 55352 -129450 -617507 -1027198 -1369335 -1818574 -2018960 -1395295 -174691 667962 663057
56796 663057 383098 486895 841646 959509 810367 714720 694673 427829 -146723 -528541
56786 -528541 -177811 742547 1413669 1335314 1038700 1395161 2280809 2574794 1712149 557436
56776E57436l29634M05129K51018k02003k69358k66559n58522n59811K29810R39012
56766A96518L82413r32062j209298J21260J525996J461454L56848k61654L0113
56757A671588K35611l37771j037471r07153n9442O09047O64661L86518j1581n73551
56747F40456r97642p36801L8098M38497K07502J46683O37455P79024q3132r61755
56737A08385o52210K12462R7968q87267j119688o9440R51575R23028L84820Q2852
56727C2485j54581n03360m53482J36845M43112n359m19044l9611N86544N45945
56717A69494m1814m88526o79035q04532n82223K73703J226700J429278P72874
56708A275919j75216q71551r37658k14900P25657P96073j98721j032310o77476
$$ plain form
56776 557436 227802 632931 883949 681946 412588 146029 -412493 -972304 -742494 196518
56766 196518 578931 -353131 -1562429 -1441169 84827 1546281 1903129 1641475 1671588
56757 1671588 1907199 1569428 531957 -375196 -434638 174409 839070 1225588 1214007 640456
56747 640456 -357186 -1093987 -1055889 -617392 -409890 -263207 374248 1153272 1070140 108385
56737 108385 -543825 -331363 -233395 -1120662 -2240350 -2309790 -1358215 -435187 -50367 32485
56727 32485 -122096 -625456 -1078938 -942093 -498981 -504340 -923384 -962995 -376451 169494
56717 169494 127680 -360846 -1039881 -1844413 -2426636 -2152933 -926233 503045 1275919
56708 1275919 1100703 229152 -708506 -923406 -197749 598324 399603 -632707 -1310183
56699a310183K47356N12474P7937j63094P4000K66658J41364m5287j31181j82104
56689e12060j66626r0987j56857k83562R493O84484Q55138J15745n77786k99381
56679d22399L40223K19100m39770n46413K8345M73504N30594N91950N64783K4333
56669A364250o48652o33056o0694K62984L37282P12916R61007J37579j169342
56660A264274j172538K96380J193234K84484r93884q43544K34863N42255j25368
56651F80156m78246Q3457P15152N10560l57764j002960p92473O7058O88902M41022
56641E54864k36320m04710K269J57497k00115k95322K91100P87646M48653k80575
56631H24987n66224l80969j34765J38743M07559J87259o16638j076587m53546
$$ plain form
56699 -1310183 -1062827 -550353 -472416 -635510 -561510 -294852 -153488 -198775 -329956 -512060
56689 -512060 -678686 -769673 -926530 -1210092 -1200599 -516115 339023 454768 -123018 -422399
56679 -422399 -82176 136924 -302846 -849259 -820914 -347410 183184 775134 1339917 1364250
56669 1364250 715598 82542 21848 284832 622114 1335030 2296037 2433616 1264274
56660 1264274 91736 388116 1581350 1865834 871950 28406 263269 805524 680156
56651 680156 201910 285367 1000519 1511079 1153315 150355 -642118 -575060 113842 554864
56641 554864 318544 -86166 -83897 73600 -126515 -421837 -130737 656909 1105562 824987
56631 824987 258763 -122206 -256971 -118228 289331 476590 -140048 -1216635 -1670181
56622a670181N44451P68910L50074K22534L76409l7126r92668j375423o72641
56613b485661K95357O48515M62575J98691L6489J18319N84257R84537N29473o05548
56603G67004j095621k21055R79965J112012L26066j46189O9314J43984m08852
56594A526628r26986o70995J02730O32248O73187N22627L88897K48493J12361
56585B609190k3405l32650q29243j043267n48255K64818N33991J00356k85352
56576D46183j09565K06716J22408j31065m1140K64573K65210n4609k16013k2566
56566G30132K53063L55752K11683k30633p91903r23300m05252O6131k41855q60362
56556a836544p02580K28773Q14179N70092K39897L44024L75718p737j86156K34300
$$ plain form
56622 -1670181 -1125730 -356820 -6746 215788 592197 555071 -437597 -1813020 -2485661
56613 -2485661 -2190304 -1541789 -1079214 -880523 -844034 -725715 -141458 843079 1372552 767004
56603 767004 -328617 -549672 430293 1542305 1868371 1722182 1791496 1935480 1526628
56594 1526628 599642 -71353 31377 663625 1336812 1859439 2248336 2496829 2609190
56585 2609190 2585785 2253135 1423892 380625 -167630 97188 631179 731535 446183
56576 446183 336618 543334 665742 534677 493537 758110 1023320 968711 752698 730132
56566 730132 983195 1338947 1550630 1319997 528094 -395206 -800458 -734327 -976182 -1836544
56556 -1836544 -2539124 -2310351 -1496172 -926080 -686183 -342159 33559 25822 -160334 73966
56546G3966N03058j5838n84736k38549N51082O34644P4638r6441K84857L44505
56536A531186j62873m10125n309L04489m6341m60776k02312L89423M69827m0892
56526A366297n01173n68518m90686m58789k65154K30696O62747N04816j76029
56517C04207n97261j47546P32539R97280L76941k77578l18891k56887p19910j111326
56507a018432m01857J002995J454960L13997j125158j405698o36523J51206N06344
56498a158166O05098M38100r8277n98344m93999Q0770M52778L77702K22793K13962
56488D2417J38631j10162k75963k22432j91508l20267k97916J60671P60528R10143
56478E94142M68282q6046k40516l275J86472k6265n63308j013644j005072n10222
$$ plain form
56546 73966 577024 561186 -23550 -262099 288983 923627 998265 901824 1186681 1531186
56536 1531186 1368313 958188 952879 1257368 1211027 750251 547939 937362 1407189 1366297
56526 1366297 865124 296606 -194080 -652869 -918023 -687327 -24580 480236 304207
56517 304207 -293054 -440600 291939 1289219 1666160 1388582 1069691 812804 92894 -1018432
56507 -1018432 -1420289 -417294 1037666 1351663 226505 -1179193 -1815716 -1664510 -1158166
56498 -1158166 -553068 -114968 -213245 -811589 -1305588 -1224818 -772040 -394338 -171545 42417
56488 42417 181048 70886 -205077 -427509 -619017 -939284 -1237200 -1076529 -316001 594142
56478 594142 1062424 976378 735862 732587 919059 892794 329486 -684158 -1689230 -2199452
56468b199452J15773L86752R6901m25445n69377q5085N90093Q13570M80433N4585
56458g41252j06609j24917j96240j67575J86387O71167Q20008N10845J43637J21774
56448A117225L43264L37896j38116p42050q66539l66959J62153O5396m72267n82332
56438a142329J00653Q42503P56151q887n54857m95122k55176j40086J21966O23745
56428a51439P82533J67141o67577q60268m69450k68922m31180k66681N29051J168720
56418d68072Q33349r0410m85767J6613O64772O78316J72060j96439j36837J4607
56408A002192j56437n67517p29683l99977K6613R604l22088k67472L78864Q34304
56398a91597L42623o56223r84655k53256O92729R26401M65555o9048l30193m14966
$$ plain form
56468 -2199452 -2083679 -1696927 -1600026 -2025471 -2594848 -2679933 -2089840 -1276270 -795837 -741252
56458 -741252 -847861 -972778 -1169018 -1336593 -1150206 -479039 340969 851814 995451 1117225
56448 1117225 1460489 1798385 1660269 918219 51680 -315279 -153126 -87730 -559997 -1142329
56438 -1142329 -1041676 -199173 556978 548091 -6766 -501888 -757064 -897150 -775184 -151439
56428 -151439 631094 798235 130658 -729610 -1199060 -1467982 -1899162 -2165843 -1636792 -468072
56418 -468072 365277 274867 -210900 -194287 470485 1148801 1320861 1124422 987585 1002192
56408 1002192 845755 278238 -451445 -851422 -824809 -815205 -1137293 -1404765 -1025901 -191597
56398 -191597 151026 -505197 -1489852 -1743108 -1050379 -123978 341577 272529 -57664 -472630
56388d72630m35902k87716J76989Q51982J254472Q54814k33838j088011r34151
56379c13991j50485K58126J09561J97429Q71608J364119R75506J25755m19796
56370C017832o73335r78796j044397m27711L56723L01453n71532j146124p87984
56361a953871q4002K30775K52262M14354O77217O92678L73265o7228l45563k01053
56351a1166L68347Q32243N61715k92975q66684p12349k92415q9468Q2922M29861
56341A0031N26859L1823m58942j28082P29761R70025K11008o02680m85131L40403
56331A145075Q32322M09445n10135j074849q24864L483P85332J009898N38297
56322B314004m00813j238760j247571j81378J142509J402782K48061j169502j510010
$$ plain form
56388 -472630 -908532 -1196248 -1019259 -167277 1087195 1942009 1708171 620160 -313991
56379 -313991 -464476 -206350 -96789 100640 972248 2336367 3311873 3437628 3017832
56370 3017832 2344497 1365701 321304 -106407 250316 551769 -19763 -1165887 -1953871
56361 -1953871 -2037873 -1807098 -1554836 -1140482 -463265 229413 602678 535450 189887 -11166
56351 -11166 357181 1189424 1751139 1458164 591480 -120869 -413284 -502752 -419830 10031
56341 10031 536890 568713 109771 -18311 711450 1681475 1892483 1289803 804672 1145075
56331 1145075 1977397 2386842 1876707 801858 -23006 -19523 765809 1775707 2314004
56322 2314004 1913191 674431 -573140 -754518 387991 1790773 2038834 869332 -640678
56313f40678p29568J93010O12920O51671N19254J79275k74296n40539n30990l96365
56303i56306j34562L10291O04171L22427k79237m93715k43868j43246l12603q6755
56293a413403O78096R96859K15251p35784n30593O40501J386276J021908J37890
56284B397001n63893r58997j011628n96843r777J89298N5902K07434O85492P19140
56274A113129l9172q67119j034580p68626n96786m10042J18523P00114P78987
56265a005572M07966J03957M8603K5113m3082n4242p4289k06720k61396l1748
56255a091410K52517K23666k0318o9508J80153M83274O41981N47958R1086n21289
56245G18110o77655j43324M07338K69231k42090l63428j31426j14817j95780K27711
$$ plain form
56313 -640678 -1370246 -1177236 -564316 87355 606609 785884 511588 -28951 -559941 -956306
56303 -956306 -1090868 -780577 -176406 146021 -133216 -626931 -870799 -1014045 -1326648 -1413403
56293 -1413403 -735307 261552 476803 -258981 -789574 -149073 1237203 2259111 2397001
56284 2397001 1833108 874111 -137517 -734360 -744137 -554839 -498937 -291503 393989 1113129
56274 1113129 1073957 206838 -827742 -1596368 -2193154 -2603196 -2484673 -1784559 -1005572
56265 -1005572 -597606 -493649 -445046 -419933 -463015 -517257 -591546 -798266 -1059662 -1091410
56255 -1091410 -838893 -615227 -635545 -705053 -524900 -41626 600355 1148313 1239399 718110
56245 718110 40455 -102869 304469 573700 331610 -31818 -163244 -278061 -473841 -246130
56235b46130R01113Q38669k0755n25403q3270M53701K55024k48844l56945l33312
56225F33848o96120j050563o91877J41233O32968O54061O83903P14022K37913
56216A259388o60995j105930n52986M64508R66792N69301k46827p06776n18937
56207e32462j08265J4665k3817K20425N79727L96414l07113o59866l02736J2785
56197g10243k44490m16075J56101Q48662P14459K2089k94711j46426n3728P5136
56187d9226O03036R83370L66957p81978j125635m86442o25j54749j63962M03910
56177d05344Q42199O21675J81782j11486n39162j010233p60822K38221Q21610
56168a21560L84344j01731K57309P77042M53699l17596n40968k91567k70127l62319
$$ plain form
56235 -246130 654983 1493652 1472897 947494 864224 1317925 1572949 1324105 967160 633848
56225 633848 -62272 -1112835 -1804712 -1663479 -1030511 -376450 307453 1021475 1259388
56216 1259388 598393 -507537 -1060523 -596015 370777 940078 693251 -13525 -532462
56207 -532462 -640727 -626062 -649879 -429454 150273 546687 239574 -420292 -723028 -710243
56197 -710243 -954733 -1370808 -1214707 -366045 348414 370503 75792 -70634 -124362 -49226
56187 -49226 553810 1537180 1904137 1122159 -3476 -489918 -490543 -645292 -809254 -405344
56177 -405344 436855 1058530 1240312 1128826 589664 -420569 -1181391 -943170 -121560
56168 -121560 262784 161053 418362 1195404 1649103 1331507 790539 498972 228845 -133474
56158a33474o943M99520M42809R3589L02032Q83912P79918j78296r56734r08668
56148H17665m74656q7410M23091R54723Q13222j19956q34292n28588K14427L49393
56138A527619r8939k74293N7910J96401l13321r27899q72783k11682L04356K91360
56128c21271J47996L11928N58930M28295L2512j40700r7649k84214o09257l84423
56118c57853M27139Q01072J36430o58856m81463K19406J73648o11360q25183O3884
56108a113136J011261J029496M82070J85578J72719P0387j8888J84802M46509
56099B450798L80107J58943J51609J31227l81515j115169j189642l72742M89839
56090G03455N70881O0346k82640j78819O293o3379k91478l93492k24591J48026
$$ plain form
56158 -133474 -140417 359103 801912 895501 1197533 2081445 2861363 2683067 1726333 817665
56148 817665 343009 255599 678690 1633413 2446635 2326679 1492387 963799 1178226 1527619
56138 1527619 1428680 1154387 1212297 1408698 1095377 167478 -705305 -916987 -612631 -321271
56128 -321271 -173275 138653 697583 1125878 1158390 1017690 920041 635827 26570 -357853
56118 -357853 69286 870358 1006788 347932 -133531 85875 259523 -351837 -1177020 -1113136
56108 -1113136 -101875 927621 1409691 1595269 1767988 1838375 1819487 2004289 2450798
56099 2450798 2830905 2989848 3141457 3272684 2891169 1776000 586358 213616 703455
56090 703455 1274336 1334682 1052042 873223 879516 816137 524659 131167 -93424 54602
56080E4602M52687L35957j98474n03272P0894J093381J204725j72639j764205
56071E73656j848735n00722N03249J12420o48256k60792J138778K003333J385630
56062B458561p9983j116497j096217l53795L09613L11691k40579o94327n85882
56053a087415j22184K07985K56699J95208J29244R1242K17706N46010P65980N46430
56043A746905K6651l34687l19838j02391L8369p4290m11428o36310l78014J61662
56033b83371K59152l37099r09418p45316j63857O1162p5822O0963O14647J038703
56023d80256R92698P04911M04397M5262l21996m69835l73526k29849j12971j4542
56013A44293o9015k73056k37757K08139M97987J34581l35876q0606N67159N19283
$$ plain form
56080 54602 507289 843246 644772 141500 212394 1305775 2510500 2337861 573656
56071 573656 -1275079 -1775801 -1272552 -1160132 -1808388 -2069180 -930402 1072931 2458561
56062 2458561 2378578 1262081 165864 -187931 121682 433373 192794 -501533 -1087415
56053 -1087415 -1209599 -1001614 -744915 -549707 -420463 -329221 -111515 434495 1200475 1746905
56043 1746905 1773556 1438869 1119031 1016640 1055009 980719 569291 -67019 -445033 -283371
56033 -283371 -24219 -361318 -1270736 -2016052 -2179909 -2118747 -2194569 -2133606 -1518959 -480256
56023 -480256 512442 1217353 1621750 1667012 1345016 875181 501655 271806 158835 144293
56013 144293 75278 -197778 -435535 -227396 270591 405172 69296 -11310 555849 1075132
56003A075132l03338q03230l96639K76667N20571L44819j34115q63830j173776
55994a457739k40163J337335J792519O44373m77376k38410N69383O18811Q7516
55985B636249k03336m44390j045550j203239p7394J277703J080497m01586j136491
55976D82463l51859N68818M58449j12895k32793m5589k0354k9341R8243Q1736
55966H96878j19511m4923K78038P8947p80199j204228m63275N44019N92993r1537
55956c12798m18911j43978J41923K51075M43067N23472R0853m38694k22744N68352
55946D81617Q48414L13345r7763K12245N45485J13828p30823j173774j100620
55937e88046q46559m25253J88158N28916K57484q9000J80215P59084Q16245L51281
$$ plain form
56003 1075132 771794 -31436 -428075 -151408 369163 713982 579867 -283963 -1457739
55994 -1457739 -1697902 -360567 1431952 2076325 1598949 1360539 1929922 2548733 2636249
55985 2636249 2432913 1988523 942973 -260266 -337660 940043 2020540 1618954 482463
55976 482463 130604 699422 1157871 1044976 812183 766594 746240 716899 815142 896878
55966 896878 777367 732444 1010482 1089429 309230 -894998 -1358273 -814254 -221261 -312798
55956 -312798 -731709 -875687 -733764 -482689 -39622 483850 574703 136009 -86735 481617
55946 481617 1330031 1643376 1545613 1757858 2303343 2417171 1686348 512574 -588046
55937 -588046 -1434605 -1859858 -1671700 -1142784 -885300 -974300 -794085 -35001 781244 1132525
55927A132525R3323K00162J22737k44464l84710k47363l68465o73327m03357L47971
55917d24968L88063n60860r84639J63344J554466J320745j26569q36188l05397
55908A87997J39236k04928m68110q523N18824M87767L12971M42808M95905J24204
55898B028151k40862j98087o7643j40411q1951K80706M13745o999m27448l55053
55888A204148j93895m14390o46849l97286L1113J59333K23127N78086Q15418L93517
55878A752322l30778n96751l69735j69289j64437j94603k72577l55748r9378M77692
55868c23282O90170K81260N7017N29360Q03348J1171r77850p78974K02149L86529
55858H80898l95154p32275l4468O48387M94311L2806o2651K1832n2020j62077
$$ plain form
55927 1132525 1225848 1426010 1548747 1304283 919573 672210 303745 -369582 -772939 -424968
55917 -424968 -36905 -597765 -1582404 -1419060 135406 1456151 1329582 493394 187997
55908 187997 327233 122305 -345805 -354328 164496 652263 965234 1408042 1903947 2028151
55898 2028151 1787289 1589202 1521559 1381148 1299197 1579903 1993648 1986649 1559201 1204148
55888 1204148 1010253 595863 -50986 -448272 -417159 -257826 -34699 543387 1358805 1752322
55878 1752322 1421544 824793 455058 285769 121332 -73271 -345848 -701596 -800974 -323282
55868 -323282 366888 648148 705165 1234525 2037873 2049044 1071194 292220 494369 880898
55858 880898 485744 -246531 -280999 367388 861699 894505 831854 853686 801666 639589
55848F39589k17432k93858r8072O45879J231311O74672n23076q02135L4078M51816
55838A742772l10819j091330q67820k75403r6531J26210P65162R18913j1456q73544
55828B6154m69685M17597L92540j46318J52853J049200J021688j53939j053544
55819A236546q62583k89690m9525K3048N9621k27638o38920m56463K64768N34117
55809d06719j3266m93786k03896L70928N40447M36517M03431K27830k65087n39574
55799E6825q8827O14719O60181q0961q74278j068624o53574m3432L13349K46206
55789i18416L9479J30634N00084O58917L63503p8815m00315p49708j144352j075377
55779b674366k09282Q54382J133557M60780l52958n16191l5695M95175N71785
$$ plain form
55848 639589 422157 128299 30227 676106 1907417 2582089 2059013 1256878 1290956 1742772
55838 1742772 1431953 340623 -527197 -802600 -899131 -772921 -7759 911154 899698 26154
55828 26154 -443531 -25934 366606 220288 373141 1422341 2444029 2290090 1236546
55819 1236546 373963 84273 34748 57796 117417 -110221 -749141 -1205604 -940836 -406719
55809 -406719 -419985 -913771 -1117667 -746739 -206292 230225 633656 861486 596399 56825
55799 56825 -32002 582717 1242898 1161937 287659 -780965 -1434539 -1477971 -1164622 -918416
55789 -918416 -878937 -748303 -248219 410698 774201 695386 295071 -454637 -1598989 -2674366
55779 -2674366 -2883648 -2029266 -895709 -434929 -787887 -1304078 -1339773 -844598 -272813
55770b72813K00800j72413j59739R5548J06199k35470m46726j75189K29616K25699
55760f04488j39037l94432l50571j21176L33053J015975J336590N60603r56494
55751F80023j756988r87358M54917J058091N31509j65647k94431k2719K52146
55742b50457M26062M01985K9520m13900l52527J57784K89175l48238j004987q53572
55732a919155j49079L40562M93456N94828M55602j75941o56145j35523Q57903
55723b93492Q49341l30598j055615k34797J080660J285255M25853k40996j88026
55714A297585N0599Q4072N9493k2600l79985p90387p03508j34575K51163Q7797
55704b00346k50474k94736m6344K42254M04649L53726J10195q5561j3134J73696
$$ plain form
55770 -272813 -72013 -244426 -404165 -308617 -202418 -437888 -884614 -1059803 -830187 -604488
55760 -604488 -743525 -1137957 -1488528 -1609704 -1276651 -260676 1075914 1636517 680023
55751 680023 -1076965 -2064323 -1609406 -551315 -19806 -185453 -479884 -502603 -250457
55742 -250457 175605 577590 607110 193210 -159317 -1533 287642 -60596 -1065583 -1919155
55732 -1919155 -2068234 -1727672 -1234216 -639388 -183786 -359727 -1015872 -1151395 -293492
55723 -293492 555849 225251 -830364 -1065161 15499 1300754 1726607 1485611 1297585
55714 1297585 1348184 1432256 1491749 1469149 1089164 298777 -404731 -539306 -288143 -200346
55704 -200346 -450820 -745556 -791900 -549646 -144997 208729 318924 233363 220229 393925
55694C93925J54758n7450j86440j58539q8159Q0288M16400N81566J54688n92403
55684F98634q42266l03205L87096N26666J58676k23497l83585m37368m64905l25476
55674a209230J30373P22010Q88601K38055p45505r62548l4240J026249J032958
55665A086723J70488m03876k57528q6549m25552q69860q38632l67700J81898O04720
55655a205868P50136M84452J7128k23243k08297k70244l53840k2059O03364P37119
55645C08648J47038l36117o2063M26968K86708l61594p91830p85582o12932l17567
55635b098323J79672N67688N24356L82180O36092R70918O28141l03414q40603
55626F46707n04165L7386N2607k04667n4065M44979N38008o9252o56784l87974
$$ plain form
55694 393925 548683 491233 304793 146254 58095 138383 554783 1136349 1291037 698634
55684 698634 -143632 -446837 -59741 466925 625601 402104 18519 -418849 -883754 -1209230
55674 -1209230 -1078857 -356847 531754 769809 24304 -938244 -972484 53765 1086723
55665 1086723 1257211 853335 595807 509258 83706 -786154 -1624786 -1992486 -1810588 -1205868
55655 -1205868 -455732 28720 45848 -177395 -385692 -655936 -1009776 -1031835 -428471 308648
55645 308648 455686 119569 57506 484474 771182 409588 -382242 -1167824 -1780756 -2098323
55635 -2098323 -1918651 -1350963 -826607 -444427 191665 1162583 1790724 1487310 646707
55626 646707 142542 179928 232535 27868 -26197 418782 956790 887538 230754 -157220
55616a57220M92131Q29348N4431r50867r46883n684O21465K64377l83633m88733
55606f71268k11192p8796K616L38995O24330M11043J8297O3583L50302J67897
55596A015807m35034o63246k90122M166k03502m77051m00450k48654l44008m12396
55586b454490q3862M53794P53515O85961L79491l2343l12091j91301J59656J90482
55576d51188j76280k70612L00073Q65727N63111l64876q59183m96000M7983M8185
55566g93060l34388m18579M6248N86032N95252R0992k31823J63193Q45911Q37946
55556A387724m9057q00347n00998M08148P78016L36206j47408j82948j73394m85660
55546E70282p17858m11585P5717O5618l86275n89216k49114K32569N20972P83081
$$ plain form
55616 -157220 334911 1164259 1218690 267823 -679060 -684744 -63279 201098 -182535 -671268
55606 -671268 -882460 -961256 -958640 -619645 4685 415728 434025 497608 847910 1015807
55596 1015807 580773 -82473 -372595 -368429 -571931 -1048982 -1449432 -1698086 -2042094 -2454490
55586 -2454490 -2538352 -2084558 -1331043 -645082 -265591 -297934 -610025 -801326 -641670 -451188
55576 -451188 -627468 -898080 -598007 267720 830831 465955 -393228 -889228 -841245 -793060
55566 -793060 -1127448 -1546027 -1499779 -913747 -318495 -227503 -459326 -296133 549778 1387724
55556 1387724 1338667 538320 37322 445470 1223486 1559692 1412284 1229336 1055942 570282
55546 570282 -147576 -559161 -483444 -417826 -804101 -1393317 -1642431 -1409862 -888890 -105809
55536a05809J129453J163875N40312l43302p27773m82943k34171m32742p42793
55527b35893n90263N374M97404N40741K76653p2554m93707r27413j046456n91204
55517b637318J84965O78445N63450Q5951k86952l38082j57071R9490L31054M32888
55507a043180K97676n3644m20392n59905l58559J10643O07820Q11404N55011P7061
55497B3935j20261J67360N39309M64289j5108l33694j58745K19668L46783J49539
55487A283075j51333m13763o13045o83843n69366l25525j0187L80580P12143O81978
55477B90714K29242k61435m48748m65580n16041l76667J61141O35339M37092j31172
55467d46115j71649L88788O47348K45022k5240K97902L38134o29309j565646r60807
$$ plain form
55536 -105809 1023644 2187519 2727831 2384529 1656756 1173813 939642 506900 -235893
55527 -235893 -826156 -820782 -323378 217363 494016 421462 -72245 -999658 -2046114 -2637318
55517 -2637318 -2452353 -1773908 -1210458 -1124507 -1411459 -1749541 -1906612 -1807122 -1476068 -1043180
55507 -1043180 -745504 -799148 -1219540 -1779445 -2138004 -2027361 -1419541 -608137 -53126 23935
55497 23935 -96326 71034 610343 1074632 1059524 725830 567085 786753 1133536 1283075
55487 1283075 1131742 717979 104934 -578909 -1148275 -1473800 -1483987 -1103407 -391264 290714
55477 290714 519956 258521 -190227 -655807 -1171848 -1548515 -1387374 -752035 -314943 -446115
55467 -446115 -617764 -228976 418372 663394 638154 936056 1274190 644881 -920765 -1881572
55457a881572P11155J425807N19288m42524j58359N80096M61420k35913l86254
55448E93144L8058K22616J51353M24911O91463m0360j362335j485568N3752J314696
55438F01730O67594p61222q37657L71495R39638J74058n59420k37144L97712M14636
55428A171420J65634K51541K50824l77768j024266p95301m9188J69201j81576
55419d19479k74746n411j02743o12497o12521J96671Q25693N20138o0660N4312
55409d91243O67039Q83024M86810j3251l07212m17451k13233L60616P39993K71156
55399A966248p31809j229174q27598k05879m5252k17251k59768n2117K73521N89510
55389g39569O74348L26113j87963k96282J3355P2592l80864o43853j24627O17500
$$ plain form
55457 -1881572 -1170417 255390 774678 332154 173795 753891 1215311 979398 593144
55448 593144 631202 853818 1005171 1430082 2121545 2081185 718850 -766718 -712966 601730
55438 601730 1269324 508102 -329555 41940 981578 1155636 596216 359072 756784 1171420
55428 1171420 1337054 1588595 1839419 1461651 437385 -357916 -407104 -237903 -419479
55419 -419479 -694225 -699636 -802379 -1414876 -2027397 -1830726 -1005033 -484895 -545555 -491243
55409 -491243 175796 1058820 1545630 1532379 1225167 807716 594483 955099 1695092 1966248
55399 1966248 1234439 5265 -822333 -1028212 -1073464 -1290715 -1550483 -1602600 -1329079 -739569
55389 -739569 -65221 260892 72929 -223353 -209998 -137406 -518270 -1162123 -1286750 -669250
55379f69250O59680R5098k57896k36199l94451p32504m89203M64678J063664N41832
55369D5449l01721k16415O09799Q00472j60346j122029q27603M46614J349003
55360F23223J140625L23711k90281n37574p27376r33704q90549n00297n2630J71653
55350a673199K32656K97322L15985J82858M1103J19362L49725M39262K70281l0826
55340E44529l36796n46017m91988j73508P8525Q2201K21316P74513J084389L32571
55330A569735r06645j081436N6452Q66289K06914q50946p96619m2191l474o11192
55320a593113n50875L35959P87554L75833J87678P68433J094941M12051m10725
55311A407736m05602j11906m30396r12365n76421K93893N97168K38782J39772
$$ plain form
55379 -669250 -9570 85528 -172368 -408567 -803018 -1535522 -2024725 -1560047 -496383 45449
55369 45449 -256272 -472687 137112 937584 777238 -344791 -1172394 -725780 623223
55360 623223 1763848 2087559 1797278 1259704 532328 -401376 -1291925 -1792222 -1844852 -1673199
55350 -1673199 -1440543 -1143221 -827236 -644378 -603275 -483913 -134188 305074 575355 544529
55340 544529 207733 -338284 -830272 -1003780 -925255 -843054 -621738 152775 1237164 1569735
55330 1569735 663090 -418346 -361894 504395 711309 -139637 -936256 -978447 -981921 -1593113
55320 -1593113 -2143988 -1808029 -1020475 -644642 -456964 311469 1406410 1818461 1407736
55311 1407736 1002134 890228 459832 -452533 -1028954 -735061 -137893 100889 240661
55302B40661N80646P81414K09514o82643j155680q83594J6867R58066J027437
55293A092688m4897j184424j072054J35778J033676Q36063R9478m04625n31388
55284c9705l34684K17565Q02761Q46299L40136j73535n46682j058282j402844
55275a348971q01857N19520J193299O63188Q0626M11523Q45413K77743o61101
55266A179383o10606J53550J32775p99473j048834Q4048J093721M60463j060019
55257d14992j499904l66400Q94055R19357n3337q24974p00760j1135M89939M47914
55247a120237J61297J02238K79429K77358l8959k10231J47995O55398O14958L9450
55237I08696l14480l5698L45786J56518m45505p57883n54362k71973k18956j54566
$$ plain form
55302 240661 821307 1602721 1812235 1129592 -26088 -909682 -892815 65251 1092688
55293 1092688 1047791 -136633 -1208687 -1072909 -39233 796830 896308 491683 -39705
55284 -39705 -374389 -156824 645937 1492236 1832372 1658837 1112155 53873 -1348971
55275 -1348971 -2150828 -1631308 -438009 225179 305805 717328 1562741 1840484 1179383
55266 1179383 568777 722327 855102 55629 -993205 -909157 184564 645027 -414992
55257 -414992 -1914896 -2281296 -1387241 -467884 -521221 -1346195 -2046955 -2058090 -1568151 -1120237
55247 -1120237 -958940 -856702 -577273 -299915 -338874 -549105 -401110 254288 869246 908696
55237 908696 594216 558518 904304 1060822 615317 -142566 -696928 -968901 -1187857 -1342423
55227a342423J60944M62194L80614P6040M8624L88444N91522K39563l81459n78430
55217D5633j32897L64456K61131k29278k75878L06237O11897p8233j075115j125092
55207a327139k19951M17213J70973k28125j13291Q7436j30793l08864R0639N57101
55197a004801L39883k17042k48172J89314L84707L19400N27204Q53898O40035
55188A784426N0592q3019K20385O7145o58884r82666n00098j0578k4879M0949
55178i6627N74689R40422O73013K96181J40692m23192j573526k066639r79653
55169b514640N51065Q10484L3200j20569P58595J291661N17257p57702j218534
55160f49183o79047K7171K15047L824R741N13582R65167O14446l40006q52899
$$ plain form
55227 -1342423 -1181479 -719285 -338671 -262631 -214007 174437 765959 1005522 624063 45633
55217 45633 -87264 277192 538323 309045 33167 339404 951301 873068 -202047 -1327139
55207 -1327139 -1547090 -1129877 -958904 -1187029 -1300320 -1212884 -1343677 -1652541 -1561902 -1004801
55197 -1004801 -664918 -881960 -1130132 -940818 -556111 -236711 290493 1144391 1784426
55188 1784426 1835018 1751999 1972384 2039529 1380645 397979 -102119 -112697 -137576 -96627
55178 -96627 478062 1418484 2091497 2387678 2528370 2105178 531652 -1534987 -2514640
55169 -2514640 -1963575 -1153091 -1119891 -1240460 -481865 809796 1327053 569351 -649183
55160 -649183 -1328230 -1301059 -1086012 -1082188 -1072447 -558865 406302 1020748 680742 -172157
55150a72157n00178n0111j44366l13676K1865M71937M64265K84291L49517K43048
55140F54435m35984j023711p98498k98882l22514l67386L94176J277137J013585
55131I2358L7726j21794N11379M16601o77026j259941o50332m5378k81046m88329
55121b465782Q6636O70773M73567J01993L01480N83546K92001r2751J05040M79143
55111E35646L38221m7030l8677K49959L42994K23529K0858l57120o51689k56416
55101C60275N88847P43737L405l56974K38067M82888n42887j474693p31454Q13476
55091A24687J189943L65833j57558n0612k58653q02591o72734J35041M87829J21957
55081D83142o1858J63786L5441m77006m41535K08069L85228j69740l59263K71141
$$ plain form
55150 -172157 -672335 -722446 -866812 -1180488 -1158623 -686686 -222421 61870 411387 654435
55140 654435 218451 -805260 -1603758 -1902640 -2225154 -2592540 -2198364 -921227 92358
55131 92358 130084 8290 519669 936270 259244 -1000697 -1651029 -1696407 -1977453 -2465782
55121 -2465782 -2379146 -1708373 -1234806 -1132813 -831333 -247787 44214 -48537 56503 535646
55111 535646 873867 826837 788160 1038119 1381113 1604642 1625500 1268380 616691 360275
55101 360275 949122 1692859 1696264 1339290 1577357 2060245 1517358 42665 -688789 124687
55091 124687 1314630 1680463 1522905 1472293 1213640 411049 -261685 -126644 361185 483142
55081 483142 421284 585070 620511 143505 -298030 -89961 295267 125527 -233736 37405
55071C7405P09395L32307q1755k78j44032q47764j012470L0210J000950N11654
55061E35622o65332p62591L00499J006268O07243q7181k12777J05313L35333K52379
55051A414776p9359m15891l98830K6589L86290K80125n0243j89431k31763m71557
55041B70706p47277o77261k97434O4147L03543M56715L95159R4304j02225K3815
55031b15808J42198n1826k24872M2429M52607M15178L195j98343q966K34230L21692
55020I11714K98488Q8516l71642p24146n40589j9810K61623K36762L56572P03397
55010A200885P51785J97982m87103o25715j99378P8130m43987j459258j736781
55001b723440m63686J433588K022972P52726p06417o51472M41827R10844M22519
$$ plain form
55071 37405 746800 1079107 997352 997074 853042 5278 -1007192 -976982 23968 535622
55061 535622 -129710 -892301 -591802 414466 1021709 934528 721751 827064 1162397 1414776
55051 1414776 1335417 919526 520696 547285 933575 1213700 1163457 974026 742263 270706
55041 270706 -476571 -1153832 -1451266 -1387119 -1083576 -626861 -231702 -137398 -239623 -215808
55031 -215808 -73610 -125436 -350308 -307879 144728 559906 563101 364758 355792 590022 911714
55020 911714 1210202 1298718 927076 202930 -337659 -357469 -95846 140916 497488 1200885
55010 1200885 1952670 2150652 1663549 1037834 838456 916586 472599 -986659 -2723440
55001 -2723440 -3187126 -1753538 269434 1022160 315743 -335729 106098 1016942 1439461
54992A439461R2961L71209L87446l35522r59185p48894k72917l60842p15773m94837
54982a596893K50389O26053J98353m64687n60996N0754P34047O88113j83809r78283
54972a236959p09466M01045J059898N40303l95325o08494p0931L53877K28349
54963d37703o4132j09079L396J3686r9777k01617k14726j39115q472J22034K18755
54952i16750K74090K48510J36352J00581L00888N21035K97893l86110q66989n64027
54942h54527K55388Q05427O98793K04952k46787m35392k93329J05429M37358L40902
54932A018214j16981m11425j74154K98795L67481j32220o07459m11711K95611
54923A26151O93640L34872l31163o57498o09004m77304j86043M58908J033294
$$ plain form
54992 1439461 1532422 1903631 2291077 1955555 996370 247476 -25441 -386283 -1102056 -1596893
54982 -1596893 -1346504 -720451 -522098 -986785 -1547781 -1497027 -762980 -74867 -258676 -1236959
54972 -1236959 -1946425 -1545380 -485482 54821 -340504 -948998 -1019929 -666052 -437703
54963 -437703 -501835 -610914 -607518 -593832 -693609 -895226 -1109952 -1249067 -1257539 -1135505 -916750
54952 -916750 -642660 -394150 -257798 -157217 143671 664706 962599 576489 -290500 -854527
54942 -854527 -599139 206288 905081 1110033 863246 427854 134525 239954 677312 1018214
54932 1018214 901233 489808 315654 614449 981930 849710 242251 -169460 126151
54923 126151 819791 1154663 823500 166002 -443002 -920306 -1106349 -647441 385853
54914C85853Q18634p5775o82625m77197O175J42381P4048J76446L31230K77150
54904I76320J42174Q1212j11758m79328n17968M5462N97787M73416k2041k06499
54894I78777j81846m62630q07171n19424K23453M87962J05298l6234N06015R71688
54884A265888O18977j64309n71417n31821m99137n35794k80208L27600P82957
54875D12736N46443l01598r71040o95127K78448P67060J37904p10523n68425K80361
54865h23761N32205m8060l44237J37761M55516k0832m01624K07709J075900R34429
54855A705006n1922o57043m70103j69386j38886K3991N58885J024028R19049K39115
54845B982734o41258j191566r68674j15937N69626N26866J11172o4968l6017j36745
$$ plain form
54914 385853 1204487 1128712 446087 -31110 -24935 117446 191494 367940 699170 976320
54904 976320 1118494 1199706 1087948 608620 90652 136114 733901 1207317 1185276 978777
54894 978777 796931 334301 -472870 -992294 -768841 -280879 -175581 -211815 294200 1265888
54884 1265888 1884865 1720556 1149139 617318 118181 -417613 -697821 -370221 412736
54875 412736 959179 657581 -313459 -1008586 -730138 36922 174826 -535697 -1104122 -823761
54865 -823761 -291556 -339616 -683853 -546092 -90576 -111408 -513032 -305323 770577 1705006
54855 1705006 1653084 996041 525938 356552 217666 241657 800542 1824570 2743619 2982734
54845 2982734 2341476 1149910 181236 65299 634925 1161791 1272963 1207995 1171978 1035233
54835A035233k43145j14161m0998l06220m29417Q0068O20223K70610o18238q51726
54825e97771k75775P9736k11325l82091P2859O16978P37441O45092M94417K8181
54815A207742n39602m35105L06695N21492l23479j128204p73966K35101P14356
54806b14970N39573L68631K87518r4985n69452m48321K99373Q59409N69060l78473
54796A217363j172290j078431j37515P22319P10871K79648M11896Q63616L98149
54787B215626r55904j508594n53227K98408k84505j055286l07741J084893J029565
54778c6765k86240p75243N6526N83217R9193j79495L22778M19980m53702r52476
54768a202227j81894N78713N0498p77149l23870Q75334J063822J04785m65558
$$ plain form
54835 1035233 792088 677927 636929 330709 -98708 -18640 601583 872193 253955 -597771
54825 -597771 -873546 -793810 -1005135 -1387226 -1314367 -697389 40052 685144 1179561 1207742
54815 1207742 668140 233035 539730 1061222 737743 -390461 -1164427 -929326 -214970
54806 -214970 324603 693234 980752 885767 316315 -132006 167367 1026776 1595836 1217363
54796 1217363 45073 -1033358 -1170873 -448554 262317 541965 953861 1817477 2215626
54787 2215626 1259722 -248872 -802099 -503691 -788196 -1843482 -2151223 -1066330 -36765
54778 -36765 -323005 -1098248 -1041722 -458505 -359312 -538807 -216029 203951 -249751 -1202227
54768 -1202227 -1384121 -805408 -754910 -1532059 -1855929 -980595 83227 188012 -277546
$$ [...]
##END NTUPLES=NMR SPECTRUM
##END=
