##TITLE=31Pdec_LR-664-RM3M
 THF, 104 sc
 2.4.2019
##JCAMPDX= 6.0         $$ Bruker NMR JCAMP-DX V2.0
##DATA TYPE= NMR SPECTRUM
##DATA CLASS= NTUPLES
##ORIGIN= UXNMR, Bruker Analytische Messtechnik GmbH
##OWNER= root
$$ XWIN-NMR		Version 3.5
$$ Tue Apr  2 15:34:07 2019 Russian Standard Time (UT+4h)  she@DPX200
##.OBSERVE FREQUENCY= 81.013821
##.OBSERVE NUCLEUS= ^31P
##.ACQUISITION MODE= SIMULTANEOUS
##.ACQUISITION SCHEME= undefined
##.AVERAGES= 104
##.DIGITISER RES= 17
##SPECTROMETER/DATA SYSTEM= spect
##.PULSE SEQUENCE= zgpg30
##.SOLVENT NAME= CDCl3
##.SHIFT REFERENCE= (INTERNAL, CDCl3, 0, 182.463)
##AUDIT TRAIL= $$ (NUMBER, WHEN, WHO, WHERE, WHAT)
$$ ##TITLE= Audit trail, XWIN-NMR		Version 3.5
$$ ##JCAMPDX= 5.01
$$ ##ORIGIN= Bruker BioSpin GmbH
$$ ##OWNER= she
$$ F:/spectra/data/she/nmr/P31/1/pdata/1/auditp.txt
$$ ##AUDIT TRAIL=  $$ (NUMBER, WHEN, WHO, WHERE, WHAT)
(   1,<2019-04-02 15:33:10.43 +0400>,<she>,<DPX200>,
      <continue with go, POWCHK disabled, PULCHK disabled
       configuration hash MD5:
       00 E9 B6 7A A2 85 ED C7 34 08 36 98 17 FE 4E 26
       data hash MD5: 32K
       77 32 82 61 F4 3F E8 93 98 F6 31 95 63 F1 30 05>)
(   2,<2019-04-02 15:33:40.46 +0400>,<she>,<DPX200>,
      <Start of raw data processing
       efp BC_mod = 2 LB = 1 FT_mod = 6 PKNL = 1 PHC0 = -1797.404 PHC1 = 40.39897 SI = 64K 
       data hash MD5: 64K
       34 8D A8 08 75 B1 DC 20 65 AC BC 8C BD 24 A8 5C>)
$$ ##END=
$$ 
$$ hash MD5
$$ 04 3E A9 9F B8 80 EA B5 A3 F6 A3 43 66 72 DA 90
##$RELAX= 
##$RELAX= 
##$RELAX= 
##$RELAX= 
##$RELAX= 
##$RELAX= 
##$RELAX= 
##$RELAX= 
$$ Bruker specific parameters
$$ --------------------------
##$DU= <F:/spectra>
##$EXPNO= 1
##$NAME= <P31>
##$PROCNO= 1
##$TYPE= <nmr>
##$USER= <she>
##$AMP= (0..31)
100 100 100 100 100 100 100 100 100 100 100 100 100 100 100 100 100 100 
100 100 100 100 100 100 100 100 100 100 100 100 100 100 
##$AQSEQ= 0
##$AQ_mod= 1
##$AUNM= <au_zg>
##$AUTOPOS= <>
##$BF1= 81.014009
##$BF2= 200.13
##$BF3= 200.13
##$BF4= 200.13
##$BF5= 200.13
##$BF6= 200.13
##$BF7= 200.13
##$BF8= 200.13
##$BYTORDA= 1
##$CFDGTYP= 0
##$CFRGTYP= 5
##$CHEMSTR= <none>
##$CNST= (0..31)
1 1 145 1 1 1 1 1 1 1 1 1 1 1 1 1 1 1 1 1 1 1 1 1 1 1 1 1 1 1 1 1 
##$CPDPRG= <waltz16>
##$CPDPRG1= <>
##$CPDPRG2= <waltz16>
##$CPDPRG3= <>
##$CPDPRG4= <mlev>
##$CPDPRG5= <mlev>
##$CPDPRG6= <mlev>
##$CPDPRG7= <mlev>
##$CPDPRG8= <mlev>
##$CPDPRGB= <>
##$CPDPRGT= <>
##$D= (0..31)
0 1 0 0 0 0 0 0 0 0 0 0.03 2e-05 3e-06 0 0 0 0 0 0 0 0 0 0 0 0 0 0 0 0 
0 0 
##$DATE= 1554204628
##$DBL= (0..7)
120 120 120 11 120 120 24 19 
##$DBP= (0..7)
150 150 150 150 150 150 150 150 
##$DBP07= 0
##$DBPNAM0= <>
##$DBPNAM1= <>
##$DBPNAM2= <>
##$DBPNAM3= <>
##$DBPNAM4= <>
##$DBPNAM5= <>
##$DBPNAM6= <>
##$DBPNAM7= <>
##$DBPOAL= (0..7)
0.5 0.5 0.5 0.5 0.5 0.5 0.5 0.5 
##$DBPOFFS= (0..7)
0 0 0 0 0 0 0 0 
##$DE= 6
##$DECBNUC= <off>
##$DECIM= 4
##$DECNUC= <off>
##$DECSTAT= 4
##$DIGMOD= 1
##$DIGTYP= 9
##$DL= (0..7)
0 0 52 120 120 21 21 25 
##$DP= (0..7)
$$ [...]
##$SUBNAM2= <"">
##$SUBNAM3= <"">
##$SUBNAM4= <"">
##$SUBNAM5= <"">
##$SUBNAM6= <"">
##$SUBNAM7= <"">
##$SUBNAM8= <"">
##$SUBNAM9= <"">
##$SW= 369.568048894756
##$SWIBOX= (0..15)
0 1 3 0 0 0 0 0 0 0 0 0 0 0 0 0 
##$SW_h= 29940.119760479
##$TD= 32768
##$TD0= 1
##$TE= 0
##$TE2= 300
##$TE3= 300
##$TEG= 300
##$TL= (0..7)
0 120 53 12 22 120 120 120 
##$TP= (0..7)
150 150 150 150 150 150 150 150 
##$TP07= 0
##$TPNAME0= <>
##$TPNAME1= <>
##$TPNAME2= <>
##$TPNAME3= <>
##$TPNAME4= <>
##$TPNAME5= <>
##$TPNAME6= <>
##$TPNAME7= <>
##$TPOAL= (0..7)
0.5 0.5 0.5 0.5 0.5 0.5 0.5 0.5 
##$TPOFFS= (0..7)
0 0 0 0 0 0 0 0 
##$TUNHIN= 0
##$TUNHOUT= 0
##$TUNXOUT= 0
##$USERA1= <user>
##$USERA2= <user>
##$USERA3= <user>
##$USERA4= <user>
##$USERA5= <user>
##$V9= 5
##$VALIST= <valist>
##$VCLIST= <CCCCCCCCCCCCCCC>
##$VD= 0
##$VDLIST= <DDDDDDDDDDDDDDD>
##$VPLIST= <PPPPPPPPPPPPPPP>
##$VTLIST= <TTTTTTTTTTTTTTT>
##$WBST= 1024
##$WBSW= 4
##$XGAIN= (0..3)
0 0 0 0 
##$XL= 0
##$YL= 0
##$YMAX_a= 33745
##$YMIN_a= -34479
##$ZGOPTNS= <>
##$ZL1= 120
##$ZL2= 120
##$ZL3= 120
##$ZL4= 120
##$ABSF1= 0
##$ABSF2= 0
##$ABSG= 0
##$ABSL= 0
##$ALPHA= 0
##$AQORDER= 0
##$ASSFAC= 0
##$ASSFACI= 0
##$ASSFACX= 0
##$ASSWID= 0
##$AUNMP= <proc_1d>
##$AZFE= 0.1
##$AZFW= 0.5
##$BCFW= 0
##$BC_mod= 2
##$BYTORDP= 0
##$COROFFS= 0
##$CY= -3
##$DATMOD= 1
##$DC= 0
##$DFILT= <>
##$DTYPP= 0
##$F1P= 0
##$F2P= 0
##$FCOR= 1
##$FTSIZE= 65536
##$FT_mod= 6
##$GAMMA= 0
##$GB= 0
##$INTBC= 1
##$INTSCL= 5.30512e-09
##$ISEN= 30
##$LB= 1
##$LEV0= 0
##$LPBIN= 0
##$MAXI= 10000
##$MC2= 0
##$MEAN= 0
##$ME_mod= 0
##$MI= 50
##$NCOEF= 0
##$NC_proc= -8
##$NLEV= 6
##$NOISF1= 182.463
##$NOISF2= 159.3651
##$NSP= 0
##$NTH_PI= 0
##$NZP= 0
##$OFFSET= 182.463
##$PC= 4
##$PHC0= -1797.404
##$PHC1= 40.39897
##$PH_mod= 1
##$PKNL= yes
##$PPARMOD= 0
##$PSCAL= 0
##$PSIGN= 0
##$REVERSE= no
##$SF= 81.0140089999434
##$SI= 65536
##$SIGF1= 159.3651
##$SIGF2= -187.1042
##$SINO= 113.3802
##$SIOLD= 16384
##$SREGLST= <1H.CDCl3>
##$SSB= 0
##$STSI= 65536
##$STSR= 0
##$SW_p= 29940.119760479
##$SYMM= 0
##$S_DEV= 0
##$TDeff= 32768
##$TDoff= 0
##$TI= <>
##$TILT= no
##$TM1= 0
##$TM2= 0
##$TOPLEV= 0
##$USERP1= <user>
##$USERP2= <user>
##$USERP3= <user>
##$USERP4= <user>
##$USERP5= <user>
##$WDW= 1
##$XDIM= 65536
##$YMAX_p= 138249658
##$YMIN_p= -406764444
$$ End of Bruker specific parameters
$$ ---------------------------------
##NTUPLES= NMR SPECTRUM
##VAR_NAME=  FREQUENCY,     SPECTRUM/REAL,   SPECTRUM/IMAG
##SYMBOL=    X,             R,               I
##VAR_TYPE=  INDEPENDENT,   DEPENDENT,       DEPENDENT
##VAR_FORM=  AFFN,          ASDF,            ASDF
##VAR_DIM=   65536,         65536,           65536
##UNITS=     HZ,            ARBITRARY UNITS, ARBITRARY UNITS
##FACTOR=    0.456856943014862, 1,           1
##FIRST=     14782.0589164792, 0,            0
##LAST=      -15158.0608439998, 0,           0
##MIN=       -15158.0608439998, -406764444,  0
##MAX=       14782.0589164792, 138249658,    0
$$ Real data points
##PAGE= N=1
##DATA TABLE= (X++(R..R)), XYDATA
$$ [...]
##PAGE= N=2
##DATA TABLE= (X++(I..I)), XYDATA
4823b1244936K883864K963880P033808M120357m147250o052002l77331K689568
4815a2130042R84259L985269J3715739J7162646M842842j3889358k1848021j3628417
4807b0805083J408262J0433253P398004l234634j0066564o005051L423561P672839
4799i775413N494093M198606O267491O734700L729312M83559l736104j2039691
4791A356553j7842265r610057P992055J4276573J850586j0735019o949490L221638
4783a6439426K048958o919047p740737M85795N944088O769792R739208J0921609
4775D810240Q04352j2695915j0866215L634945O524560r017626j8426582m020713
4767c9252954J6213596J7086420M264428K17711N745329K910251r531589j1877827
$$ y = [-21244936, -18361072, -15397192, -8363384, -4243027, -8390277, -14442279, -14819610, -12130042, -11145783, -7160514, 6555225, 23717871, 28560713, 14671355, -7176666, -20805083, -19396821, -8963568, -1565564, -4800198, -14866762, -20871813, -17448252, -9775413, -4281320, -82714, 6184777, 12919477, 16648789, 17132348, 13396244, 1356553, -16485712, -26095769, -18103714, -3827141, -1976555, -12711574, -19661064, -16439426, -14390468, -21309515, -29050252, -28564457, -22620369, -15850577, -6111369, 4810240, 5614592, -7081323, -17947538, -14312593, -7788033, -16805659, -35232241, -39252954, -23039358, -5952938, -1688510, -1470799, 4274530, 7184781, -2346808, -14224635]
4759a4224635K914555J6483318J4094099N405970M355814N796947j939586j3480726
4751A9405756j3720810k850715L533140j548890q091899p286324l946531m850535
4743a9356808o282274j926755M920684O825012M670228M431362M589490j737946
4735c867007j1767491j2227113J136161J3037539P121929j0194861j5594624R70713
4727c1384754K2020657K3789263N393461j1259075r130675M898885J2139307O736635
4719B3203704J67224K347813P436384L391115r925515j9693905j6106961l164527
4711a2344668P299892P645819n73770r352920j0506317k872906N408401N207343
4703a0089126k330866p132275l705660K241997L098894n00645k875934j710370
$$ y = [-14224635, -11310080, 5173238, 19267337, 24673307, 29029121, 34826068, 32886482, 19405756, 5684946, 2834231, 6367371, 4818481, -3273418, -10559742, -14506273, -19356808, -25639082, -27565837, -22645153, -15820141, -11149913, -6718551, -2129061, -3867007, -15634498, -27861611, -26725450, -13687911, -6565982, -16760843, -32355467, -31384754, -9364097, 14425166, 19818627, 8559552, -571123, 4327762, 16467069, 23203704, 23370928, 25718741, 33155125, 36546240, 26620725, 6926820, -9180141, -12344668, -5044776, 2601043, 2027273, -7325647, -17831964, -20704870, -15296469, -10089126, -12419992, -19552267, -23257927, -21015930, -17917036, -18417681, -21293615, -23003985]
4695b3003985J711742O696801J2172321J4515416J1464820N622391k26019p221095
4687B1732392j4438047j4134316j790132J2749801J5001259N481655j978918j921076
4679B0702618l510137j0968754j2750584p43880J1812182P015239r742104j5890402
4671a4075822m578059O387574K891872n090167j897869Q361311J0094422K364327
4663D457589q60741M768168O722378k707909j2744047j0848582j161805M753848
4655g621101O246755R685702J2920594Q510069o01873l918974j659184m692560
4647A8869428j3955305j6130614n862646L377488L78848n691206j123684R680235
4639a0457456J2789637P838580N394989N859029n73213j2825900j5691424k502695
$$ y = [-23003985, -21292243, -14595442, -2423121, 12092295, 23557115, 29179506, 28953487, 21732392, 7294345, -6839971, -8630103, 4119698, 19120957, 24602612, 22623694, 20702618, 17192481, 6223727, -6526857, -7270737, 4541445, 11556684, 1814580, -14075822, -18653881, -12266307, -9374435, -14464602, -16362471, -8001160, 2093262, 4457589, 3596848, 8365016, 15087394, 12379485, -364562, -11213144, -12374949, -7621101, -1374346, 8311356, 21231950, 29742019, 29140146, 25221172, 23561988, 18869428, 4914123, -11216491, -17079137, -13701649, -13322801, -19014007, -20137691, -10457456, 2332181, 10170761, 15565750, 21424779, 20851566, 8025666, -7665758, -10168453]
4631a0168453J3394098J6708436Q583947k003l485508k612936J869560P638988
4623C1926129Q118783l78907j1692579j6456477j3462709q959164o745791m594457
4615b2245172m3236M773327N306660J80064n832999n401957K716944R858785O346582
4606d341002o089210j5621113j4390933o012680J558135M546150L412305R86608
4598c5951740K615941J1227585J9686481J6051733N11197j1394281q450811J545870
4590d158025M663840O64774n54631L209279M628027R34955k083589j074686J44746
4581F374690j170358k803899m436974r492416j6280664j5765836m105533R173494
4573c8507496J2589367P711189N070198P741472P722862m23539j0146258j1427532
$$ y = [-10168453, 3225645, 19934081, 28518028, 28516025, 25030517, 22417581, 24287141, 31926129, 40044912, 39666005, 27973426, 11516949, -1945760, -10904924, -17650715, -22245172, -22288408, -17515081, -12208421, -12028357, -17861356, -23263313, -20546369, -10687584, -4341002, -10430212, -26051325, -40442258, -46454938, -44896803, -40350653, -36938348, -35951740, -33335799, -22108214, -2421733, 13630000, 14141197, 2746916, -5703895, -4158025, 505815, 1170589, 615958, 3825237, 8453264, 9388219, 7304630, 6229944, 6374690, 5204332, 2400433, -2036541, -11528957, -27809621, -43575457, -47680990, -38507496, -25918129, -18206940, -13136742, -5395270, 2327592, 1904053, -8242205, -19669737]
4565a9669737l922504L941320O715235O670362O754088N329720R43621l085493
4557C676612l697472l475745n154302m889639R33288N650694K87816r347399p302402
4548b3318549P694198J6875789Q530644m045073l958542K792151n89794j2070128
4540h089304j3949210k425655P201335O321385L479710M235398R84353q073166
4532a0315154r245655L720795J3799633N189332r650579q080039O588172J0256546
4524B263051l797796j5765968j1377115q99004K307102K727395Q806046J3039436
4516b696853L284220j3888648j8659590n563751Q788450Q307494l023104r207085
4508c2658867k981783P680102J1632730P983517N119048P556255Q490356Q3181
$$ y = [-19669737, -23592241, -19650921, -12935686, -6265324, 488764, 5818484, 6762105, 3676612, -20860, -3496605, -8650907, -13540546, -12607258, -6956564, -6668748, -16016147, -23318549, -15624351, 1251438, 9782082, 5737009, 1778467, 4570618, 3980824, -8089304, -22038514, -24464169, -17262834, -10941449, -7461739, -3226341, -2241988, -10315154, -19560809, -15840014, -2040381, 3148951, -6501628, -14581667, -7993495, 2263051, -1534745, -17300713, -28677828, -29576832, -27269730, -24542335, -15736289, -2696853, 587367, -13301281, -31960871, -37524622, -28736172, -20428678, -23451782, -32658867, -35640650, -27960548, -16327818, -8344301, -3225253, 4331002, 12821358, 12904539]
4500A2904539j1810446j2392243Q65961J1981817P619175m636964q570210k533525
4492f571896J850284k26456j713875K013319O850297R320147J0484410Q745209
4484C0751439O14618r003943r941406l516213k451745r198362r813325K222989
4476a0335948J2035962N866921o644728q703544l165032m326151j1325122j0413159
4468c7010801L34411Q824956J0135564J0657147J1266790N980437j295822O92650
4460I585332P609033R04062k0284280l0206394j2149615J5136912K2242499O708176
4452d54275r857906j1843922j593197J1058747J7378440J3053835L254908j230700
4444A9765930L99389k647529j1707954j1296632M854016J6809179N769132j5504793
$$ y = [12904539, 1094093, -11298150, -10432189, 1549628, 9168803, 4531839, -4038371, -6571896, -4721612, -4948068, -6661943, -4648624, 2201673, 11521820, 22006230, 30751439, 31366057, 22362114, 12420708, 8904495, 6452750, -2745612, -12558937, -10335948, 1700014, 7566935, 922207, -7781337, -10946369, -15272520, -26597642, -37010801, -36676390, -27851434, -17715870, -7058723, 4208067, 10188504, 8892682, 9585332, 17194365, 18098427, -2185853, -32392247, -44541862, -29404950, -7162451, -454275, -10312181, -22156103, -23749300, -12690553, 4687887, 17741722, 20996630, 19765930, 20165319, 17517790, 5809836, -5486796, -632780, 16176399, 21945531, 6440738]
4436F440738k1348194j0942901k800505m40621P727683J8009183J2138908q080494
4428G03797j6496474j892542J4924096J5057069P683173O940234N581909p761744
4420B4739518k2349975j9365372j857471J0393793R481272M102124O40693k118095
4412C666487j818141O201105J5755460J3555244r71794j2602044j1026255l659468
4404I100594k766838q753371j2619382r297885k082630L810936O716615P085773
4396h806188M197147k357921q118672n443544O287069J6105289J4045741N587359
4388B1496280L944166R119658P382382n968976j7586301j6508275r895152q192065
4380a6208283p221628J159086J0633529R199842J95310k587081K127441K070947
$$ y = [6440738, -14907456, -25850357, -28650862, -29091483, -21363800, -3354617, 8784291, 703797, -15792677, -17685219, -2761123, 12295946, 19979119, 26919353, 32501262, 24739518, 2389543, -16975829, -18833300, -8439507, 1041765, 5143889, 5784582, 3666487, 1848346, 8049451, 23804911, 37360155, 36388361, 23786317, 12760062, 9100594, 6333756, -2419615, -15038997, -24336882, -26419512, -22608576, -15891961, -8806188, -4609041, -6966962, -15085634, -20529178, -14242109, 1863180, 15908921, 21496280, 25440446, 34560104, 41942486, 35973510, 18387209, 1878934, -8016218, -16208283, -23429911, -22270825, -11637296, -2437454, -2242144, -4829225, -2701784, -630837]
4372f30837o508270j2129691o741001K836210O947436N290836K377318N61977
4364g996022J723757O776793R965108L163677j0259946j5931033p905628K337022
4356a8126272K881061k233719k218942L003426N339612L563917M337655R231303
4348E778041J0780966L729260o508604r811007k487364R412811J5991699J2019610
4340C8905412J305702o830576o434959m75641K892506p65601p655098j0346673
4332A0595072o749596l102892n654698j0406919o939465N277864J1819510J835296
4324c325828j3961519j4957688J407380J5996727J4739366O276729N693594J1284649
4316B3153410R266072l445374j3797955j0879271q4705N234863Q47472n044095
$$ y = [-630837, -7139107, -19268798, -26009799, -23173589, -16226153, -10935317, -8557999, -7996022, -6272265, 504528, 10469636, 13633313, 3373367, -12557666, -20463294, -18126272, -15245211, -17478930, -19697872, -16694446, -11354834, -7790917, -3453262, 5778041, 16559007, 20288267, 13779663, 3968656, 1481292, 10894103, 26885802, 38905412, 40211114, 33380538, 26945579, 26469938, 29362444, 28596843, 20941745, 10595072, 3845476, 742584, -4912114, -15319033, -22258498, -16980634, -5161124, -3325828, -17287347, -32245035, -30837655, -14840928, -101562, 6175167, 11868761, 23153410, 32419482, 28974108, 15176153, 4296882, 4212177, 9447040, 10294512, 5250417]
4308E250417m345607m5603j361412r378761j3348995n109564P465828R260542
4300a1613155j067142q292337j503001J1049879J3691144L159856j0397083j7436208
4292b2408047j6110301q197086L623852J4165832J7831662J3901508O331587j311990
4284G827017p144064q594813l903112L802270Q266052O719707J756772k921711
4276E808118n146628l538727J395660N511088M767198Q36306j455980k029300
4268F147735n119192j0185715j0079807j427479R018466J2612466Q583345J537841
4260A1087660n108127p643530n55864J4119484K0532395M849888k2729673l5057547
4252b0505314k0946523J547549J1217793R968676J1573721J5768830J1173812
$$ y = [5250417, 904810, 859207, -502205, -9880966, -23229961, -28339525, -20873697, -11613155, -12680297, -20972634, -22475635, -11425756, 2265388, 5425244, -4971839, -22408047, -38518348, -46715434, -43091582, -28925750, -11094088, 2807420, 9139007, 7827017, 682953, -7911860, -11814972, -8012702, 253350, 6973057, 8729829, 5808118, 661490, -2877237, -1481577, 4029511, 8796709, 9633015, 8177035, 6147735, 1028543, -9157172, -19236979, -20664458, -11645992, 966474, 9549819, 11087660, 5979533, -1663997, -2219861, 11899623, 32432018, 37281906, 14552233, -20505314, -41451837, -39904288, -28686495, -18717819, -7144098, 8624732, 19798544]
4245A9798544j180168o811101j480070K215322k843232o198968J000374R401950
4237A3902651O168792n060552j2219987j3662746j4636141j2449870j529207J0945715
4229b8541345J1370140Q61743n662387k273070J682720N60957J679448R505764
4221a0816030J4631508P555556o320521j3981759j0269040M3242R104246J0287249
4213B34451K704675m714702j482910R042537J2216422L469685n039292m613564
4205A1817302k760307o539907p688926J544530R901248K569180j2558109j4030217
4197a7745206M37474J0300782L483210o961380m519643O843719J0746369J827241
4189D412566r220497j0811464k804251O481432J0872494J1398643J1205275Q717713
$$ y = [19798544, 18618376, 11807275, 10327205, 12542527, 9699295, 3500327, 4500701, 13902651, 20071443, 15010891, 2790904, -10871842, -25507983, -37957853, -39487060, -28541345, -17171205, -16309462, -21971849, -24244919, -22562199, -22001242, -20321794, -10816030, 3815478, 11371034, 5050513, -8931246, -19200286, -19157044, -10052798, 234451, 2939126, -1775576, -3258486, 5784051, 18000473, 21470158, 16430866, 11817302, 9056995, 2517088, -5171838, -3627308, 6273940, 8843120, -3714989, -17745206, -17307732, -7006950, -3523740, -10485120, -15004763, -8161044, 2585325, 4412566, -4807931, -15619395, -18423646, -11942214, -1069720, 10328923, 21534198, 30251911]
4181C0251911N92906r253448j1394311m712491j16623m701083j0690566q392744
4173a8416449j725099K43175k95373M120128R323282M995548n229487o574342
4165a3558617K725610P278952r97554j0283880p922770J757351P511626P573408
4157e915874O363303L990386j232002o487192q888125j0304593j1103252o038191
4149c9615540O266813J6655830J6562837R879092N260013K169928n641297j6374906
4141d837230k0144907j2384061L86221Q840013R801325O850551N617179Q096019
4133B225110R816790M679902o178683j3958478j2176578l076803O704333J1521262
4125d43145P615867l623703j2279731r129877J8182N28477p914713q968048L536732
$$ y = [30251911, 30844817, 21591369, 10197058, 5484567, 5367944, 666861, -10023705, -18416449, -20141548, -19898373, -20193746, -16073618, -6750336, -1754788, -6984275, -13558617, -10833007, -3554055, -4551609, -14835489, -22758259, -21000908, -13489282, -5915874, 447429, 4437815, 3205813, -3281379, -12169504, -22474097, -33577349, -39615540, -33348727, -16692897, -130060, 9749032, 15009045, 17178973, 11537676, -4837230, -24982137, -37366198, -36979977, -28139964, -18338639, -11488088, -5870909, 2225110, 12041900, 16721802, 10543119, -3415359, -15591937, -18668740, -11964407, -443145, 7172722, 3549019, -8730712, -17860589, -17842407, -17313930, -25228643, -34196691, -30659959]
4116c0659959J3167962O460519n355330n818760K16239q92754m807756J432864
4108b6256975J1654581Q551178m137981n180053P382472J1475079r21031r257439
4100f690169K45052J1133663N631246n749331m538624L968379L047767m573295
4092B474688l152227O671458R354718J862041k986338J6589K321913J02641m19848
4083A6245635J377021k101825r756962r678351Q56702R426649Q174203L926695
4075A8469767K924177J701542j96220M029416J1384195O786404j0287804j6937431
4067A7874046j576569J2107019n69620k3297989k0945175N620557K0353337O865708
4059A6431314j1093265j0886228j211669K428286M365555J1625445J3269215l1429
$$ y = [-30659959, -17491997, -11031478, -16386808, -22205568, -21989329, -22882083, -27689839, -26256975, -14602394, -6051216, -10189197, -15369250, -7986778, 3488301, 2567270, -6690169, -6445117, 4688546, 10319792, 4570461, 31837, 4000216, 7047983, 2474688, -677539, 5993919, 15348637, 17210678, 14224340, 14240929, 16562842, 16665483, 16245635, 17622656, 15520831, 5763869, -3914482, -3057780, 6368869, 14543072, 18469767, 21393944, 23095486, 22899266, 26928682, 38312877, 45099281, 34811477, 17874046, 16297477, 28404496, 27834876, 4536887, -16408288, -10787731, 9565606, 16431314, 5338049, -5548179, -6759848, -4331562, 33993, 11659438, 24928653, 24897224]
4051B4897224j3319799r044924J759458l549323j9897965k0662853o12180J5580752
4043b4849610J1496125m7357k504895N15316p76167k932427J045802N686960J966945
4034a0399308o446210r539147p034733n415180l925856L545719J4835729J9569080
4026d809906J3461581L578375k098593l485611m882556p495761q030562l462840
4018a7225873L502063N072301k407168j0916701q625463L853277J2762227R653085
4010d332252K101359Q01620M335875M594120P32659j417679L86317L691652P238444
4001A8132115R965460P181581l856825j6218291j8798590r075523M851325J3005630
3993E186882J0035400k573252j4974490j4823643j763189R285707P038335o40287
$$ y = [24897224, 11577425, 2532501, 4291959, 742636, -19155329, -39818182, -40430362, -24849610, -13353485, -13400842, -15905737, -15390421, -16166588, -19099015, -18053213, -12366253, -10399308, -16845518, -26384665, -33419398, -38834578, -42760434, -39214715, -24378986, -4809906, 8651675, 12230050, 10131457, 6645846, 1763290, -5732471, -13763033, -17225873, -13723810, -8651509, -11058677, -21975378, -30600841, -26747564, -13985337, -4332252, -2230893, -1429273, 2906602, 7500722, 8233381, 6815702, 7202019, 10893671, 18132115, 28097575, 35279156, 31422331, 15204040, -3594550, -12670073, -7818748, 5186882, 15222282, 12649030, -2325460, -17149103, -18912292, -9626585, -2588250, -3228537]
3985c228537j96298N954342N238642k745554o518540l733082l991780q629352
3977a7850159n811205P885583J7395521J0474901l832514r074510l652561K286225
3969b178719M268590N336813N204739N3274p553339q795571q33648P678940O462016
3960I643095l897413j1883812p830622M140543J0053053L953120l061985J923794
3952C039773J3702671J4977155J481265j1595933j1537358m110360j044555k341559
3944B571099o84481M060004N476360K146165n96171O78174L538119L806777l75106
3935B0620940p204348j1459761q790267j647757K802435K200111J502702M350736
3927B374791P754817P570623L486184k994849r097737q921326K19991R010519
$$ y = [-3228537, -3424835, 2529507, 7768149, 5022595, -1495945, -5229027, -9220807, -17850159, -23661364, -15775781, 1619740, 12094641, 8262127, -812383, -4464944, -2178719, 2089871, 7426684, 12631423, 12684697, 5131358, -3664213, -4497861, 3181079, 9643095, 5745682, -6138130, -13968752, -9828209, 224844, 4177964, 1115979, 3039773, 16742444, 31719599, 33200864, 21604931, 10067573, 5957213, 4912658, 2571099, 1886618, 5946622, 11422982, 13569147, 12972976, 13651150, 17189269, 20996046, 20620940, 13416592, 1956831, -6833436, -8481193, -5678758, -3478647, -1975945, 2374791, 10129608, 17700231, 21186415, 18191566, 9093829, 172503, 392494, 9403013]
3919I403013M834863q895259j5148336q261611j275837k624672k855741N624776
3911a9198804J3164487J0846762P122004R729969P187622j0707448k7938932k2884807
3903c2679147l799066L554923k861451k187927R471754J2122802m39927p419810
3895b4237849K980648J2306362L251484j0828097p967974P944412J5879823R554706
3887H883515Q82804j468985K98869K745382M136327R21725o886245j0210792j695716
3878b393116J1093119J3386880J798691j3284850k0967030j7631812n098534J0309401
3870b2787251J8863625J5024997L152677q145927j3727688j1175519M7988J2883455
3862e863643J4225282O82671j3520093j2849764J097944J5131567K1025384J7480082
$$ y = [9403013, 14237876, 5342617, -9805719, -18067330, -19343167, -21967839, -24823580, -19198804, -6034317, 4812445, 11934449, 21664418, 28852040, 18144592, -9794340, -32679147, -36478213, -32923290, -35784741, -37972668, -28500914, -16378112, -16818039, -24237849, -21257201, -8950839, -5699355, -16527452, -24495426, -16551014, -671191, 8883515, 9766319, 8297334, 8596203, 11341585, 15477912, 16399637, 9513392, -697400, -2393116, 8700003, 22086883, 23885574, 10600724, -10366306, -27998118, -33096652, -22787251, -3923626, 11101371, 14254048, 6108121, -7619567, -18795086, -18747098, -5863643, 8361639, 9044310, -4475783, -17325547, -16227603, -1096036, 19929348, 37409430]
3854C7409430M200635j3448726k0888352j0052589N761774P532027k588466o183063
3846A742670J744701O691963L12664o952526n777388l208201p124704r661141
3838b2231962n36048J2431415J2156994j928565j1826044n914432O220865Q534499
3830c093278n79999q976637p872757r22949L551824L353918K431856L375833M143248
3821d588941K040141k076234m296286j029019P265417J3979724J0568755l071581
3813A8791976j4996844j4111821m528985J155774J017482M211668J1385519J0221491
3805A3146260k654298j0751559j198730J3318507J2273756j636123p419527K369105
3797A7447391J3169391J1706315R59956j0321541j7955466j8667199r848300K337317
$$ y = [37409430, 41610065, 28161339, 7272987, -2779602, 2982172, 10514199, 7925733, 1742670, 3487371, 10179334, 10491998, 3539472, -2237916, -5446117, -12570821, -22231962, -22768010, -10336595, 1820399, -108166, -11934210, -17848642, -11627777, -3093278, -3673277, -12649914, -20522671, -21445620, -17893796, -14539878, -12108022, -8732189, -4588941, -2548800, -4625034, -8921320, -9950339, -2684922, 11294802, 21863557, 18791976, 3795132, -10316689, -14845674, -13689900, -12672418, -8460750, 2924769, 13146260, 10491962, -259597, -1458327, 11860180, 24133936, 22497813, 15078286, 17447391, 30616782, 42323097, 43283053, 32961512, 15006046, -3661153, -13509453, -11172136]
3789a1172136O246851L19505n288404n317469n469390q351921o743226L013471
3781c2762719J2857321J5075885J1857170O719457k025545j2185694j4159929
3774a4624054n541572J799066r24826n618565j851597N158588M323349j907559
3766a9187170k466546L387787O064223J442588n490501r985060r676103j386293
3758c7297075J2721247K0203811J2464896j0864o05546Q586802J0907176K272489
3750B9242936m372667l380321n203147j4240432j7108554n043969P747123L912793
3742h446238r729850j2088317R25924J2515757J1059635L509259j35712j043623
3734c433165l473655m164240M06851L893397j352739r377750o600327O903898
$$ y = [-11172136, -4925285, -4605780, -9894184, -15211653, -20681043, -29032964, -35776190, -32762719, -19905398, -4829513, 7027657, 13747114, 11721569, -464125, -14624054, -20165626, -18366560, -19291386, -24909951, -26761548, -21602960, -17279611, -19187170, -21653716, -18265929, -12201706, -10759118, -16249619, -26234679, -35910782, -37297075, -24575828, -4372017, 8092879, 8082015, 7476469, 16063271, 26970447, 29242936, 24870269, 21489948, 16286801, 2046369, -15062185, -20106154, -12359031, -8446238, -18176088, -30264405, -29338481, -16822724, -5763089, -2253830, -2389542, -3433165, -6906820, -11071060, -10664209, -6770812, -8123551, -17501301, -24101628, -17197730]
3726a7197730J4415846N874030o645604n944592N755147J1814028O736309K097648
3718A6905082N965157J0917842Q009818J49845o242540j1945187j7769452j6760042
3710a0769477n525988M746473K321785o006962m737823N599230J0050504M218052
3702a04206n1820L649571O215908N99870o020483n944018l290367k978102J82761
3693g740886R406461J3474425J136462j8204976k3311879q851403Q611628J2704357
3685a2775811M147239o252289j1587396j1647301q358914l251611K849364R281952
3677c7594767J3466075J1295439L347388j797267L123080J2026044J0423883n260460
3669I029415k0206278j8217606j989766J0188891O941996l722329o953697n18808
$$ y = [-17197730, -2781884, 3092146, -3553458, -9498050, -3742903, 8071125, 14807434, 16905082, 22870239, 33788081, 41797899, 41947744, 35705204, 23760017, 5990565, -10769477, -16295465, -11548992, -9227207, -15234169, -19971992, -14372762, -4322258, -104206, -156026, 3493545, 9709453, 10309323, 4288840, -1655178, -4945545, -7923647, -7740886, 1665575, 15140000, 16276462, -1928514, -25240393, -34091796, -25480168, -12775811, -8628572, -14880861, -26468257, -38115558, -46474472, -49726083, -46876719, -37594767, -24128692, -12833253, -9485865, -11283132, -8160052, 3865992, 14289875, 9029415, -11176863, -29394469, -31384235, -21195344, -14253348, -17975677, -24929374, -25448182]
3661b5448182M608522J148227n381837p281705o456840q456180j0334190m742604
3653f2344789N776918R958089M903427J093111O003164J2716204J1477303M219999
3645f196574n46794q93836q52245j381718m97958R77392J489309L197669O908552
3636B203797O684917j672737j0543828r304548q18149K426009k054136l674539
3628a6753214K477606O717444N87971q923442r475453o23929P868426J0552970
3620g571621J0237134R206238N102734k752944r018319p988007j095201M353415
3612D73429L447388j464984m426687k398947K892824P457642P286667O96866p801625
3603F162573q789075Q20076J0201608P011727m122477p549949j525839q71870
$$ y = [-25448182, -20839660, -19691433, -25073270, -32354975, -38811815, -47267995, -57602185, -62344789, -56567871, -46609782, -41706355, -40613244, -34610080, -21893876, -10416573, -6196574, -6743368, -7637204, -8489449, -9871167, -10369125, -9391733, -7902424, -4704755, 2203797, 8888714, 7215977, -3327851, -12632399, -13450548, -11024539, -13078675, -16753214, -14275608, -7558164, -6970193, -15893635, -25369088, -25993017, -18124591, -7571621, 2665513, 11871751, 16974485, 14221541, 5203222, -2784785, -3879986, 473429, 3920817, 2455833, -1970854, -4369801, -1476977, 5980665, 13267332, 13964198, 6162573, -2626502, -1806426, 8395182, 15406909, 11284432, 3734483, 2208644, 1336774]
3595A336774r505132j0102705N704532J6567039K634127j8102912j3580429J1025262
3587a4023444J9292216M45051j5181898o214280Q548713O224318l207786k47770
3579d364880Q106654M253608n620094l419964O096948L296446r820679j1625489
3571a3097450J884574J0956539N830545p74213m79241k330984j0203929j1625412
3563a9839571j239701O580344K745537P07177J1641504K0652298Q957180j3455966
3555A6748802k0658426q905009R84032k920708r414882o120697K792494P547247
3547a9947147P664734P709568P439142M439273J124310J842082N209808M750655
3539B0232425k490261j0697453j0538089l96232R314264O923297n342277j2750064
$$ y = [1336774, -8168358, -18271063, -12566531, 4000508, 6634635, -11468277, -25048706, -14023444, 5268772, 5713823, -9468075, -15682355, -7133642, -909324, -4117110, -4364880, 3741774, 7995382, 2375288, -1044676, 5052272, 8348718, -1471961, -13097450, -11212876, -256337, 5574208, 4799995, 4320754, 1989770, -8214159, -19839571, -21079272, -14498928, -11753391, -11046214, 595290, 21247588, 30204768, 16748802, -3909624, -12814633, -11830601, -14751309, -24166191, -30286888, -27494394, -19947147, -12282413, -4572845, 2866297, 7305570, 8429880, 10271962, 15481770, 20232425, 17742164, 7044711, -3493378, -3889610, 5424654, 12347951, 7005674, -5744390]
3531e744390o957856L204815M899509j289580n015755k730164q93045l926532
3523a8452998p988892p777556k589682N535731J3804594J7784938J3961008M559012
3515A8836155m086227q092556p410258k519324M660094Q085670K912221o408119
3507E977656j0170110o223044j918279k210908l274097o68835L020842L088542
3499a2378233M81112K14681M389013R449910R170817M84646j1366087j5559691
3491a5113832q002822J814044K753354k409590k846499J623102J236948l770550
3483b4715845m18594J3777801K1145699Q739939j0761160j7406348j1898176p909113
3475b9445797n441521O408761K2925402K3619925M056810j2283898m786554J6286731
$$ y = [-5744390, -12702246, -9497431, -4597922, -5887502, -10903257, -13633421, -14526466, -18452998, -26441890, -34219446, -36809128, -31273397, -17468803, 316135, 14277143, 18836155, 14749928, 6657372, -752886, -3272210, 1387884, 9473554, 12385775, 5977656, -4192454, -10415498, -12333777, -14544685, -17818782, -18487617, -15466775, -12378233, -11897121, -11682440, -7293427, 2156483, 11327300, 11811946, 445859, -15113832, -23116654, -21302610, -18549256, -20958846, -23805345, -22182243, -20945295, -24715845, -25134439, -11356638, 9789061, 18529000, 7767840, -9638508, -21536684, -29445797, -34887318, -28478557, -5553155, 18066770, 22123580, 9839682, 5053128, 21339859]
3467B1339859K5209373J4129582k234484r314102p201369l892587m234209p051081
3459B6750982p604033k357446N673884Q310118K092569o642645j0579373j0793548
3451D850508j1417645r659250k86489J1778469J3926402L333159p014458n075775
3443D34921L806310M448424o916884j6709344j1304011N011547J4631861Q411925
3435A814749l003473l627183O085751J0119091L13279j0825021p628852N452310
3427a299349R238580l190325j6542978j3802129K221050J3766860R305001n859606
3419f162896j7234102j4991088k035232R035822Q979953K679789K531043J0378243
3411f818468J3855523M884251p005371q344030j555551P59296k862149j716071
$$ y = [21339859, 46549232, 60678814, 58444330, 49130228, 41928859, 38036272, 33802063, 26750982, 19146949, 16789503, 22463387, 30773505, 32866074, 26223429, 15644056, 4850508, -6567137, -16226387, -16512876, -4734407, 9191995, 12525154, 5510696, 434921, 4241231, 8689655, 1772771, -14936573, -26240584, -21229037, -6597176, 1814749, -1188724, -4815907, 1269844, 11388935, 11702214, 877193, -6751659, -1299349, 7939231, 4748906, -11794072, -25596201, -23375151, -9608291, -303290, -6162896, -23396998, -38388086, -40423318, -31387496, -22407543, -19727754, -17196711, -6818468, 7037055, 11921306, 4915935, -3428095, -4983646, -4224350, -7086499, -8802570]
3403h802570O440444R178845k11317r288405l639378J1323291J7451436Q108200
3395C0560546n774613j1916713q800699j706428M021562M175488j847163p317442
3387A394538l748791P036459J2791290O245466n277751r957553n819487N63234
3379C227405N305999R784698J3512813J1965827L441768o800466j2033865j1024414
3371A7379765p377583m161378j904384r78749k840542p529955j1345995r106134
3363b7864955N55711J2758952J9816825J7337049P751080j255804k940764J372952
3355B7531046J904900q847614k4260444k8025366j3798820N374056J3285056J0574035
3347a6263151Q877032R101490L59848j7055940k3810418p438795J5252014J7298314
$$ y = [-8802570, -2362126, 6816719, 6605402, -2683003, -6322381, 5000910, 22452346, 30560546, 24785933, 12869220, 4068521, 2362093, 6383655, 10559143, 8711980, 1394538, -2354253, 4682206, 17473496, 23718962, 18441211, 8483658, 2664171, 3227405, 8533404, 18318102, 31830915, 43796742, 47238510, 40438044, 28404179, 17379765, 10002182, 5840804, 3936420, 2957671, 117129, -7412826, -18758821, -27864955, -27309244, -14550292, 5266533, 22603582, 30354662, 29098858, 26158094, 27531046, 29435946, 20588332, -3672112, -31697478, -45496298, -40122242, -26837186, -16263151, -7386119, 1715371, 2075219, -14980721, -38791139, -46229934, -30977920, -13679606]
3339a3679606j433412j3043243L22630K1995518K2946375q98739k4919104k6562988
3331c5272569r216290O968719R832347M215107P463q0892J242893K868481M927676
3322a4507065N441726L711280M174569R373436J1630388K187925j1711118j2208711
3314a907570K709116J2494991K986547j1178978p528365J0451955J8578456O938810
3306C3544962r219590j4546729j1862756j0070392q671972k826467O133107J3081074
3298d438763J5416870J2158897L416777n768865q308527m488819r35625O92826
3290G744771L703864M564157m433529j7141697j5131540M473540J9389288J2437402
3282A5606256l871690q020814j009289R03691n807081j0996957j0495387p455253
$$ y = [-13679606, -15113018, -28156261, -27833631, -5838113, 17108262, 16209523, -8709581, -35272569, -44488859, -37520140, -27687793, -23472686, -23465223, -23546115, -22303222, -19434741, -14507065, -9065339, -5354059, -1179490, 8193946, 19824334, 22012259, 10301141, -1907570, 801546, 13296537, 16283084, 5104106, -2424259, 8027696, 26606152, 33544962, 24325372, 9778643, -2084113, -12154505, -20826477, -23652944, -17519837, -4438763, 10978107, 23137004, 26553781, 20784916, 12476389, 7987570, 7051945, 7744771, 11448635, 16012792, 11579263, -5562434, -20693974, -16220434, 3168854, 15606256, 11734566, 3713752, 2704463, 3608154, -2198927, -13195884, -23691271, -31146524]
3274c1146524n22008J0020271J1610988k639690j2368978N670562L4588743L2042002
3266D7255366o639101l4990414k0426240R638548J1344250j1929363k1764465
3259b7511419n095325J2789576J1981673K493754n92793p24024o934646j4549333
3251b8142537j2132573P99922J2874178J4018862M664087n475619o233978K602324
3243a7025334J0791605J0983923Q569521J1755354J6546828J1799795k918124
3236E0503568j5542937j7661310j2286624n159350J071694K719288l607472j2372405
3228a2335548j2348804k637458M473678J388051m110296k252282M204624O864009
3220a6754026N029868L132186J307404j779338j732891N561996J3834963J2908384
$$ y = [-31146524, -31668532, -21648261, -10037273, -12676963, -25045941, -19375379, 15213364, 47255366, 40616265, 5625851, -14800389, -5161841, 6182409, -5746954, -27511419, -32606744, -19817168, -7835495, -5341741, -5934534, -6658558, -13593204, -28142537, -40275110, -39475188, -26601010, -12582148, -7918061, -13393680, -19627658, -17025334, -6233729, 4750194, 13319715, 25075069, 41621897, 53421692, 50503568, 34960631, 17299321, 5012697, -146653, 925041, 3644329, 36857, -12335548, -24684352, -27321810, -22848132, -21460081, -25570377, -27822659, -23618035, -16754026, -11724158, -8591972, -7284568, -9063906, -10796797, -5234801, 8600162, 21508546]
3212B1508546M123920j102858J237749K268872m233815j0346677n270512P443379
3204A5628604J2435217J601738j5788239k3757449j6498084k269826P151498P771753
3196a3724788M273248K247926J705809j129185o490573q136968p03812J0689984
3188a1268359J3554555L889138o431506m951323K818877J044819j0876421j4564923
3180b6785143n9352J6834730J6109717K000027n288299J07225M960527Q96711
3172H776143m361777k742200K145973L950873K325818k170082j0284577j6417910
3164a8777739j1147526K536575Q219996q38216r969914m220755J0275747J7532014
3156f389818J4251048Q400376L672368r73795k494172K183473P856971Q389164
$$ y = [21508546, 25632466, 24529608, 25767357, 28036229, 23802414, 13455737, 8185225, 15628604, 28063821, 29665559, 13877320, -9880129, -26378213, -28648039, -21496541, -13724788, -9451540, -7203614, -5497805, -6626990, -13117563, -21254531, -21958343, -11268359, 2286196, 6175334, -256172, -5207495, -2388618, -1343799, -12220220, -26785143, -26844495, -10009765, 6099952, 8099979, 2811680, 2918905, 7879432, 8776143, 4414366, 1672166, 3818139, 7769012, 10094830, 7924748, -2359829, -18777739, -29925265, -27388690, -19168694, -20006910, -29976824, -34197579, -23921832, -6389818, 7861230, 16261606, 19933974, 18960179, 16466007, 18649480, 26506451, 34895615]
3148C4895615O892995P242100K963065j1088974k3077966j7628857n73404Q022184
3140G646758L228075j272691J573085L558523P2173k271837j407328m076430q493350
3131a443022k409932J3145976J7871134J751134j7195928j8896954r081315m991226
3123b1250133p081034l865661M500788O918153J058195m047555k712272K857471
3115b3622048R214368J1789502L954187j2225737k0845959j0903699O436404J3355089
3107b2847893J0716564J1372468J5398160J2281405L564353J046321L224220l307528
3099C1448070j6369093j5998290K927807J8137425J1528467n297662j0346096
3092A6030628r89687R145440J0808324L767980q819869j9047513j6743934l486289
$$ y = [34895615, 41788610, 49030710, 51993775, 40904801, 17826835, 197978, -375426, 7646758, 10874833, 9602142, 11175227, 14733750, 14805923, 12534086, 11126758, 7050328, -1443022, -3852954, 9293022, 27164156, 28915290, 11719362, -7177592, -16258907, -21250133, -28331167, -32196828, -27696040, -20777887, -19719692, -23767247, -26479519, -23622048, -14407680, -2618178, 1336009, -10889728, -31735687, -42639386, -36202982, -22847893, -12131329, -758861, 14639299, 26920704, 30485057, 31531378, 34755598, 31448070, 15078977, -919313, 2008494, 20145919, 31674386, 26376724, 16030628, 15040941, 24186381, 34994705, 38762685, 29942816, 10895303, -5848631, -9334920]
3084i334920N783017L774343O34023K996625j0880j4368083k1532727l648718
3076c5707320K3294655K7407610O593572r792245m614189P022958N982743n454657
3068A4733127j4777203j7280649j3268626k205667J0923193J5545375R536622
3061C206172K521873K18768j631433l378017J995802J1126311P361724j2398074
3053I023126k5347027j3397786Q733972J5077086N655694J45899L197230J490146
3045D578340p073294p101764O548052J6750583R109556p518285j5606199j1610669
3037a1923680m333151q9411J584923L677769Q776797J4662219J1362087p390293
3029A6327260k7931012k6163404L21433K4067832K1882644L905010m749587K93322
$$ y = [-9334920, -3551903, 222440, 856463, 3853088, 3842208, -10525875, -32058602, -35707320, -12412665, 14994945, 21588517, 11796272, 7182083, 14205041, 20187784, 14733127, -44076, -17324725, -30593351, -32799018, -21875825, -6330450, 3206172, 5728045, 5946813, 4315380, 937363, 2933165, 14059476, 21421200, 9023126, -16323901, -29721687, -20987715, -5910629, -254935, -109036, 3088194, 4578340, -2494954, -9596718, -3048666, 13701917, 22811473, 15293188, -313011, -11923680, -16256831, -16346242, -14761319, -11083550, -2306753, 12355466, 23717553, 16327260, -11603752, -37767156, -37445723, -13377891, 8504753, 12409763, 7660176, 7953498]
3021G953498K850711m702868j1678427q166631J961813R687258J0590064M141059
3013A2636477o229916j1287429m728693N389789N150917m139300o091392O204835
3005c094712J8945135J7340171M870843n521279r445144j0221024p962940j270505
2997C640545M241900M31270j0539236j6110349p592040R785570K1519681J6965324
2989B2342665l0333j2974502r960795N80946j81574j3701207j8934921k968277
2981c5827998J6670582J5428949j935316q268536N695702J9245820J3930300j442785
2973B3496718p904869l633062q82955m533058p358272l622680L215062O254593
2965E031477K180460o904398j4502059j4288633o942594J02221K118176K106653
$$ y = [7953498, 10804209, 6101341, -5577086, -13743717, -11781904, -2094646, 8495418, 12636477, 6406561, -4880868, -9609561, -4219772, 931145, -3208155, -9299547, -3094712, 15850423, 33190594, 38061437, 32540158, 23095014, 12873990, 4911050, 3640545, 7882445, 8313715, -2225521, -18335870, -25927910, -16142340, 5377341, 22342665, 22312332, 9337830, -622965, -42019, -223593, -13924800, -32859721, -35827998, -19157416, -3728467, -5663783, -13932319, -8236617, 11009203, 24939503, 23496718, 15591849, 11958787, 11075832, 6542774, -815498, -4438178, -1223116, 5031477, 7211937, 307539, -14194520, -28483153, -35425747, -35323526, -33205350, -31098697]
2957c1098697L596301M282707J674728o12655J297571L960630K064679k018924
2949a6853660j700130L219337O911395O908281N814348M769672K621434J108140
2941A2798817L264247O184148K843991p172037j5245345j4212579o052822K483380
2933a5108200O792037N501461j98866o385951r490668j0067247r440492m373390
2925d2771316P659736J9035480J8120579O619915m83174L181392N412531m656201
2917A2118942j8023659j9152631r085203o46535L417401J0208825J6779206J0358616
2909E974962p187796j4411098n30012J5311775J0504302p091703j1312813K200382
2901f542001J0855767K180482o896222Q03216J2991078O696065j3532218j9436439
$$ y = [-31098697, -27502396, -23219689, -21544961, -22157616, -20860045, -16899415, -14834736, -16853660, -18553790, -15334453, -8423058, -1514777, 4299571, 9069243, 11690677, 12798817, 16063064, 22247212, 25091203, 17919166, 2673821, -11538758, -17591580, -15108200, -8316163, -2814702, -3013568, -9399519, -18890187, -28957434, -38397926, -42771316, -35111580, -16076100, 2044479, 8664394, 8181220, 11362612, 16775143, 12118942, -5904717, -25057348, -34142551, -34789086, -31371685, -21162860, -4383654, 5974962, -1212834, -15623932, -16153944, -842169, 9662133, 2570430, -8742383, -6542001, 4313766, 6494248, -401974, 401242, 13392320, 20088385, 6556167, -12880272]
2893a2880272j073367J6850144R531912j3652849k3851138j1851989M322209Q086241
2885b4519109L927739M227624R336197R837254K454283n254765n050058K832515
2877b208320J1176870J3371708Q945067K838527n37682j900647m398379p740968
2869A9546176q679428o927890n759309n880147m204394p64888q00182o193175
2861a9663237j0593605q182991k025045K337139O065483J1709149J3778232N758801
2853h16074n823473p099687K482595Q242542K710533l429465k02352M782796L94679
2844A242094p011497k552190J1961231J8843449J1024914J433396J187744L202076
2836C9331217l423889j4168768j6404917r288193l780339n349230q071934o249541
$$ y = [-12880272, -13953639, 2896505, 12428417, -1224432, -25075570, -36927559, -32605350, -24519109, -20591370, -16363746, -7027549, 2809705, 5263988, 9223, -5040835, -2208320, 8968550, 22340258, 31285325, 34123852, 33586170, 31685523, 27287144, 19546176, 10866748, 3938858, -1820451, -7700598, -11904992, -12669880, -13470062, -19663237, -30256842, -38439833, -40464878, -38127739, -32062256, -20353107, -6574875, -816074, -6639547, -13739234, -11256639, -3014097, -303564, -3733029, -3935381, 847415, 1242094, -5769403, -8321593, 3639638, 22483087, 33508001, 34941397, 36129141, 39331217, 35907328, 21738560, 5333643, -3954550, -7734889, -13084119, -21156053, -27405594]
2828b7405594j994921R52510K800956L898365K252284j065594J48632Q572758
2820a1840604J6559543J4009735J683504q622542p833199J92622M035981j516920
2812F668120r538907r584968p07077P253594O269599N089k721340p90302k66297
2803c412489k493414j782701K910339L470517m338528j1288142o847009M517001
2795a9264426R490451N480098K568383N665476O645961j157999j0484082r856914
2787a0913052K18226Q945926J0138324P647776O410312N100617J47191p214272
2779B0481048j1431124r121747k753527K478924M005512K831176J18151m088835
2771B519578p786738o695510o22924L263312q19119p507942o602986J611741O234677
$$ y = [-27405594, -29400515, -28448005, -25647049, -21748684, -19496400, -20561994, -20413362, -11840604, 4718939, 18728674, 20412178, 11789636, 3956437, 4149059, 8185040, 6668120, -2870787, -12455755, -13162832, -5909238, 360361, 365450, -2355890, -3146192, -3412489, -5905903, -7688604, -4778265, -1307748, -5646276, -16934418, -23781427, -19264426, -9773975, -4293877, -1725494, 3939982, 10585943, 9427944, -1056138, -10913052, -10694826, -1748900, 8389424, 16037200, 22447512, 27548129, 27695320, 20481048, 9049924, -71823, -2825350, -346426, 3659086, 6490262, 6608413, 2519578, -5267160, -11962670, -12585594, -9322282, -10141401, -17649343, -24252329, -22640588, -16405911]
2762a6405911K455695j559020R04482L791965l52123o026139l232660M740675
2754a5683036N166364l593722q610859k107783P176938Q009546K461145j75840
2746g357247J351639K10340o019094j0934993p842807K434323J2990744J6910463
2738A743368J1997029K342041m540311l956271K384688R098117J1578851P479784
2730C8127296k448671j2778211j6410403j2520453q086015p759215o603543J085159
2722b7394056R860492R188452J05665m762282J86393N627922L170990j231892
2714e248316J280323N951614J911384q140298j0248366j554633M341073o37915
2706a2345134n311472K604100J4897925J3160752m038722j8542295j7266466o562435
$$ y = [-16405911, -13950216, -15509236, -14604754, -10812789, -11164912, -17191051, -20423711, -15683036, -10516672, -14110394, -22721253, -24829036, -17652098, -9642552, -7181407, -7357247, -6005608, -5795268, -11814362, -22749355, -30592162, -28157839, -15167095, 1743368, 13740397, 16082438, 11542127, 7585856, 9970544, 19068661, 30647512, 38127296, 35678625, 22900414, 6490011, -6030442, -14116457, -21875672, -28479215, -27394056, -17533564, -8345112, -8239447, -13001729, -12815336, -7187414, -4016424, -5248316, -3967993, 1983621, 3895005, -4245293, -14493659, -16048292, -11707219, -12345134, -17656606, -15052506, -154581, 13006171, 8967449, -9574846, -26841312, -33403747]
2698c3403747J333070M387204O522985O690794K118350k589727j81563O606406
2690h516228O968245j694254q350623m044581M131952K908603o798597r671023
2682b5066506J894223J4984385J2713303k373249j1717931o206347L085586K915327
2674i771209l740253m872508K269059R487490J0215720M860317l535648j0208699
2666e295731q167676L295988J2085468O893994m439272m355591O431804P769790
2658A4218774q086573k1841521j5260697K377171J1036776R658718J0444832J3252336
2650A5799816P687819l268716m315594N814756R687950j522377j4166299j3944091
2642A773264o080064k985328m146079p34300P770094J3323768J1206978L242166
$$ y = [-33403747, -32070677, -27683473, -21160488, -14469694, -12351344, -14941071, -15122634, -8516228, -1547983, -3242237, -11592860, -15637441, -11505489, -8596886, -15395483, -25066506, -23172283, -8187898, 4525405, 2152156, -9565775, -15772122, -12686536, -9771209, -13511462, -18383970, -16114911, -6627421, 3588299, 8448616, 4912968, -5295731, -13463407, -10167419, 1918049, 8812043, 4372771, 17180, 6448984, 14218774, 6132201, -15709320, -30970017, -28592846, -17556070, -7897352, 2547480, 15799816, 23487635, 20218919, 15903325, 21718081, 31406031, 29883654, 15717355, 1773264, -4306800, -7292128, -11438207, -12172507, -4402413, 8921355, 20128333, 23370499]
2634B3370499o951195j4563074j3715809m340436M453742M293648k357802p157735
2626a6968162o320374m06777J0424609K2687408K5806360J2526462q254743j8873812
2618B0620971j4034849n985578o252671j0253115n618781Q787004J9366644J4252599
2610B0882224j270980j0108500l683341Q174702J0840538L428698l257482m027322
2602B0978537m094543o196244n009195P54568K079989o071162j3480039q350552
2594a9388641M546938J1237704R266386P967058J0086824P235449l895144j2937289
2586A4119285r461022K404445Q887033K175326j2525166k2745921j9793824o748348
2578d3688192L907444L202521m495859p615813j248930R736860J9039879K3743496
$$ y = [23370499, 16419304, 1856230, -11859579, -16200015, -11746273, -7452625, -9810427, -16968162, -23288536, -23695313, -13270704, 9416704, 35223064, 47749526, 39494783, 20620971, 6586122, 600544, -5652127, -15905242, -21524023, -12737019, 6629625, 20882224, 19611244, 9502744, 5819403, 13994105, 24834643, 28263341, 25005859, 20978537, 16883994, 10687750, 5678555, 6433123, 8513112, 2441950, -11038089, -19388641, -14841703, -3603999, 5662387, 13629445, 23716269, 30951718, 27056574, 14119285, 4658263, 7062708, 15949741, 18125067, 5599901, -17146020, -36939844, -43688192, -39780748, -36578227, -41074086, -48689899, -49938829, -40201969, -21162090, 2581406]
2570B581406K1772589J1992152j666152j1565168j3293628q033020N16020P073726
2562I377925N610887l764167j0972375p179154J833889K759096n935347j2571047
2554b0840293j0300184m568413m66728M536220J0519360J0295773K044816l926885
2546a2706334L53664Q083517Q269663R59888o386263r980578q654049J451J2521312
2537g537729J6472409N768501p690326r359676k269940R21560r46007j5943K402016
2528b255135j812088r419071q501549J124341Q689527J2927936J9952701K0417163
2520D1123825k391123l3583854k8879022K2883502O8097238N1168326j0292594
2513A08126298m9629663l9181922j3234478m769840m155042N638988J2784149
$$ y = [2581406, 24353995, 36346147, 34679995, 23114827, 9821199, 1788179, 2304199, 9377925, 14988812, 11224645, 252270, -6926884, -5092995, -2333899, -8269246, -20840293, -31140477, -35708890, -36175618, -31639398, -21120038, -10824265, -8779449, -12706334, -12352670, -4269153, 4000510, 4960398, -1425865, -11406443, -20060492, -20059041, -7537729, 8934680, 14703181, 7012855, -2346821, -4616761, -3695201, -4641208, -4657151, -2255135, -4067223, -13486294, -21987843, -20863502, -12173975, 753961, 20706662, 41123825, 38732702, 5148848, -23730174, -846672, 67250566, 118418892, 108126298, 58496635, 19314713, 6080235, 1310395, -2844647, 2794341, 15578490]
2506A5578490J862656j2796621r196500N016337O727469l509537n956726J826999
2498d47433K442920q603072j4876249p139243L934938Q056587P357429L239738
2490f034385p814739j8890609j4183666N211953J7066410R960170k01403K142523
2482a2743746Q011161L288711o025714p244262m419722p430659j0255501k379248
2474c9198980Q159501O441656k051500R9031J1312658J3291454K651595m194272
2466c488857P14145O804240O487864M960505L997318k874295j3185946j3960353
2458a0545379m268997L48777o413156j1202168m836390L416393N442538P868930
2450b0189452J3889387J1930453k357332j2155992n487820K581978n488701j8380434
$$ y = [15578490, 17441146, 4644525, -4551975, 464362, 7191831, 3682294, -2274432, -447433, 1995487, -6607585, -21483834, -28623077, -24688139, -16631552, -9274123, -6034385, -13849124, -32739733, -46923399, -41711446, -24645036, -14684866, -14886269, -12743746, -4732585, -1443874, -7469588, -14713850, -19133572, -26564231, -36819732, -39198980, -31039479, -24597823, -26649323, -26550292, -15237634, -1946180, 705415, -3488857, -2774712, 4029528, 10517392, 15477897, 19475215, 16600920, 3414974, -10545379, -14814376, -14465599, -20878755, -32080923, -36917313, -33500920, -28058382, -20189452, -6300065, 5630388, 3273056, -8882936, -14370756, -11788778, -17277479, -35657913]
2442c5657913j3021078P946164K0783924J6625422Q940842P601255P740529N169506
2434B6128651L421624K766117j938802r938537j4083782j2336295q163836j359848
2426a5504708Q686815J3644288N366931p578297q708854J805560Q059552L889218
2418I660505n84929K13916r61279o520034o680719J855787O506353j168727j0069504
2409g748631o540195M360995P963984K593714p33083K443626L985812k569944
2401C756278j1030407j0216953J098522J1455476J0211311J008387l482605p4974
2393B725035N27487p873742j4735813q696247L583996Q053017N263289N258356
2385e894622O173400j974991j3919795j1726874N857278J7820115J1617197J96404
$$ y = [-35657913, -48678991, -40732827, -19948903, -3323481, 5617361, 13218616, 20959145, 26128651, 29550275, 32316392, 30377590, 20439053, 6355271, -5981024, -14144860, -15504708, -6817893, 6826395, 12193326, 4615029, -4093825, -2288265, 5771287, 9660505, 9075576, 9289492, 8328213, 1808179, -4872540, -3016753, 3489600, 2320873, -7748631, -14288826, -9927831, -1963847, 629867, -103216, 2340410, 6326222, 3756278, -7274129, -17491082, -16392560, -4937084, 5274227, 6282614, 2800009, 2725035, 3252522, -4621220, -19357033, -28053280, -24469284, -16416267, -11152978, -5894622, 278778, -1696213, -15616008, -27342882, -21485604, -3665489, 7951708, 8148112]
2377H148112p07400N554757Q206680O474805L260977m403754j5941795k0749315
2369a0156933j3530823m628487l402336l553230K468887P510472L421651j148592
2361b3019391N601191J6218273J4104637L94249p717194k923777M668523N455660
2353A2782171J280396k248907k836087m77633K060001k71167o546104p424827
2345c682157O76675O872796K184293m528008j189723N978867L359401m918156
2337D753988l558772O159520P707906j850417p070249j551889J895528m680794
2329A804821j0447655n517659K931732N124137M061198N015476L230567n486398
2321G16219j3229086j1595160n421415k901160p97250P423109J5840668J2840266
$$ y = [8148112, 7440712, 12995469, 21202149, 27676954, 30937931, 26534177, 10592382, -10156933, -23687756, -28316243, -31718579, -35271809, -32802922, -25292450, -21870799, -23019391, -17418200, -1199927, 12904710, 13298959, 5581765, 2657988, 7326511, 12782171, 14062567, 11813660, 8977573, 8499940, 10559941, 10288774, 3742670, -3682157, -3005482, 3867314, 6051607, 1523599, 333876, 6312743, 9672144, 4753988, 1195216, 7354736, 15062642, 13212225, 6141976, 4590087, 6485615, 1804821, -8642834, -14160493, -11228761, -6104624, -2043426, 2972050, 6202617, 716219, -12512867, -24108027, -29529442, -32430602, -33227852, -25804743, -9964075, 2876191]
2313B876191J01976q484186o255872r33254j335611o189215q752212o053253l68206
2304c5393642M803531P515374P417136M852727J049206p38191K837011R410987
2296A754139J0418980J622339q912847j0606230n512062m044007o965341m063070
2288b6308099P183377J4743417R661437q05954n346676m329839m676296o795387
2280a6674020o008029j633645L466507P896982R657092M555022o245777j2618460
2272a7604328p154717M090351R650919O772434O56214m860069p870541m936252
2264b1255989L720069R362466M289133o267688j0035398l401993N907320R231426
2256h450654L578404q312935j7569046j3551719L365427J8091197J8116092Q848798
$$ y = [2876191, 2978167, -5506019, -11761891, -12695145, -14030756, -20219971, -28972183, -35025436, -35393642, -30590111, -23074737, -15657601, -10804874, -9755668, -10493859, -7656848, 1754139, 12173119, 13795458, 4882611, -5723619, -11235681, -15279688, -22245029, -26308099, -19124722, -4381305, 5280132, 4474178, -872498, -5202337, -9878633, -16674020, -22682049, -24315694, -20849187, -12952205, -3295113, 1259909, -4985868, -17604328, -24759045, -20668694, -11017775, -4245341, -3589127, -8449196, -16319737, -21255989, -17535920, -8173454, -3884321, -10152009, -20187407, -23589400, -17682080, -8450654, -4872250, -13185185, -30754231, -44305950, -40940523, -22849326, -4733234, 4115564]
2248D115564K584364j11680n086000q035737p02027J0078201Q961236k168013
2240I635908n232148L888907P588617k800803r748795K247886J8535780J4550076
2232C8665428o224306j6497627m531802J1079840R616359m884480j3121100p130415
2224F971897K160790J244930q822147j3678961l104263J5110718K2484088J1458910
2216C3825962n815412j3262526r126221k611102J693909O464220J1182173R716623
2208C2067626N48333q304619q243670K93789R172997J0251518J552277j0222989
2200B7115262j3841765n254958N398923M748783n993440j2000970n180101N182648
2192A74382O413084p76384n977718l795874K289582P067092P965731M708451k349
$$ y = [4115564, 6699928, 6588248, 1502248, -6533489, -7235516, 2842685, 11803921, 9635908, 4403760, 8292667, 15881284, 13080481, 3331686, 5579572, 24115352, 38665428, 32441122, 15943495, 11411693, 22491533, 32107892, 27223412, 14102312, 6971897, 9132687, 10377617, 1555470, -12123491, -15227754, -117036, 22367052, 33825962, 28010550, 14748024, 5621803, 3010701, 4704610, 11168830, 22351003, 32067626, 32615959, 24311340, 16067670, 16361459, 25534456, 35785974, 37338251, 27115262, 13273497, 8018539, 13417462, 18166245, 12172805, 171835, -5008266, 174382, 6587466, 5811082, -166636, -3962510, -1672928, 5394164, 13359895, 18068346, 18065997]
2183A8065997j814263q41146k458774p773412r685651m985029k330745p570903
2175a9393926r145674N711310K4915411K2530073k431652k0425165j2954942J728929
2167i465636o51762j2884217j0945252O568595J8725820J6293849J0271072O803995
2159B4716464j253906j2688579j1953835M240993J4845369L718277j5246689j8969937
2151a2591843q360502j900164m950276o041317m61077K600044j301940l080453
2143c6087528M225950J3742458J5563241J0159772M512220J561458m62015k615489
2135A0600067l937491l070897Q04739N734426N856037k119733j1128509r804887
2127g066248J556567R028671L550973n880483m475396P905538J6754570J1448314
$$ y = [18065997, 16251734, 15410588, 12951814, 5178402, -4507249, -9492278, -11823023, -19393926, -28539600, -22828290, 2087121, 24617194, 22185542, 1760377, -11194565, -9465636, -10117398, -23001615, -33946867, -27378272, -8652452, 7641397, 17912469, 24716464, 23462558, 10773979, -1179856, 3061137, 17906506, 21624783, 6378094, -12591843, -20952345, -22852509, -27802785, -33844102, -34305179, -31705135, -33007075, -36087528, -31861578, -18119120, -2555879, 7603893, 12116113, 13677571, 13215556, 10600067, 6662576, 3591679, 4396418, 10130844, 15986881, 13867148, 2738639, -7066248, -5509681, 3518990, 7069963, 1189480, -3285916, 4619622, 21374192, 32822506]
2119C2822506l626082j6401266j9074596j1415577J888063J3374967J5582186
2112A3150201O529021o900849j3559593q044495L787255J0569713P653013K406655
2104A5590921M933029J3947656J6419280M222531j2859910j7337946o539387L253663
2096B1629837j214261j2118105j2935965l210760K173330k057052l109771O946648
2088c896099J5151616Q055994l762437r25889J1291352Q219539j4009310k7954537
2080g829771j4437383Q855653J4460410L901359j278295L975237M373891o558872
2072E462229j5949215j3047983l348060L768258P168935Q295928N279922j517515
2064c887501p146636r182114r191291n888357L103578J1594885R010359l092397
$$ y = [32822506, 29196424, 12795158, -6279438, -17695015, -15806952, -2431985, 13150201, 19679222, 12778373, -781220, -8825715, -5038460, 5531253, 13184266, 15590921, 20523950, 34471606, 50890886, 55113417, 42253507, 24915561, 18376174, 21629837, 20415576, 8297471, -4638494, -7849254, -5675924, -7732976, -10842747, -3896099, 11255517, 19311511, 15549074, 14623185, 25914537, 34134076, 20124766, -7829771, -22267154, -13411501, 1048909, 4950268, 3671973, 7647210, 12021101, 5462229, -10486986, -23534969, -26883029, -23114771, -15945836, -7649908, -2369986, -3887501, -11034137, -20216251, -29407542, -35295899, -32192321, -20597436, -11587077, -14679474]
2056a4679474j0864386p635736p48077M114110J0096169J5442723R882130o027991
2048d20532j4822727p600455P88418l066405p523207K460163J4964841Q578972
2040f640932q991151r759355Q813858J7918395L496136j1079785k733214J5056688
2032F080640J4031049o898281k3355148k0607810o885522M756672R990356Q469618
2024a4418426P58476o701813m845127N678082J3511300J1421121N197295L718769
2016A4319677N713067K116083r975244k0476691j6023818L645927K1827201K1089825
2008B2236027K771759j4795067j8106814j1691408o739263m988312j221206M462067
2000b8072217O673025M437777K077199J738637K695640N928026J0777036R604485
$$ y = [-14679474, -25543860, -33179596, -33927673, -29813563, -19717394, -4274671, 5607459, -420532, -15243259, -22843714, -22055296, -25121701, -32644908, -30184745, -15219904, -6640932, -15632083, -25391438, -16577580, 1340815, 4836951, -6242834, -8976048, 6080640, 20111689, 13213408, -10141740, -30749550, -37635072, -32878400, -22888044, -14418426, -13659950, -20361763, -25206890, -19528808, -6017508, 5403613, 10600908, 14319677, 20032744, 22148827, 12173583, -8303108, -24326926, -20680999, 1146202, 22236027, 25007786, 10212719, -7894095, -19585503, -26324766, -31313078, -32534284, -28072217, -21399192, -16961415, -14884216, -13145579, -10449939, -4521913, 6255123, 15859608]
1992A5859608l017169j6761164j4727274J506974J0601265J701910q317783M47475
1984a2706158K0003749K4146449M692642j7628279j9982582l259711J2781993
1977H048103J2164643l646921j9716722k1873695r339591N579711J1119325P070804
1969a0594343N15483m081167n446815j910874M588387N299358m597012j5056071
1961c1283054j2232304J247765R674008P692289N965921J0754853J3181000N680988
1953A0681466m482707p481751n381554m264223k087249M316351Q979942N879267
1945F159542R03903J905300L437811m079214j5001064j4740160l814516J299389
1937b3929009o272806j3038492o028875Q068979J3179391N251974m985847o811163
$$ y = [15859608, 12842439, -3918725, -18645999, -17139025, -6537760, -4835850, -13153633, -12706158, 7297591, 31444040, 36136682, 18508403, -1474179, -4733890, 8048103, 20212746, 16565825, -3150897, -25024592, -34364183, -28784472, -17665147, -10594343, -10078860, -14160027, -19606842, -21517716, -16929329, -11629971, -16226983, -31283054, -43515358, -42267593, -32593585, -24901296, -18935375, -8180522, 5000478, 10681466, 6198759, -1282992, -6664546, -10928769, -13016018, -8699667, 280275, 6159542, 7063445, 8968745, 12406556, 8327342, -6673722, -21413882, -25228398, -23929009, -30201815, -43240307, -49269182, -41200203, -28020812, -22768838, -27754685, -34565848]
1929c4565848n47896N431224N437263K864291M315509Q087414N118140n381257
1921i241160j0440893j873950Q641569O048285l615256k416694R179139J1322057
1913G603097l730662j8912925j7973661o344299K768852P241990R579576N990402
1905a3777630l854265p456822M184219J8522435J6020784j363958j2122141n086979
1897d934357P019192P077529m438550j2521389o629035Q338143J8187115J4204180
1889B6302828J473600q036214r275961p223036o917335o841315m038974M64638
1881a4091769M191672N757461L119736m371973j0923418r223578j919325J203810
1873b6257384q37846J203098R246312J2752935O889661J193429K020092J595798
$$ y = [-34565848, -35113744, -29682520, -24245257, -21380966, -17065457, -8978043, -3859903, -9241160, -19682053, -21556003, -12914434, -6866149, -10481405, -12898099, -3718960, 7603097, 3872435, -15040490, -33014151, -39358450, -36589598, -29347608, -19768032, -13777630, -17631895, -25088717, -20904498, -2382063, 13638721, 12274763, 152622, -4934357, 2084835, 9162364, 4723814, -7797575, -14426610, -6088467, 12098648, 26302828, 27776428, 19740214, 10464253, 3241217, -3676118, -10517433, -14556407, -14091769, -9900097, -4142636, -1022900, -5394873, -16318291, -25541869, -27461194, -26257384, -27095230, -25892132, -16645820, -3892885, 2996776, 4190205, 6210297, 7806095]
1865G806095m843691o918315J769853P645919j967554j5118595j2607353J532783
1857b2700858Q675189N986012M741295N176033j042735o976010K718082K0156199
1849A6733207J8579100n237827k0997298r130747J0280753R530234o512737j2643468
1841F01217j710091J0413763J1292382M948840K23574j34313K020465L879420
1833C1535257K732104k327646r657425j6355898j7955209r738391N133523J2769469
1825c864216M481339p926980p049757K692187J466374j1715234j4443140K479625
1817c3879802J7705424J1918243l567766q330699m670715o833885j2564737q891855
1809d9115792K224427O669882K136390p51821J881669M876029Q468668J6359579
$$ y = [7806095, 2962404, -3955911, -2186058, 5459861, 3492307, -11626288, -24233641, -22700858, -14025669, -8039657, -3298362, 1877671, 834936, -6141074, -3422992, 16733207, 35312307, 30074480, 9077182, -53565, 10227188, 19757422, 13244685, 601217, -1108874, 9304889, 20597271, 25546111, 25769685, 25635372, 27655837, 31535257, 34267361, 31939715, 22282290, 5926392, -12028817, -21767208, -16633685, -3864216, 617123, -7309857, -14359614, -11667427, -10201053, -21916287, -36359427, -33879802, -16174378, -4256135, -7823901, -16154600, -20825315, -27659200, -40223937, -49115792, -46891365, -40221483, -38085093, -38836914, -36955245, -32079216, -23610548, -7250969]
1801g250969K1296852J1822441o366045j4492032q051669k065798n714318r748389
1793b0569927n177639K167411M245199M001800O313799P041011J321379n649567
1785f306534n900529q50187K197427J337275O55889K612136N622281P351972O583099
1776A3302829L263658j541396p220845j4075703j8992633j4251387J820809J5837086
1768b1857582J2255183m202268j1360130J555572J9791463K3581477J1464701
1761C1228416m510065j5947642k0334296j5565760m692792O04655n705689j1446631
1753d6369804j971362J5451360J9513656O604625l677726O41586N941463l269518
1745g135720j7900310j7644051j508061J2724223J5331800J2961222J0238958
$$ y = [-7250969, 14045883, 25868324, 19502279, 5010247, -3041422, -5107220, -10821538, -20569927, -25747566, -23580155, -19334956, -15333156, -9019357, -1978346, -656967, -6306534, -12207063, -13057250, -10859823, -9522548, -8866659, -6254523, -632242, 6719730, 13302829, 16566487, 15025091, 7804246, -6271457, -25264090, -39515477, -37694668, -21857582, -9602399, -13804667, -25164797, -23609225, -3817762, 19763715, 31228416, 26718351, 10770709, -9563587, -25129347, -29822139, -29217484, -34923173, -46369804, -48341166, -32889806, -13376150, -6771525, -10449251, -9807665, -3866202, -7135720, -25036030, -42680081, -44188142, -31463919, -16132119, -3170897, 7068061]
1738G068061J910515j0809052j3089787K609529K0386913J9654701K955655r303803
1730B1382732q116163m534380q201866j2068598n410075P946984J4074699P804627
1722A2877960j246626k085113L842898N738167j493859j0141575j0254654l288955
1714f051757J018927o50770k442284j503834k004068l965960n44660P497990Q177457
1705d68959j555305o649392J582181O908528o686531k4284214j9203000M932990
1697d5423702J8512694R689541l508690n885548k879666j350902J715956M916019
1689b4214298N60983o835267l453310P781361Q902481j696917p397682n739821
1681c2092470r939128j4890477j504278J8846491J1808353j7004489k3321138
$$ y = [7068061, 8978576, -1830476, -14920263, -12310734, 8076179, 27730880, 30686535, 21382732, 13266569, 8732189, 530323, -11538275, -16948350, -9001366, 5073333, 12877960, 11631334, 9546221, 13389119, 19127286, 17633427, 7491852, -2762802, -6051757, -5032830, -5683600, -8125884, -9629718, -11633786, -15599746, -16144406, -8646416, -468959, -2024264, -8673656, -7091475, -182947, -6869478, -31153692, -50356692, -45423702, -26911008, -17221467, -20730157, -26615705, -29495371, -30846273, -29130317, -24214298, -23653315, -30488582, -33941892, -26160531, -17258050, -18954967, -26352649, -32092470, -42031598, -56922075, -58426353, -39579862, -27771509, -44775998, -68097136]
1674f8097136o364332j7790987n1812934j2373664J34229065K49247449J77026011
1667D04063472k8518469j57348965j16000061k0949287K62307k7443424k1275544
1660C2790029J0975669R504898j9730294k2795187K537531J0762924n563907r133707
1652I347956R390407J7432181J396651j3599713j1124939m418486k811102K692757
1644H305712J2211673J0359098m578874j4439502j1126754o357790o465734l059254
1636a5151425N913954R761921N393783K714751N006292L710419l488577q073299
1628E787819o905117n269701k640508O246282J5551879J2847910P38759n133798
1620B1223525j252568j71707p010147j1145605n386799L599662Q001107P311061
$$ y = [-68097136, -74461468, -92252455, -144065389, -156439053, -22209988, 227037461, 404063472, 375545003, 218196038, 102195977, 81246690, 81508997, 54065573, 32790029, 43765698, 53270596, 33540302, 10745115, 13282646, 24045570, 18481663, 9347956, 18738363, 36170544, 37567195, 23967482, 12842543, 8424057, 5612955, 8305712, 20517385, 30876483, 26297609, 11858107, 731353, -5626437, -12092171, -15151425, -9237471, 524450, 5918233, 8632984, 13639276, 17349695, 13861118, 5787819, -1117298, -6386999, -9027507, -2781225, 12770654, 25618564, 26357323, 21223525, 19970957, 19799250, 12789103, 1643498, -3743301, -143639, 7857468, 15168529]
1612A5168529K204700n836525r032669k360113L948427k339508j2835713q789714
1604a9872586Q230836J7693551J1910241L942674K407579J556470n56055K451493
1596B7764203O991347J47072j5197416j9022675n541095O730908M786013j457551
1588E200806j082888J169427J348695O688703J6122555J2560900q975031k5484494
1580G548673j6867174L930607J0805322R33462p805229n468066J977312O485291
1572A540198N105170j357248o825992m159909K372815o4800j1046198j3132244
1564b7568208Q04358J3758222J0940509K604135M101520R042218K316665j1976337
1556D023082j6490913p229170M125804R042524P911255K620594l179164k804763
$$ y = [15168529, 17373229, 11536704, 2504035, 143922, 4092349, 1752841, -11082872, -19872586, -11641750, 6051801, 17962042, 21904716, 24312295, 25868765, 25312710, 27764203, 34755550, 34902622, 19705206, 682531, -4858564, 1872344, 6658357, 5200806, 4117918, 5287345, 6636040, 13324743, 29447298, 42008198, 33033167, 7548673, -9318501, -5387894, 5417428, 6350890, -1454339, -6922405, -4945093, 1540198, 6645368, 5288120, -1537872, -5697781, -3324966, -3389766, -14435964, -27568208, -26763850, -13005628, -2065119, 539016, 4640536, 13682754, 15999419, 4023082, -12467831, -19697001, -15571197, -6528673, 1382582, 4003176, 824012, -1980751]
1548a980751K980475L149983m951014o959760M693413J3283811K643710j4444730
1540a584863j5123277k493179K098183m999284p605771L67792Q305008J1134504
1532i900887J4050093J4438429K774017j5503171k1190044r237560M033009O066825
1524a4469289J815938j802288o065921r311987l961613P891706J2079098L112619
1516a0711737o980280p194501j054021M438177R063393J1845727P174453l757406
1508B823805r923569o112104j56567J529580L182821P656760P945990n45674r918027
1499c516985j0479009k860699O905553J5171207J8195731J2352569K310268j988681
1491C6089954j486187p904952k1223971k3149836m151604J7602896J9244789M075867
$$ y = [-1980751, 999724, 4149707, -801307, -7761067, -3067654, 10216157, 12859867, -1584863, -16708140, -19201319, -17103136, -22102420, -29708191, -29340399, -21035391, -9900887, 4149206, 18587635, 21361652, 5858481, -15331563, -24569123, -20536114, -14469289, -12653351, -14455639, -20521560, -29833547, -33795160, -25903454, -13824356, -10711737, -17692017, -24886518, -25940539, -21502362, -12438969, -593242, 6581211, 2823805, -7099764, -13211868, -13368435, -11838855, -8656034, -999274, 6946716, 6401042, -3516985, -13995994, -16856693, -9951140, 5220067, 23415798, 35768367, 38078635, 36089954, 34603767, 26698815, 5474844, -17674992, -21826596, -4223700, 15021089, 19096956]
1483A9096956o809415n622917k916473n402469o400907o1056Q648035J2351489
1475A2883243J0527521O560768K043968k382817m508492k162205L372525O597992
1467C2932503J773608j0125714j9550378j7863261q386485k445263m197555o192868
1459c4055413j364182P753858J4091278J3705681O571311l315073p550654j470256
1451e633450O301412K720273r593217j3798355m206699M272609l31461q384133
1443b8653021n051950O521581J2312368Q952893L745246o23198o726635j1292373
1435b0815089p387019L097565J0550719J0939372Q503146O065418J818256m494447
1427H277921r965887j2691271j1636083m941939N257885J0377322N797170p1849
$$ y = [19096956, 12287541, 6664624, 3748151, -1654318, -8055225, -8116281, 531754, 12883243, 23410764, 29971532, 32015500, 29632683, 25124191, 22961986, 26334511, 32932503, 34706111, 24580397, 5030019, -12833242, -21219727, -23664990, -27862545, -34055413, -35419595, -27665737, -13574459, 131222, 6702533, 3387460, -4163194, -5633450, 667962, 3388235, -6204982, -20003337, -24210036, -19937427, -20268888, -28653021, -33704971, -27183390, -14871022, -5918129, -2172883, -2796081, -9522716, -20815089, -28202108, -25104543, -14553824, -3614452, 4888694, 10954112, 12772368, 8277921, -1687966, -14379237, -26015320, -30957259, -25699374, -15322052, -9524882, -9596731]
1419i596731L654763J3764569J6910699Q443744k609019o973781m528949o0320
1411A9004975K470228J054409k524717k793172J663613L443334l350648j1699777
1403G268245j0289374j084595K929639k575273p210436j960145Q352060J2788686
1395H218807P600604j969835q458278q098189l037033J355637K859858L832738
1387B304309M501483O43358p439913j0949592n306882M91450k555171p693410
1379b6004368l382601O005327O711436m44788r62527P992096J2114213M457007
1371F485795k575426J787755R022233N938965m308976q132712j687407N812446
1363A2342673N991961O19074k471941O88716M221598j725838j5945132k2675812
$$ y = [-9596731, -5941968, 7822601, 24733300, 33177044, 30568025, 23594244, 19065295, 19004975, 21475203, 22529612, 20004895, 17211723, 18875336, 22318670, 18968022, 7268245, -3021129, -4105724, -1176085, -3751358, -10961794, -12921939, -4569879, 8218807, 15819411, 13849576, 5391298, -2706891, -5743924, -4388287, -1528429, 2304309, 6805792, 7449150, 9237, -10940355, -16247237, -15755787, -18310958, -26004368, -29386969, -23381642, -16670206, -17114994, -18077521, -10085425, 2028788, 6485795, 3910369, 5698124, 14720357, 20659322, 16350346, 8217634, 6530227, 12342673, 18334634, 18953708, 16481767, 17170483, 21392081, 19666243, 3721111, -18954701]
1355a8954701j1602923M996491Q545440K051557L049454J1538554Q963628p443872
1347A143628j5388623k789310J2416824J2630968P232541R372548Q314888r135342
1339B3798122k6693457j8472764Q595820K2245965J0904191n678925j0571637
1332D127315p220721j497333P055756J1722209J943177j3637116j2614202M757394
1324e363521J0903660n447052j7942784l389119K0043800J9936922k402506j8149002
1316a809602j4476647m756222j61557K995021P081331O871238K956746K788989
1308A489297N006324M39322p777778m244619J1942357J9873436P740085o210902
1300B8257522O783J7561142J8707667k343528k1190568j7984472k883599J316159
$$ y = [-18954701, -30557624, -25561133, -17015693, -14964136, -11914682, -376128, 8587500, 1143628, -14244995, -17034305, -4617481, 8013487, 15246028, 24618576, 32933464, 23798122, -2895335, -21368099, -12772279, 9473686, 20377877, 14698952, 4127315, -3093406, -4590739, 2465017, 14187226, 16130403, 2493287, -10120915, -5363521, 5540139, 93087, -17849697, -21238816, -1195016, 18741906, 16339400, -1809602, -16286249, -21042471, -21204028, -18209007, -11127676, -4256438, -1299692, 1489297, 6495621, 6934943, -842835, -5087454, 6854903, 26728339, 34468424, 28257522, 28264305, 45825447, 64533114, 62189586, 40999018, 23014546, 20130947, 21447106]
1292B1447106r721156j9259056j3339993K889506J3706587J1143153J015875o673658
1284A208364q419750o842477l831521O31261L887759J749059l552758l495195
1276a8665258L683820O739456l337389j6575351j4285931M317024J8350979J2372188
1268g400462l778260r770842p70469J1192211J5965376J3953115Q239167m93743
1260B7136093r457405j3088823j0045486m823983p53737K332186K500641l676686
1252i877200j1634247r185533O585025K0098431J4704159m416780j5284686o840279
1244a5851110Q447916J2906302N926851Q59402M310806P802352J594687j0450848
1236A5546358j5980057j1246609n087935m173716k906384M969382J1718390N279106
$$ y = [21447106, 11725950, -7533106, -20873099, -17983593, -4277006, 6866147, 7882022, 1208364, -7211386, -14053863, -17885384, -17254123, -13366364, -11617305, -15170063, -18665258, -14981438, -8241982, -11579371, -28154722, -42440653, -38123629, -19772650, -7400462, -11178722, -20949564, -21720033, -10527822, 5437554, 19390669, 27629836, 27136093, 17678688, 4589865, -5455621, -10279604, -11033341, -8701155, -6200514, -9877200, -21511447, -30696980, -24111955, -4013524, 10690635, 6273855, -9010831, -15851110, -7403194, 5503108, 11429959, 12289361, 16600167, 24402519, 25997206, 15546358, -433699, -11680308, -16768243, -20941959, -23848343, -18878961, -7160571, -1881465]
1228a881465q230317p679865J1658072K5122299J0115469k0122469l1770410j4910893
1220c7699579O569663J0932759M546168L573241P479321O177165J963564N255007
1212H797309J2705553Q749726q920473k2441663j8818961p324823k043694R8933
1204b9198093Q986888J7712448R319502j2944072k2347433m367154K0047914K1059949
1196H269949j43082j5140200q190222N975220P521506j586532n403241J963051
1188f733551J1432848J2889136M505951q882145j8757610j6638110k489706J1815315
1180a2857872J4019983N194934l834905o907596n667808j089665P341540J3453466
1172I652077P021658j0593996k2731809j6471885O68032J0354915N884521k223388
$$ y = [-1881465, -10111782, -17791647, -6133575, 18988724, 29104193, 8981724, -22788686, -37699579, -31129916, -20197157, -15650989, -12077748, -4598427, 1578738, 3542302, 8797309, 21502862, 30252588, 21332115, -1109548, -19928509, -27253332, -29297026, -29198093, -20211205, -2498757, 6820745, -6123327, -28470760, -32837914, -12790000, 8269949, 8126867, -7013333, -15203555, -9228335, -1706829, -3293361, -8696602, -6733551, 4699297, 17588433, 22094384, 13212239, -5545371, -22183481, -24673187, -12857872, 1162111, 6357045, 2522140, -4385456, -10053264, -11142929, -3801389, 9652077, 16673735, 6079739, -16652070, -33123955, -32455923, -22101008, -16216487, -18439875]
1164a8439875j521370P939316J5535985J2704134J807049p009601p081807j624626
1156B309205K489227L943777N087364L986322k876680j0394517q295323K083171
1148a667454O136563k399698j0108995m821702L189847l061740j7494104j7056547
1140d7283830K763862J9193666J5010501J611843j645956M447031O619745L458916
1132D175778L914691P400259M116860n838155j1363003j0119136j1833793j7080204
1124c6626703j1272719R764923K5151655J6123632m423962r372927K854907Q275260
1116D74066m147125j7230478j4488885l038769L509059P035250J4490696J9340088
1108E943902J1610588k132186p055244l076760j959313n032995k698772M584395
$$ y = [-18439875, -19961245, -12021929, 3514056, 16218190, 18025239, 11015638, 3933831, 2309205, 4798432, 8742209, 13829573, 17815895, 14939215, 4544698, -3750625, -1667454, 4469109, 2069411, -8039584, -12861286, -9671439, -12733179, -30227283, -47283830, -44519968, -25326302, -10315801, -8703958, -10349914, -5902883, 716862, 4175778, 8090469, 15490728, 19607588, 13769433, 2406430, -7712706, -19546499, -36626703, -47899422, -38134499, -12982844, 3140788, -1283174, -10656101, -7801194, 474066, -3673059, -20903537, -35392422, -38431191, -34922132, -27886882, -13396186, 5943902, 17554490, 15422304, 8367060, 5290300, 3330987, -1702008, -4400780, 183615]
1100A83615M562416m462255q442225q81580O305981L726299k95324L371667P402046
1091A1470640J511645q547282j0390302m686714j055364j387783j145528q78177
1083a5108865k581297q27143P857296J2958815L740447j0184181j0554834N02208
1075a4197554L644607n753385j0922945l034643M836936J958517j832571M844128
1067b0456910J3702173R969458m144214j3657257j1117684q72078J0035934J4704054
1059a836524P487055p045917j3523564m900816N558180L280501m891578j988875
1051a7861538J1130768J6622117O970227n399737q118627l935072j330630k101063
1043d023555m143400p538862j1712443j2595776p665283l2851N349005O480126
$$ y = [183615, 4746031, 283776, -8158449, -9040029, -2734048, 992251, 696927, 4068594, 11470640, 12982285, 4435003, -5955299, -10642013, -11697377, -13085160, -14230688, -15108865, -17690162, -18517305, -10660009, 2298806, 6039253, -4144928, -14699762, -14197554, -10552947, -16306332, -27229277, -30263920, -25426984, -23468467, -25301038, -20456910, -6754737, 3214721, -929493, -14586750, -25704434, -26576512, -16540578, -1836524, 5650531, -1395386, -14918950, -19819766, -14261586, -10981085, -15872663, -17861538, -6730770, 9891347, 16861574, 11461837, 3343210, -591862, -1922492, -4023555, -8166955, -15705817, -27418260, -40014036, -47679319, -47712170, -42363165, -35883039]
1035c5883039M331412J481752R81845L483636O206547P127415P286355O172143
1027A188066M31946p867777r032283M9543P048974J011130q641748m727317J0250246
1018a0289220J6515612O511006n722260p820223m907255n848651q279438n587069
1010b5427498K034926J0297940J5421788J2293060q64382j2981936r027125P407589
1002h45638J5740380P937792j340700j834862m102771j5403635k0172341n114231
994b5136006J2911046R002267j0491282j6808178j536648J4745589J5412043N797308
986C896139l490435r560853r489456R18759J4928869J8021555Q440994m57112
978B3208460k078156m327183j0654242j0856342R17355J3906749J5763363P922040
$$ y = [-35883039, -31551627, -30069875, -29088030, -25604394, -19397847, -12270432, -4984077, 1188066, 1620012, -6247765, -15280048, -15230505, -8181531, -7170401, -15812149, -20539466, -10289220, 6226392, 12737398, 7015138, -805085, -5712340, -11560991, -19840429, -25427498, -23392572, -13094632, 2327156, 14620216, 13755834, 773898, -8253227, -845638, 14894742, 22832534, 21491834, 19656972, 15554201, 150566, -20021775, -25136006, -12224960, -3222693, -13713975, -30522153, -32058801, -17313212, -1901169, 3896139, 405704, -9155149, -18644605, -17725846, -2796977, 15224578, 23665572, 23208460, 21130304, 16803121, 6148879, -4707463, -3790108, 10116641, 25880004, 33802044]
970C3802044j508774q534816j0523818n182991J202425k313600j2644788j2809205
962a8513523J221757J0568972J982752j0311384p063962O158093J0788084O199117
954A029906P185257J5645421J6242166J486909j5887017j9854813r316588L784720
946C15961P529267M41090p099596m867385J690278k620876j6872684j9497540
938d0981485r69980J6261364R831733n798300j238982J9325436K3863599M776197
930B5069582r113421j36531J1549253M499698q943437o281509P083647Q648661
922C2375943m507946j3963968r541452l86759K228501k283641q161090r418269
914a3658681k800754P344917J0648003L841991m000124o053066p747035j2885265
$$ y = [33802044, 32293270, 23758454, 13234636, 8051645, 9254070, 6940470, -5704318, -18513523, -17291766, -6722794, -4740042, -15051426, -22115388, -15957295, -5169211, 1029906, 8215163, 23860584, 40102750, 41589659, 25702642, 5847829, -3468759, 315961, 7845228, 8286318, 1186722, -3680663, -1990385, -4611261, -21483945, -40981485, -41951465, -25690101, -15858368, -21656668, -22895650, -3570214, 20293385, 25069582, 15956161, 15819630, 27368883, 31868581, 22925144, 16643635, 23727282, 32375943, 27867997, 13904029, 4362577, 3975818, 6204319, 3920678, -4240412, -13658681, -16459435, -9114518, 1533485, 5375476, 1375352, -4677714, -12424749, -25310014]
906b5310014j1931129J691752J4900314J2606319K967393M033332J1990670P342758
898A8291395r639814j6773589o841187O24679o124640j0789540J077533J4691226
890a5483937R964683m006986l181633J2424529J9266120O911788r045840j2942212
882C906512q061847m281778l010043j811279j493357j204152L453168J0899590
874a603186J1745731L245079l857814j114015L743067r88998j1730461j4934232
866a5494829q075522k064205k381960q70627Q735485J7649914J3224918k184729
858H538445j2975757j0004172o11338L131182L4882j283436L718102Q969796O879826
849F397530l19821k713493M575770J4735584J6641970O650038q149739j6709437
$$ y = [-25310014, -37241143, -35549391, -20649077, -8042758, -5075365, -1042033, 10948637, 18291395, 8651581, -8122008, -14963195, -14338516, -20463156, -31252696, -30175163, -15483937, -5519254, -9526240, -12707873, -283344, 18982776, 25894564, 16848724, 3906512, -4155335, -8437113, -11447156, -13258435, -14751792, -15955944, -12502776, -1603186, 10142545, 13387624, 9529810, 8415795, 12158862, 11169864, -560597, -15494829, -23570351, -25634556, -28016516, -28887143, -20151658, -2501744, 10723174, 8538445, -4437312, -14441484, -15052822, -11921640, -11886758, -13170194, -9452092, -482296, 6397530, 6077709, 3364216, 7939986, 22675570, 39317540, 45967578, 37817839, 21108402]
841B1108402j3297872k164519N980525M239783k938370n292691l67636L323488
833A0591110o59866o492102m919139K443488O184967M135248L304106O183574
825B0771386N625977k512462j0831300j1205835p257306p870835j2562648j2043832
817c7886855k254811R488800J3360323P497211j164723m007273Q83711O186505
809g897112L605509m475335o886324L37618P518737O577881M002531Q408470J2729560
800B3921535L869845j3111172j8114522n849183M580499k498351j6727088j8366708
792d2295145o232910M995739Q307353R966602J3767350J4202669Q193773K575113
784A3480544M206707R130610P526322l025374j3713861j4379535n329827K776159
$$ y = [21108402, 7810530, 5646011, 11626536, 15866319, 12927949, 7635258, 7267622, 10591110, 9931244, 3439142, -1479997, 963491, 7148458, 11283706, 14587812, 20771386, 26397363, 23884901, 13053601, 1847766, -5409540, -13280375, -25843023, -37886855, -40141666, -30652866, -17292543, -9795332, -10960055, -14967328, -14083617, -7897112, -4291603, -8766938, -15653262, -15315644, -7796907, -1219026, 2783505, 11191975, 23921535, 27791380, 14680208, -3434314, -9283497, -4702998, -7201349, -23928437, -42295145, -48528055, -43532316, -35224963, -25258361, -11491011, 2711658, 10905431, 13480544, 17687251, 26817861, 34344183, 31318809, 17604948, 3225413, -2104414, 671745]
776F71745J962043k748964q00926P322368R078090j875113j4923540j6314058
768a7628355o767655K819735P422777R463971Q342329O38213r386627j1267556
760a6363168l220770M233617L612268P49833M140888J1155707J2264745N056017
752B1629137l206288o052106n149159n989478r480633j0291068l849382O373671
744a6015306J1294209O841783j189891n289318n058949l670763m26978N705422
736g809791Q868896K730702p005179p675976J540758P674244M172326L67568L984599
727F848147O845979o65813j0932666r687231M53010L330466n033415j0437303
719a9278826l734379M856821K646900n855250p110386O54607O637038M673710
$$ y = [671745, 2633788, -115176, -916102, 6406266, 15484356, 13609243, -1314297, -17628355, -24396010, -21576275, -14153498, -4689527, 3652802, 4291015, -5095612, -16363168, -19583938, -15350321, -11738053, -10988220, -6847332, 4308375, 16573120, 21629137, 18422849, 12370743, 7221584, 1232106, -8248527, -18539595, -22388977, -16015306, -4721097, 2120686, 930795, -4358523, -9417472, -13088235, -13515213, -7809791, 1059105, 3789807, -3215372, -10891348, -9350590, -1676346, 2495980, 2863548, 6848147, 13694126, 13028313, 2095647, -7591584, -7138574, -3808108, -8841523, -19278826, -23013205, -18156384, -15509484, -21364734, -28475120, -27820513, -21183475, -16509765]
711a6509765J42714r48004l7482J42613J958884P537871J2133803R456802J457010
702A5334446l500273k141146l82321m325220j1492315j3784408o854797N435403
694b1710631J4349212J3435358M802808j594680J286044P297130L533727j0905160
686A0493808k0303819j2192851N192950J3982540R805855K852121p96872n102449
678C931283j0549180r233234P33682Q085187M178702l608043l938689R48817J228101
669h223374k655861j418644N598755P868930R12402n574765k343632N358442N775335
660E297588k457117r281567p623990j998287r93161n435997p639922j782557P985442
651b3929568J1746732N180452n691316j1444207q589742r68124N711897Q556783
$$ y = [-16509765, -16367051, -17315055, -17352537, -17209924, -15251040, -7713169, 4420634, 13877436, 15334446, 11834173, 9693027, 9310706, 4985486, -6506829, -20291237, -27146034, -21710631, -7361419, 6073939, 10876747, 9282067, 10568111, 17865241, 21398968, 10493808, -9810011, -22002862, -16809912, -2827372, 6978483, 9830604, 9033732, 3931283, -6617897, -15851131, -15117449, -7032262, -2853560, -6461603, -10400292, -9451475, -8223374, -10879235, -12297879, -6699124, 1169806, 2082208, -3492557, -5836189, -477747, 5297588, 2840471, -6441096, -14065086, -16063373, -17056534, -22492531, -30132453, -31915010, -23929568, -12182836, -7002384, -12693700, -24137907, -32727649, -33695773, -27983876, -19427093]
643a9427093Q174928P001170O822534P242193P117383O871618P079102N417545
635C6299380p77355q410168j0527163o593429m791001r541558j2765328n130218
627b2236840Q018910J1866959L021844m825669J66970J1577177J4074366M443917
619B6107634n254838n183994k02643q10751p355517j0626144o428677q84495R85288
610i654137L126503Q834582J1230623L388661p421771q283019q45192J453774
602A830024l684792m070407L607293N620388m341284j0787898j376202R717962
594c484916L389836j1276802r541285R293633K0455838J2237910P03418J25373
586B1903005K407389k751852p357540o94032Q837871N078738j0323931j9409340
$$ y = [-19427093, -11252165, -4250995, 2571539, 9813732, 16931115, 23802733, 30881835, 36299380, 35522025, 27111857, 16584694, 9991265, 5200264, -4341294, -17106622, -22236840, -14217930, -2350971, 670873, -4154796, -3987826, 7589351, 21663717, 26107634, 20852796, 15668802, 15466159, 14655408, 7299891, -3326253, -9754930, -10639425, -9654137, -6527634, 2306948, 13537571, 16926232, 9504461, 1221442, 376250, 1830024, -1854768, -5925175, -2317882, 3302506, -1038778, -11826676, -13202878, -3484916, -95080, -11371882, -20913167, -11619534, 8836304, 21074214, 21777632, 21903005, 24310394, 21558542, 14201002, 13506970, 22344841, 27423579, 17099648, -2309692]
578b309692j1910675M163243J4504610J2299840J358534q075431q197736k267714
570d35021p71763o203730q669099j624786O371843M107926m710117o733693J707791
561a6960649J0674555J1024620M270206k447585m773700l299598j232290q66506
553c610947j510574k246214n471204j2225196j4903741m459807J2721791J7190143
545a4515749K534373j2464967q253641Q802046J7297771J0963039K767669K569070
537I699611N944917N502126N49303o186596j1630899j1374580m177687L083071
529h590734L214802o25158j038579N03464j936777m951040o23017O830963N503723
520a712353k769727l081537P063535J1274401N20626j1529169j0226428j968936
$$ y = [-2309692, -14220367, -10057124, 4447486, 16747326, 18105860, 10030429, 1832693, -435021, -1206784, -7410514, -16079613, -17704399, -11332556, -7224630, -11934747, -18668440, -16960649, -6286094, 4738526, 9008732, 6561147, 1787447, -1512151, -2744441, -3610947, -5121521, -7367735, -12838939, -25064135, -39967876, -44427683, -31705892, -14515749, -11981376, -24446343, -32699984, -23897938, -6600167, 4362872, 7130541, 9699611, 15644528, 21146654, 21695957, 15509361, 3878462, -7496118, -11673805, -8590734, -5375932, -6001090, -7039669, -6536205, -8472982, -13424022, -14047039, -7216076, -1712353, -4482080, -7563617, -500082, 10774319, 11294945, -234224, -10460652, -12429588]
512a2429588j052968o353930o240492J051183O732923O749530M877359L242322
504c423661Q03333o27924J625492M964441N672029O523429J1646199J6486433
496D3669771J2275255p85370j3321143j8734711j7506461j1250547j483303O096475
488a040034N279475j276755l982861P01670N947393M896602r63941n948033p310014
479c696498n747453k792533N2298J922200L050860L096813O14137l341005m096947
470a0938128J17919L929985K303711j391629j329042O12708r73585l965516k139515
461a3773092K271724J338055l345248j466996P454878J0385778J522643o773632
453b385890l009600N264403M342294l750366o393749j602869J011629j576557
$$ y = [-12429588, -13482556, -19836486, -26076978, -25025795, -18292872, -11543342, -6665983, -3423661, -2620328, -3248252, -1622760, 3341681, 9013710, 15537139, 27183338, 43669771, 55945026, 55159656, 41838513, 23103802, 5597341, -5653206, -7136509, -1040034, 4239441, 2962686, -1020175, -318505, 5628888, 10525490, 9561549, 3613516, -3696498, -9443951, -12236484, -12184186, -10261986, -7211126, -4114313, -3500176, -6841181, -10938128, -10820209, -6890224, -4586513, -5978142, -7307184, -6694476, -7668061, -11633577, -13773092, -11501368, -10163313, -13508561, -14975557, -7520679, 2865099, 4387742, -2385890, -5395490, -131087, 4211207, 460841, -5932908, -7535777, -6524148, -8100705]
445h100705j506610M697339R785123Q433916M888284K932177j572711j1243085
437H313728j8485576j4571093k217062Q453190J2535365J1768793P230399o58647
429A2369097o589670m214515L293272M881041k937932r325345l049037J1537927
421E964838J8758944J0194967o414862j6970079j5355437o635521P41008K890716
413f825426J346585j017709k617472k290053J010205N607696O594224J515537
405C323587m754009n301722p86962J826504N75795J300315O297942Q153435J095759
396A1730644q190557r603083m518341j652709j471418L274815J2050620J4544895
388A6164866P061644j156375l023444l624008p984331r703615k193132O942104
$$ y = [-8100705, -9607315, -4909976, 4875147, 13309063, 18197347, 21129524, 19556813, 8313728, -10171848, -24742941, -26960003, -18506813, -5971448, 5797345, 13027744, 12369097, 5779427, 1564912, 4858184, 9739225, 6801293, -2524052, -5573089, 5964838, 24723782, 34918749, 28503887, 11533808, -3821629, -10457150, -9716142, -6825426, -5478841, -6496550, -9114022, -11404075, -10393870, -4786174, 1808050, 3323587, -1430422, -6732144, -7519106, -5692602, -5116807, -3816492, 2481450, 10634885, 11730644, 3540087, -6062996, -10581337, -12234046, -13705464, -10430649, 1619971, 16164866, 23226510, 22070135, 19046691, 15422683, 7438352, -2265263, -4458395, 2483709]
380B483709N125242o083663j3143791r842076l214576l42296J85409J664224K997341
371b0170477K425547J469716K297150N112242R044476J1909058R855411J844144
363B3787267o940993j1253831j2789140j4483414j1555244J575485J7190293J9631935
355E162358O658822o536636q459479m677123m276627m682124P40840Q748642J0671872
346C350545N812656J106113O68272L037650N521312N041792j255635j0238153
338A3044552j2708382n631209J480707L9557m479697k608462K623923J891472
330f347539k711409j023676O224920P601944Q60363l224348m4955J739932k040279
321A034953k340860M831128O691881o206300k0367259j6799551l41924P095193
$$ y = [2483709, 7608951, 1525288, -11618503, -21460579, -24675155, -25017451, -24832042, -23167818, -20170477, -17744930, -16275214, -13978064, -8865822, 178654, 12087712, 21943123, 23787267, 16846274, 5592443, -7196697, -21680111, -33235355, -31659870, -14469577, 5162358, 11821180, 5284544, -3174935, -7852058, -12128685, -16810809, -16069969, -7321327, 3350545, 9163201, 10269314, 10937586, 13975236, 19496548, 24538340, 23282705, 13044552, 336170, -5295039, -3814332, -3774775, -8254472, -10862934, -8239011, -6347539, -9058948, -10082624, -3857704, 3744240, 4604603, 1380255, 1335300, 3075232, 1034953, -1305907, 3525221, 10217102, 4010802, -16356457, -33156008, -33497932, -26402739]
313b6402739l34163n450401K946628J2363308P183048o420418r420581K640731
305b2894587J4502582J3076209L675045M43076P260959J4112620J0508004k418349
297C8265559j4152898j6185192r163109j76375M530535L940498J274376k86886
289H046508j064966l544676p128337o641637P48633Q832137P883542k498935j1526957
280f894688j0361349k046015M607939N692469K526415l145013p983514n680995
272b3284751N194039J4740751J1930209J05946o932012m330557j244356m150342
264g971073o398280q47644O638678O084528j97732j123628N445311R309871L668665
255A4608696m802120n704979J356140P884089P999105L868160N21756n70319j350122
$$ y = [-26402739, -26736902, -32187303, -29240675, -16877367, -9694319, -16114737, -25535318, -22894587, -8392005, 4684204, 8359249, 8802325, 16063284, 30175904, 40683908, 38265559, 24112661, 7927469, -1235640, -1412015, 3118520, 7059018, 8333394, 8046508, 6981542, 3436866, -3691471, -10333108, -9584475, -752338, 7131204, 4632269, -6894688, -17256037, -19302052, -14694113, -9001644, -6475229, -9620242, -17603756, -23284751, -18090712, -3349961, 8580248, 8686194, 1754182, -2576375, -3820731, -7971073, -14369353, -15216997, -8578319, -2493791, -2691523, -3815151, 1630160, 10940031, 14608696, 9806576, 4101597, 5457737, 13341826, 21340931, 25209091, 25730847, 25160528, 23810406]
246B3810406k829643l582231k998387l619630p479489j1065672q007399K018256
238a3753789J0912093J1252493M700376j613678m024036l839085k660408j070984
230i7018m90554j602763k017672m5411Q52671k857807o727035l089041N688389
221a0386241P665826j556196j0722510q146009J855029O130630J773050j906846
213a5293267Q80889M983985M824016L204205M344525M944745k22768p250876o111149
204e695695M788928J4312317J2152278J701654n141345k907604K944231N103056
196B7257820K339068k233518n644202n809635k124200K063844J386365m195825
188A3039717p848352n263164j457683l103063p677368o966012M94325P509470
$$ y = [23810406, 20980763, 17398532, 14400145, 10780515, 3301026, -7764646, -15772045, -13753789, -2841696, 8410797, 13111173, 11497495, 7473459, 3634374, 973966, -97018, -587572, -2190335, -4208007, -4253418, -3400747, -6258554, -12985589, -16074630, -10386241, -2720415, -4276611, -14999121, -23145130, -21290101, -15159471, -13386421, -15293267, -14412378, -9428393, -4604377, -1400172, 2944353, 7889098, 7666330, 415454, -5695695, -906767, 13405550, 25557828, 27259482, 22118137, 19210533, 22154764, 27257820, 29596888, 27363370, 21719168, 15909533, 13785333, 15849177, 17235542, 13039717, 5191365, -71799, -1529482, -4632545, -12309913, -19275925, -18781600, -11272130]
180a1272130Q455535M993103J261315o96785k43567J532657P18456m484493q444713
171h180622m785954K442617L324261j965643k704420M361514Q533115K369694
163C394562n827010m910157K926310P751265N993086L63565o737822j1074516
155h120717o003196O289725J1621919K884695p012053m359013L244550Q92570
147e61520o818983m546802M328548K368591q938907q584695O672365J2652624
139c428779k997427j8131078j0257539Q744306J3723114M698767l344L413832
131d238148L859822L95973K137774O298392R54925j0193839r952365K236633O154676
122b346157n822506j4076778k855752J3746666J3741702L95332o025443n40387
$$ y = [-11272130, -2816595, 2176508, 3437823, 2741038, 2497471, 4030128, 4748584, 264091, -8180622, -12966576, -10523959, -7199698, -9165341, -11869761, -7508247, 1024868, 3394562, -2432448, -7342605, -4416295, 3334970, 9328056, 9691621, 2953799, -8120717, -14123913, -7834188, 3787731, 6672426, -339627, -4698640, -1454090, -561520, -7380503, -11927305, -7598757, -5230166, -14169073, -22753768, -16081403, -3428779, -6426206, -24557284, -34814823, -26070517, -12347403, -7648636, -7651980, -4238148, -378326, 17647, 2155421, 8453813, 9408738, -785101, -10737466, -8500833, -2346157, -8168663, -22245441, -25101193, -11354527, 2387175, 2782507, -3242936, -3783323]
114c783323L030315k056843n641199n687O872683N004409j650842k412463L111378
105B468428N191116m30376o022455l404460M338188P679713L928034n64853j249269
96A1934066j779386o268015j0399746o452118M700393J2923730J0983075K539583
88A8181582l814529m799247m043239n470444q011700p400296k248581L231415
80a4375039M246633K274988L109829P288349P801306Q77339o280059m828738K435964
71B550572N100003M99068l875807l413717k255054l550431l169469J553924M574440
62a986471M1026o808194n876689L327609J1301776J1708083P518944L505399j14998
53B2616485l912598n430395l679418k956542o496930r126562l159503Q756395
$$ y = [-3783323, -753008, -2809851, -8451050, -8456737, -1584054, 3420355, 1769513, -642950, 2468428, 7659544, 7229168, 1206713, -2197747, 2140441, 9820154, 13748188, 13183335, 11934066, 10154680, 3886665, -6513081, -12965199, -8264806, 4658924, 15641999, 18181582, 14367053, 9567806, 5524567, 54123, -7957577, -15357873, -17606454, -14375039, -10128406, -7853418, -4743589, 2544760, 10346066, 11223405, 4943346, 114608, 2550572, 7650575, 8149643, 4273836, 860119, -1394935, -4945366, -8114835, -6560911, -1986471, -1945445, -8753639, -14630328, -11302719, -943, 11707140, 19226084, 22731483, 22616485, 18703887, 13273492, 9594074, 6637532, 140602, -8985960, -12145463, -3389068]
45c389068J4168936O797037m646178q346333m454397j551881k544739l039872
37g006495j615542j500174j744585K576928Q969531P464313l172629j0077646
29f106299m437097M945671N365751j434954n321526m145357j780732L058287J1590495
20A734239J4124330J362455j5797819j5893201K160126J5394057Q805812n508627
12F381372r136658k778521J45855m733349q998929m688773O785860J6176845J3549776
3A2703478j203777j3907706j0160836
0a2568841
$$ y = [-3389068, 10779868, 17576905, 12930727, 4584394, 129997, -1421884, -3966623, -7006495, -8622037, -10122211, -11866796, -9289868, -320337, 7143976, 3971347, -6106299, -10543396, -5597725, -231974, -1666928, -6988454, -11133811, -12914543, -9856256, 1734239, 15858569, 17221024, 1423205, -14469996, -12309870, 3084187, 11889999, 6381372, -2755286, -5533807, -5387952, -10121301, -19120230, -23809003, -17023143, -846298, 12703478, 11499701, -2408005, -12568841]
##END NTUPLES=NMR SPECTRUM
##END=
