##TITLE=31Pdec_LR-664-RM3AK
 CDCl3, 104 sc
 2.4.2019
##JCAMPDX= 6.0         $$ Bruker NMR JCAMP-DX V2.0
##DATA TYPE= NMR SPECTRUM
##DATA CLASS= NTUPLES
##ORIGIN= UXNMR, Bruker Analytische Messtechnik GmbH
##OWNER= root
$$ XWIN-NMR		Version 3.5
$$ Tue Apr  2 15:26:41 2019 Russian Standard Time (UT+4h)  she@DPX200
##.OBSERVE FREQUENCY= 81.013821
##.OBSERVE NUCLEUS= ^31P
##.ACQUISITION MODE= SIMULTANEOUS
##.ACQUISITION SCHEME= undefined
##.AVERAGES= 104
##.DIGITISER RES= 17
##SPECTROMETER/DATA SYSTEM= spect
##.PULSE SEQUENCE= zgpg30
##.SOLVENT NAME= CDCl3
##.SHIFT REFERENCE= (INTERNAL, CDCl3, 0, 182.463)
##AUDIT TRAIL= $$ (NUMBER, WHEN, WHO, WHERE, WHAT)
$$ ##TITLE= Audit trail, XWIN-NMR		Version 3.5
$$ ##JCAMPDX= 5.01
$$ ##ORIGIN= Bruker BioSpin GmbH
$$ ##OWNER= she
$$ F:/spectra/data/she/nmr/P31/1/pdata/1/auditp.txt
$$ ##AUDIT TRAIL=  $$ (NUMBER, WHEN, WHO, WHERE, WHAT)
(   1,<2019-04-02 15:26:04.59 +0400>,<she>,<DPX200>,
      <continue with go, POWCHK disabled, PULCHK disabled
       configuration hash MD5:
       00 E9 B6 7A A2 85 ED C7 34 08 36 98 17 FE 4E 26
       data hash MD5: 32K
       5B 73 B1 37 70 50 FF 39 D3 54 CE D3 FB C2 F0 C5>)
(   2,<2019-04-02 15:26:06.65 +0400>,<she>,<DPX200>,
      <Start of raw data processing
       efp BC_mod = 2 LB = 1 FT_mod = 6 PKNL = 1 PHC0 = -1797.404 PHC1 = 40.39897 SI = 64K 
       data hash MD5: 64K
       60 D6 8D 69 CB 72 6A CE 48 17 3A 8B 0A 3B CF C5>)
$$ ##END=
$$ 
$$ hash MD5
$$ DE EC 52 84 63 0B 1C CF F9 EC DD B2 83 5C 35 33
##$RELAX= 
##$RELAX= 
##$RELAX= 
##$RELAX= 
##$RELAX= 
##$RELAX= 
##$RELAX= 
##$RELAX= 
$$ Bruker specific parameters
$$ --------------------------
##$DU= <F:/spectra>
##$EXPNO= 1
##$NAME= <P31>
##$PROCNO= 1
##$TYPE= <nmr>
##$USER= <she>
##$AMP= (0..31)
100 100 100 100 100 100 100 100 100 100 100 100 100 100 100 100 100 100 
100 100 100 100 100 100 100 100 100 100 100 100 100 100 
##$AQSEQ= 0
##$AQ_mod= 1
##$AUNM= <au_zg>
##$AUTOPOS= <>
##$BF1= 81.014009
##$BF2= 200.13
##$BF3= 200.13
##$BF4= 200.13
##$BF5= 200.13
##$BF6= 200.13
##$BF7= 200.13
##$BF8= 200.13
##$BYTORDA= 1
##$CFDGTYP= 0
##$CFRGTYP= 5
##$CHEMSTR= <none>
##$CNST= (0..31)
1 1 145 1 1 1 1 1 1 1 1 1 1 1 1 1 1 1 1 1 1 1 1 1 1 1 1 1 1 1 1 1 
##$CPDPRG= <waltz16>
##$CPDPRG1= <>
##$CPDPRG2= <waltz16>
##$CPDPRG3= <>
##$CPDPRG4= <mlev>
##$CPDPRG5= <mlev>
##$CPDPRG6= <mlev>
##$CPDPRG7= <mlev>
##$CPDPRG8= <mlev>
##$CPDPRGB= <>
##$CPDPRGT= <>
##$D= (0..31)
0 1 0 0 0 0 0 0 0 0 0 0.03 2e-05 3e-06 0 0 0 0 0 0 0 0 0 0 0 0 0 0 0 0 
0 0 
##$DATE= 1554204218
##$DBL= (0..7)
120 120 120 11 120 120 24 19 
##$DBP= (0..7)
150 150 150 150 150 150 150 150 
##$DBP07= 0
##$DBPNAM0= <>
##$DBPNAM1= <>
##$DBPNAM2= <>
##$DBPNAM3= <>
##$DBPNAM4= <>
##$DBPNAM5= <>
##$DBPNAM6= <>
##$DBPNAM7= <>
##$DBPOAL= (0..7)
0.5 0.5 0.5 0.5 0.5 0.5 0.5 0.5 
##$DBPOFFS= (0..7)
0 0 0 0 0 0 0 0 
##$DE= 6
##$DECBNUC= <off>
##$DECIM= 4
##$DECNUC= <off>
##$DECSTAT= 4
##$DIGMOD= 1
##$DIGTYP= 9
##$DL= (0..7)
0 0 52 120 120 21 21 25 
##$DP= (0..7)
$$ [...]
##$SUBNAM2= <"">
##$SUBNAM3= <"">
##$SUBNAM4= <"">
##$SUBNAM5= <"">
##$SUBNAM6= <"">
##$SUBNAM7= <"">
##$SUBNAM8= <"">
##$SUBNAM9= <"">
##$SW= 369.568048894756
##$SWIBOX= (0..15)
0 1 3 0 0 0 0 0 0 0 0 0 0 0 0 0 
##$SW_h= 29940.119760479
##$TD= 32768
##$TD0= 1
##$TE= 0
##$TE2= 300
##$TE3= 300
##$TEG= 300
##$TL= (0..7)
0 120 53 12 22 120 120 120 
##$TP= (0..7)
150 150 150 150 150 150 150 150 
##$TP07= 0
##$TPNAME0= <>
##$TPNAME1= <>
##$TPNAME2= <>
##$TPNAME3= <>
##$TPNAME4= <>
##$TPNAME5= <>
##$TPNAME6= <>
##$TPNAME7= <>
##$TPOAL= (0..7)
0.5 0.5 0.5 0.5 0.5 0.5 0.5 0.5 
##$TPOFFS= (0..7)
0 0 0 0 0 0 0 0 
##$TUNHIN= 0
##$TUNHOUT= 0
##$TUNXOUT= 0
##$USERA1= <user>
##$USERA2= <user>
##$USERA3= <user>
##$USERA4= <user>
##$USERA5= <user>
##$V9= 5
##$VALIST= <valist>
##$VCLIST= <CCCCCCCCCCCCCCC>
##$VD= 0
##$VDLIST= <DDDDDDDDDDDDDDD>
##$VPLIST= <PPPPPPPPPPPPPPP>
##$VTLIST= <TTTTTTTTTTTTTTT>
##$WBST= 1024
##$WBSW= 4
##$XGAIN= (0..3)
0 0 0 0 
##$XL= 0
##$YL= 0
##$YMAX_a= 9652
##$YMIN_a= -14772
##$ZGOPTNS= <>
##$ZL1= 120
##$ZL2= 120
##$ZL3= 120
##$ZL4= 120
##$ABSF1= 0
##$ABSF2= 0
##$ABSG= 0
##$ABSL= 0
##$ALPHA= 0
##$AQORDER= 0
##$ASSFAC= 0
##$ASSFACI= 0
##$ASSFACX= 0
##$ASSWID= 0
##$AUNMP= <proc_1d>
##$AZFE= 0.1
##$AZFW= 0.5
##$BCFW= 0
##$BC_mod= 2
##$BYTORDP= 0
##$COROFFS= 0
##$CY= -3
##$DATMOD= 1
##$DC= 0
##$DFILT= <>
##$DTYPP= 0
##$F1P= 0
##$F2P= 0
##$FCOR= 1
##$FTSIZE= 65536
##$FT_mod= 6
##$GAMMA= 0
##$GB= 0
##$INTBC= 1
##$INTSCL= 5.30512e-09
##$ISEN= 30
##$LB= 1
##$LEV0= 0
##$LPBIN= 0
##$MAXI= 10000
##$MC2= 0
##$MEAN= 0
##$ME_mod= 0
##$MI= 50
##$NCOEF= 0
##$NC_proc= -8
##$NLEV= 6
##$NOISF1= 182.463
##$NOISF2= 159.3651
##$NSP= 0
##$NTH_PI= 0
##$NZP= 0
##$OFFSET= 182.463
##$PC= 4
##$PHC0= -1797.404
##$PHC1= 40.39897
##$PH_mod= 1
##$PKNL= yes
##$PPARMOD= 0
##$PSCAL= 0
##$PSIGN= 0
##$REVERSE= no
##$SF= 81.0140089999434
##$SI= 65536
##$SIGF1= 159.3651
##$SIGF2= -187.1042
##$SINO= 113.3802
##$SIOLD= 16384
##$SREGLST= <1H.CDCl3>
##$SSB= 0
##$STSI= 65536
##$STSR= 0
##$SW_p= 29940.119760479
##$SYMM= 0
##$S_DEV= 0
##$TDeff= 32768
##$TDoff= 0
##$TI= <>
##$TILT= no
##$TM1= 0
##$TM2= 0
##$TOPLEV= 0
##$USERP1= <user>
##$USERP2= <user>
##$USERP3= <user>
##$USERP4= <user>
##$USERP5= <user>
##$WDW= 1
##$XDIM= 65536
##$YMAX_p= 189922137
##$YMIN_p= -209066312
$$ End of Bruker specific parameters
$$ ---------------------------------
##NTUPLES= NMR SPECTRUM
##VAR_NAME=  FREQUENCY,     SPECTRUM/REAL,   SPECTRUM/IMAG
##SYMBOL=    X,             R,               I
##VAR_TYPE=  INDEPENDENT,   DEPENDENT,       DEPENDENT
##VAR_FORM=  AFFN,          ASDF,            ASDF
##VAR_DIM=   65536,         65536,           65536
##UNITS=     HZ,            ARBITRARY UNITS, ARBITRARY UNITS
##FACTOR=    0.456856943014862, 1,           1
##FIRST=     14782.0589164792, 0,            0
##LAST=      -15158.0608439998, 0,           0
##MIN=       -15158.0608439998, -209066312,  0
##MAX=       14782.0589164792, 189922137,    0
$$ Real data points
##PAGE= N=1
##DATA TABLE= (X++(R..R)), XYDATA
$$ [...]
##PAGE= N=2
##DATA TABLE= (X++(I..I)), XYDATA
$$ plain form
4849 -3381223 1187274 -1635323 -8467775 -10586548 -5831248 -949973 -2518208 -8787745
4841 -8787745 -11979924 -7396615 1524960 7546786 7573195 4700702 2862589 1913972 -541831
4832 -541831 -4145169 -5362604 -2407522 1690984 2626804 343654 -1191775 111003 1050906
4823 1050906 -2892963 -11558575 -20057911 -24232162 -24337588 -23526179 -24501986 -27711500 -30964077
4814 -30964077 -30499241 -24192699 -14322264 -5834248 -1518422 -67341 1252083 3586341
4806 3586341 5928992 5844428 1284863 -6216552 -11061953 -9304620 -4275840 -3020402 -7505975
4797 -7505975 -13306600 -16455730 -16397191 -12221132 -3009318 5987110 5205389 -6034229 -14208120
4788 -14208120 -6444004 12493795 24630423 18865525 1441062 -12850064 -15625772 -11320392
$$ packed form
4849c381223M568497k822597o832452k118773M755300M881275j568235o269537
4841h787745l192179M583309Q921575O021826K6409k872493j838113r48617k455803
4832e41831l603338j217435K955082M098506R35820k283150j535429J302778R39903
4823A050906l943869q665612q499336m174251j05426Q11409r75807l209514l252577
4814c0964077M64836O306542R870435Q488016M315826J451081J319424K334258
4806C586341K342651q4564m559565p501415m845401J757333N028780J255438m485573
4797g505975n800625l149130N8539M176059R211814Q996428p81721j1239618q173891
4788a4208120P764116J8937799J2136628n764898j7424463j4291126k775708M305380
$$ plain form
4780 -11320392 -11159553 -19828683 -27686756 -20579926 925219 18968333 19933864 11456881
4772 11456881 9832256 16438000 18137772 8840509 -1777170 -3001642 3886512 11274366
4764 11274366 15737214 18058363 18620535 17368057 14528006 8720627 -1401646 -11660875
4756 -11660875 -13767806 -5196443 7013025 15184930 18993883 21443829 22097049 19026019
4748 19026019 13800189 9621772 6671248 3137921 -1076737 -4813566 -7571150 -8104358
4740 -8104358 -3988228 3765268 8383554 4448014 -3763445 -5598504 4018703 19294510
4732 19294510 30715660 34610502 34302586 33663822 31976768 26260615 17707366 12707442
4724 12707442 15179425 20062676 18500902 8894894 -1476183 -5723104 -3350632 3189087
$$ packed form
4780a1320392J60839q669130p858073P106830K1505145J8043114R65531q476983
4772A1456881j624625O605744J699772r297263j0617679j224472O888154P387854
4764A1274366M462848K321149N62172j252478k840051n807379j0122273j0259229
4756a1660875k106931Q571363J2209468Q171905L808953K449946O53220l071030
4748A9026019n225830m178417k950524l533327m214658l736829k757584n33208
4740h104358M116130P753496M618286l935540q211459j835059R617207J5275807
4732A9294510J1421150L894842l07916o38764j687054n716153q553249m999924
4724A2707442K471983M883251j561774r606008j0371077m246921K372472O539719
$$ plain form
4716 3189087 11514433 16830122 13409432 3034643 -3921921 -1218699 5033146 7142546
4708 7142546 8255967 13957623 16485214 1974970 -25542768 -42391876 -34319987 -15103907
4700 -15103907 -6047942 -7049539 -2293216 11313666 19237367 13910471 6998840 9692827
4692 9692827 14685902 9489394 -1832945 -4176372 6097952 17764598 22068782 20309817
4684 20309817 13893164 493954 -16194977 -25079133 -21863625 -14839689 -11187231 -7891783
4676 -7891783 -2685793 -2295960 -9539489 -12383959 623312 20497722 27428305 16651796
4668 16651796 1391301 -7607648 -11565165 -13108800 -10340031 -4141768 204194 1639547
4660 1639547 3454897 3268818 -5262395 -17802180 -19454917 -5858967 7159357 3385371
$$ packed form
4716C189087Q325346N315689l420690j0374789o956564K703222O251845K109400
4708G142546J113421N701656K527591j4510244k7517738j6849108Q071889J9216080
4700a5103907R055965j001597M756323J3606882P923701n326896o911631K693987
4692I692827M993075n196508j1322339k343427J0274324J1666646M304184j758965
4684B0309817o416653j3399210j6688931q884156L215508P023936L652458L295448
4676g891783N205990L89833p243529k844470J3007271J9874410O930583j0776509
4668A6651796j5260495q998949l957517j543635K768769O198263M345962J435353
4660A639547J815350j86079q531213j2539785j652737J3595950J3018324l773986
$$ plain form
4652 3385371 -12849494 -23937612 -20632869 -8536076 1773834 3713835 -2224487 -8143114
4644 -8143114 -4783676 7347829 16540647 13370904 1363001 -8991612 -11635376 -7514079
4636 -7514079 -2385927 -5401175 -21803213 -42144944 -47325297 -31025957 -9193052 3087
4628 3087 -2863929 -6133166 -6190531 -6242646 -2758246 11355527 31265891 41290682 33008481
4619 33008481 12625924 -9568056 -26703737 -32086225 -20780642 690721 15054849
4612 15054849 10841422 -6302838 -22268596 -29782855 -31584800 -32328233 -31963723 -26800167
4604 -26800167 -15021516 -212635 11242884 15748127 13706032 6772013 -1270914 -2229737
4596 -2229737 8986334 22530510 20043799 -995426 -19627963 -16955191 203615 12117553
$$ packed form
4652C385371j6234865j1088118L304743J2096793J0309910J940001n938322n918627
4644h143114L359438J2131505R192818l169743j2007903j0354613k643764M121297
4636g514079N128152l015248j6402038k0341731n180353J6299340K1832905R196139
4628C087k867016l269237n7365n2115L484400J4113773J9910364J0024791q282201
4619C3008481k0382557k2193980j7135681n382488J1305583K1471363J4364128
4612A5054849m213427j7144260j5965758p514259j801945p43433L64510N163556
4604b6800167J1778651J4808881J1455519M505243k042095o934019q042927r58823
4596b229737J1216071J3544176k486711k1039225j8632537K672772J7158806J1913938
$$ plain form
4588 12117553 13119552 11168595 7940226 -2184933 -15257589 -17858660 -6199821 9426735
4580 9426735 20852401 28264537 29070734 17407256 -634615 -7709469 1356122 11145367
4572 11145367 8867631 2190588 3897024 11456855 14234237 11352402 9635765 10649246
4564 10649246 11395809 12374904 14482081 13123417 5484744 -1342374 474427 6914176
4556 6914176 8823795 6816347 8533349 14056454 14947568 6687782 -6773636 -19143527
4548 -19143527 -24614954 -18166595 -2451526 8917183 5154956 -7572040 -16086876 -19701821
4540 -19701821 -26169240 -32034792 -25393171 -9511153 -3964880 -15204116 -24469494 -16949432
4532 -16949432 -6632489 -14555514 -33240979 -34345325 -9457186 16894914 19611054 2639386
$$ packed form
4588A2117553J001999j950957l228369j0125159j3072656k601071J1658839J5626556
4580I426735J1425666P412136Q06197j1663478j8041871p074854R065591R789245
4572A1145367k277736o677043J706436P559831K777382k881835j716637J013481
4564A0649246P46563R79095K107177j358664p638673o827118J816801O439749
4556F914176J909619k007448J717002N523105Q91114q259786j3461418j2369891
4548a9143527n471427O448359J5715069J1368709l762227j2726996q514836l614945
4540a9701821o467419n865552O641621J5882018N546273j1239236r265378P520062
4532a6949432J0316943p923025j8685465j104346K4888139K6352100K716140j6971668
$$ plain form
4524 2639386 -12102053 -13863974 -9754405 -8202862 -8105087 -5515898 -2295397 -3017172 -6999472
4515 -6999472 -8942107 -7673996 -9521908 -19378976 -30951373 -31977915 -20332867 -8537778
4507 -8537778 -7493840 -10968379 -4421972 12921881 25033136 20368562 6706606 -1083595
4499 -1083595 -370913 704223 -1141823 -1138569 1850077 1224372 -6306201 -13728338 -13294159
4490 -13294159 -8008791 -7711659 -16034403 -26076373 -28438421 -20369660 -6998114 4529771
4482 4529771 11470383 15970727 19616757 20458030 17622421 14865577 14453694 11513334 2464323
4473 2464323 -4303452 2122912 15696568 17730224 4072581 -7364756 -3520815 5137400
4465 5137400 4689241 1440462 8126354 17845259 13366223 -2869942 -10188601 -923297
$$ packed form
4524B639386j4741439j761921M109569J551543R7775K589189L220501p21775l982300
4515f999472j942635J268111j847912r857068j1572397j026542J1645048J1795089
4507h537778J043938l474539O546407J7343853J2111255m664574j3661956p790201
4499a083595P12682J075136j846046L254K988646o25705p530573p422137M34179
4490a3294159N285368K97132q322744j0041970k362048Q068761J3371546J1527885
4482D529771O940612M500344L646030Q41273k835609k756844m11883k940360r049011
4473B464323o767775O426364J3573656K033656j3657643j1437337L843941Q658215
4465E137400m48159l248779O685892R718905m479036j6236165p318659R265304
$$ plain form
4457 -923297 10221474 10863555 6321914 5641331 9326363 16549024 28297017 37233449
4449 37233449 30885644 12207183 136840 1083251 -1786296 -18612821 -31089310 -18806927
4441 -18806927 7545291 20819158 15181300 6669441 2354041 -6506785 -20647912 -25789382
4433 -25789382 -15848283 -4615283 -5450035 -13290169 -15751922 -10672804 -3218576 5233643
4425 5233643 14951252 20503537 15667349 3433691 -6350195 -8057835 -3366522 4724031
4417 4724031 14082257 19794428 16010338 5332516 769275 11257992 27014256 27674067
4409 27674067 7408816 -15959791 -22460576 -13536769 -5721935 -6969208 -11537537 -15234417
4401 -15234417 -20614219 -25359523 -20197443 -3541364 14001666 24576172 30208653 30927921
$$ packed form
4457i23297J1144771O42081m541641o80583L685032P222661J1747993Q936432
4449C7233449o347805j8678461j2070343R46411k869547j6826525j2476489J2282383
4441a8806927K6352218J3273867n637858q511859m315400q860826j4141127n141470
4433b5789382R941099J1233000q34752p840134k461753N079118P454228Q452219
4425E233643R717609N552285m836188j2233658r783886j707640M691313Q090553
4417D724031R358226N712171l784090j0677822m563241J0488717J5756264O59811
4409B7674067k0265251k3368607o500785Q923807P814834j247273m568329l696880
4401a5234417n379802m745304N162080J6656079J7543030J0574506N632481P19268
$$ plain form
4393 30927921 21409548 6542985 2951344 13832872 19693995 8809335 -807237 10374671
4385 10374671 29154163 28567655 9612991 -3956526 -5458171 -9429710 -17731901 -13717328
4377 -13717328 4043980 12239280 -1441606 -18302194 -18035210 -6224224 2112477 6137227
4369 6137227 9648250 6223981 -6605289 -12935857 634642 19853525 19608628 -334281
4361 -334281 -16641766 -16706312 -12247009 -16859891 -26294290 -27029616 -14500440 3168980
4353 3168980 15270507 19191591 21462238 26950698 28745829 16565983 -3865019 -12159495
4345 -12159495 -580386 12362360 6815735 -10409098 -17375667 -9217537 -1601126 -4300536
4337 -4300536 -8332330 -2610883 9767608 17736075 16767766 12213071 12246977 19544725 27324132
$$ packed form
4393C0927921r518373j4866563l591641J0881528N861123j0884660r616572J1181908
4385A0374671J8779492n86508j8954664j3569517j501645l971539q302191M014573
4377a3717328J7761308Q195300j3680886j6860588K66984J1810986Q336701M024750
4369F137227L511023l424269j2829270o330568J3570499J9218883k44897j9942909
4361c34281j6307485o4546M459303m612882r434399p35326J2529176J7669420
4353C168980J2101527L921084K270647N488460J795131j2179846k0431002q294476
4345a2159495J1579109J2942746n546625j7224833o966569Q158130P616411k699410
4337d300536m031794N721447J2378491P968467r68309m554695L3906P297748P779407
$$ plain form
4328 27324132 24580917 8436675 -11102075 -22072492 -22315308 -16684306 -8966633 -2713203
4320 -2713203 -2871618 -7716082 -5740913 8666473 22432410 19608495 5524997 169958
4312 169958 9285572 18284199 16504555 11155511 11539139 13884075 10824908 5246440 4471062
4303 4471062 7306048 6357356 -100419 -5941453 -5440242 1059028 8808525 13456569 15221515
4294 15221515 18562081 25402338 30009445 25243570 12863783 1638896 -4118739 -6925372
4286 -6925372 -7361199 -2271480 6108544 9040127 4382361 2433033 11793241 25762728
4278 25762728 30544785 22702486 10674387 1686049 -4595817 -9632266 -11174887 -8118492
4270 -8118492 -5327480 -8692186 -16281488 -18669818 -10098625 3206846 9365848 4250485
$$ packed form
4328B7324132k743215j6144242j9538750j0970417k42816N631002P717673O253430
4320b713203j58415m844464J975169J4407386J3765937k823915j4083498n355039
4312A69958R115614Q998627j779644n349044L83628K344936l059167n578468p75378
4303D471062K834986r48692o457775n841034N01211O499270P749497M648044J764946
4294A5221515L340566O840257M607107m765875j2379787j1224887n757635k806633
4286f925372m35827N089719Q380024K931583m657766j949328R360208J3969487
4278B5762728M782057p842299j2028099q988338o281866n036449j542621L056395
4270h118492K791012l364706p589302k388330Q571193J3305471O159002n115363
$$ plain form
4262 4250485 -6096824 -15749266 -24171604 -29442108 -26112301 -16413584 -13888612 -24576588
4254 -24576588 -32200139 -17501324 11223711 24627253 10754801 -10712963 -18251260
4247 -18251260 -15423574 -17763610 -27204066 -33772285 -33306144 -28831920 -20182497 -6367756
4239 -6367756 5200664 5585376 -801253 -1043444 6288293 8670037 -405575 -11136666
4231 -11136666 -12438421 -7286794 -5893357 -11036453 -18280699 -25463359 -32727042 -35553585
4223 -35553585 -27653661 -12513491 -4023641 -10954216 -25566901 -32561505 -26101492 -12717802
4215 -12717802 -31343 10118356 17516570 20667747 20949366 22747786 25357562 21502201
4207 21502201 9335184 -1405560 -3313379 -4378689 -15513581 -29835715 -29228687 -11004231
$$ packed form
4262D250485j0347309r652442q422338n270504L329807R698717K524972j0687976
4254b4576588p623551J4698815K8725035J3403542j3872452k1467764p538297
4247a8251260K827686k340036r440456o568219M66141M474224Q649423J3814741
4239f367756J1568420L84712o386629k42191P331737K381744r075612j0731091
4231a1136666j301755N151627J393437n143096p244246p182660p263683k826543
4223c5553585P899924J5140170Q489850o930575j4612685o994604O460013J3383690
4215a2717802J2686459J0149699P398214L151177K81619J798420K609776l855361
4207B1502201j2167017j0740744j907819j065310j1134892j4322134O07028J8224456
$$ plain form
4199 -11004231 7611631 14746679 17846578 25430724 30369412 23562365 12240968 8938198
4191 8938198 9652960 515653 -16036308 -19710534 -1282581 21298256 24120725 5463708
4183 5463708 -16292856 -26881559 -27856052 -25859921 -21430416 -13512689 -7874080 -11783813
4175 -11783813 -21168475 -21879353 -7116625 13312803 25843256 28100923 24074570 12850495
4167 12850495 -5018742 -15643179 -4198813 20188389 30512839 18310341 5772940
4160 5772940 11793507 23967659 20111069 3021023 -6537652 -2695076 1258162 -2003992
4152 -2003992 -5156835 -3449716 -2254172 -4241557 -4842362 -4153790 -8745546 -17723032 -21471911
4143 -21471911 -18826043 -20584256 -29910390 -34729203 -28572425 -24111637 -33274298 -45739722
$$ packed form
4199a1004231J8615862P135048L099899P584146M938688o807047j1321397l302770
4191H938198P14762r137307j6551961l674226J8427953K2580837K822469j8657017
4183E463708k1756564j0588703r74493J996131M429505P917727N638609l909733
4175a1783813r384662p10878J4762728K0429428J2530453K257667m026353j1224075
4167A2850495j7869237j0624437J1444366K4387202J0324450j2202498j2537401
4160E772940O020567J2174152l856590j7090046r558675L842576L953238l262154
4152b003992l152843J707119J195544j987385o00805O88572m591756q977486l748879
4143b1471911K645868j758213r326134m818813O156778M460788r162661j2465424
$$ plain form
4135 -45739722 -42296857 -22339145 -3534315 1738399 -3482560 -11311646 -16521155 -13527785
4127 -13527785 1907224 24319810 39662624 38410978 23636559 5699757 -6400967
4120 -6400967 -8559921 -2124064 7179120 13813049 16628125 16946169 14193312 6521615
4112 6521615 -5387626 -17804233 -26123122 -26388429 -17977445 -6807328 -1483285 -3150709
4104 -3150709 -3902112 1407540 8160311 11805843 16863691 27466621 35732744 31350773
4096 31350773 18674668 11065191 9752920 2711834 -13599940 -25762363 -22347892 -9524038
4088 -9524038 -495995 847345 -2030917 -7663272 -14531082 -16494546 -10281442 -2899756
4080 -2899756 -2296755 -4937990 -2631905 2171312 22890 -7835458 -8694758 2064205
$$ packed form
4135d5739722L442865J9957712J8804830N272714n220959p829086n209509K993370
4127a3527785J5435009K2412586J5342814j251646j4774419j7936802j2100724
4120f400967k158954O435857R303184O633929K815076L18044k752857p671697
4112F521615j1909241j2416607q318889k65307Q410984J1170117N324043j667424
4104c150709p51403N309652O752771L645532N057848J0602930Q266123m381971
4096C1350773j2676105p609477j312271p041086j6311774j2162423L414471J2823854
4088i524038R028043J343340k878262n632355o867810j963464O213104P381686
4080b899756O03001k641235K306085M803217k148422p858348q59300J0758963
$$ plain form
4072 2064205 13079053 14665996 13445545 19683747 27755503 22137617 1171845 -17559841
4064 -17559841 -19020691 -8314329 -170153 2089053 7431779 19392916 28481512 25966989
4056 25966989 16938598 12683204 15252007 18158008 19589341 24228502 30688815 28409188
4048 28409188 13402661 -1524599 -1692671 9258781 14423412 6980015 -2149458 -1258284
4040 -1258284 7429044 14173317 14876115 11693291 5945401 -2521946 -11285684 -16709965
4032 -16709965 -18716314 -19721320 -19325790 -14240547 -3895366 6963606 11830503 6879462
4024 6879462 -6994144 -23450357 -32859266 -29780268 -19760310 -14826508 -19397461 -23699908
4016 -23699908 -15640865 1941211 11616995 1201552 -21390871 -37685348 -39848738 -35670639
$$ packed form
4072B064205J1014848J586943j220451O238202Q071756n617886k0965772j8731686
4064a7559841j460850J0706362Q144176K259206N342726J1961137R088596k514523
4056B5966989r028391m255394K568803K906001J431333M639161O460313k279627
4048B8409188j5006527j4927260j68072J0951452N164631p443397r129473Q91174
4040a258284Q687328O744273P02798l182824n747890q467347q763738n424281
4032a6709965k006349j005006L95530N085243J0345181J0858972M866897m951041
4024F879462j3873606j6456213r408909L078998J0019958M933802m570953m302447
4016b3699908Q059043J7582076R675784j0415443k2592423j6294477k163390M178099
$$ plain form
4008 -35670639 -33495540 -31341054 -24585953 -16058555 -11035647 -7860514 -2394898 1924112
4000 1924112 -1487574 -9578032 -11924318 -6020831 133185 1639481 1429965 -642545
3992 -642545 -9959604 -23082940 -25493082 -12403046 874400 1040071 -2254991 7709766
3984 7709766 27116359 37082572 31070719 19094943 7829721 -4883139 -16154380 -17838165
3976 -17838165 -13273235 -16298497 -28245268 -32907564 -22002990 -9863503 -12740268 -26662653
3968 -26662653 -36900249 -38795713 -38225428 -39707580 -43616207 -47916328 -45532776 -29239993
3960 -29239993 -6232272 3588075 -7276592 -22729490 -27264792 -27255743 -33922373 -39395540
3952 -39395540 -29698328 -11416414 -2919322 -4754126 -1894281 6975265 6491690 -7186901
$$ packed form
4008c5670639K175099K154486O755101Q527398N022908L175133N465616M319010
4000A924112l411686q090458k346286N903487O154016J506296k09516k072510
3992f42545r317059j3123336k410142J3090036J3277446J65671l295062R964757
3984G709766J9406593R966213o011853j1975776j1265222j2712860j1271241j683785
3976a7838165M564930l025262j1946771m662296J0904574J2139487k876765j3922385
3968b6662653j0237596j895464N70285j482152l908627m300121K383552J6292783
3960b9239993K3007721R820347j0864667j5452898m535302R049o666630n473167
3952c9395540R697212J8281914Q497092j834804K859845Q869546m83575j3678591
$$ plain form
3944 -7186901 -18625504 -19624993 -22004040 -34240964 -43900699 -36007121 -15274857 2236006
3936 2236006 9141064 7631102 -78448 -11031388 -18143493 -17308783 -13279109 -12261026
3928 -12261026 -14476278 -18377061 -23798420 -26045547 -17133707 419604 11691306 9238601
3920 9238601 4130696 8055010 15972944 18020563 17035291 19523787 19217902 7276749
3912 7276749 -8135805 -11702797 -6483172 -9370437 -21653634 -25385964 -13434629 -2874252
3904 -2874252 -8949132 -22153049 -23607936 -11266328 2155853 8485584 7869745 -648341
3896 -648341 -17569328 -32942709 -31360773 -11270352 8894624 9305974 -10099966 -30708408
3888 -30708408 -35367066 -23998073 -9235392 -80374 5810700 12900551 16754115 9456611
$$ packed form
3944g186901j1438603r99489k379047j2236924r659735P893578K0732264J7510863
3936B236006O905058j509962p709550j0952940p112105Q34710M029674J018083
3928a2261026k215252l900783n421359k247127Q911840J7553311J1271702k452705
3920I238601n107905L924314P917934K047619r85272K488496l05885j1941153
3912G276749j5412554l566992N219625k887265j2283197l732330J1951335J0560377
3904b874252o074880j3203917j454887J2341608J3422181O329731o15839q518086
3896f48341j6920987j5373381J581936K0090421K0164976M11350j9405940k0608442
3888c0708408m658658J1368993J4762681R155018N891074P089851L853564p297504
$$ plain form
3880 9456611 -5309437 -12016787 -2437732 12191390 15398981 7268479 2676652 8849484
3872 8849484 15258043 10324657 130190 1829672 20784958 42455800 48754866 36815233
3864 36815233 18705522 7041084 5109405 8422477 10852938 9304357 5767242 5033882
3856 5033882 8595764 12491453 13858943 16365087 23527149 29125018 22751065 5581305
3848 5581305 -8333389 -9976807 -6370552 -8236252 -13975282 -13788505 -5218226 3663322
3840 3663322 4979020 -999542 -7170690 -4879229 8603035 23473412 23661693 6245300
3832 6245300 -11061306 -10333066 4273541 15310697 17283558 18055073 18030490 7161192
3824 7161192 -13433667 -25344050 -17675497 -2981968 2690043 1767746 3020786 252665
$$ packed form
3880I456611j4766048o707350R579055J4629122L207591q130502m591827O172832
3872H849484O408559m933386j0194467J699482J8955286K1670842O299066j1939633
3864C6815233j8109711j1664438j931679L313072K430461j548581l537115p33360
3856E033882L561882L895689J367490K506144P162062N597869o373953j7169760
3848E581305j3914694j643418L606255j865700n739030J86777Q570279Q881548
3840C663322J315698n978562o171148K291461J3482264J4870377J88281j7416393
3832F245300j7306606P28240J4606607J1037156J972861P71515k4583j0869298
3824G161192k0594859j1910383P668553J4693529N672011r22297J253040k768121
$$ plain form
3816 252665 -17127101 -39148963 -43143283 -27083433 -14759159 -22318915 -37529102 -41315853
3808 -41315853 -34306429 -28813539 -25898931 -16575178 -588135 11465412 14302025 13601861
3800 13601861 14133140 13076363 7888485 1473134 -4064879 -10835308 -18609474 -22314438
3792 -22314438 -20145730 -16979656 -15422322 -11425373 -4437025 -3057413 -11767824 -19579365
3784 -19579365 -13279129 3039282 14036290 15480340 16979987 23416672 28413106 28494769
3776 28494769 29097381 31332382 26546745 11732977 -1825467 -4399574 -1272860 -234199
3768 -234199 3308200 15540279 27662137 25792957 12026403 32651 -6537281 -14743932
3760 -14743932 -23413526 -21834047 -9715977 -986774 -2286913 -3874445 627515 1712462
$$ packed form
3816B52665j7379766k2021862l994320J6059850J2324274p559756j5210187l786751
3808d1315853P009424N492890K914608R323753J5987043J2053547K836613p00164
3800A3601861N31279j056777n187878o415351n538013o770429p774166l704964
3792b2314438K168708L166074J557334L996949O988348J379612q710411p811541
3784a9579365O300236J6318411J0997008J444050J499647O436685M996434Q1663
3776B8494769O02612K235001m785637j4813768j3558444k574107L126714J038661
3768b34199L542399J2232079J2121858j869180j3766554j1993752o569932q206651
3760a4743932q669594J579479J2118070Q729203j300139j587532M501960J084947
$$ plain form
3752 1712462 -7186537 -12709516 290295 22765361 31821268 23289242 15504559 19018656
3744 19018656 20598934 6029357 -14865279 -20124747 -6666759 5705645 2627207 -5981449
3736 -5981449 -3038837 9592667 15321549 9754947 7607044 18304000 29310464 25077323
3728 25077323 12254905 10338230 21862965 29137917 21379896 8309195 1578967 -1707084
3720 -1707084 -7456195 -9599293 -32287 14402583 19041852 12191139 6165242 8366648
3712 8366648 12685270 11068766 3931700 -3704408 -8471648 -7701336 868520 13848689
3704 13848689 21578419 17720136 6830142 -1445366 -3403203 -2616456 -2250777 -1569278
3696 -1569278 -896283 -4491659 -13818750 -20625459 -13522029 6824578 24769211 26320390
$$ packed form
3752A712462q898999n522979J2999811K2475066R055907q532026p784683L514097
3744A9018656J580278j4569577k0894636n259468J3457988J2372404l078438q608656
3736e981449K942612J2631504N728882n566602k147903J0696956J1006464m233141
3728B5077323j2822418j916675J1524735P274952p758021j3070701o730228l286051
3720a707084n749111k143098R567006J4434870M639269o850713o025897K201406
3712H366648M318622j616504p137066p636108m767240P70312Q569856J2980169
3704A3848689P729730l858283j0889994q275508j957837P86747L65679O81499
3696a569278O72995l595376r327091o806709P103430K0346607J7944633J551179
$$ plain form
3688 26320390 14911703 5384364 5422818 9885826 11836695 10579200 7637068 3222828
3680 3222828 65671 3286515 11681318 15503870 8836594 -756681 -1354670 7864296
3672 7864296 16328298 14960935 4142599 -8904956 -15374713 -9587810 5638749 18983166
3664 18983166 21033395 14529867 10013276 11913490 13906193 8815708 -1309537 -7489102
3656 -7489102 -4388348 3373117 5903099 -1068728 -11191458 -15153323 -11967364 -8777026
3648 -8777026 -9923028 -11838230 -10432413 -7673680 -7138923 -7540226 -4874415 2012450 10921518
3639 10921518 18010287 18247230 9594520 -476899 476979 13664238 23804891 17023632
3631 17023632 -1015389 -12328598 -7936133 5746404 18337143 24628747 23987261 19057543
$$ packed form
3688B6320390j1408687r527339L8454M463008J950869j257495k942132m414240
3680C222828l157157L220844Q394803L822552o667276r593275n97989R218966
3672G864296Q464002j367363j0818336j3047555o469757N786903J5226559J3344417
3664A8983166K050229o503528m516591J900214J992703n090485j0125245o179565
3656g489102L100754P761465K529982o971827j0122730l961865L185959L190338
3648h777026j146002j915202J405817K758733N34757m01303K665811O886865Q909068
3639A0921518P088769K36943q652710j0071419R53878J3187259J0140653o781259
3631A7023632j8039021j1313209M392465J3682537J2590739O291604o41486m929718
$$ plain form
3623 19057543 15424343 16362321 17892401 13970042 5507649 -732794 -967152 2352225
3615 2352225 4301170 890830 -7683757 -13180923 -4374983 17733794 35660954 34428551
3607 34428551 19332674 5934010 -1108273 -7352078 -12673152 -11681653 -7933424 -11207374
3599 -11207374 -19145438 -17560325 -3265538 8256193 4634973 -6724818 -11638458 -7915005
3591 -7915005 -2582881 432793 697770 -3414392 -10642514 -13395185 -6836550 2541325
3583 2541325 5055202 1443812 949022 7266528 13244506 10989880 3462048 2803154 15613428
3574 15613428 31326732 31289343 12541016 -5242948 -4377243 7320705 10370678 3785703
3566 3785703 2475467 7330696 1759252 -16894161 -26966459 -16231414 -4308953 -12640667
$$ packed form
3623A9057543l633200R37978J530080l922359q462393o240443k34358L319377
3615B352225J948945l410340q574587n497166Q805940K2108777J7927160j232403
3607C4428551j5095877j3398664p042283o243805n321074R91499L748229l273950
3599a1207374p938064J585113J4294787J1521731l621220j1359791m913640L723453
3591g915005N332124L015674K64977m112162p228122k752671O558635R377875
3583B541325K513877l611390m94790O317506N977978k254626p527832o58894J2810274
3574A5613428J5713304l7389j8748327j7783964Q65705J1697948L049973o584975
3566C785703j310236M855229n571444j8653413j0072298J0735045J1922461q331714
$$ plain form
3558 -12640667 -29464037 -28362266 -10779956 -3568952 -16580181 -27484775 -13920626
3551 -13920626 18012495 44853622 51685915 39616790 18449643 569487 -4266358
3544 -4266358 4368885 17615926 26120536 26297207 18879001 7270609 -1689191 -1192816
3536 -1192816 8610478 20155342 25782687 23086391 13967596 2280637 -7508266 -12120003
3528 -12120003 -10131991 -878569 13826558 26206900 27174533 17763431 9109381 6733735
3520 6733735 3372151 -5790994 -10710257 -746467 16520867 25127409 24509340 27487165
3512 27487165 36171833 36962862 22492605 3240001 -8665141 -14596066 -21039017 -26250219
3504 -26250219 -23930990 -13915261 -2082915 6311298 8765102 5455566 660567 -181647
$$ packed form
3558a2640667j6823370J101771J7582310P211004j3011229j0904594J3564149
3551a3920626L1933121K6841127O832293j2069125k1167147j7880156m835845
3544d266358Q635243J3247041Q504610J76671p418206j1608392q959800M96375
3536a192816R803294J1544864N627345k696296r118795j1686959r788903m611737
3528a2120003J988012R253422J4705127J2380342R67633r411102q654050k375646
3520F733735l361584r163145m919263R963790J7267334Q606542o18069K977825
3512B7487165Q684668P91029j4470257j9252604j1905142n930925o442951n211202
3504b6250219K319229J0015729J1832346Q394213K453804l309536m794999q42214
$$ plain form
3496 -181647 2399826 2456557 -1644585 -3760549 1146328 10419446 18885848 24891359 27907460
3487 27907460 25762637 18527586 11136092 8452021 10447785 14036494 16295057 14858735
3479 14858735 9236041 2780369 -438739 -744131 -897785 -853399 -118674 -2407278 -9496509
3470 -9496509 -13154788 -4560429 9410873 13146340 6656214 6835699 19642471 28813205
3462 28813205 22654531 15136774 23753277 38864453 35987821 13311408 -4180036 567300
3454 567300 15898387 21117013 12864040 3418185 1888614 6129211 9069769 6105141
3446 6105141 -2442072 -12193171 -18614210 -21582632 -24842725 -30596510 -36877608 -40761034
3438 -40761034 -41832868 -41745676 -41988905 -42281959 -39969166 -32010195 -19521477 -8995716
$$ packed form
3496a81647K581473N6731m101142k115964M906877R273118Q466402O005511L016101
3487B7907460k144823p235051p391494k684071J995764L588709K258563j436322
3479A4858735n622694o455672l219108l05392j53654M4386P34725k288604p089231
3470i496509l658279Q594359J3971302L735467o490126J79485J2806772R170734
3462B8813205o158674p517757Q616503J5111176k876632k2676413j7491444M747336
3454E67300J5331087N218626q252973r445855j529571M240597K940558k964628
3446F105141q547213r751099o421039k968422l260093n753785o281098l883426
3438d0761034j071834Q7192k43229k93054K312793P958971J2488718J0525761
$$ plain form
3430 -8995716 -6134665 -9241666 -11790876 -11170960 -11456046 -16664881 -23995347 -25748106 -17515595
3421 -17515595 -3564772 6388575 6125458 -1810280 -10488829 -16729274 -22247219 -27792757
3413 -27792757 -30664803 -29141093 -25273139 -21248592 -16483019 -10591872 -5935755 -4534536
3405 -4534536 -5156638 -5820667 -6464557 -7067300 -6480402 -5769878 -9154582 -17974578 -26538150
3396 -26538150 -28022656 -22805214 -17437351 -16713570 -19910920 -23699160 -25470334 -23806702
3388 -23806702 -18006893 -8306989 3066410 11148441 11125665 4917772 2696737 12875634
3380 12875634 31238852 45056972 47390147 41724989 33564112 25082833 18287939 14882751
3372 14882751 11532687 3896347 -3306576 -678618 8847058 9721234 -3894692 -17838575
$$ packed form
3430h995716K861051l107001k549210O19916k85086n208835p330466j752759Q232511
3421a7515595J3950823R953347k63117p935738q678549o240445n517945n545538
3413b7792757k872046J523710L867954M024547M765573N891147M656117J401219
3405d534536o22102o64029o43890o02743N86898P10524l384704q819996q563572
3396b6538150j484506N217442N367863P23781l197350l788240j771174J663632
3388b3806702N799809R699904J1373399Q082031k2776o207893k221035J0178897
3380A2875634J8363218J3818120K333175n665158q160877q481279o794894l405188
3372A4882751l350064p636340p202923K627958R525676Q74176j3615926j3943883
$$ plain form
3364 -17838575 -18129307 -9826664 -5481141 -5416678 -2007346 4985462 10776508 16491338 24322287
3355 24322287 27822578 21083908 12160056 12253557 16437487 12367441 4851837 11372498
3347 11372498 31582294 42111825 29196138 8733284 2533488 8041889 5655992 -11219771
3339 -11219771 -27304335 -26139574 -10675195 -11470 -7707737 -25564891 -32249600 -19390999
3331 -19390999 -3025481 -3395798 -19983974 -36159184 -42484195 -41830198 -35302601 -20296342
3323 -20296342 -3383952 2310279 -2614364 -1811308 12252228 26572586 28348264 23079769
3315 23079769 21688886 22199666 16432536 5348916 -4158499 -10191537 -13295628 -11181280
3307 -11181280 -6501836 -10719821 -27063217 -37535112 -22875853 8495808 27623347
$$ packed form
3364a7838575k90732Q302643M345523O4463L409332O992808N791046N714830P830949
3355B4322287L500291o738670q923852R3501M183930m070046p515604O520661
3347A1372498K0209796J0529531j2915687k0462854o199796N508401k385897j6875763
3339a1219771j6084564J164761J5464379J0663725p696267j7857154o684709J2858601
3331a9390999J6365518l70317j6588176j6175210o325011O53997O527597J5006259
3323b0296342J6912390N694231m924643Q03056J4063536J4320358J775678n268495
3315B3079769j390883N10780n767130j1083620r507415o033038l104091K114348
3307a1181280M679444m217985j6343396j0471895J4659259L1371661J9127539
$$ plain form
3300 27623347 20895351 4226432 -1090178 6249968 12166537 8247804 542722 -192795
3292 -192795 7534894 13214095 6797053 -6748083 -10773910 2225727 19031700 20573948
3284 20573948 4064162 -15633758 -23068787 -14891653 781639 11481722 9625587 -205620
3276 -205620 -5916651 -2662366 2803468 5378474 9183483 15301866 14032170 1554863
3268 1554863 -6353277 5787789 26408650 29627183 12482563 -894319 5530009 20175056
3260 20175056 25784449 22568217 19134553 15473472 8266318 2636031 4808450 9371432
3252 9371432 6144778 -4203657 -11965260 -12680679 -9930075 -6610148 -3461066 -4819671
3244 -4819671 -15423601 -30580146 -38777779 -36275275 -30794358 -27912517 -22754114 -10934797
$$ packed form
3300B7623347o727996j6668919n316610P340146N916569l918733p705082p35517
3292a92795P727689N679201o417042j3545136m025827J2999637J6805973J542248
3284B0573948j6509786j9697920p435029Q177134J5673292J0700083j856135r831207
3276b05620n711031L254285N465834K575006L805009O118383j269696j2477307
3268A554863p908140J2141066K0620861L218533j7144620j3376882O424328J4645047
3260B0175056N609393l216232l433664l661081p207154n630287K172419M562982
3252I371432l226654j0348435p761603p15419K750604L319927L149082j358605
3244d819671j0603930j5156545q197633K502504N480917K881841N158403J1819317
$$ plain form
3236 -10934797 133070 -154367 -10327039 -20212807 -26904992 -34952984 -39903875 -27292676
3228 -27292676 3360720 27334828 23169643 4468449 4510742 31463820 59073789 64546498
3220 64546498 54370735 43998203 33129617 17019779 4948437 6251755 9258430
3213 9258430 -2918100 -21977474 -23615098 -5419818 8192558 2115218 -10610780 -13224464
3205 -13224464 -8510867 -6881207 -7441724 -3735305 3292963 10124543 19617352 34239547
3197 34239547 47074662 48683183 37570936 17843685 -6133650 -27046715 -35962140
3190 -35962140 -33694238 -31648684 -33647042 -27407155 -4310374 22450970 32595687 24570017
3182 24570017 13464803 8389744 5160925 -1647506 -11569190 -21332659 -25301035 -16425851
$$ packed form
3236a0934797J1067867k87437j0172672r885768o692185q047992m950891J2611199
3228b7292676L0653396K3974108m165185j8701194M2293K6953078K7609969N472709
3220F4546498j0175763j0372532j0868586j6109838j2071342J303318L006675
3213I258430j2176530j9059374j637624J8195280J3612376o077340j2725998k613684
3205a3224464M713597J629660n60517L706419P028268O831580R492809J4622195
3197C4239547J2835115J608521j1112247j9727251k3977335k0913065q915425
3190c5962140K267902K045554j998358O239887K3096781K6761344J0144717q025670
3182B4570017j1105214n075059l228819o808431r921684r763469l968376Q875184
$$ plain form
3174 -16425851 3164428 17639342 15752979 8590410 14251450 28682466 29863234 11224718
3166 11224718 -8369338 -12946449 -9486196 -10373592 -11646266 -2515926 13736063 23324008
3158 23324008 21863497 18032703 18790871 21249245 19792969 13469652 4753977 -3744322
3150 -3744322 -9871913 -12411578 -11546090 -7363486 289203 8054201 8104552 -4102076 -21625541
3141 -21625541 -30226706 -22427935 -5388798 6287869 4767321 -4112866 -7601352 53022
3133 53022 10709371 11048674 -1689119 -15770641 -18817378 -12750011 -10868454 -20869386
3125 -20869386 -35485272 -41915949 -37040995 -29234736 -26024476 -24688064 -17456183 -3078789
3117 -3078789 10647607 15190419 8876105 -3356486 -13999854 -16605729 -10077339 -1370284
$$ packed form
3174a6425851J9590279J4474914j886363p162569N661040J4431016J180768j8638516
3166A1224718j9594056m577111L460253q87396j272674R130340J6251989R587945
3158B3324008j460511l830794P58168K458374j456276o323317q715675q498299
3150c744322o127591k539665Q65488M182604P652689P764998N0351j2206628j7523465
3141b1625541q601165P798771J7039137J1676667j520548q880187l488486P654374
3133E3022J0656349L39303j2737793j4081522l046737O067367J881557j0000932
3125b0869386j4615886o430677M874954P806259L210260J336412P231881J4377394
3117c078789J3726396M542812o314314j2232591j0643368k605875O528390Q707055
$$ plain form
3109 -1370284 -15941 -7354721 -14516557 -13441494 -5859490 1835022 7781955 13276765
3101 13276765 15957410 11705507 2626081 -3249615 -1188684 5595797 10846854 11117847
3093 11117847 6906237 1530018 -1378691 -2033808 -4490064 -9409010 -10466739 -3683596
3085 -3683596 3112740 -1524475 -16343931 -28399970 -30715123 -29131025 -29150108 -26267857
3077 -26267857 -15260591 -967192 7714807 9267202 7895124 4698220 -1845904 -8847934
3069 -8847934 -9989700 -3962905 3105560 4414426 -1332699 -10168259 -16584971 -17563743
3061 -17563743 -14974370 -13019036 -12034734 -7424973 2990478 13677588 17088752 12405010
3053 12405010 4692070 -2722839 -10402101 -18177490 -23243949 -23859385 -21686478 -19253235
$$ packed form
3109a370284J354343p338780p161836J075063P582004P694512N946933N494810
3101A3276765K680645m251903r079426n875696K060931O784481N251057K70993
3093A1117847m211610n376219k908709o55117k456256m918946j057729O783143
3085c683596O796336m637215j4819456j2056039k315153J584098j9083K882251
3077b6267857J1007266J4293399Q681999J552395j372078l196904o544124p002030
3069h847934j141766O026795P068465J308866n747125q835560o416712r78772
3061a7563743K589373J955334R84302M609761J0415451J0687110L411164m683742
3053A2405010p712940p414909p679262p775389n066459o15436K172907K433243
$$ plain form
3045 -19253235 -17034649 -13638853 -7562995 953158 8418589 9573116 3027039 -4965105
3037 -4965105 -5524618 2950109 12039176 11945640 1564317 -11591705 -20326536 -23869598
3029 -23869598 -24675960 -22827357 -17399178 -11462007 -9738534 -10541288 -7037545 83072
3021 83072 -757672 -15198727 -29883762 -28114907 -14467706 -8665893 -14820943 -14504089
3013 -14504089 2982134 20854104 18974747 4599943 673901 10418149 14081231 975584
3005 975584 -14830916 -17096277 -9745945 -6280403 -8186953 -6749023 -475943 2465154
2997 2465154 -1142189 -3436735 2454581 11562711 14003940 9189950 6367718 10200954
2989 10200954 11912617 197477 -21488483 -35956629 -32414940 -18825863 -9748357 -7952144
$$ packed form
3045a9253235K218586L395796O075858Q516153P465431J154527o546077p992144
3037d965105n59513Q474727R089067r3536j0381323j3156022q734831l543062
3029b3869598q06362J848603N428179N937171J723473q02754L503743P120617
3021H3072q40744j4441055j4685035J768855J3647201N801813o155050L16854
3013a4504089J7486223J7871970j879357j4374804l926042R744248L663082j3105647
3005I75584j5806500k265361P350332L465542j906550J437930O273080K941097
2997B465154l607343k294546N891316R108130K441229m813990k822232L833236
2989A0200954J711663j1715140k1685960j4468146L541689J3589077R077506J796213
$$ plain form
2981 -7952144 -5319209 2377354 11171213 17966205 23689936 25976710 18772499 3634176
2973 3634176 -7085924 -4775982 3812100 6253762 1116478 -2334579 1882478 10041217
2965 10041217 15002913 12764661 3834282 -5737028 -5694180 8514134 26091637 28843632
2957 28843632 12570376 -5485774 -5914409 10173653 23819090 21277576 7369120 -4616256
2949 -4616256 -9147877 -10383276 -12469381 -14308823 -13556792 -10531905 -6307326 -398509
2941 -398509 7100450 13162809 14145185 9434672 1220142 -7627316 -13418241 -11816907 -2202248
2932 -2202248 8881963 13018603 9500083 5974775 8240892 13065125 13541289 8461539
2924 8461539 2820194 754998 1941080 4769266 9208771 14766886 18067032 15436212
$$ packed form
2981g952144K632935P696563Q793859O794992N723731K286774p204211j5138323
2973C634176j0720100K309942Q588082K441662n137284l451057M217057Q158739
2965A0041217M961696k238252q930379r571310M2848J4208314J7577503K751995
2957B8843632j6273256j8056150m28635J6088062J3645437k541514j3908456j1985376
2949d616256m531621j235399k086105j839442P52031L024887M224579N908817
2941c98509P498959O062359R82376m710513q214530q847458n790925J601334R614659
2932b202248J1084211M136640l518520l525308K266117M824233M76164n079750
2924H461539n641345k065196J186082K828186M439505N558115L300146k630820
$$ plain form
2916 15436212 7937151 1584517 1031753 4060083 4521843 700320 -2319655 -385405
2908 -385405 2770189 636785 -5156428 -4573601 8345398 27086953 39940124 42548083
2900 42548083 39365134 35105895 30319146 25636213 24850659 30421208 38627634 42765943
2892 42765943 40265567 33704669 25353286 14632650 2462003 -5653542 -5225241 -565633
2884 -565633 -2207641 -14604168 -29514446 -34561651 -26848823 -15387258 -10940223 -16096404
2876 -16096404 -24814262 -28800388 -23924188 -12903428 -2927712 523265 -1976500 -6220773
2868 -6220773 -10118619 -14841104 -20697075 -25011074 -25443074 -23509275 -23187013 -26478279 -30733780
2859 -30733780 -30088659 -20500090 -4627974 9509132 16570070 18944693 21315390 22907793
$$ packed form
2916A5436212p499061o352634n52764L028330M61760l821523l019975J934250
2908c85405L155594k133404n793213N82827J2918999J8741555J2853171K607959
2900D2548083l182949m259239m786749m682933p85554N570549Q206426M138309
2892D2765943k500376o560898q351383j0720636j2170647q115545M28301M659608
2884e65633j642008j2396527j4910278n047205P712828J1461565M447035n156181
2876a6096404q717858l986126M876200J1020760R975716L450977k499765m244273
2868f220773l897846m722485n855971m313999m32000J933799L22262l291266m255501
2859c0733780O45121R588569J5872116J4137106P060938K374623K370697J592403
$$ plain form
2851 22907793 20041929 14220404 10236235 6229452 -5195202 -22547148 -31560649 -23173313
2843 -23173313 -8223196 -4181443 -11543169 -15189686 -8437207 -2929122 -10164992 -23482450
2835 -23482450 -26439460 -13581319 4911570 16739285 19192253 18343966 21531550 30229577
2827 30229577 36944368 30743150 10021027 -11709225 -17741638 -5423014 13125609 26353167
2819 26353167 32527147 33126623 26140184 12051155 492852 2056379 14363444 23427016
2811 23427016 19923840 8394556 -1707654 -8784475 -18535650 -32995384 -44745767 -43424763
2803 -43424763 -26954052 -5407325 7156628 5339408 -3954564 -10877450 -12622747 -11353538
2795 -11353538 -6279213 4765521 16371168 17133896 3957523 -12310657 -20620984 -22435821
$$ packed form
2851B2907793k865864n821525l984169m006783j1424654j7351946r013501Q387336
2843b3173313J4950117M041753p361726l646517O752479N508085p235870j3317458
2835b3482450k957010J2858141J8492889J1827715K452968q48287L187584Q698027
2827C0229577O714791o201218k0722123k1730252o032413J2318624J8548623J3227558
2819B6353167O173980N99476o986439j4089029j1558303J563527J2307065R063572
2811B3427016l503176j1529284j0102210p076821r751175j4459734j1750383J321004
2803d3424763J6470711K1546727J2563953j817220r293972o922886j745297J269209
2795a1353538N074325J1044734J1605647P62728j3176373j6268180q310327j814837
$$ plain form
2787 -22435821 -23806216 -21418952 -7864367 11553907 20148174 11220525 -2042642 -3619304
2779 -3619304 6215863 15639314 18909765 20229884 22733451 23155938 18946457 13395721
2771 13395721 10200388 7899431 3892224 294867 272767 403425 -6056447 -16479392
2763 -16479392 -16855912 961937 24402687 31989395 19821941 6204555 6432516 13271725
2755 13271725 10648537 -1364888 -7259190 1677948 18218088 32137676 40327894 41596530
2747 41596530 32973205 16797474 2655616 -3744098 -6428691 -9021003 -7665957 -1342392
2739 -1342392 -98927 -11709196 -26009554 -25781100 -11573573 -2671767 -11107088 -25840990
2731 -25840990 -27956046 -13448558 5631140 17559546 21022296 20070058 15763899 6763138
$$ packed form
2787b2435821j370395K387264J3554585J9418274Q594267q927649j3263167j576662
2779c619304R835167R423451L270451J320119K503567M22487m209481n550736
2771A3395721l195333k300957m007207l597357k2100J30658o459872j0422945
2763a6479392l76520J7817849K3440750P586708j2167454j3617386K27961O839209
2755A3271725k623188j2013425n894302Q937138J6540140J3919588Q190218J268636
2747D1596530q623325j6175731j4141858o399714k684593k592312J355046O323565
2739a342392J243465j1610269j4300358K28454J4207527Q901806q435321j4733902
2731b5840990k115056J4507488J9079698J1928406L462750r52238m306159r000761
$$ plain form
2723 6763138 -3193016 -3444276 12879384 36774690 48661830 39534930 21447572 11482328
2715 11482328 10649234 7110914 -3530527 -12801335 -14468728 -13129953 -13491095 -11638080
2707 -11638080 -4309840 1293603 -3452592 -14242506 -18033259 -9873246 2839768 12300808
2699 12300808 18112271 21952565 22422709 18873977 14643797 12294865 9632337 4100414
2691 4100414 -2610464 -8093936 -13340482 -18368414 -17370252 -4977880 14075157 28000593
2683 28000593 30016044 21497502 5375754 -14261135 -26536295 -20543373 -2237451 7778889
2675 7778889 1085998 -6147971 1099697 10945593 2372182 -19292434 -27105686 -11888496
2667 -11888496 5741025 7466915 -57852 -3876638 -5964917 -11574966 -12845390 -1799649
$$ packed form
2723F763138r956154k51260J6323660K3895306J1887140r126900j8087358r965244
2715A1482328q33094l538320j0641441r270808j667393J338775l61142J853015
2707a1638080P328240N603443m746195j0789914l790753Q160013J2713014R461040
2699A2300808N811463L840294M70144l548732m230180k348932k662528n531923
2691D100414o710878n483472n246546n027932R98162J2392372J9053037J3925436
2683B8000593K015451q518542j6121748j9636889j2275160N992922J8305922J0016340
2675G778889o692891p233969P247668R845896q573411k1664616p813252J5217190
2667a1888496J7629521J725890p524767l818786k088279n610049j270424J1045741
$$ plain form
2659 -1799649 11545358 12045197 2981671 182829 8531527 20109294 29945885 36747213
2651 36747213 32806822 12094130 -13098532 -21800338 -11148629 3060635 12123081 21751246
2643 21751246 31957767 30673179 14646795 -1323687 -5112016 -2077585 -885482 141946
2635 141946 3101039 2208740 -3310820 -2421650 8778384 14817396 2628480 -15902781
2627 -15902781 -19865245 -9092539 -915010 -3552466 -10023825 -14623276 -18516397 -20348896
2619 -20348896 -16638422 -11396353 -11890617 -15385474 -13209506 -6862498 -5625505 -8378929
2611 -8378929 -3806531 8866524 15479291 8614153 -1208563 -3418355 -2673239 -6317907
2603 -6317907 -8596876 -539286 12108489 15041492 6741016 1048773 7741725 20945124
$$ packed form
2659a799649J3345007M99839r063526k798842Q348698J1577767R836591O801328
2651C6747213l940391k0712692k5192662q701806J0651709J4209264R062446R628165
2643B1751246J0206521j284588j6026384j5970482l788329L034431J192103J027428
2635A41946K959093q92299n519560Q89170J1200034O039012j2188916j8531261
2627a5902781l962464J0772706Q177529k637456o471359m599451l893121j832499
2619b0348896L710474N242069m94264l494857K175968O347008J236993k753424
2611h378929M572398J2673055O612767o865138r822716k209792P45116l644668
2603f317907k278969Q057590J2647775K933003q300476n692243O692952J3203399
$$ plain form
2595 20945124 30073654 34252177 40126255 49236802 53732585 45384491 25741207 5382926
2587 5382926 -6125201 -8072077 -6727218 -7462704 -9527319 -7810783 443310 10332655
2579 10332655 12606066 4843896 -3281571 -1722443 4324007 -659913 -20056931 -37782306
2571 -37782306 -39478303 -31762327 -30803478 -38661236 -42990963 -37055175 -27834568 -23979552
2563 -23979552 -25796095 -28714413 -28667038 -22792363 -11779990 -2228356 -421062 -4065632
2555 -4065632 -6243640 -5425117 -3868920 930760 12611319 25203532 28036195 21838462
2547 21838462 17540279 17440598 11475211 -3204644 -12931772 -6233312 9059480 16984504
2539 16984504 13649004 7073471 3385417 2507037 3628180 7166396 13179531 21792470
$$ packed form
2595B0945124R128530M178523N874078R110547M495783q348094j9643284k0358281
2587E382926j1508127j946876J344859p35486k064615J716536Q254093R889345
2579A0332655K273411p762170q125467J559128O046450m983920j9397018j7725375
2571c7782306j695997P715976R58849p857758m329727N935788R220607L855016
2563b3979552j816543k918318M7375N874675J1012373R551634J807294l644570
2555d065632k178008Q18523J556197M799680J1680559J2592213K832663o197733
2547B1838462m298183r9681n965387j4679855r727128O698460J5292792P925024
2539A6984504l335500o575533l688054q78380J121143L538216O013135Q612939
$$ plain form
2531 21792470 31807470 37309455 32397286 21313794 14896414 14224126 9470728 -245198
2523 -245198 -511274 15458470 32504201 36463009 37759155 52214720 67985065 56696648
2515 56696648 16572546 -19711973 -26105046 -12051687 -1434244 -320183 1045492 6679734
2507 6679734 11063750 11542216 11377501 11763167 10224417 6636961 3772602 2036140 -723678
2498 -723678 -4483469 -7087348 -8744048 -11685573 -14989373 -14320834 -8352277 -1887162 -481696
2489 -481696 -4525362 -10877948 -17693970 -23709515 -24481389 -15860426 -3217022 -337938
2481 -337938 -12790470 -26972830 -24673658 -6641593 8884070 11624870 10388367 13670268
2473 13670268 12643257 -4560566 -30115557 -42485908 -32423639 -10841479 7831339
$$ packed form
2531B1792470J0015000N501985m912169j1083492o417380o72288m753398r715926
2523b45198k66076J5969744J7045731L958808J296146J4455565J5770345j1288417
2515E6696648m0124102l6284519o393073J4053359J0617443J114061J365675N634242
2507F679734M384016M78466j64715L85666j538750l587456k864359j736462k759818
2498g23678l759791k603879j656700k941525l303800O68539N968557O465115J405466
2489d81696m043666o352586o816022o015545p71874Q620963J2643404K879084
2481c37938j2452532j4182360K299172J8032065J5525663K740800j236503L281901
2473A3670268j027011j7203823k5554991j2370351J0062269K1582160J8672818
$$ plain form
2466 7831339 18232729 19968764 13276118 2413596 -5520327 -8500295 -9614244 -8616558
2458 -8616558 -2339453 5233867 3920434 -7764622 -18410396 -19418152 -15656835 -14383976
2450 -14383976 -12855572 -5747410 2053362 251489 -12527226 -27536944 -36925556 -39154196
2442 -39154196 -35750015 -29502188 -24568116 -22591645 -20020952 -14131129 -9201987 -10741273
2434 -10741273 -15567493 -14266883 -2897432 13410045 27621623 35844958 36403289 30744558
2426 30744558 25358604 25890611 28391495 23525381 11517379 5167013 13047253 25763763
2418 25763763 25981551 9282397 -11843676 -24023448 -26190121 -25142064 -24335529 -22420828
2410 -22420828 -19946181 -20630861 -24550199 -25532913 -19412748 -11433476 -9904195 -13913177
$$ packed form
2466G831339J0401390J736035o692646j0862522p933923k979968j113949R97686
2458h616558O277105P573320j313433j1685056j0645774j007756L761317J272859
2450a4383976J528404P108162P800772j801873j2778715j5009718r388612k228640
2442c9154196L404181O247827M934072J976471K570693N889823M929142j539286
2434a0741273m826220J300610J1369451J6307477J4211578Q223335N58331n658731
2426C0744558n385954N32007K500884m866114j2008002o350366P880240J2716510
2418B5763763K17788j6699154k1126073j2179772k166673J048057Q06535J914701
2410b2420828K474647o84680l919338r82714O120165P979272J529281m008982
$$ plain form
2402 -13913177 -13934875 -5827419 2164838 -69098 -11757106 -23165673 -26316592 -19373185
2394 -19373185 -4614747 11572889 19531337 14677101 4306694 -723406 -311654 -3123774
2386 -3123774 -10493063 -13075448 -7344891 -4233021 -12711947 -23568655 -21663793 -9100497
2378 -9100497 -1665721 -3214164 106485 15140123 26844588 19451752 983294 -8750029
2370 -8750029 -7921090 -12181479 -25167967 -29246413 -12887469 9304161 16583081 10520338
2362 10520338 8438031 15914837 22964162 24944207 29174643 37566414 38922108 26326922
2354 26326922 9880363 2710858 3688388 3979077 3030148 6632040 14100819 19033585
2346 19033585 20272073 21363133 21020265 15633772 10779052 17175360 31918452 36041940
$$ packed form
2402a3913177k1698Q107456P992257k233936j1688008j1408567l150919O943407
2394a9373185J4758438J6187636P958448m854236j0370407n030100M11752k812120
2386c123774p369289k582385N730557L111870q478926j0856708J904862J2563296
2378i100497P434776j548443L320649J5033638J1704465p392836j8468458r733323
2370h750029Q28939m260389j2986488m078446J6358944K2191630P278920o062743
2362A0520338k082307P476806P049325J980045M230436Q391771J355694j2595186
2354B6326922j6446559p169505R77530K90689r48929L601892P468779M932766
2346A9033585J238488J091060l42868n386493m854720O396308J4743092M123488
$$ plain form
2338 36041940 17773454 -10878918 -28644322 -29015310 -21571229 -15891926 -14992600 -21151009
2330 -21151009 -35450358 -49755456 -50087689 -33483360 -14246359 -7236550 -10195017 -9856461
2322 -9856461 -2117270 3294217 -648572 -6078842 -1028130 12134610 17685909 6867286
2314 6867286 -10130135 -17162849 -12289858 -7884759 -12391430 -20591549 -24333553 -24390253
2306 -24390253 -24785907 -21336917 -6263797 16839128 33254451 35442735 32214486 34314052
2298 34314052 38573177 34313753 20032040 4095971 -8262077 -18037311 -22744632 -14950475
2290 -14950475 5432844 26054858 34725641 30929510 20732126 7942048 -3499559
2283 -3499559 -6379925 555756 5173283 -4958467 -23787796 -32160533 -22528387 -7725816
$$ packed form
2338C6041940j8268486k8652372j7765404l70988P444081N679303Q99326o158409
2330b1151009j4299349j4305098l32233J6604329J9237001P009809k958467L38556
2322i856461P739191N411487l942789n430270N050712J3162740N551299j0818623
2314F867286j6997421p032714M872991M405099m506671q200119l742004n6700
2306b4390253l95654L448990J5073120K3102925J6415323K188284l228249K099566
2298C4314052M259125m259424j4281713j5936069j2358048r775234m707321P794157
2290a4950475K0383319K0622014Q670783l796131j0197384j2790078j1441607
2283c499559k880366O935681M617527j0131750j8829329q372737R632146J4802571
$$ plain form
2275 -7725816 -2672277 -7491942 -13510465 -16867893 -18851165 -18897676 -15350511 -10338584 -7665594
2266 -7665594 -7693505 -8895584 -11957681 -17710908 -23549970 -26658943 -28307941 -30138596 -29155241
2257 -29155241 -22441261 -14479297 -12648403 -16312359 -17456153 -12110985 -4068108 2980473
2249 2980473 8779051 10393522 2169668 -13454675 -23584831 -20548538 -13328404 -14765616
2241 -14765616 -22731391 -24778789 -18547138 -14733364 -18611236 -21568959 -16561355 -10658737
2233 -10658737 -13020320 -18791158 -16802176 -8658390 -6946679 -14743505 -19855116 -13357612
2225 -13357612 -2868150 -176125 -3464763 -1030023 10631636 20872895 17516781 648593
2217 648593 -17016249 -21547990 -10182923 6822035 18195601 24149058 31553937 37836830
$$ packed form
2275g725816N053539m819665o018523l357428j983272m6511L547165N011927K672990
2266g665594k7911j202079l062097n753227n839062l108973j648998j830655R83355
2257b9155241O713980P961964J830894l663956j143794N345168Q042877P048581
2249B980473N798578J614471q223854j5624343j0130156L036293P220134j437212
2241a4765616p965775k047398O231651L813774l877872k957723N007604N902618
2233a0658737k361583n770838J988982Q143786J711711p796826n111611O497504
2225a3357612J0489462K692025l288638K434740J1661659J0241259l356114j6868188
2217F48593j7664842m531741J1365067J7004958J1373566N953457P404879O282893
$$ plain form
2209 37836830 30629825 8326363 -10382201 -8129676 7886971 17023611 13834855 10507348
2201 10507348 13489856 15390591 12841887 15259168 27877491 39601530 37879975 25791057
2193 25791057 14334687 6059690 -2983424 -11557385 -14835346 -13741793 -12548516 -10117201
2185 -10117201 -3038193 5169906 7978639 7529466 12219706 22217981 26948309 19314344
2177 19314344 4674652 -7265587 -13265795 -16204999 -18902437 -21471969 -21842704 -17378359
2169 -17378359 -8840856 -2888757 -6093325 -15051386 -17219085 -5280049 11774696 16347275
2161 16347275 1981863 -17337892 -21105222 -5668899 11030648 11609433 649709 -4514878
2153 -4514878 -646584 -2165884 -15474304 -25457888 -17222580 1422031 12563398 13758074
$$ packed form
2209C7836830p207005k2303462j8708564K252525J6016647R136640l188756l327507
2201A0507348K982508J900735k548704K417281J2618323J1724039j721555j2088918
2193B5791057j1456370q274997r043114q573961l277961J093553J193277K431315
2185a0117201P079008Q208099K808733m49173M690240R998275M730328p633965
2177A9314344j4639692j1940239o000208k939204k697438k569532l70735M464345
2169a7378359Q537503N952099l204568q958061k167699J1939036J7054745M572579
2161A6347275j4365412j9319755l767330J5436323J6699547N78785j0959724n164587
2153d514878L868294j519300j3308420r983584Q235308J8644611J1141367J194676
$$ plain form
2145 13758074 15444307 19498652 18121462 11475385 8484228 9419132 4918850 -5201934
2137 -5201934 -9863803 -8386336 -15712079 -36294601 -49636458 -36408056 -7002647 11957462
2129 11957462 11852894 6754680 8408193 13042250 13463567 9956484 5082547 -1955661
2121 -1955661 -10440402 -14476036 -9439943 1562896 11435858 17171707 21466762 26912365
2113 26912365 30332466 24606228 7964919 -9631233 -14189822 -3521708 9439588 12430220
2105 12430220 8069695 7232022 12687495 17046535 15541554 12572132 13155851 13925749 7566934
2096 7566934 -5508671 -14266151 -8089489 9905739 23412180 19098709 539582 -17342303
2088 -17342303 -25781020 -28196983 -29362034 -27352395 -20351575 -14117442 -15792661 -24102960
$$ packed form
2145A3758074J686233M054345j377190o646077k991157R34904m500282j0120784
2137e201934m661869J477467p325743k0582522j3341857J3228402K9405409J8960109
2129A1957462j04568n098214J653513M634057M21317l507083m873937p038208
2121a955661q484741m035634N036093J1002839R872962N735849M295055N445603
2113B6912365L420101n726238j6641309j7596152m558589J0668114J2961296K990632
2105A2430220m360525q37673N455473M359040j504981k969422N83719P69898o358815
2096G566934j3075605q757480O176662J7995228J3506441m313471j8559127j7881885
2088a7342303q438717k415963j165051K009639P000820O234133j675219q310299
$$ plain form
2080 -24102960 -31396571 -32252792 -25410754 -11791515 2940613 8192744 -511509 -12105811
2072 -12105811 -10247868 6865467 24609693 30429540 26224126 20207936 14778229 8105938
2064 8105938 2525893 4171389 14765267 28189323 36009574 34343874 25192166 13383991
2056 13383991 3816275 193567 2846124 6270330 2518513 -8573983 -15165654 -6382870
2048 -6382870 11019885 18027127 7974048 -4392280 -5042615 -1814844 -11591710 -32667252
2040 -32667252 -45126093 -38442196 -23994345 -15849112 -12088343 -3764228 7041004 9916802
2032 9916802 3537021 -761886 5292777 15403250 17588916 10475697 4541846 6895570
2024 6895570 10875100 5866665 -5686654 -9459717 808059 13038612 12679412 2471355
$$ packed form
2080b4102960p293611q56221O842038J3619239J4732128N252131q704253j1594302
2072a2105811J857943J7113335J7744226N819847m205414o016190n429707o672291
2064H105938n580045J645496J0593878J3424056P820251j665700r151708j1808175
2056A3383991r567716l622708K652557L424206l751817j1092496o591671Q782784
2048f382870J7402755P007242j0053079j2366328o50335L227771r776866k1075542
2040c2667252j2458841O683897J4447851Q145233L760769Q324115J0805232K875798
2032I916802o379781m298907O054663J0110473K185666p113219n933851K353724
2024F895570L979530n008435j1553319l773063J0267776J2230553l59200j0208057
$$ plain form
2016 2471355 -2506646 4049389 13715083 17827502 17447949 16389363 13489458 6751745
2008 6751745 -1038282 -5613484 -6082876 -3632188 298796 2736269 1638957 1394015 8616045
1999 8616045 19588949 20785736 7483544 -7310284 -11073116 -10228729 -17990632 -29985432
1991 -29985432 -28542842 -11200617 1987985 -4140705 -18734611 -21055575 -8164183 5070523
1983 5070523 7781915 2578738 -4749955 -12941014 -20712418 -24149712 -22762044 -21643086
1975 -21643086 -23816071 -25656497 -23287196 -18420636 -14041423 -9139853 -2383030 3014339
1967 3014339 3184968 -606494 -4619748 -7896812 -10217027 -8743566 -2885687 1010122
1959 1010122 -2650726 -8899450 -8533303 -2454450 277430 -1452499 1709797 12676517
$$ packed form
2016B471355m978001O556035R665694M112419l79553j058586k899905o737713
2008F751745p790027m575202m69392K450688L930984K437473j097312k44942P222030
1999H616045J0972904J196787j3302192j4793828l762832Q44387p761903j1994800
1991b9985432J442590J7342225J3188602o128690j4593906k320964J2891392J3234706
1983E070523K711392n203177p328693q191059p771404l437294J387668J118958
1975b1643086k172985j840426K369301M866560M379213M901570O756823N397369
1967C014339J70629l791462m013254l277064k320215J473461N857879L895809
1959A010122l660848o248724L66147O078853K731880j729929L162296J0966720
$$ plain form
1951 12676517 19739410 12416077 -2663276 -10089331 -4926352 4118061 7694857 4920279
1943 4920279 648729 -905074 496573 1796062 1106170 1080013 4412288 6920024 1677258
1934 1677258 -9317937 -15819778 -14107132 -12042766 -15226694 -17785142 -13500287 -7108481
1926 -7108481 -6227685 -9567015 -11739067 -12898972 -14901621 -14674831 -10391928 -7388119 -8963661
1917 -8963661 -9170136 -4400115 -2460379 -8005878 -9859593 1078435 11701649 4936623
1909 4936623 -9875081 -9178521 6070552 10936078 -2542971 -12448233 -2429532 15408319
1901 15408319 24145808 25237599 24193989 14776053 -4992297 -19069375 -14789279 -3443880
1893 -3443880 -649720 -134523 11530580 25850973 22869453 4556350 -6916854 -2874371
$$ packed form
1951A2676517P062893p323333j5079353p426055N162979R044413L576796k774578
1943D920279m271550j553803J401647J299489o89892k6157L332275K507736n242766
1934A677258j0995195o501841J712646K064366l183928k558448M284855O391806
1926g108481Q80796l339330k172052j159905k002649K26790M282903L003809j575542
1917h963661k06475M770021J939736n545499j853715J0938028J0623214o765026
1909D936623j4811704O96560J5249073M865526j3479049r905262J0018701J7837851
1901A5408319Q737489J091791j043610r417936j9768350j4077078M280096J1345399
1893c443880K794160N15197J1665103J4320393k981520j8313103j1473204M042483
$$ plain form
1885 -2874371 2941479 971163 -728281 4104373 6340707 -2175737 -11997271 -7167608
1877 -7167608 14053934 37388673 46853713 36713969 14519199 -4287497 -9563738 -6475918
1869 -6475918 -7843313 -16545971 -22410196 -17042659 -3304709 12066896 26171169 35835433
1861 35835433 34349534 19934177 2847627 -3334212 3842761 14626844 18773834 14040837
1853 14040837 4270099 -6020600 -13755959 -16952803 -14866342 -8763693 -1769859 2826882
1845 2826882 3585568 1478216 -1137696 -2038724 -805098 109797 -2531182 -8088618 -11686294
1836 -11686294 -11050083 -10594792 -14121843 -16720314 -11126893 -173591 6007330 4661921
1828 4661921 2097253 96977 -6875493 -17384080 -19665885 -10100193 -2155605 -6225868
$$ packed form
1885b874371N815850j970316j699444M832654K236334q516444r821534M829663
1877g167608K1221542K3334739R465040j0139744k2194770j8806696n276241L087820
1869f475918j367395q702658n864225N367537J3737950J5371605J4104273R664264
1861C5835433j485899j4415357j7086550o181839P176973J0784083M146990m732997
1853A4040837r770738j0290699p735359l196844K086461O102649O993834M596741
1845B826882P58686k107352k615912r01028J233626R14895k640979n557436l597676
1836a1686294O36211M55291l527051k598471N593421J0953302O180921j345409
1828D661921k564668k000276o972470j0508587k281805R565692P944588m070263
$$ plain form
1820 -6225868 -12055392 -5111351 8486185 9971004 -3634654 -15839356 -15167896 -8385096
1812 -8385096 -6539407 -9891248 -11212060 -6056156 3564975 10481924 7045753 -6117016
1804 -6117016 -17621629 -17809024 -10941234 -7648382 -9143854 -8595449 -4703119 -1998508
1796 -1998508 876018 10306413 23954428 29607151 20522538 2757877 -13879727 -22942343
1788 -22942343 -20099785 -6858851 3594841 -2530527 -19807679 -27806927 -18908522 -8066804
1780 -8066804 -9022019 -15406550 -15363390 -12223245 -17088786 -28615130 -33856495 -26158276 -11740328
1771 -11740328 -658657 306706 -11365070 -30827090 -44992748 -43644368 -32197158 -26274976
1763 -26274976 -32245748 -39619554 -35597214 -21932040 -12427431 -15760217 -26267552 -33294967
$$ packed form
1820f225868n829524O944041J3597536J484819j3605658j2204702O71460O782800
1812h385096J845689l351841j320812N155904R621131O916949l436171j3162769
1804f117016j1504613j87395O867790L292852j495472N48405L892330K704611
1796a998508K874526R430395J3648015N652723r084613j7764661j6637604r062616
1788b2942343K842558J3240934J0453692o125368j7277152p999248Q898405J0841718
1780h066804r55215o384531M3160L140145m865541j1526344n241365P698219J4417948
1771a1740328J1081671R65363j1671776j9462020j4165658J348380J1447210N922182
1763b6274976n970772p373806M022340J3665174R504609l332786j0507335p027415
$$ plain form
1755 -33294967 -34991648 -37479674 -41957630 -40221289 -26060616 -5196041 10888108 16641680
1747 16641680 13594034 5352352 -1945995 920618 17496797 38018505 47802420 42293238
1739 42293238 28768663 16543598 11555486 16130572 26045183 30973617 25096607 13791638
1731 13791638 4280028 -3138933 -7456034 -1624978 12974319 18216846 2641974 -16156105
1723 -16156105 -13174506 6830285 17091668 9551478 1956794 4559888 7035881 3096303
1715 3096303 1719963 5810833 4015265 -6727082 -13701735 -13443221 -20182992 -36924006
1707 -36924006 -42581917 -24786964 -3831126 -4467578 -21364823 -31919800 -28720138 -20776539
1699 -20776539 -14995445 -13303956 -17087508 -20280465 -10003972 13165003 28906786 23350545
$$ packed form
1755c3294967j696681k488026m477956J736341J4160673K0864575J6084149N753572
1747A6641680l047646q241682p298347K866613J6576179K0521708R783915n509182
1739D2293238j3524575j2225065m988112M575086R914611M928434n877010j1304969
1731A3791638r511610p418961m317101N831056J4599297N242527j5574872j8798079
1723a6156105K981599K0004791J0261383p540190p594684K603094K475993l939578
1715C096303j376340M090870j795568j0742347o974653K58514o739771j6741014
1707c6924006n657911J7794953K0955838o36452j6897245j0554977L199662P943599
1699b0776539N781094J691489l783552l192957J0276493K3168975J5741783n556241
$$ plain form
1691 23350545 7370646 -2285985 -3951180 -2843860 -903980 -4994956 -23025920 -41554723
1683 -41554723 -34215755 -4441659 12616222 5444912 3634380 19440206 20429736 -6697025
1675 -6697025 -19003127 7155551 20192677 -15752048 -25079578 83573811 250072919
1668 250072919 305767127 194695287 44959786 -13100812 485916 -1737610 -29723800
1661 -29723800 -34771623 -13622816 -6347273 -18840838 -22156090 -14391383 -19553215 -33151361
1653 -33151361 -25773721 2084547 18727754 14354129 10529280 15492023 12248269 -4209863
1645 -4209863 -15913181 -14984040 -14421061 -18915398 -15560394 -1837668 4788365 -5174377
1637 -5174377 -18666990 -21693990 -15434708 -4467953 11500255 27177632 30173640 17215199
$$ packed form
1691B3350545j5979899r656631j665195J107320J939880m090976j8030964j8528803
1683d1554723P338968K9774096J7057881p171310j810532J5805826R89530k7126761
1675f697025j2306102K6158678J3037126l5944725r327530J08653389J66499108
1668B50072919N5694208j11071840j49735501n8060598J3586728k223526k7986190
1661b9723800n047823K1148807P275543j2493565l315252P764707n161832j3598146
1653c3151361P377640K7858268J6643207m373625l824849M962743l243754j6458132
1645d209863j1703318R29141N62979m494337L355004J3722726O626033r962742
1637e174377j3492613l027000O259282J0966755J5968208J5677377K996008j2958441
$$ plain form
1629 17215199 -785025 -13328707 -18682908 -18149280 -14617411 -14679309 -19151743 -16090713
1621 -16090713 2033759 20923064 21987932 10012401 2549096 -614881 -11837747 -24712298
1613 -24712298 -18827088 3491680 15022319 4199626 -9560025 -9200691 -2490744 -376307
1605 -376307 2746537 13438276 24198397 27634627 28374129 29074537 21634573 4136083
1597 4136083 -9792865 -10231756 -4308094 -266921 4750555 10216759 4418024 -14647058
1589 -14647058 -28383705 -24196828 -16931811 -25375857 -41440162 -43242348 -28370729 -13239883
1581 -13239883 -6460474 -3256550 -2555956 -10410780 -26188741 -40106551 -45327531 -42056427
1573 -42056427 -31600125 -16654790 -4800516 -1500673 -1891824 1949820 9179665 13402914
$$ packed form
1629A7215199j8000224j2543682n354201N33628L531869o1898m472434L061030
1621a6090713J8124472J8889305J064868j1975531p463305l163977j1222866j2874551
1613b4712298N885210K2318768J1530639j0822693j3759651L59334O709947K114437
1605c76307L122844J0691739J0760121L436230P39502P00408p439964j7498490
1597D136083j3928948m38891N923662M041173N017476N466204n798735j9065082
1589a4647058j3736647M186877P265017q444046j6064305j802186J4871619J5130846
1581a3239883O779409L203924P00594p854824j5777961j3917810n220980L271104
1573d2056427J0456302J4945335J1854274L299843l91151L841644P229845M223249
$$ plain form
1565 13402914 12214068 5299800 -9588108 -28594299 -37807722 -30032378 -18204324 -17652842
1557 -17652842 -21691222 -12211233 9455969 21880814 14699317 2078923 273466 7265771
1549 7265771 11576986 8666794 600587 -11057111 -24006715 -33145600 -35722288 -33709073
1541 -33709073 -27627171 -14473763 3987025 17446278 17648068 8840937 2300452 2910410
1533 2910410 5804941 5009863 1099303 -816402 1364249 3794972 2672010 930379
1525 930379 4170807 10105678 9415540 302534 -6154510 -2269851 2225479 -6555347 -24050138
1516 -24050138 -31492264 -22472290 -11392279 -11245488 -15190763 -8520133 9016743 22436548
1508 22436548 19615796 2157271 -20334585 -39230786 -48890913 -46364538 -34474417 -23462571
$$ packed form
1565A3402914j188846o914268j4887908j9006191r213423P775344J1828054N51482
1557a7652842m038380R479989K1667202J2424845p181497j2620394j805457O992305
1549G265771M311215k910192q066207j1657698j2949604r138885k576688K013215
1541c3709073O081902J3153408J8460788J3459253K01790q807131o540485O09958
1533B910410K894531p95078l910560j915705K180651K430723j122962j741631
1525I30379L240428N934871o90138r113006o457044L884659M495330q780826j7494791
1516b4050138p442126R019974J1080011J46791l945275O670630J7536876J3419805
1508B2436548k820752j7458525k2491856j8896201r660127K526375J1890121J1011846
$$ plain form
1500 -23462571 -23883983 -35189360 -44558520 -40952614 -27999011 -17451041 -11648135 -1188605
1492 -1188605 18321794 37056961 44189404 41992886 38950488 35772341 27786688 15924169
1484 15924169 4783936 -6391617 -19655390 -28272683 -23419878 -10143607 -3123681 -4779650
1476 -4779650 -1352082 14313050 28913641 26047405 8194133 -7957152 -12241727 -8540445
1468 -8540445 -5429736 -7034648 -11515965 -13293785 -8343604 -941955 -2347075 -18623119
1460 -18623119 -41947225 -57432090 -56463180 -41104704 -19479151 -1045084 6765057 2677628
1452 2677628 -7668108 -17157737 -21995555 -20520116 -11941789 287399 7854387 5326254
1444 5326254 -3394811 -10310159 -13075471 -15414891 -19344756 -21585742 -18008387 -8818828
$$ packed form
1500b3462571m21412j1305377r369160L605906J2953603J0547970N802906J0459530
1492a188605J9510399J8735167P132443k196518l042398l178147p985653j1862519
1484A5924169j1140233j1175553j3263773q617293M852805J3276271P019926j655969
1476d779650L427568J5665132J4600591k866236j7853272j6151285m284575L701282
1468h540445L110709j604912m481317j777820M950181P401649j405120j6276044
1460a8623119k3324106j5484865R68910J5358476K1625553J8434067P810141m087429
1452B677628j0345736r489629m837818J475439Q578327J2229188P566988k528133
1444E326254q721065o915348k765312k339420l929865k240986L577355R189559
$$ plain form
1436 -8818828 894775 4497001 -876826 -10471284 -15244185 -11592777 -6188587 -8289831
1428 -8289831 -18269453 -26467451 -23024690 -7258487 11500598 20905903 15731261 3709973
1420 3709973 -887619 6944840 15372860 8745671 -12315834 -29777786 -29370734 -17530320
1412 -17530320 -12090851 -19393532 -28290479 -27579372 -20946478 -18704911 -20881972 -18651500
1404 -18651500 -11116523 -8898991 -17014324 -24459424 -18822549 -4136124 5220515 3780434
1396 3780434 -1557730 -4121796 -3197987 1273919 9315414 16217239 16757113 13926618 13671051
1387 13671051 11964874 -382825 -19444452 -29301743 -25123940 -20070911 -22774328 -23305073
1379 -23305073 -11537076 4590005 11903135 11143491 9276247 3804367 -8528372 -16349422
$$ packed form
1436h818828R713603L602226n373827r594458m772901L651408N404190k101244
1428h289831r979622q197998L442761J5766203J8759085R405305n174642j2021288
1420C709973m597592P832459Q428020o627189k1061505j7461952M07052J1840414
1412a7530320N439469p302681q896947P11107O632894K241567k177061K230472
1404a8651500P534977K217532q115333p445100N636875J4686425R356639j440081
1396C780434n338164k564066R23809M471906Q041495O901825N39874k830495k55567
1387A3671051j706177j2347699j9061627r857291M177803N053029k703417n30745
1379b3305073J1767997J6127081P313130p59644j867244n471880j2332739p821050
$$ plain form
1371 -16349422 -6299168 13800785 23450323 18363713 11584724 7207069 -5143936 -26057538
1363 -26057538 -38004841 -29946945 -12789397 -460081 8594178 19586846 25806896 19688821
1355 19688821 9134037 7493250 13577720 15344085 9191959 3275507 4413186 12030825
1347 12030825 22125712 28053066 21776759 4730994 -7015499 -488446 14537753 16841287
1339 16841287 3131911 -8221671 -3872598 8762613 16689567 18554883 19167948 17968409
1331 17968409 12902342 8792736 11975556 19906550 23747608 19505714 11378710 6278379
1323 6278379 9163318 20434661 33129911 35999106 25067578 9972911 3273292 5137647
1315 5137647 4613233 -4403612 -14747154 -15513699 -5803873 4101768 3900525 -6461646
$$ packed form
1371a6349422J0050254K0099953R649538n086610o778989m377655j2351005k0913602
1363b6057538j1947303Q057896J7157548J2329316R054259J0992668O220050o118075
1355A9688821j0554784j640787O084470J766365o152126n916452J137679P617639
1347A2030825J0094887N927354o276307j7045765j1746493O527053J5026199K303534
1339A6841287j3709376j1353582M349073J2635211P926954J865316O13065j199539
1331A7968409n066067m109606L182820P930994L841058m241894q127004n100331
1323F278379K884939J1271343J2695250K869195j0931528j5094667o699619J864355
1315E137647n24414r016845j0343542p66545R709826R905641k01243j0362171
$$ plain form
1307 -6461646 -17769037 -21561624 -17217202 -8210247 5058194 23185571 39620663 42792985
1299 42792985 30157290 13867086 7152940 9877331 13202053 13394902 13002195 11764758
1291 11764758 6040925 -2777852 -7588510 -4786224 1914305 7099967 6988187 -1775744
1283 -1775744 -18255191 -32150186 -32447128 -22957027 -18790677 -24221105 -26034021 -14998654
1275 -14998654 -1164816 2871331 2895257 12603972 29417278 37571896 32766654 26874744
1267 26874744 26925717 25476181 16421918 6005572 1086334 -1493775 -6006160 -9206049
1259 -9206049 -9312088 -13031560 -22738088 -26117162 -12346280 7983971 14575718 5937551
1251 5937551 212623 7378947 16996607 17959329 14991307 16583124 18641190 12133748
$$ packed form
1307f461646j1307391l792587M344422R006955J3268441J8127377J6435092L172322
1299D2792985j2635695j6290204o714146K724391L324722J92849l92707j237437
1291A1764758n723833q818777m810658K802286O700529N185662j11780q763931
1283a775744j6479447j3894995k96942R490101M166350n430428j812916J1035367
1275a4998654J3833838M036147K3926R708715J6813306Q154618m805242n891910
1267B6874744N0973j449536r054263j0416346m919238k580109m512385l199889
1259i206049j06039l719472r706528l379074J3770882K0330251O591747q638167
1251E937551n724928P166324R617660R62722k968022J591817K058066o507442
$$ plain form
1243 12133748 -249709 -7186562 -4894065 644094 5832920 13086336 21620627 24800176
1235 24800176 20280600 14848022 14173741 13974988 7713370 -1132227 -2267932 6736557
1227 6736557 16240972 17092664 11737498 8908372 11237228 13569060 11793257 7233747
1219 7233747 1910155 -4266020 -9257212 -8351958 -2706011 -2496409 -13741221 -26026100
1211 -26026100 -23677792 -8145611 2340071 -2543155 -13372949 -19352731 -25092935 -37611706
1203 -37611706 -47527810 -39937440 -18763301 -1988649 6386576 19658523 39540440 45496972
1195 45496972 25769876 1461069 408880 17957332 25747132 14579886 4161518
1188 4161518 7461505 9815907 -4240939 -22260159 -20565833 634364 18316399 19438685
$$ packed form
1243A2133748j2383457o936853K292497N538159N188826P253416Q534291L179549
1235B4800176m519576n432578o74281j98753o261618q845597j135705R004489
1227F736557R504415Q51692n355166k829126K328856K331832j775803m559510
1219G233747n323592o176175m991192R05254N645947K09602j1244812j2284879
1211b6026100K348308J5532181J0485682m883226j0829794n979782n740204j2518771
1203c7611706r916104P590370K1174139J6774652Q375225J3271947J9881917N956532
1195D5496972j9727096k4308807j052189J7548452P789800j1167246j0418368
1188D161518L299987K354402j4056846j8019220J694326K1200197J7682035J122286
$$ plain form
1180 19438685 14368113 15496292 18931832 15380628 7890447 7951392 18745003 31373367
1172 31373367 36448835 32875057 25462146 19326994 17468088 19535316 21148797 17116013
1164 17116013 7255568 -2374479 -5582766 -2673863 260804 -1524008 -6128260 -7433190
1156 -7433190 -2348571 5366618 8901742 5239613 -2489760 -8704999 -10160078 -7567480
1148 -7567480 -4421908 -4870620 -11228004 -22032414 -32491994 -37500550 -34818273 -26051551
1140 -26051551 -14940084 -4070976 7188063 20551973 34091584 41618493 38784505
1133 38784505 28277645 16575716 7523420 2858694 6718802 22297975 42652971 52361627
1125 52361627 43418171 24764837 10892305 5481569 2889147 1411280 4699456 10316376
$$ packed form
1180A9438685n070572J128179L435540l551204p490181O0945J0793611J2628364
1172C1373367N075468l573778p412911o135152j858906K067228J613481m032784
1164A7116013r860445r630047l208287K908903K934667j784812m604252j304930
1156g433190N084619P715189L535124l662129p729373o215239j455079K592598
1148g567480L145572m48712o357384j0804410j0459580n008556K682277Q766722
1140b6051551J1111467J0869108J1259039J3363910J3539611P526909k833988
1133C8784505j0506860j1701929r052296m664726L860108J5579173K0354996R708656
1125E2361627q943456j8653334j3872532n410736k592422j477867L288176N616920
$$ plain form
1117 10316376 8461947 -2763744 -9869203 -377764 18184725 25403837 13088988 -5829715
1109 -5829715 -15390195 -15038770 -14481861 -16492981 -14290559 -5528653 451593 -5218200 -16374037
1100 -16374037 -16865797 -138614 22381955 34780992 33340116 25442306 16295732 4698929
1092 4698929 -8189656 -14695344 -10310752 -2040074 -148423 -4102204 -4231647 2827356
1084 2827356 8720942 6751444 3207327 8397494 20935155 30014861 32393018 37060653
1076 37060653 49455637 59975938 56284221 42034584 33268799 36617808 40798970 33198736
1068 33198736 17151752 6749993 9308560 19493685 27917180 28748544 20270257 5365341
1060 5365341 -7503679 -10229504 -4258324 1236726 2093145 3709138 9625661 13200038
$$ packed form
1117A0316376j854429j1225691p105459R491439J8562489P219112j2314849j8918703
1109e829715r560480L51425N56909k011120K202422Q761906N980246n669793j1155837
1100a6374037m91760J6727183K2520569J2399037j440876p897810r146574j1596803
1092D698929j2888585o505688M384592Q270678J891651l953781j29443P059003
1084B827356N893586j969498l544117N190167J2537661R079706K378157M667635
1076C7060653J2394984J0520301l691717j4249637q765785L349009M181162p600234
1068C3198736j6046984j0401759K558567J0185125Q423495Q31364q478287j4904916
1060E365341j2869020k725825N971180N495050Q56419J615993N916523L574377
$$ plain form
1052 13200038 8084502 1435120 5963825 19960013 26503851 15923382 -540948 -5939520
1044 -5939520 550895 5527727 1317028 -5426765 -5205809 2296702 10389329 13978446
1036 13978446 12609697 8561322 5172519 4932758 6745342 6389063 1056247 -7790850
1028 -7790850 -16202094 -20284600 -17641979 -9931763 -3404840 -1682320 1562022 14601333
1020 14601333 30668418 30234273 7700654 -14728116 -12816112 6891543 16426768 6187491
1012 6187491 -3823486 3188316 15975042 15181177 3403588 -1559658 4686069 9631495
1004 9631495 6936710 5289515 10346281 12469422 1011485 -18064505 -28152334 -21806545
996 -21806545 -7273134 3461878 7135499 8256985 9436700 7272292 -138682 -5353334
$$ packed form
1052A3200038n115536o649382M528705J3996188O543838j0580469j6464330n398572
1044e939520O490415M976832m210699o743793K20956P502511Q092627L589117
1036A3978446j368749m048375l388803k39761J812584l56279n332816q847097
1028g790850q411244m082506K642621P710216O526923J722520L244342J3039311
1020A4601333J6067085m34145k2533619k2428770J912004J9707655R535225j0239277
1012F187491j0010977P011802J2786726p93865j1777589m963246O245727M945426
1004I631495k694785j647195N056766K123141j1457937j9075990j0087829O345789
996b1806545J4533411J0735012L673621J121486J179715k164408p410974n214652
$$ plain form
988 -5353334 1253533 15492707 20023199 7023951 -9067423 -11852877 -7603278 -13812967
980 -13812967 -27871342 -27805132 -7129607 11764108 8758295 -6780842 -13419608 -8253805
972 -8253805 -3790757 -4521251 -4650892 -3215596 -3681742 -1676945 9416798 21739286 19542952
963 19542952 4182810 -4710329 2472961 11786560 7401999 -6998985 -16763777 -14635417
955 -14635417 -2353247 15374191 29634345 29776150 16509268 4197568 1787331 1313018
947 1313018 -4998140 -8172870 1975371 14358851 9302974 -9816819 -18079164 -4618747
939 -4618747 11790855 9831249 -6785336 -18903778 -17922522 -10274632 -2535936 5435475
931 5435475 13470495 16983219 12825952 4609085 -558672 605046 4523225 5001167 318977
$$ packed form
988e353334O606867J4239174M530492j2999248j6091374k785454M249599o209689
980a3812967j4058375O6210K0675525J8893715l005813j5539137o638766N165803
972h253805M463048p30494j29641J435296m66146K004797J1093743J2322488k196334
963A9542952j5360142q893139P183290R313599m384561j4400984r764792K128360
955a4635417J2282170J7727438J4260154J41805j3266882j2311700k410237m74313
947A313018o311158l174730J0148241J2383480n055877j9119793q262345J3460417
939d618747J6409602j959606j6616585j2118442R81256P647890P738696P971411
931E435475Q035020L512724m157267q216867n167757J163718L918179M77942m682190
$$ plain form
922 318977 -5029546 -6436285 -4622588 -2373222 1461742 9752561 20010878 25307364
914 25307364 23154098 18722189 17661671 19186287 17428067 7288584 -10522791 -27585462
906 -27585462 -33077189 -25258136 -14895865 -11655898 -11071238 -3898567 5171211 1565390
898 1565390 -15525643 -28111628 -23700609 -11807746 -7785409 -11337220 -12053581 -7639646
890 -7639646 -3837512 -1360673 4333527 12329905 16546158 16082192 15401038 14437401 8423431
881 8423431 -1158541 -4932024 1375176 9300788 7762327 -3105551 -12379846 -11285172
873 -11285172 -2960377 1639052 -2738312 -8783100 -6527580 2463476 7770976 5939542
865 5939542 3393557 2026877 -4838420 -16077199 -16887171 -823049 15105109 12630283
$$ packed form
922C18977n348523j406739J813697K249366L834964Q290819J0258317N296486
914B5307364k153266m431909j060518J524616j758220j0139483j7811375j7062671
906b7585462n491727P819053J0362271L239967N84660P172671R069778l605821
898A565390j7091033j2585985M411019J1892863M022337l551811p16361M413935
890g639646L802134K476839N694200P996378M216253m63966o81154r63637o013970
881H423431r581972l773483O307200P925612j538461j0867878r274295J094674
873a1285172Q324795M599429m377364o044788K255520Q991056N307500j831434
865E939542k545985j366680o865297j1238779q09972J6064122J5928158k474826
$$ plain form
857 12630283 -1107832 -7045263 -5144085 -9760632 -19608030 -18065865 -4307770 1627411
849 1627411 -8957111 -19936579 -18340749 -12962908 -12234364 -5302656 16959163 39501616
841 39501616 42042426 28199351 16234325 11038724 5394075 650226 4080409 9651821
833 9651821 2881711 -15108355 -26949370 -23634370 -13193270 -3817912 4537526 8999311
825 8999311 1685510 -14813671 -24371946 -17672120 -4748521 -604817 -7987287 -19947225
817 -19947225 -29291603 -29167928 -14431302 9231067 25260306 23510206 11881145 4265015
809 4265015 3519920 3972557 4437611 8587057 14953656 16150376 9095758 -181427 -3564636
800 -3564636 928286 8796899 14346318 15504052 14707283 15636388 19099730 22238084 20927311
$$ packed form
857A2630283j3738115n937431J901178m616547r847398J542165J3758095N935181
849A627411j0584522j0979468J595830N377841P28544O931708K2261819K2542453
841C9501616K540810j3843075j1965026n195601n644649m743849L430183N571412
833I651821o770110j7990066j1841015L315000J0441100R375358Q355438M461785
825H999311p313801j6499181r558275O699826J2923599M143704p382470j1959938
817a9947225r344378J23675J4736626K3662369J6029239j750100j1629061p616130
809D265015p45095M52637M65054M149446O366599J196720p054618r277185l383209
800c564636M492922P868613N549419J157734p96769R29105L463342L138354j310773
$$ plain form
791 20927311 12469416 -1924809 -15629079 -20461636 -15140092 -7148895 -2869364 203478
783 203478 6665334 13643566 15517743 13915925 13477511 10880976 -265790 -14839653
775 -14839653 -19684310 -13312180 -8902742 -13523415 -17124124 -8954578 6009040 15179115
767 15179115 14341881 7887538 684725 -2923581 930535 9656504 14791372 14310854 15881862
758 15881862 21450033 19624788 3877042 -11970318 -10714165 2636932 7849779 -1511305
750 -1511305 -11805435 -11413576 -3656886 4826195 14262800 24441569 28515462 22007009
742 22007009 11107037 5090734 4951880 5267639 3982774 4483687 8605906 12121083 9416655
733 9416655 1714927 -2227344 3725769 13933770 17193676 12138414 9202620 14757016
$$ packed form
791B0927311q457895j4394225j3704270m832557N321544P991197M279531L072842
783B03478O461856O978232J874177j601818m38414k596535j1146766j4573863
775a4839653m844657O372130M409438m620673l600709Q169546J4963618R170075
767A5179115q37234o454343p202813l608306L854116Q725969N134868m80518J571008
758A5881862N568171j825245j5747746j5847360J256153J3351097N212847r361084
750a511305j0294130L91859P756690Q483081R436605J0178769M073893o508453
742B2007009j0899972o016303j38854L15759j284865N00913M122219L515177k704428
733I416655p701728l942271N953113J0208001L259906n055262k935794N554396
$$ plain form
725 14757016 21631753 20700913 13466287 5302236 -5659548 -21900818 -34768959 -32323132
717 -32323132 -16444833 -450250 8291462 11719179 9922085 1345361 -5881452 1109847
709 1109847 19588951 30288408 22802278 8766952 2512302 1713979 -2458561 -7460497
701 -7460497 -5440923 -352458 -4410306 -18868533 -30173519 -26848943 -12152493 1702288
693 1702288 5968445 794500 -6643595 -7621163 963390 12780207 16939071 8151189
685 8151189 -7626067 -17551559 -12929953 2507705 16079009 19411340 16048557 13147597
677 13147597 9765104 253987 -12997779 -19471107 -14394130 -4762324 386668 -1716808
669 -1716808 -10323057 -23180315 -32955281 -31253923 -20964596 -15668614 -21371086 -27872965
$$ packed form
725A4757016O874737r30840p234626q164051j0961784j6241270j2868141K445827
717c2323132J5878299J5994583Q741712L427717j797094q576724p226813O991299
709A109847J8479104J0699457p486130j4035326o254650p98323m172540n001936
701g460497K019574N088465m057848j4458227j1304986L324576J4696450J3854781
693A702288M266157n173945p438095r77568Q584553J1816817M158864q787882
685H151189j5777256r925492M621606J5437658J3571304L332331l362783k900960
677A3147597l382493r511117j3251766o473328N076977R631806N148992k103476
669a716808q606249j2857258r774966J701358J0289327N295982n702472o501879
$$ plain form
661 -27872965 -24622436 -15568352 -10069688 -8415221 -6689117 -7551982 -13640407 -16833603
653 -16833603 -8370337 4258817 5519817 -4288882 -8502122 927386 12606094 14650806
645 14650806 11147663 11517805 13696498 8749386 -2866085 -10347057 -7721620 -2019359
637 -2019359 -3114458 -9663028 -10346416 243569 11807191 9813791 -5139455 -17455354
629 -17455354 -17117472 -10143429 -3835151 6459408 24913730 39486684 34922240 17106841
621 17106841 7228958 12053752 17052983 11298473 1558630 -4074285 -9316342 -16923414
613 -16923414 -18078268 -7088527 5364229 7168468 3222749 5130747 11146036 11638589
605 11638589 7769708 8219956 11566434 8686719 544668 -3054703 -1450655 -2576660
$$ packed form
661b7872965L250529R054084N498664J654467J726104q62865o088425l193196
653a6833603Q463266J2629154J261000r808699m213240R429508J1678708K044712
645A4650806l503143L70142K178693m947112j1615471p480972K625437N702261
637b019359j095099o548570o83388J0589985J1563622j993400j4953246j2315899
629a7455354L37882O974043O308278J0294559J8454322J4572954m564444j7815399
621A7106841r877883M824794M999231n754510r739843n632915n242057p607072
613a6923414j154854J0989741J2452756J804239l945719J907998O015289M92553
605A1638589l868881M50248L346478k879715q142051l599371J604048j126005
$$ plain form
597 -2576660 -4366489 3750774 17307115 15803791 -5757696 -23732129 -17536215 1748355
589 1748355 10200118 4557180 -1609796 -4240267 -9761337 -15615843 -11908972 -1502401
581 -1502401 1876317 -3174021 -4060922 1478397 -29353 -12564083 -20468187 -14086906
573 -14086906 -6811227 -12338623 -21202678 -17570674 -6939153 -7218056 -19744483 -28570952
565 -28570952 -24658807 -13147105 594955 14689693 22087427 15817084 3408430 -271969
557 -271969 5005962 6808133 3845305 7571708 16996213 14428138 -5151755 -21808546
549 -21808546 -20017784 -10711922 -8802728 -7349958 5869190 20997387 19029459 3284117
541 3284117 -5555368 -1307508 3132363 974003 -982374 -1088426 -7480742 -19607677
$$ packed form
597b576660j789829Q117263J3556341j503324k1561487j7974433O195914J9284570
589A748355Q451763n642938o166976k630471n521070n854506L706871J0406571
581a502401L378718n050338q86901N539319j507750j2534730p904104O381281
573a4086906P275679n527396q864055L632004J0631521k78903j2526427q826469
565b8570952L912145J1511702J3742060J4094738P397734o270343j2408654l680399
557b71969N277931J802171k962828L726403R424505k568075j9579893j6656791
549b1808546J790762R305862J909194J452770J3219148J5128197j967928j5745342
541C284117q839485M247860M439871k158360j956377j06052o392316j2126935
$$ plain form
533 -19607677 -24803101 -19713789 -17011569 -22708410 -24232015 -12154815 1472001 398043
525 398043 -11445922 -17376997 -12105923 -4320007 -6930 3005437 5387370 3335614
517 3335614 -3275257 -8423855 -7719619 -3154568 736913 1208857 -1942909 -5921125 -5779084
508 -5779084 486576 8261023 10995672 7691420 2571828 -1655740 -6624737 -14262970
500 -14262970 -22472467 -25801343 -20262780 -7953739 3822631 9713515 11295616 12046475
492 12046475 9747782 -109265 -14251682 -22888596 -22742276 -20982768 -23028170 -24478921
484 -24478921 -20255097 -14269119 -13132008 -16105474 -18595168 -20536630 -23329056 -22793047
476 -22793047 -14490667 -3821303 -1456098 -8792258 -16068386 -15676391 -9875067 -3755560
$$ packed form
533a9607677n195424N089312K702220n696841j523605J2077200J3626816j073958
525C98043j1843965n931075N271074P785916M313077L012367K381933k051756
517C335614o610871n148598P04236M565051L891481M71944l151766l978216J42041
508e779084O265660P774447K734649l304252n119592m227568m968997p638233
500a4262970q209497l328876N538563J2309041J1776370N890884J582101P50859
492A2046475k298693r857047j4142417q636914J46320J759508k045402j450751
484b4478921M223824N985978J137111k973466k489694j941462k792426N36009
476b2793047Q302380J0669364K365205p336160p276128L91995N801324O119507
$$ plain form
468 -3755560 2181493 8912468 13672153 12528325 6175132 -145636 -2347094 -1747516 -3220298
459 -3220298 -8989960 -14960092 -14756782 -6829784 4973777 16666404 25198463 25312789
451 25312789 13457251 -2971555 -9353510 -2239769 4134041 -3166482 -18036868 -25438474
443 -25438474 -21819460 -14331525 -6227856 2989395 7096028 -887865 -12838158 -12440156
435 -12440156 -538046 3537629 -7879450 -16379220 -4447001 17298796 25126304 15318371
427 15318371 5377705 5909741 7974740 365774 -13940925 -24012860 -24978777 -20179985
419 -20179985 -14581066 -10887856 -9475182 -8962660 -8278667 -9100005 -13881340 -20861540 -24208872
410 -24208872 -20701531 -13773505 -9255165 -9130154 -11146250 -12559860 -11764536 -7282275 1733367
$$ packed form
468c755560N937053O730975M759685j143828o353193o320768k201458N99578j472782
459c220298n769662n970132K03310P926998J1803561J1692627Q532059J14326
451B5312789j1855538j6428806o381955P113741O373810p300523j4870386p401606
443b5438474L619014P487935Q103669R217251M106633p983893j1950293L98002
435a2440156J1902110M075675j1417079q499770J1932219K1745797P827508r807933
427A5318371r940666N32036K064999p608966j4306699j0071935r65917M798792
419b0179985N598919L693210J412674N12522O83993q21338m781335o980200l347332
410b4208872L507341O928026M518340J25011k016096j413610P95324M482261R015642
$$ plain form
401 1733367 13056511 21519016 23477108 20356013 15880757 10518623 1928198 -8284705
393 -8284705 -12430202 -5197452 7761745 14135585 7722716 -6216369 -17589973 -19816785
385 -19816785 -12657673 -2065907 2238263 -5371079 -18693066 -24199839 -15716363 -860172
377 -860172 9095268 11204969 9956922 9392525 10628120 13611998 16509027 15751283 10810921
368 10810921 6278869 5006789 2423115 -6712902 -18393652 -22950311 -17747390 -9599266
360 -9599266 -4199301 14744 5515879 9696557 9311426 6714777 7335006 13183586 21990685
351 21990685 30269266 33573955 26063810 5494097 -20371038 -36955515 -36065703 -24419369
343 -24419369 -15899277 -15790781 -16416791 -9490333 1911081 8507652 9205048 12783451 23959825
$$ packed form
401A733367J1323144Q462505J958092l121095m475256n362134q590425j0212903
393h284705m145497P232750J2959197O373840o412869j3939085j1373604k226812
385a9816785P159112J0591766M304170p609342j3321987n506773Q483476J4856191
377h60172R955440K109701j248047n64397J235595K983878K897029p57744m940362
368A0810921m532052j272080k583674r136017j1680750m556659N202921Q148124
360i599266N399965M214045N501135M180678l85131k596649O20229N848580Q807099
351B1990685Q278581L304689p510145k0569713k5865135j6584477Q89812J1646334
343b4419369Q520092J08496o26010O926458J1401414O596571O97396L578403J1176374
$$ plain form
334 23959825 35299959 37699839 32912938 28765263 26197184 19959253 10635495 6144310
326 6144310 9559443 14366539 15446748 16372900 20067491 19897229 8771341 -7656217
318 -7656217 -16618276 -15104491 -11571813 -11184564 -9689527 -4468273 -1399447 -4519893 -6710805
309 -6710805 989977 15416694 24896806 24121137 17423665 9094139 -705495 -10173984
301 -10173984 -14908758 -15143406 -16531144 -20837196 -22877269 -19901517 -16355832 -14759375
293 -14759375 -10041525 87163 6794516 1844256 -7804233 -8128932 2488918 13340903
285 13340903 18774090 22590352 25202811 21086056 12825521 13113232 25009411 33228031
277 33228031 25946294 14258291 15865694 27365066 29849873 19234250 12712455 21332944
$$ packed form
334B3959825J1340134K399880m786901m147675k568079o237931r323758m491185
326F144310L415133M807096J080209R26152L694591j70262j1125888j6427558
318g656217q962059J513785L532678L87249J495037N221254L068826l120446k190912
309f710805P700782J4426717R480112p75669o697472q329526r799634r468489
301a0173984m734774k34648j387738m306052k040073K975752L545685J596457
293a4759375M717850J0128688O707353m950260r648489l24699J0617850J0851985
285A3340903N433187L816262K612459m116755q260535K87711J1896179Q218620
277C3228031p281737j1688003J607403J1499372K484807j0615623o521795Q620489
$$ plain form
269 21332944 32062942 26250031 5338759 -12744677 -17272298 -14144412 -13248921 -15945405
261 -15945405 -17625417 -16459128 -14967953 -14923016 -14566993 -11584604 -6619350 -1978356 2328560
252 2328560 8644314 16867831 21812787 17535255 3842872 -12394712 -21642196 -17680574
244 -17680574 -2311792 14343329 21219712 16423426 7758298 1778204 -3311419 -10731024
236 -10731024 -16701087 -15515771 -9407507 -5348807 -3691428 1315859 9448659 12132412
228 12132412 5217908 -3616676 -5108703 -566759 1402750 -3305269 -10696910 -15066304
220 -15066304 -15205880 -14636978 -17126863 -21548943 -22350819 -17628440 -14182726 -18673868 -25393399
211 -25393399 -21713397 -7025611 3702914 -4689 -9561734 -9865101 1135998 13971432
$$ packed form
269B1332944J0729998n812911k0911272j8083436m527621L127886Q95491k696484
261a5945405j680012J166289J491175M4937L56023K982389M965254M640994M306916
252B328560O315754Q223517M944956m277532j3692383j6237584r247484L961622
244a7680574J5368782J6655121O876383m796286q665128n980094n089623p419605
236a0731024n970063J185316O108264M058700J657379N007287Q132800K683753
228A2132412o914504q834584j492027M541944J969509m708019p391641m369394
220a5066304j39576N68902k489885m422080q01876M722379L445714m491142o719531
211b5393399L680002J4687786J0728525l707603r557045l03367J1001099J2835434
$$ plain form
203 13971432 22471644 26638069 24555618 13059350 -3475014 -14721706 -16495105 -13846101
195 -13846101 -11073123 -6342836 1633638 8849066 11605826 11652165 12276886 13248525 12545763
186 12545763 9941307 6563765 3383042 1235913 -360587 -4525524 -13348569 -22812698
178 -22812698 -26103902 -22732730 -19329387 -20079815 -21535071 -18673771 -10984009 -659444
170 -659444 9705614 15458553 12288527 3630764 -711130 2491331 5000557 390098
162 390098 -5213905 -3503960 1570330 373634 -5571285 -5521778 2661605 8841506 6452292
153 6452292 550149 -3419481 -7567582 -12502606 -11240335 -1194894 6493168 1108843
145 1108843 -9825349 -9707057 2651795 11290979 7147344 582194 4518873 16009950
$$ packed form
203A3971432Q500212M166425k082451j1496268j6534364j1246692j773399K649004
195a3846101K772978M730287P976474P215428K756760M6339O24721R71639p02762
186A2545763k604456l377542l180723k147129j596500m164937q823045r464129
178b2812698l291204L371172L403343p50428j455256K861300P689762J0324565
170f59444J0365058N752939l170026q657763m341894L202461K509226m610459
162C90098n604003J709945N074290j196696n944919M9507Q183383O179901k389214
153F452292n902143l969630m148101m935024J262271J0045441P688062n384325
145A108843j0934192J18292J2358852Q639184m143635o565150L936679J1491077
$$ plain form
137 16009950 22662482 19494097 10398143 -1184700 -12757118 -17451010 -9367371 5929725
129 5929725 16010281 17584729 18461348 21924666 20134642 8141192 -5649439 -10977831
121 -10977831 -9778673 -9547714 -9472209 -4531446 1232790 -976933 -8103100 -6683774 6455766
112 6455766 17558258 15176476 4991393 -1506689 -3105721 -4504955 -4152871 1961453
104 1961453 8991064 7641026 -1145600 -6201659 -1605083 6523762 10349832 10038470 10679127
95 10679127 15112368 21909388 26195398 21910392 8242600 -5799431 -8813421 252749
87 252749 12247218 20588246 26402015 29795772 25506703 12463134 116219 -2055155
79 -2055155 3178426 5787021 2421104 -1504699 -1819148 -808802 -1827724 -3600261 -1814366
$$ packed form
137A6009950O652532l168385r095954j1582843j1572418m693892Q083639J5297096
129E929725J0080556J574448Q76619L463318j790024j1993450j3790631n328392
121a0977831J199158K30959P5505M940763N764236k209723p126167J419326J3139540
112F455766J1102492k381782j0185083o498082j599032j399234L52084O114324
104A961453P029611j350038q786626n056059M596576Q128845L826070l11362O40657
95A0679127M433241O797020M286010m285006j3667792j4042031l013990R066170
87B52749J1994469Q341028N813769L393757m289069j3043569j2346915k171374
79b055155N233581K608595l365917l925803l14449J010346j018922j772537J785895
$$ plain form
70 -1814366 5259647 13379199 15065651 7883759 -568750 -454510 7184014 11642811 8819314
61 8819314 7511592 13927292 18982239 11134867 -4324116 -11168049 -4686354 4361128
53 4361128 7894333 9658200 13733704 16424365 15257432 15785544 22072206 27969609 25153727
44 25153727 14176830 1468019 -8828456 -14087788 -11101202 -2649821 -317969 -11256889
36 -11256889 -25876211 -28060053 -14863253 3140743 17858668 28405980 31409280 21039885
28 21039885 2525196 -7497701 -1861097 5961748 902877 -11670612 -14805562 -5835026
20 -5835026 652034 -4055293 -10506806 -7666569 -694688 -1866516 -9790029 -10426858 749637
11 749637 9524906 2205301 -13905595 -19217483 -8221903 3761960 2567410 -5940764
$$ packed form
70a814366P074013Q119552J686452p181892q452509J14240P638524M458797k823497
61H819314j307722O415700N054947p847372j5458983o843933O481695R047482
53D361128L533205J763867M075504K690661j166933N28112O286662N897403k815882
44B5153727j0976897j2708811j0296475n259332K986586Q451381K331852j0938920
36a1256889j4619322k183842J3196800J8003996J4717925J0547312L003300j0369395
28B1039885j8514689j0022897N636604P822845n058871j2573489l134950Q970536
20e835026O487060m707327o451513K840237O971881j171828p923513o36829J1176495
11G49637Q775269p319605j6110896n311888J0995580J1983863j194550q508174
$$ plain form
3 -5940764 -6262222 3584118 9643287
0 9643287
$$ packed form
3e940764l21458R846340O059169
0I643287
##END NTUPLES=NMR SPECTRUM
##END=
