##TITLE=31Pdec_LR-664-RM2
 THF, 104 sc
 1.4.2019
##JCAMPDX= 6.0         $$ Bruker NMR JCAMP-DX V2.0
##DATA TYPE= NMR SPECTRUM
##DATA CLASS= NTUPLES
##ORIGIN= UXNMR, Bruker Analytische Messtechnik GmbH
##OWNER= root
$$ XWIN-NMR		Version 3.5
$$ Mon Apr  1 14:49:32 2019 Russian Standard Time (UT+4h)  she@DPX200
##.OBSERVE FREQUENCY= 81.013821
##.OBSERVE NUCLEUS= ^31P
##.ACQUISITION MODE= SIMULTANEOUS
##.ACQUISITION SCHEME= undefined
##.AVERAGES= 104
##.DIGITISER RES= 17
##SPECTROMETER/DATA SYSTEM= spect
##.PULSE SEQUENCE= zgpg30
##.SOLVENT NAME= CDCl3
##.SHIFT REFERENCE= (INTERNAL, CDCl3, 0, 182.463)
##AUDIT TRAIL= $$ (NUMBER, WHEN, WHO, WHERE, WHAT)
$$ ##TITLE= Audit trail, XWIN-NMR		Version 3.5
$$ ##JCAMPDX= 5.01
$$ ##ORIGIN= Bruker BioSpin GmbH
$$ ##OWNER= she
$$ F:/spectra/data/she/nmr/P31/1/pdata/1/auditp.txt
$$ ##AUDIT TRAIL=  $$ (NUMBER, WHEN, WHO, WHERE, WHAT)
(   1,<2019-04-01 14:46:44.51 +0400>,<she>,<DPX200>,
      <continue with go, POWCHK disabled, PULCHK disabled
       configuration hash MD5:
       00 E9 B6 7A A2 85 ED C7 34 08 36 98 17 FE 4E 26
       data hash MD5: 32K
       07 DC AB 4E E7 06 DA 5E 24 96 20 E0 C6 46 EA 6D>)
(   2,<2019-04-01 14:48:31.51 +0400>,<she>,<DPX200>,
      <Start of raw data processing
       efp BC_mod = 2 LB = 1 FT_mod = 6 PKNL = 1 PHC0 = -1659.925 PHC1 = -48.60104 SI = 64K 
       data hash MD5: 64K
       A1 06 98 55 9B F6 7D 40 D1 9B CE 7D EE F7 DF C2>)
(   3,<2019-04-01 14:49:01.84 +0400>,<she>,<DPX200>,
      <pk PHC0 = -67.84444 PHC1 = 11.8 
       data hash MD5: 64K
       3A DE A8 38 13 56 03 EB 35 0B B9 5B 9E A5 4B 8E>)
(   4,<2019-04-01 14:49:04.78 +0400>,<she>,<DPX200>,
      <abs ABSG = 5 
       data hash MD5: 64K
       08 58 41 7F 66 E1 59 BC 5C 13 7A 94 28 41 59 1D>)
$$ ##END=
$$ 
$$ hash MD5
$$ D6 0F C3 83 F0 B4 7F 50 A9 21 CC 65 00 61 C2 51
##$RELAX= 
##$RELAX= 
##$RELAX= 
##$RELAX= 
##$RELAX= 
##$RELAX= 
##$RELAX= 
##$RELAX= 
$$ Bruker specific parameters
$$ --------------------------
##$DU= <F:/spectra>
##$EXPNO= 1
##$NAME= <P31>
##$PROCNO= 1
##$TYPE= <nmr>
##$USER= <she>
##$AMP= (0..31)
100 100 100 100 100 100 100 100 100 100 100 100 100 100 100 100 100 100 
100 100 100 100 100 100 100 100 100 100 100 100 100 100 
##$AQSEQ= 0
##$AQ_mod= 1
##$AUNM= <au_zg>
##$AUTOPOS= <>
##$BF1= 81.014009
##$BF2= 200.13
##$BF3= 200.13
##$BF4= 200.13
##$BF5= 200.13
##$BF6= 200.13
##$BF7= 200.13
##$BF8= 200.13
##$BYTORDA= 1
##$CFDGTYP= 0
##$CFRGTYP= 5
##$CHEMSTR= <none>
##$CNST= (0..31)
1 1 145 1 1 1 1 1 1 1 1 1 1 1 1 1 1 1 1 1 1 1 1 1 1 1 1 1 1 1 1 1 
##$CPDPRG= <waltz16>
##$CPDPRG1= <>
##$CPDPRG2= <waltz16>
##$CPDPRG3= <>
##$CPDPRG4= <mlev>
##$CPDPRG5= <mlev>
##$CPDPRG6= <mlev>
##$CPDPRG7= <mlev>
##$CPDPRG8= <mlev>
##$CPDPRGB= <>
##$CPDPRGT= <>
##$D= (0..31)
0 1 0 0 0 0 0 0 0 0 0 0.03 2e-05 3e-06 0 0 0 0 0 0 0 0 0 0 0 0 0 0 0 0 
0 0 
##$DATE= 1554115438
##$DBL= (0..7)
120 120 120 11 120 120 24 19 
##$DBP= (0..7)
150 150 150 150 150 150 150 150 
##$DBP07= 0
##$DBPNAM0= <>
##$DBPNAM1= <>
$$ [...]
##$SUBNAM3= <"">
##$SUBNAM4= <"">
##$SUBNAM5= <"">
##$SUBNAM6= <"">
##$SUBNAM7= <"">
##$SUBNAM8= <"">
##$SUBNAM9= <"">
##$SW= 369.568048894756
##$SWIBOX= (0..15)
0 1 3 0 0 0 0 0 0 0 0 0 0 0 0 0 
##$SW_h= 29940.119760479
##$TD= 32768
##$TD0= 1
##$TE= 0
##$TE2= 300
##$TE3= 300
##$TEG= 300
##$TL= (0..7)
0 120 53 12 22 120 120 120 
##$TP= (0..7)
150 150 150 150 150 150 150 150 
##$TP07= 0
##$TPNAME0= <>
##$TPNAME1= <>
##$TPNAME2= <>
##$TPNAME3= <>
##$TPNAME4= <>
##$TPNAME5= <>
##$TPNAME6= <>
##$TPNAME7= <>
##$TPOAL= (0..7)
0.5 0.5 0.5 0.5 0.5 0.5 0.5 0.5 
##$TPOFFS= (0..7)
0 0 0 0 0 0 0 0 
##$TUNHIN= 0
##$TUNHOUT= 0
##$TUNXOUT= 0
##$USERA1= <user>
##$USERA2= <user>
##$USERA3= <user>
##$USERA4= <user>
##$USERA5= <user>
##$V9= 5
##$VALIST= <valist>
##$VCLIST= <CCCCCCCCCCCCCCC>
##$VD= 0
##$VDLIST= <DDDDDDDDDDDDDDD>
##$VPLIST= <PPPPPPPPPPPPPPP>
##$VTLIST= <TTTTTTTTTTTTTTT>
##$WBST= 1024
##$WBSW= 4
##$XGAIN= (0..3)
0 0 0 0 
##$XL= 0
##$YL= 0
##$YMAX_a= 20894
##$YMIN_a= -64667
##$ZGOPTNS= <>
##$ZL1= 120
##$ZL2= 120
##$ZL3= 120
##$ZL4= 120
##$ABSF1= 182.463
##$ABSF2= -187.1042
##$ABSG= 5
##$ABSL= 3
##$ALPHA= 0
##$AQORDER= 0
##$ASSFAC= 0
##$ASSFACI= 0
##$ASSFACX= 0
##$ASSWID= 0
##$AUNMP= <proc_1d>
##$AZFE= 0.1
##$AZFW= 0.5
##$BCFW= 0
##$BC_mod= 2
##$BYTORDP= 0
##$COROFFS= 0
##$CY= -3
##$DATMOD= 1
##$DC= 0
##$DFILT= <>
##$DTYPP= 0
##$F1P= 0
##$F2P= 0
##$FCOR= 1
##$FTSIZE= 65536
##$FT_mod= 6
##$GAMMA= 0
##$GB= 0
##$INTBC= 1
##$INTSCL= 5.30512e-09
##$ISEN= 30
##$LB= 1
##$LEV0= 0
##$LPBIN= 0
##$MAXI= 10000
##$MC2= 0
##$MEAN= 0
##$ME_mod= 0
##$MI= 50
##$NCOEF= 0
##$NC_proc= -8
##$NLEV= 6
##$NOISF1= 182.463
##$NOISF2= 159.3651
##$NSP= 0
##$NTH_PI= 0
##$NZP= 0
##$OFFSET= 182.463
##$PC= 4
##$PHC0= -1727.77
##$PHC1= -36.80104
##$PH_mod= 1
##$PKNL= yes
##$PPARMOD= 0
##$PSCAL= 0
##$PSIGN= 0
##$REVERSE= no
##$SF= 81.0140089999434
##$SI= 65536
##$SIGF1= 159.3651
##$SIGF2= -187.1042
##$SINO= 113.3802
##$SIOLD= 16384
##$SREGLST= <1H.CDCl3>
##$SSB= 0
##$STSI= 65536
##$STSR= 0
##$SW_p= 29940.119760479
##$SYMM= 0
##$S_DEV= 0
##$TDeff= 32768
##$TDoff= 0
##$TI= <>
##$TILT= no
##$TM1= 0
##$TM2= 0
##$TOPLEV= 0
##$USERP1= <user>
##$USERP2= <user>
##$USERP3= <user>
##$USERP4= <user>
##$USERP5= <user>
##$WDW= 1
##$XDIM= 65536
##$YMAX_p= 327092856
##$YMIN_p= -160449878
$$ End of Bruker specific parameters
$$ ---------------------------------
##NTUPLES= NMR SPECTRUM
##VAR_NAME=  FREQUENCY,     SPECTRUM/REAL,   SPECTRUM/IMAG
##SYMBOL=    X,             R,               I
##VAR_TYPE=  INDEPENDENT,   DEPENDENT,       DEPENDENT
##VAR_FORM=  AFFN,          ASDF,            ASDF
##VAR_DIM=   65536,         65536,           65536
##UNITS=     HZ,            ARBITRARY UNITS, ARBITRARY UNITS
##FACTOR=    0.456856943014862, 1,           1
##FIRST=     14782.0589164792, 0,            0
##LAST=      -15158.0608439998, 0,           0
##MIN=       -15158.0608439998, -160449878,  0
##MAX=       14782.0589164792, 327092856,    0
$$ Real data points
##PAGE= N=1
##DATA TABLE= (X++(R..R)), XYDATA
$$ [...]
6002 11746995 8009811 14799880 23090834 19006831 662921 -16383318 -15429855 1799945
5994 1799945 18365568 23359475 20537340 15045364 4548578 -9707994 -15737375 -7336107
5986 -7336107 1362013 -6162145 -21468899 -20179381 1756265 19953228 15400038 -937659
5978 -937659 -7630214 -2746632 -60334 -4475529 -7641864 -5480950 -5112798 -11513645 -18252772
5969 -18252772 -17072678 -10110196 -6159936 -7075812 -3779946 11983020 34594708 47969511
5961 47969511 43937771 33166383 32490109 43471202 50929944 43541749 28108659 19779205
5953 19779205 24462199 35694960 43756015 42345217 30110079 11636949 -4507743 -12647865
5945 -12647865 -13585698 -10059158 -3489387 1842199 -1703457 -14580368 -24083659 -17511313
5937 -17511313 1395559 17589134 24015835 25629410 24472568 13513494 -8615891 -26693562
5929 -26693562 -23577742 -2775431 13450605 9713205 -6382996 -17163420 -17282784 -15920861
5921 -15920861 -19762071 -24176000 -24443646 -25860978 -33455597 -37768775 -24186016 3794348
5913 3794348 24443994 25681121 20370551 25177062 35608952 35707262 25301296 20559073
5905 20559073 27803531 32853688 21786159 573348 -13277996 -10986467 2157611 15566982
5897 15566982 20972693 16091097 7417209 6314467 16264186 26160939 22054020 4274925
5889 4274925 -12741455 -17511861 -12924972 -9140165 -9738384 -8988207 -1814528 7555137
5881 7555137 9810134 2827794 -3940441 31752 13766165 26703006 31885258 31660476
5873 31660476 29622888 23628020 11299178 -2015118 -7288679 -3326532 624735 -4867495
5865 -4867495 -19011283 -31901870 -35116428 -30291906 -26359318 -27756786 -27685394 -17064020
5857 -17064020 502311 9130131 -756992 -19671452 -30531831 -29349405 -27281460 -32974865
5849 -32974865 -40562944 -37886500 -21312133 1538392 20778943 31988679 36145385 35580430
5841 35580430 31331955 23384308 12256303 -205463 -11173347 -16883973 -12995741 1679041
5833 1679041 19953551 28557865 20681306 5048964 -2862629 1122669 6422396 4045728
5825 4045728 -344350 4611603 18311801 27799093 25228199 17898548 16537979 18843077
5817 18843077 12145895 -7870151 -28494987 -34390825 -26399776 -19526809 -23309698 -31617562
5809 -31617562 -34046247 -29762168 -23917685 -16262019 -3178820 10477103 12308592 -1602825
5801 -1602825 -19581220 -27715801 -23935231 -14215525 -1859447 11986834 22289231 23996379
5793 23996379 20333639 18925467 20026125 16673157 7509470 1492168 6559327 19242761
5785 19242761 28902821 28486115 19283759 9179103 7281176 14943998 20551611 9860891
5777 9860891 -14976015 -33153657 -27404458 -3778635 16269429 19475904 10342814 483951
5769 483951 -4164786 -5689882 -9044962 -15398506 -18919934 -12557189 1067234 9444447
5761 9444447 4866847 -6340883 -14799359 -21066397 -28591999 -31008662 -20660650 -6121650
5753 -6121650 -3951770 -11964318 -9467339 9384824 21474690 7422350 -16999780 -21353467
5745 -21353467 -3563285 9281233 1423359 -12010118 -11662619 -1589665 1637449 -4919356
5737 -4919356 -10056239 -8559080 -7400523 -11168177 -12937296 -4978338 8035641 13146070
5729 13146070 4518066 -10653753 -22200876 -28271577 -33157103 -36607547 -31512989 -14255613
5721 -14255613 7214170 19980680 18890523 8939308 -3103215 -14420351 -23961846 -30054456
5713 -30054456 -32015082 -30405565 -24105135 -10834900 7149463 21179066 23331822 14270162
5705 14270162 2049332 -5389048 -4909430 2383633 12986978 22092077 25168274 20244688
5697 20244688 9299835 -2623437 -10764311 -14293760 -16174795 -18573930 -19664195 -16438748
5689 -16438748 -9084918 -440551 7030493 10956386 8212719 -1275904 -11722643 -17639077
5681 -17639077 -21315802 -28112477 -35783736 -36532036 -29561715 -22001477 -15497807 -2935442
5673 -2935442 16182305 27741389 19478456 -1625717 -17303958 -17916050 -6827978 8038997
5665 8038997 17341974 11894824 -6656713 -21513019 -19608811 -10304500 -11194691 -19917039
5657 -19917039 -18216850 -2658536 9691997 9698245 8593102 13707709 13153889 -1328634
5649 -1328634 -14904150 -11370838 159539 1058347 -5340168 -1404719 11870254 14469025
5641 14469025 -257720 -16079689 -20786789 -21412529 -25557131 -27093285 -21188924 -17223139
5633 -17223139 -23571958 -31722771 -28897830 -17187288 -7182355 -513759 7345175 12648762
5625 12648762 7142144 -5127462 -9074478 716454 11760558 10726350 262061 -7397917
5617 -7397917 -8401122 -11306891 -23313497 -38440136 -43676761 -34914399 -20875796 -9973169
5609 -9973169 -941461 7525548 6193050 -12537039 -35581702 -39484750 -22655394 -10034633
5601 -10034633 -17625537 -29141931 -21743199 -1230409 7380566 -2999491 -13881576 -9455695
5593 -9455695 5284966 16997890 19590189 13338995 1160063 -8921925 -7712402 3188841
5585 3188841 10806107 6110220 -6626626 -17916813 -22888346 -21041963 -14848223 -11673375
5577 -11673375 -18348299 -29589310 -30302861 -15115064 1624581 2034426 -14276176 -31802315
5569 -31802315 -38062264 -34593737 -30491697 -30125413 -28832917 -20323205 -7615342 -2889036
5561 -2889036 -12794875 -27627839 -31802888 -22969677 -12904349 -10387185 -11722348 -8744357
5553 -8744357 1562553 15818195 25206414 18637590 -6037855 -34446050 -48548010 -45993963
5545 -45993963 -37147378 -27039963 -14922557 -8240405 -16660555 -30661739 -28356561 -9578361
5537 -9578361 -14439 -11242401 -20641760 -7036126 16105715 24284284 19542392 18714646
5529 18714646 18529504 1711764 -28908205 -50424947 -52698456 -47141315 -42989449 -37594698
5521 -37594698 -31530988 -31311517 -33655249 -26873773 -11834803 -3342674 -7198280 -13806521
5513 -13806521 -17788851 -24961613 -34935364 -35645121 -22385244 -6164402 2968536 5530463
5505 5530463 1731592 -10626828 -22139729 -15950798 5761778 19196446 12640241 2784996
5497 2784996 5659744 12061470 7717195 -1051591 -665653 6340924 10726557 15641969
5489 15641969 26226846 32385704 23428443 10001148 9621782 18633744 20738167 15874363
5481 15874363 16147782 18049751 5584383 -18794914 -32532974 -26782012 -18279731 -20653995
5473 -20653995 -25960815 -24403476 -22246501 -27178241 -32160897 -28395164 -22334975 -25353078
5465 -25353078 -34834087 -38900018 -34402008 -28424659 -25462939 -23428474 -20627406 -18135932
5457 -18135932 -15522074 -10588800 -4021319 -425267 -3851202 -13269540 -22321905 -24894656
5449 -24894656 -22879931 -25143714 -34038100 -37290388 -22417584 2991692 17071957 10949990
5441 10949990 -1510802 -4492052 1266672 6584037 8993857 10834802 10712442 6487300
5433 6487300 1000197 -3265578 -9389546 -17973191 -20594585 -11306359 704257 1360949
5425 1360949 -8663784 -16244709 -15860884 -14557838 -16088958 -13533717 -2795790 7839303
5417 7839303 9553553 6097445 5697334 5702305 -3315564 -19603140 -27777858 -17625263 2999989
5408 2999989 18734581 23190687 18852160 7393084 -9683769 -23824448 -24934542 -15700213
5400 -15700213 -9421667 -10010476 -5786035 9900180 23598500 19128958 1536415 -10544004
5392 -10544004 -11042184 -9157151 -8645269 -2404280 10192502 18157106 17120974 16854441
5384 16854441 22263334 22076089 8208517 -6817602 -6699002 4232658 9857844 8569691
5376 8569691 12214679 21239190 20416373 3428983 -14351755 -15338807 -538224 17090398
5368 17090398 30752569 41719545 49171710 48987828 42200341 36809820 38725222 44526786
5360 44526786 45358867 36772333 23397375 13745873 11202773 11823771 11316889 11056215 14426702
5351 14426702 19932158 22712224 22072663 22469884 26303018 29978125 28229855 18677707
5343 18677707 1573863 -20025916 -37979737 -42480081 -32393046 -18968568 -14312866
5336 -14312866 -18021766 -20293289 -17057025 -15310353 -21540563 -31097748 -34227387 -29002516
5328 -29002516 -21766671 -16203456 -9753964 -2298786 192629 -3840646 -4777180 5204477
5320 5204477 16784555 13195067 -4627134 -15281045 -4343041 16152646 23993184 14542097
5312 14542097 1691624 -4145507 -6902672 -13651187 -22992190 -28321327 -26206732 -17855086
5304 -17855086 -6341928 4697751 12202973 15318987 14449876 9252500 457881 -7427059
5296 -7427059 -9861210 -8760689 -10304853 -15449627 -18083061 -14852474 -11322936 -13949138
5288 -13949138 -19857759 -20533114 -14397189 -9700970 -13272329 -20894681 -22473941 -14589046
5280 -14589046 -3699496 2767610 3826746 1858910 -2736738 -9251599 -12880948 -10050235
5272 -10050235 -5872557 -8545118 -16218676 -17896376 -9140613 2143672 8796056 13192429
5264 13192429 17501575 16224791 7733035 3163836 11160157 21588004 19225456 7591737
5256 7591737 1789064 1416437 -8310034 -26852864 -32491189 -15105359 4974909 4822056
5248 4822056 -9793060 -17252766 -12298219 -6570353 -4350216 1681908 11365215 12527102
5240 12527102 156859 -13535072 -14259192 -1838682 12927852 19915981 15228959 2873236
5232 2873236 -6009101 -2847382 6657001 8001947 -2470543 -12434147 -12230134 -8600534
5224 -8600534 -12234024 -20482200 -23374144 -21248298 -23689946 -32071009 -35242102 -25284749
5216 -25284749 -8029344 6281539 15052234 20760154 22680422 18277320 9701465 2249793
5208 2249793 -2776589 -8543794 -16351346 -23313610 -26670406 -26814157 -25681766 -24953154 -25275440
5199 -25275440 -23991395 -15055668 3431263 21803694 25658515 12380203 -5100392 -14041243
5191 -14041243 -14964817 -14498373 -12493429 -5111716 3521548 3889788 -4039455 -8175447 -254868
5182 -254868 12605952 17349475 11632479 5788909 9549617 20442272 25820956 15589214
5174 15589214 -6928620 -27298932 -33772391 -27072185 -15589169 -5200681 2333405 5901286
5166 5901286 7269866 13193458 25904690 33662153 22659775 -826379 -13456996 -4754502
5158 -4754502 8603567 6382896 -8684418 -19275169 -19734534 -19845453 -25891456 -31553018
5150 -31553018 -28819294 -18225716 -6277656 588343 -1139534 -8990814 -13877464 -8095431
5142 -8095431 5553812 16711744 18408574 11065034 -1540528 -14500074 -22391705 -23921246
5134 -23921246 -23991149 -25671289 -23863118 -14062360 -2936868 -356095 -3896671 -2371244
5126 -2371244 6645206 14346564 15330442 12640000 7661618 -1951466 -12011109 -13081540
5118 -13081540 -6534169 -6122783 -17192771 -26787755 -22446215 -9418496 -14955 3475585
5110 3475585 4436820 42586 -13077997 -26864658 -28009778 -14048659 5220031 19152728
5102 19152728 22213091 14127176 2343821 -1317261 5045728 8960439 2490388 -3017512
5094 -3017512 5960506 21143365 22668417 9328619 -64739 4057549 9485531 3066436
5086 3066436 -11807292 -24698309 -31552815 -31662355 -23149218 -9543470 -1660979 -5754291
5078 -5754291 -17047616 -29094397 -39827148 -44111110 -33112750 -9584536 7568353
5071 7568353 4768644 -9025684 -17146824 -18187855 -21220539 -25710153 -22470614 -12188802
5063 -12188802 -7309519 -13527587 -21924995 -22944583 -18096808 -13829142 -12151949 -11812258
5055 -11812258 -12130306 -11106852 -4862814 6379468 15079639 13329164 1805424 -10368288
5047 -10368288 -13866754 -6737897 4695109 11907767 11840527 7920115 3362755 -3294246
5039 -3294246 -13732940 -24563759 -30659162 -31258909 -28443258 -22102456 -11604863 -342250
5031 -342250 7315915 12312699 18038799 22057724 17618423 4204076 -9769868 -16613168
5023 -16613168 -16518952 -13293892 -8052327 -278136 7973740 12131135 9279065 2260736
5015 2260736 -741995 5776571 15423675 14326809 -791111 -15615706 -17003241 -11818484
5007 -11818484 -15056406 -24328722 -22707874 -6902837 5363766 1438060 -9273929 -13038025
4999 -13038025 -11349544 -10792782 -6712822 7042899 21034876 20514463 8901750 4464631
4991 4464631 14015893 24545376 22691158 9945990 -4077979 -12441448 -11961359 -3601120
4983 -3601120 4657675 3892975 -3940218 -8361819 -6085838 -4389549 -6307302 -4427320
4975 -4427320 4753440 11856062 8921235 3189535 5767608 13650046 15114436 8547314
4967 8547314 3237379 3150271 2408714 -2243878 -6291646 -7785602 -11794729 -18912515 -18796858
4958 -18796858 -3626758 17875846 28833003 23948251 13110073 6910851 6611490 8729404
4950 8729404 11204586 11551810 5485875 -6834719 -16553226 -13930143 158830 14403942
4942 14403942 18286323 10135071 -4498630 -17756120 -22752098 -17327218 -7181366 -2039826
4934 -2039826 -6027723 -13736573 -17263596 -14398195 -8037044 -1056742 4523622 5602464
4926 5602464 -103510 -10073177 -17873980 -18612239 -12339978 -3081215 3830518 4790361 548568
4917 548568 -4820437 -8580112 -11079243 -12021143 -8957681 -2348325 2081222 602025 -2459014
4908 -2459014 -1241680 2647176 4144779 3983869 5346419 4542379 -3338373 -10363899 -1728714
4899 -1728714 20411139 33523277 23414602 3671491 -4970602 -3271774 -5873552 -13341985
4891 -13341985 -12124020 -1189668 2394238 -9230661 -19891660 -13298600 1894525 5685628
4883 5685628 -3410362 -8819475 -3033154 2550825 -2450073 -11860194 -14022559 -8108242
4875 -8108242 -1026074 4783917 11138817 15816851 14101300 7789364 4412161 6553058
4867 6553058 8815497 6937594 3384468 1416710 89053 -730034 3713267 15722806
4859 15722806 27367494 27419292 15414640 2410169 -3021867 -3733921 -6757960 -12354630
4851 -12354630 -15079702 -13736524 -14913345 -24538417 -38622221 -46391666 -43244460 -36369665
4843 -36369665 -33675748 -30605766 -15557001 11562034 35141361 41837625 34319082 21677244
4835 21677244 5828573 -12710106 -24309664 -20536344 -10886930 -12631679 -24218755 -26185306
4827 -26185306 -11699212 2131135 970438 -6637756 -7830429 -7504239 -15007994 -22132250
4819 -22132250 -15469517 -2657740 -3419577 -17454598 -24544467 -17880421 -13251647 -18247661
4811 -18247661 -15838421 7409189 35526136 43851858 33017721 22994581 21243490 17215907
4803 17215907 6118790 -1737077 1039390 7252919 7892043 5109590 5483419 8759151
4795 8759151 10321995 9192365 7553479 6231481 5108505 4698115 4324082 2692189 2526253
4786 2526253 9072189 20631516 26979848 22636385 15859355 17167430 23479011 22613402
4778 22613402 11281410 -1123053 -7157722 -10522001 -17446613 -26128367 -29375415 -23394536
4770 -23394536 -10387387 3971644 12896135 12259649 5059358 -1368557 -5126987 -12496645
4762 -12496645 -27685428 -44497497 -52877091 -50053438 -40388256 -28014468 -15752502 -8360258
4754 -8360258 -9409066 -15298737 -18329204 -15762155 -11148628 -7758600 -6023040 -6243307
4746 -6243307 -7851563 -7220272 -3018156 -2507132 -13951512 -32423858 -42478111 -37187357
4738 -37187357 -25545616 -17717764 -12277748 -3311712 8332224 17623283 22340001 21053917
4730 21053917 11063585 -4260540 -12756749 -7165129 3395291 4847807 -3059659 -9032416
4722 -9032416 -7698246 -3626028 674157 8769873 20180972 26343742 21090640 8436786
4714 8436786 -3752014 -12309613 -17389164 -17230117 -9349471 3618431 12164156 6783768
4706 6783768 -10763319 -24874978 -21454140 -6489472 270501 -6455542 -8971026 4401288
4698 4401288 16939372 8192618 -10517250 -10479030 8937367 18213078 4951422 -6862751
4690 -6862751 2300589 15489266 9749429 -3754506 1374764 21478637 27940028 13028635
4682 13028635 -343362 1818925 3893399 -9463006 -26130488 -25752775 -10176490 3107679
4674 3107679 7741896 10819183 13872244 9741983 -738232 -4641657 4193695 12720851
4666 12720851 3908781 -20402676 -40399587 -41646238 -30407969 -22507311 -22151242 -18990900
4658 -18990900 -5655842 10520259 18690764 20986572 28109590 40312194 44161267 31798750
4650 31798750 13749848 5649627 9218298 14671918 16405148 15658841 10697903 -2510848
4642 -2510848 -17795642 -19506193 -2498860 17821886 23911167 17637191 13892418 18242821
4634 18242821 22863539 22177439 19135349 14643437 4203538 -9737429 -14262919 -3520409
4626 -3520409 9304144 7625981 -7363235 -21319675 -27057896 -28520698 -27789675 -21407330
4618 -21407330 -10718124 -4483087 -7429593 -13975532 -16391609 -13098144 -7099576 -2058245
4610 -2058245 -966138 -2978535 -1552331 7987689 19971790 24923642 22912295 20998994
4602 20998994 19182981 11193550 -856949 -7074230 -7186622 -11233832 -17977353 -10806049
4594 -10806049 14554675 35516824 31252906 12380262 4081411 9688484 11453531 2092050
4586 2092050 -5958291 -3241967 3830784 7276237 9423884 14117412 17459642 14272845
4578 14272845 6538155 355807 -720105 2727029 6247597 3186336 -8441166 -21272629
4570 -21272629 -26457334 -24628100 -22890632 -23669764 -24187782 -23968098 -23759207 -19742894 -9054160
4561 -9054160 1121504 1030321 -6714843 -11259236 -10787222 -12448246 -16061943 -13285844 -4557287
4552 -4557287 -950604 -5268831 -6951655 -1514291 591808 -7251927 -14632068 -10036255
4544 -10036255 2019151 10549540 14304578 17451850 18524378 15272868 12770482 15347227
4536 15347227 17140271 11611122 4191423 4114493 8819860 7955815 -560994 -8854207 -10871492
4527 -10871492 -7175851 -1008763 2688890 -1550233 -11693561 -16415973 -9923727 -2798493
4519 -2798493 -7731714 -19741751 -22652320 -11623203 3575692 15572845 25635248 31856441
4511 31856441 24936317 2028897 -23254589 -31225528 -14632431 14359379 34057667
4504 34057667 32233585 17985963 11235287 18290024 25160847 19438098 7953565 3122548
4496 3122548 2748381 -1686682 -5109165 3748728 18793913 20828066 6666117 -4990611
4488 -4990611 -1049125 10002817 15657450 16359697 16400683 12533184 2383549 -7026545
4480 -7026545 -9464541 -8992696 -10424521 -9866750 -4328701 -1416361 -8406307 -19306159
4472 -19306159 -24070281 -23994706 -25966153 -27069420 -18542006 -2464454 8909058 10837030
4464 10837030 11239993 15993469 19688837 15624391 7042895 2474541 4362921 7668799
4456 7668799 7658105 4549235 616470 -3639800 -8397883 -11376526 -9292103 -3137340 1649183
4447 1649183 2564499 3578947 7525491 9913133 6806197 3651590 6123702 6259183 -7849085
4438 -7849085 -28794402 -33501430 -15488629 3532826 4661969 -1072563 8169603 30716726
4430 30716726 45296636 43149365 36202105 33495387 28109751 12657658 -6493677 -17882404
4422 -17882404 -18583717 -13100837 -5812195 115811 2030693 1238674 3657565 13298095
4414 13298095 27122457 37959328 40610982 35095678 25998125 17484893 7364410 -9768720
4406 -9768720 -30153561 -38496711 -25896383 -4469358 6441869 4611633 3385572 8975556
4398 8975556 14305993 15423354 17286599 19048706 10262845 -9452184 -21080991 -8532958
4390 -8532958 19261110 39985616 44179039 38905038 31822900 23743911 13992875 3295274
4382 3295274 -6862238 -11379164 -3165932 14816251 25897870 18650038 3927295 846935
4374 846935 10233023 16160506 11630259 6685524 9246875 13506592 12980852 11744030 14652273
4365 14652273 16879914 12360437 5099493 3027061 5835194 7235125 5578079 4746902
4357 4746902 7068296 11600252 16926640 19880561 14462951 -1103116 -17756946 -22732233
4349 -22732233 -13413817 754994 9406640 9241963 2154375 -7857286 -15007737 -15342139
4341 -15342139 -12482359 -14390811 -21328061 -22472744 -9842334 8315675 15438731 7422424
4333 7422424 -2020508 666709 12331585 20270010 20940079 22315487 28155751 30388081
4325 30388081 22250643 11173928 10002564 18943253 25181056 20325877 10624501 7956517
4317 7956517 16232178 28862352 35737790 31407391 19849956 11557006 12350214 16048910
4309 16048910 13192303 5281508 2401497 6600902 7499562 -1891020 -13889135 -16854746
4301 -16854746 -10864229 -6218094 -10187387 -19974333 -25663238 -17971708 1752926 17862886
4293 17862886 14567158 -3991960 -17687986 -17452302 -14980952 -19099829 -19138642 -5491636
4285 -5491636 8255394 3428656 -13585849 -21346819 -17354724 -18123556 -27344715 -29573630
4277 -29573630 -19288469 -11573886 -15498106 -19234779 -13425862 -9390078 -19100782 -32974190
4269 -32974190 -33603493 -19648540 -1764020 13866060 23771409 20715108 5398134 -4752046
4261 -4752046 4457969 22380050 28284485 21011117 16354830 20005689 22019148 16671478
4253 16671478 10053848 6811456 4266144 1041490 -1090763 -3607025 -7394595 -5365599
4245 -5365599 6808010 16357066 7945051 -9154852 -9341593 11727309 29570910 26850886
4237 26850886 15469707 12999665 17145399 17243764 14202993 13289491 10600756 2674453
4229 2674453 -2102093 1730050 971969 -18433251 -45077550 -53438545 -38563019 -20430814
4221 -20430814 -13639299 -11179577 -2658560 7267440 6808269 -6754212 -25942946 -41217515
4213 -41217515 -44960689 -33859131 -13422747 3402626 6827622 -1698501 -12965214 -18861741
4205 -18861741 -17589241 -13975779 -15459508 -24210684 -32819121 -31700245 -21072734 -10862911
4197 -10862911 -7592069 -6526244 326259 12791385 23448204 27451378 26375890 22499198
4189 22499198 14453060 1401280 -11987351 -19709129 -22432698 -25396631 -27657139 -21251858
4181 -21251858 -5404977 6672696 3921149 -5954502 -7713296 -1976980 -2219779 -9232139
4173 -9232139 -6639136 12861454 33819817 40028971 35183887 29603722 20617222 2685045
4165 2685045 -13598179 -12319629 2628296 11626791 6973580 -410482 -1785179 -1300049
4157 -1300049 -3322912 -4406069 -2605932 -2018924 -3117848 194339 9291334 17122463
4149 17122463 20170723 23728075 30547711 34289726 29409418 18453162 5299251 -9016417
4141 -9016417 -19768051 -19456362 -10897323 -7263075 -11900765 -11144546 2773835 14776260
4133 14776260 7106450 -13711861 -26620302 -26032698 -24441578 -28327978 -29913962 -24166687
4125 -24166687 -16963998 -11711358 -2852352 10152434 15389857 4898506 -11082360 -17448277
4117 -17448277 -15582645 -19458408 -33028808 -43746450 -40918295 -30609433 -26200661 -30053371
4109 -30053371 -32477081 -27352163 -20615784 -20173866 -23556559 -22162466 -15308785 -12263799
4101 -12263799 -18878398 -28926977 -32515185 -28047009 -21148358 -15681114 -11345361 -7490069
4093 -7490069 -3559702 2448947 10331633 14226839 9401736 1563170 1791337 11394905
4085 11394905 19571199 18378237 11955992 6553902 -501534 -14110320 -29084494 -34168513
4077 -34168513 -26960823 -16267604 -9139464 -3631673 3194690 7726719 5679076 860003
4069 860003 1543849 9153802 15808400 14231218 6723234 2002532 4310377 8370290 6750070
4060 6750070 440448 -2445784 162578 -1402813 -14770800 -30378096 -30342404 -12457843
4052 -12457843 5682019 9679027 4208147 193606 -1569456 -3544128 693803 16451528
4044 16451528 32713641 34098563 24669183 22135345 29630913 32704125 25960952 21208509
4036 21208509 23035955 18658308 3576970 -4044885 8353395 23396875 18922608 3226602
4028 3226602 903670 13151942 18827642 11059180 5482760 9817635 10992051 610814
4020 610814 -8135537 -508064 18102883 31199461 30609368 19069735 4113988 -4053101
4012 -4053101 756200 10298614 9024817 -3367219 -8946334 2783953 19472662 24254205
4004 24254205 17031618 8337050 3639271 3636229 9208416 15523136 11249048 -5592756
3996 -5592756 -20321371 -20597235 -13275116 -11699770 -16443175 -20844281 -25687470 -34311782
3988 -34311782 -41292301 -40050042 -34660780 -31289544 -26560986 -18112734 -15798842 -24895398
3980 -24895398 -29041008 -12004736 12020833 15795743 1840447 -1534569 12478332 18006709
3972 18006709 1246398 -14983036 -8588698 6558845 6194135 -3811788 -620576 13744683
3964 13744683 13853379 -7698057 -27496674 -25919954 -12913882 -8490946 -13196199 -12059028
3956 -12059028 308422 12648783 13787582 5842068 -1735414 -4321601 -3829004 -1855039
3948 -1855039 3140132 11067259 16584038 13402851 1672743 -10722632 -14676234 -7993539
3940 -7993539 1947478 4410194 -3487108 -12659175 -12964919 -6901291 -5196110 -8021327
3932 -8021327 -1122564 22963348 48986848 54447061 35447611 7127067 -16543916 -31592105
3924 -31592105 -36706715 -31707921 -23800824 -21989226 -22648431 -12560630 10295485 30362658
3916 30362658 33519911 22408640 7955463 -4720701 -16099996 -26053302 -33425986 -35710190
3908 -35710190 -27095312 -6130224 12644699 8111427 -19695014 -44091507 -43631635 -27854117
3900 -27854117 -19136755 -19579739 -12565371 7999407 27516214 30799567 18974321 3418414
3892 3418414 -6947893 -9076665 -4718942 73639 -673178 -6711945 -13084176 -17066921
3884 -17066921 -18770777 -16256271 -7379165 2444206 1521266 -15056428 -37419257 -49464578
3876 -49464578 -43807705 -26604431 -9413521 1364952 6892288 9741222 8970332 4215059
3868 4215059 1943375 10661766 28414992 42052481 43155811 38491193 38183197 38439803
3860 38439803 25356875 -4459061 -35301294 -47612893 -37713805 -19681534 -10014914
3853 -10014914 -12929839 -20057242 -21998509 -17662829 -12139924 -9169746 -9059923 -11012633
3845 -11012633 -12242275 -7048769 6240519 18513020 18308115 7180796 -2401754 -5200009
3837 -5200009 -7941610 -12888116 -9882935 7158717 26771551 33500605 27237728 18838460
3829 18838460 13182332 7369500 498988 -5578256 -11429385 -16329034 -13707101 -290932
3821 -290932 14588888 19658193 17836590 20285853 27692395 30215631 24607961 18443131
3813 18443131 16519321 14515284 7966056 -1784947 -11386214 -16778766 -11799427 4624516
3805 4624516 20919286 23325679 13532029 5173165 4033442 4352085 4041260 8280003
3797 8280003 15447065 14820529 3960079 -4735200 -1227440 9800648 19493831 26061759
3789 26061759 29133868 24745088 14069332 7023428 9083165 13623486 14566184 16483441
3781 16483441 23674961 29478706 27124960 22932529 27101285 36902642 39737799 29713047
3773 29713047 13268217 1539748 2344740 14298471 24320795 18651633 1192007 -9049911
3765 -9049911 -4437120 787457 -4109885 -6016875 10716692 35237825 43398138 32830111
3757 32830111 22827621 22044477 18707286 5134278 -8466288 -10537738 -2086735 11597744
3749 11597744 28058413 40907654 41261113 33117413 32496589 42439221 43648503 22217264
3741 22217264 -6165328 -15425441 -4267220 4811097 -1628665 -12805573 -13784387 -6815007
3733 -6815007 -5046261 -12434666 -18983847 -15722644 -8262309 -10744594 -26852708 -42486603
3725 -42486603 -41809511 -26721358 -13002646 -9001482 -8082520 -3641830 -452636 -4975113
3717 -4975113 -13014285 -15106775 -8794845 1413778 11373584 17992715 17963856 13227509
3709 13227509 12435615 18547032 20267951 6330187 -15823515 -28110478 -26728216 -25066196
3701 -25066196 -30349447 -32102471 -20104561 -1440636 9825188 11373410 10843491 11314370
3693 11314370 9448634 5331219 3823623 6029811 7748720 7493949 8976349 13876767
3685 13876767 18285954 18632867 15903093 11401208 3289862 -8980017 -20486803 -25227353
3677 -25227353 -22590108 -15996680 -6959828 5480755 19819613 30259183 31099866 21482644
3669 21482644 5401233 -11556612 -24851523 -31531216 -29940304 -20705795 -8856016 -3041187
3661 -3041187 -8925482 -22144467 -30550276 -25849137 -12056457 -1077763 -979135 -9343865
3653 -9343865 -16308691 -13179246 -483818 11207270 11504995 2841211 -1503027 4889863
3645 4889863 11573230 5675209 -8129845 -12185446 104150 15238212 17492029 6538212
3637 6538212 -7627808 -18795688 -26092216 -27749864 -22508643 -14529825 -9157690 -5574961
3629 -5574961 -539980 3149548 793994 -2526871 5096545 24788402 41286880 40560987
3621 40560987 26625213 14536190 11345932 11124186 6444888 -2537584 -10881445 -15075396
3613 -15075396 -14568503 -10478003 -4722245 983446 5983183 9872675 11749261 11655215 11266258
3604 11266258 11161138 9628308 7307989 9922165 20311744 29516428 24672727 7669680
3596 7669680 -3713879 794279 8259700 434913 -18598503 -26570473 -14286398 1865993
3588 1865993 3797561 -4534539 -6790809 1173882 8326631 5960171 -3108652 -11694579
3580 -11694579 -14810957 -9277663 3657068 14085403 10958319 -3556169 -15242985 -15930095
3572 -15930095 -11808322 -10119659 -7493062 1043266 9472636 7462312 -4199251 -14292821
3564 -14292821 -15733379 -11392084 -6530203 -3723037 -5576207 -14182918 -25324716 -29755740
3556 -29755740 -23710945 -13494381 -6672852 -3053274 1999062 8758042 12296717 9651679
3548 9651679 4617436 4566950 12705484 22989077 24117087 11955347 -2200353 -1134389
3540 -1134389 17502705 34693252 30236190 7246208 -10558173 -6599103 10913350 22675251
3532 22675251 22514399 19862780 21625598 22519260 15964305 5480486 -797282 -895584 2459321
3523 2459321 9296745 20373848 30805818 34549100 33754229 34563876 34586713 25712493 10809669
3514 10809669 4688710 12319819 17721346 4686029 -19473013 -32655944 -26135286 -12378697
3506 -12378697 -6076175 -8106848 -9863913 -4979586 6277561 18648917 25249572 22759458
3498 22759458 14661137 7314012 3722236 3531919 6344107 10615906 11774897 6889930
3490 6889930 -130480 -2697252 871014 8108765 17198651 25196285 25714714 16834482
3482 16834482 8675825 13649157 30180153 45298533 52408098 56046304 58953358 56497419
3474 56497419 47124885 37285381 31037519 24288800 14602721 7450492 6342537 5434730
3466 5434730 -141524 -3799274 3477696 18254367 27950251 27225509 23438324 25370647
3458 25370647 31499150 31207752 17010778 -4409957 -16031031 -9363653 3731485 5598244
3450 5598244 -3856912 -9704309 -6376759 -3751309 -5976613 -2551566 10437903 17864579
3442 17864579 8730258 -3159654 351878 12689509 14861658 8003340 9420299 19851642
3434 19851642 20526671 5674063 -6180520 -994068 11654364 18210494 21224545 27360722
3426 27360722 31526280 27644331 22691080 25116094 29584607 27977773 25817560 31117944
3418 31117944 35054029 23340621 3064690 -2464242 12900596 28863755 27792887 15892067
3410 15892067 6972203 456667 -11546887 -25721108 -31397249 -28977332 -30589338 -41441466
3402 -41441466 -51304288 -48284347 -33903384 -19880204 -14050601 -13834005 -11775394 -3897464
3394 -3897464 7277114 15511856 15965705 9053820 522453 -2750596 1556376 9161018
3386 9161018 13607334 12957413 10565156 8762883 4987530 -2826533 -9971010 -9950964 -5313801
3377 -5313801 -6540562 -17659511 -29558198 -32463756 -29332866 -29630101 -33891631 -33936144
3369 -33936144 -27386407 -21610252 -20664501 -17900381 -7138874 6463978 14328588 18033802
3361 18033802 26370706 41221042 54499332 58549964 52346437 37479044 15959233 -5545942
3353 -5545942 -15897019 -8599759 11307197 30846816 37662025 26882662 5418874 -10538902
3345 -10538902 -9288184 3212652 10390716 6858399 4418242 12043320 19875378 12699469
3337 12699469 -7185307 -22316989 -22936025 -16089562 -11292317 -7917776 -938672 8824272
3329 8824272 15908400 17279234 13830518 7945810 3019932 2854010 8328906 15828093
3321 15828093 20158840 17357241 5190287 -14529925 -33127108 -40270790 -35413935 -29246375
3313 -29246375 -29494688 -30163351 -21349172 -6020532 2143833 -2202016 -8355862 -4780163
3305 -4780163 5170695 9126032 2970321 -5176412 -6822079 -1822175 5324615 11020760
3297 11020760 11717907 3667152 -11318213 -23458531 -24044008 -15563704 -8226733 -7359689
3289 -7359689 -8891086 -7086535 -2107032 1136583 -1460961 -9128441 -15314024 -12341871
3281 -12341871 -810994 7692072 3066231 -9394904 -14616829 -6763926 5707061 14250205
3273 14250205 18707641 18620273 8660989 -9159328 -19435734 -11225856 4925468 10013501
3265 10013501 1876686 -5230369 -3250939 1510871 2874576 3500063 5655657 5147538
3257 5147538 -140242 -4865904 -4792120 -3053761 -3064804 -2816334 -1645522 -5055901 -15380679
3248 -15380679 -23139003 -16095990 4877229 25047452 30422507 19930822 4671376 -2458701
3240 -2458701 1831075 8835121 9039268 4723918 5870456 13985958 18838279 13965027
3232 13965027 5879881 2405325 1199371 -2124579 -3169443 3007870 9438770 6290596
3224 6290596 -1004666 2919607 19540451 32222341 30005794 22731340 24444652 31562905
3216 31562905 28639242 11373351 -7007489 -12696286 -6753121 -1129185 -4317285 -14453212
3208 -14453212 -24344499 -29488858 -30073952 -27167886 -20519068 -12029418 -8737621 -17284115
3200 -17284115 -34269011 -46484043 -44246637 -32253536 -23411237 -23149751 -24400123 -18554195
3192 -18554195 -6521754 3966512 8367142 8146494 5681951 1974947 -562501 842368
3184 842368 3137171 -2141984 -17938149 -35200717 -42258836 -37402513 -26993978 -14989161
3176 -14989161 -1968773 7938357 8987679 3550067 916841 3990859 5438464 -21343
3168 -21343 -8296574 -15006052 -22385076 -30609105 -31437195 -19889489 -5034155 1668382
3160 1668382 3048683 8861204 15860894 10542041 -7347269 -19014283 -10234350 10519658
3152 10519658 24967122 27294679 24954589 23521910 20887377 14837844 8039008 4072591
3144 4072591 3345884 4334659 6049446 8233289 10487102 11648155 10108734 5944074 2446141
3135 2446141 2621471 3286102 -3551600 -20357649 -37685803 -42359949 -31959954 -18028539
3127 -18028539 -13702860 -19784471 -24862702 -19506745 -8403221 -5002497 -13473385 -21252933
3119 -21252933 -14870998 373442 5381790 -7650333 -24668495 -28372522 -18353908 -5462265
3111 -5462265 5385976 14764355 16073297 -409712 -27735014 -40927812 -24535288 7330385
3103 7330385 28143296 29558593 23989062 21698741 19890544 15534509 14761255 22450235
3095 22450235 32112818 34656448 30983403 27638254 24888443 18279079 9104932 3884304
3087 3884304 4093522 4771315 3143176 375998 -5321975 -17914011 -33826468 -42316680
3079 -42316680 -39286087 -32331193 -27815483 -21983908 -11304775 -2826052 -4799489 -13070819
3071 -13070819 -17154415 -16159544 -18134620 -25178773 -29735483 -26741918 -20611401 -17737442
3063 -17737442 -18888687 -21402560 -23175173 -22074474 -16040279 -5936315 4895089 14273907
3055 14273907 20762258 20645748 11050198 -3637846 -14172052 -16219047 -12784540 -7098548
3047 -7098548 263444 6429488 6169884 -257153 -5735921 -5926229 -4052855 -3108920 -660982
3038 -660982 3925516 4578218 -2437124 -10985653 -14639263 -18152814 -29146943 -41848180
3030 -41848180 -41406032 -25136115 -7981065 -3143714 -7384359 -11176884 -13603646 -17387807
3022 -17387807 -16009267 705515 28446664 47975893 46637797 31255962 15259458
3015 15259458 2474832 -8955099 -15671692 -14286661 -12502411 -20862101 -33835164 -33397562
3007 -33397562 -14792701 4702100 9011097 3032296 456009 2909184 3098131 636488
2999 636488 1247415 4493781 4668481 1311839 -1972137 -6058316 -12608427 -15572687 -9026668
2990 -9026668 -145032 215431 -2463664 7212682 28007337 40963144 38762675 36474461
2982 36474461 44715446 51178802 42224377 27046593 23379953 29799486 29936259 18415590
2974 18415590 6359860 3427475 7694840 12243507 11134254 708914 -15092331 -22816173
2966 -22816173 -12655594 7949852 22118148 22275947 13146292 620454 -11815970 -18914086
2958 -18914086 -17375731 -12183833 -9144529 -3888010 10223861 26072340 28786977 17758395
2950 17758395 8286781 8766653 9872298 1085240 -14066587 -25077375 -26817721 -19636545
2942 -19636545 -6570361 4553215 5782827 1171403 4422314 18335052 27324198 19243226
2934 19243226 4704631 2381736 11445306 12697778 -3827774 -24826050 -30754216 -18954341
2926 -18954341 -4739752 -2644190 -10874150 -15437368 -8302621 2557960 4788146 -527695
2918 -527695 -1201225 6232904 10287676 2976352 -6110187 -3494077 7851411 13344919
2910 13344919 8185426 1877406 1544002 1815311 -5395395 -19034380 -30907357 -34306005
2902 -34306005 -27712865 -14663666 -2801434 1273731 -539286 924430 10181570 19714018
2894 19714018 18541481 6121774 -6550135 -9112167 -1616109 7569102 10118119 3728171
2886 3728171 -6312655 -9793103 409575 19320525 31182752 24569993 5970119 -6087853
2878 -6087853 -1150753 12990420 21071689 16333526 3684487 -7509631 -9615003 -603874
2870 -603874 12315893 16011965 4454804 -13335454 -23338554 -21684276 -13993481 -3586221
2862 -3586221 10641514 26297374 37501851 43538870 48373616 50715137 44683772 32310338
2854 32310338 23945346 21914943 15600875 -182968 -13668709 -13641672 -8575294 -14076473
2846 -14076473 -27143671 -29124867 -13734932 3384281 7239513 2695202 3300239 9949722
2838 9949722 11102764 1120694 -11066726 -13217465 -3712066 9030570 17462780 20553250
2830 20553250 19745758 15526626 10702085 11244335 17643043 19616971 8498903 -7043215
2822 -7043215 -9298779 2872611 9904176 -760109 -15670647 -15146068 -1526876 7450065
2814 7450065 7001308 8998367 18044657 22223937 13510704 2363314 1941339 7927547
2806 7927547 5817283 -6694842 -15835871 -9991016 6250499 18200409 16525173 4657664
2798 4657664 -6410888 -8560991 -2542413 4545194 6189548 895511 -7961046 -14763180
2790 -14763180 -15797696 -13309482 -14189289 -22004218 -31646679 -34714480 -28595118 -17070559
2782 -17070559 -4270026 7345963 14914966 16973179 16872992 19000280 22087163 22089709
2774 22089709 21094538 26047382 37601885 47570063 49621250 45541425 38418967 27485834
2766 27485834 14026473 4779544 3174863 3367552 41741 -1422469 6583535 18940610
2758 18940610 21676050 10754262 -2301313 -5779585 -859713 4357652 6819391 8320987
2750 8320987 7853389 2145619 -6437603 -9693318 -4385406 1396102 -2666294 -15828797
2742 -15828797 -26981467 -27967485 -20959065 -11925058 -3045621 4956039 8731520 6785968
2734 6785968 4632131 8488793 15381456 16551583 10308253 4080995 2598788 1424200
2726 1424200 -4864307 -14368262 -21502471 -23777034 -21091830 -13039775 -1573746 7271691
2718 7271691 9249860 7312946 7007736 8141345 4965083 -5819252 -19933142 -28777160
2710 -28777160 -27708291 -21873001 -21878797 -30259126 -35017135 -23903000 -4057413 3067474
2702 3067474 -10599340 -28045388 -29709900 -17464261 -6267981 -950371 4611553 10025812
2694 10025812 6543031 -5915927 -14241821 -10013123 -1150322 768823 -3578874 -5382383
2686 -5382383 -1472680 4144064 8958499 14031138 17885416 15041272 2949855 -12761125
2678 -12761125 -22216199 -20179310 -10873808 -4085090 -6000496 -14110462 -21914164 -27174080
2670 -27174080 -32543335 -38645803 -41182220 -36938962 -29005657 -22650465 -18209480 -11988836
2662 -11988836 -3689206 973646 -3152738 -13139776 -19176664 -13946646 -460306 10214348
2654 10214348 9805168 1362522 -4148734 -405445 6510561 5225869 -6175203 -16348955
2646 -16348955 -14722464 -6039785 -4139215 -11471731 -14297112 -3509696 8875439 5091927
2638 5091927 -11670392 -20334762 -11936687 -1593447 -5313475 -18319779 -25245512 -20714329
2630 -20714329 -8837133 8310971 28259396 40770190 37701220 27040728 22916325
2623 22916325 23763305 16074148 101923 -5967523 6395909 19970255 14057361 -7952146
2615 -7952146 -25515629 -28806580 -26780407 -29275869 -33177842 -30466806 -22853580 -21178386
2607 -21178386 -30202244 -39546153 -35369704 -20041502 -12053549 -22338511 -38845575 -43035581
2599 -43035581 -34856699 -29135545 -31271761 -31664220 -24715430 -18163437 -19146067 -23733123
2591 -23733123 -25422521 -22525169 -12460272 8644352 34358966 48436894 44458981 33325323
2583 33325323 24251155 12568406 -3834328 -11842355 -2215739 11472822 10984959 1059251
2575 1059251 120882 10756291 19795398 23249684 29401857 37612492 35805659 22915114
2567 22915114 14134205 16839674 18354536 6999036 -8589327 -12179725 -2390178 8198159
2559 8198159 10538760 6702490 2630324 -72750 -4516404 -12164902 -16871291 -9356593
2551 -9356593 9554689 26533129 32461929 33656243 37297983 35229394 16933965 -8794740
2543 -8794740 -23276403 -24352423 -23695717 -21166602 -4966236 22026277 40214925 41918368
2535 41918368 39003102 36933987 26148991 7158378 -1851392 5890302 14015728 12943420
2527 12943420 15107532 25763257 28135242 17394154 18362380 43590911 65795820 65063179
2519 65063179 69771703 103764690 120988740 55591101 -71501390 -160449878 -155064263
2512 -155064263 -100140201 -61532141 -46605988 -32699028 -22899825 -30041697 -39163007
2505 -39163007 -29993231 -15692828 -20401184 -34949212 -32451525 -15371055 -9365735 -17399235
2497 -17399235 -16920872 -1746758 7522772 -675110 -12118841 -13180083 -9192279 -8181155
2489 -8181155 -7451547 -5219602 -7581391 -15159689 -17975738 -11138194 -2087640 3451359
2481 3451359 8361505 11350857 3390396 -14058333 -21939531 -7014025 17731507 27950187
2473 27950187 16457255 -2915977 -14152173 -12539203 -3749087 2164183 -1626285 -11117350
2465 -11117350 -14149529 -5019146 7562133 11654287 6667859 1092563 -458579 -916197
2457 -916197 -2745686 -3066028 764120 3971302 -2861575 -21409165 -37944101 -34548147
2449 -34548147 -11209841 9613233 7157049 -14107051 -33464848 -40837252 -42132732 -41434924
2441 -41434924 -34984023 -25388894 -24490313 -33854152 -36658690 -20081061 5138493 19370265
2433 19370265 19490364 16875638 17188325 16779840 15722424 19504164 26914452 28701388 21444165
2424 21444165 13266517 12013698 15023572 14517709 7869462 -1088554 -7688048 -10784724
2416 -10784724 -12973419 -16736276 -19547838 -15819548 -6659004 -2829393 -11140238 -21584245
2408 -21584245 -18073434 -1590551 8787604 1796453 -9900817 -7860179 5600823 11100805
2400 11100805 609118 -10523720 -4950132 12247817 19920288 8621896 -8020278
2393 -8020278 -12013335 -2774293 5924657 5451670 226024 -2640040 -3264824 -6291163 -13841450
2384 -13841450 -23548190 -29611841 -25069425 -8451305 10369735 17113129 8617885 -4095604
2376 -4095604 -10727427 -12932187 -16873047 -21848621 -22721590 -18690860 -13555185 -10762942
2368 -10762942 -11986370 -15340919 -12235734 4657440 24731626 23113595 -7376750 -39005733
2360 -39005733 -40343176 -16791886 -22970 -1544935 -1424745 13535379 25868305 14548830
2352 14548830 -13050774 -32924578 -35406450 -27980406 -17101441 -5236437 -260095 -9019245
2344 -9019245 -21955219 -20756740 -4219426 7823386 1684220 -11236622 -10889100 4314868
2336 4314868 16491524 11125972 -7372593 -23350601 -27425375 -23508706 -20502808 -20562257
2328 -20562257 -17778547 -7589533 6199806 15835693 18408637 17097101 15211196 12611489
2320 12611489 7990403 1999140 -2711110 -4042558 -3684932 -7312057 -18365697 -30990703
2312 -30990703 -33914556 -24102086 -11825441 -8155350 -12189378 -15862740 -16040343 -14003181
2304 -14003181 -7529543 5447366 16563924 12829861 -4176822 -15890638 -9539930 5432082
2296 5432082 11418318 6184004 2366437 6602531 10005402 1959203 -13857150 -22664691
2288 -22664691 -16105320 -2512244 2331690 -6187119 -15603897 -11774235 2809762 12085908
2280 12085908 7279004 -2995715 -6250839 -2153109 949144 -268940 -2158208 -3196281
2272 -3196281 -6281156 -11273980 -12654128 -7717304 -2299623 -4150978 -12127156 -15353463
2264 -15353463 -4700606 15256001 28186751 22836210 6345532 -4473255 -4503512 -4394167
2256 -4394167 -10735896 -13457143 -2153201 13930909 15942153 1387796 -14331071 -21349406
2248 -21349406 -25154667 -30603912 -31400244 -22186637 -8558973 3166602 15308763 28824993
2240 28824993 34260896 24480801 9106483 3645126 8509124 10569679 2730353 -9306259
2232 -9306259 -18098935 -21319290 -17900564 -7736474 3510525 7946478 5463667 3595459
2224 3595459 7098242 14067579 21599405 28212427 31556764 30915193 30484887 32700595 31286756
2215 31286756 20552107 8294911 6981801 13999243 15454367 9818507 10734173 22218852
2207 22218852 28726877 18730443 2870281 -3064635 -922152 -2986454 -11408552 -18129320
2199 -18129320 -18996907 -16076637 -10692345 -4388059 -2438724 -7694448 -15526773 -21496573
2191 -21496573 -26682110 -28714380 -18724860 2088165 14637208 5475425 -11770501 -15535271
2183 -15535271 -8373314 -10013446 -23978162 -33026648 -26708925 -12550344 1230857 13889149
2175 13889149 20648056 13451502 -2187759 -10501607 -10765716 -19032599 -37826481 -46232470
2167 -46232470 -31860096 -12024998 -7409787 -12254067 -9116062 881040 3098330 -4472616
2159 -4472616 -10168702 -9335030 -9141115 -15029716 -25445928 -36823008 -42709009 -33604885
2151 -33604885 -9851360 11560835 16079368 10660648 9507872 9115624 -3266049 -21612932
2143 -21612932 -24253957 -6043603 13197000 16297674 6328869 -7876236 -24625016 -40106068
2135 -40106068 -44272141 -37037224 -33832347 -43207446 -51944461 -45299520 -30085520 -22373335
2127 -22373335 -21663016 -14949612 -1525984 4709848 -1628902 -8004871 -2375223 10799079
2119 10799079 18908113 17018883 9273709 751000 -5719276 -8325233 -7515168 -6824628
2111 -6824628 -8577765 -10318787 -8934543 -6591203 -8274747 -14075567 -18868111 -20813110
2103 -20813110 -24946911 -34298992 -41237673 -34384426 -14083815 5598520 13089297 12205405
2095 12205405 14274927 21406592 24468280 17232089 5909170 1595547 6934376 14332533
2087 14332533 16577042 15162000 15624677 17065019 12245645 466718 -5893182 4749159
2079 4749159 25641472 37695267 33153378 22434376 14714613 4702120 -13032721 -28329238
2071 -28329238 -27713235 -15977553 -10843433 -17974074 -24613602 -18858717 -3881829 8914280
2063 8914280 11440146 2295293 -12141641 -18723775 -9168808 7410966 13011489 3967486
2055 3967486 -4319942 514032 11005064 11349391 -1652864 -15782216 -17546311 -4944704
2047 -4944704 11160104 17232342 11772918 7880649 15622776 26330178 24683611 12407010
2039 12407010 5153826 7114164 6719068 101464 -1334926 5927540 7469132 -3445449
2031 -3445449 -9619838 3073732 18800983 13805414 -6136293 -14571081 -4605745 4547419
2023 4547419 490356 -6933961 -7757608 -8235337 -15898125 -24230945 -23043228 -13635211 -4491837
2014 -4491837 585669 2841574 3281416 3194688 5589460 11957274 20778552 30124330 37131857
2005 37131857 35876672 23140340 6155702 -3705209 -5351869 -7144510 -11228581 -9599363
1997 -9599363 1356104 13176558 17260070 15684960 15092952 17647328 22570361 28596821
1989 28596821 30340725 20956014 4079320 -5562712 -502204 8147476 5241379 -9337435
1981 -9337435 -23833410 -30025671 -26527815 -12702619 9644963 30843663 39531359 34511093
1973 34511093 24033378 14587843 6737918 146810 -4834125 -10310868 -18639136 -26323619
1965 -26323619 -26171542 -17256184 -8147616 -7959385 -16617698 -25315601 -25279533 -15794109 -4366718
1956 -4366718 1144997 -12419 -3371626 -6669648 -10891109 -15023436 -16665484 -18488229
1948 -18488229 -25496862 -32904193 -26666525 -3059663 20709859 25194803 12788358 3316934
1940 3316934 8854104 22470540 30463853 27070533 17252130 11527396 17216601 29553730
1932 29553730 34262161 24465967 10255827 4401896 5316335 4891564 6157555 16951893
1924 16951893 29158255 23775500 168928 -17832235 -13004815 3248811 10113849 5620100
1916 5620100 2943229 7888248 14208083 16649993 15930701 12269331 4264077 -5588916
1908 -5588916 -11686483 -12236240 -11101668 -13690268 -23282730 -37680121 -47230674 -42598311
1900 -42598311 -28229866 -20040461 -24217536 -27988322 -19866018 -8616951 -9424405 -19894396
1892 -19894396 -25677958 -24055959 -24039184 -25980981 -20885576 -11273745 -12616494 -27973349
1884 -27973349 -39182358 -32414407 -17524595 -11764754 -17016732 -23806030 -26572283 -23977076
1876 -23977076 -14190800 -913499 5127865 930171 -2543711 1038694 1343723 -8640841
1868 -8640841 -14704974 -2521571 15212105 16072467 3916999 563261 5464226 -5327789
1860 -5327789 -35875160 -56931982 -47996361 -26375032 -17928486 -21511271 -22103756 -19948544
1852 -19948544 -23319060 -26382221 -19045702 -9944974 -15108147 -28660646 -28954521 -12906704
1844 -12906704 -1304899 -7362166 -20932688 -29125388 -33400217 -38211851 -39034325 -31741418
1836 -31741418 -21752570 -14692396 -7988629 267081 3935172 -962186 -7014739 -5545975
1828 -5545975 259221 637227 -7183728 -17732859 -25170672 -26063634 -18473092 -4563370
1820 -4563370 8522758 14611695 12625780 3384725 -11447067 -24669569 -26220471 -16213803
1812 -16213803 -8140272 -12598473 -24244522 -31386229 -31464152 -28934375 -24609112 -17421361
1804 -17421361 -12141032 -14412656 -20612483 -22847130 -22079607 -25533155 -31897116 -31078204
1796 -31078204 -20901179 -12855823 -16159376 -25159516 -29274186 -28366239 -29636150 -33018772
1788 -33018772 -29223132 -13226483 7547820 21799820 26165092 24282715 18290665 8273452
1780 8273452 -1164637 -2696779 2505421 3748157 -3287090 -7696418 623023 13063605
1772 13063605 13007251 464120 -8526531 -6118499 -469970 2644068 9116690 21129878
1764 21129878 27997303 21632123 8542548 -2593051 -12897149 -23508295 -27304104 -22131970
1756 -22131970 -19506258 -26802924 -33028549 -26858825 -16266536 -13285880 -11869269 -1453578
1748 -1453578 8604175 2772089 -9761082 -4909657 17674975 32178500 24345714 6806036
1740 6806036 -6173745 -13905178 -13614475 4659406 36731782 59531458 59741790 49320677
1732 49320677 42579132 36509805 24955766 13951466 10174264 10018623 11290351 19082758
1724 19082758 29212926 24711553 2168823 -17124973 -16946128 -7854042 -3407817 3518763
1716 3518763 19715481 28590686 15726463 374711 9932399 34396688 39418680 18797453
1708 18797453 404489 398504 4493929 -179888 -5362300 -4087993 -6307745 -17929212
1700 -17929212 -24939229 -14150578 4604111 11371383 1720872 -11690311 -16383369 -10471526
1692 -10471526 -566968 5151700 4324560 1799115 1378266 522950 -2040289 -1565543 1934928
1683 1934928 -845734 -10728161 -11517124 4343461 17534684 11493944 1939637 6182696
1675 6182696 4224042 -21788100 -23525020 69809249 230983708 327092856 271721533
1668 271721533 132578745 39890598 31216250 45578731 38225917 26768072 29019815
1661 29019815 25952716 5110290 -10791810 -3061855 12568535 17439537 20422474 33248089
1653 33248089 41897846 28936779 5290134 -6332953 -6739596 -13969856 -29362924 -34075057
1645 -34075057 -19146724 329086 5608640 -3654762 -13086083 -12053434 -3519949 1949038
1637 1949038 -1389713 -9450471 -16228519 -22435259 -31481979 -40041559 -41294913 -37316686
1629 -37316686 -38366413 -47122558 -52827515 -45966327 -31217812 -20091172 -16736583 -17290832
1621 -17290832 -18746230 -21397985 -23893469 -21812054 -13216572 -3854291 -4229555 -18557314
1613 -18557314 -36335980 -39742215 -22874786 634781 13426467 12682335 7045616 1947582
1605 1947582 -2606162 -4458911 -804662 4894738 7651034 9920225 15038471 15484710
1597 15484710 1901138 -17662947 -23318394 -9742064 7905175 16722799 18990188 18599936
1589 18599936 11759126 -931513 -8266240 -4257676 1941334 1119134 -2547238 -2228129
1581 -2228129 -724988 -1474439 1565933 12898637 23421539 21654247 9871592 -1998574
1573 -1998574 -11322823 -20312678 -25516911 -21959931 -13092211 -6030323 -1396318 2794211
1565 2794211 2965121 -4075868 -12483905 -14990574 -14103592 -15885997 -18283637 -16012240 -11204345
1556 -11204345 -8358590 -4916157 1290868 1643496 -12282217 -31881032 -39955686 -33317782
1548 -33317782 -23873197 -19865856 -19109775 -18419253 -16625374 -10266510 1138734 8423273
1540 8423273 4461081 -1444405 4027587 15169179 14191505 -642590 -12794531 -13743277
1532 -13743277 -12010093 -13536191 -13074897 -10082055 -13424523 -22857827 -24595550 -14607389
1524 -14607389 -8524961 -17253860 -29415252 -31062680 -27549349 -30351846 -34670185 -27419039
1516 -27419039 -9712502 4413073 7056686 1651790 -6197797 -11754905 -9658572 -177024
1508 -177024 6745905 2441868 -10019732 -23276382 -35679149 -44992636 -41938662 -23343211
1500 -23343211 -4352218 -2423283 -13471047 -18588776 -11213795 -2040401 1937672 6827772
1492 6827772 17238490 26163952 25021011 14276302 -180030 -13508828 -22038348 -24480291
1484 -24480291 -25219660 -29136375 -32079936 -25219135 -10664060 -2669058 -8780193 -18931618
1476 -18931618 -19860010 -12993181 -9866964 -14690076 -20776498 -22881618 -23798432 -25792918
1468 -25792918 -22649120 -7460471 13291985 21407617 6943818 -18113332 -32424235
1461 -32424235 -29205255 -20127394 -16469099 -16752597 -16298721 -18313654 -27123352 -37115427
1453 -37115427 -37676329 -25980054 -8180707 8032411 15452592 7729227 -12426813 -28995815
1445 -28995815 -27439452 -12740118 -3006870 -5960718 -12411886 -13946814 -15554981 -25593473
1437 -25593473 -41326048 -50900656 -46135680 -29652481 -11991789 -3513416 -6253917 -12362216
1429 -12362216 -12505394 -5476784 2552001 5883463 2500128 -7668693 -21718363 -32363436
1421 -32363436 -33488234 -26858776 -19170366 -14500481 -14228889 -20280760 -30897504 -36451960
1413 -36451960 -28916729 -14387341 -6979794 -10573132 -15842506 -15690409 -13839416 -16154774
1405 -16154774 -22195482 -27982344 -29868123 -24072065 -9874267 5273021 11248623 7057230
1397 7057230 208292 -4872912 -8752441 -8567560 -64094 10589367 10438888 -648505
1389 -648505 -6884013 1020811 12694613 15105558 11254444 11976837 17967219 20474950
1381 20474950 14153411 880601 -13922938 -22328159 -18055504 -6294925 -1776732 -9794952
1373 -9794952 -17690390 -13950553 -6541305 -10413592 -24256556 -33694410 -33335115 -31235683
1365 -31235683 -32466413 -31739916 -24566554 -15121931 -9418921 -7770123 -6890670 -4778231
1357 -4778231 -2102442 -1709397 -5867345 -11672630 -12818229 -9252720 -9222236 -16015697 -19529921
1348 -19529921 -10104411 4576950 7617463 -4598007 -19325207 -26532597 -30264448 -38806473
1340 -38806473 -51953150 -61381049 -59071558 -44570143 -27408021 -20240472 -24906814 -28814592
1332 -28814592 -21227509 -8615399 -5608132 -14944561 -26461391 -32869735 -35348487 -35243679
1324 -35243679 -31992617 -29108723 -31020840 -33798866 -29977583 -22174858 -19684226 -21874130
1316 -21874130 -19513446 -13977887 -18314331 -33937870 -43220255 -34671222 -20612876 -17866327
1308 -17866327 -23644726 -24734861 -20142083 -18141857 -17601486 -9868925 3025760 8845906
1300 8845906 5248845 4606902 14747079 27609080 32949789 32221009 30775781 25642459
1292 25642459 12389503 -1151861 -1634065 8436253 8744262 -12580678 -39607225 -45980974
1284 -45980974 -27522572 -5543393 2107868 -160573 -573403 174363 -4413997 -9867526
1276 -9867526 -6373113 2739055 4154259 -3786574 -8400981 -4760899 -4620811 -15883371
1268 -15883371 -27219103 -24426921 -11844177 -4468203 -5261513 -3915636 4290111 11305395
1260 11305395 9605978 2854803 -755885 -209898 -2667251 -14300547 -31586466 -42090565
1252 -42090565 -36016011 -17914652 -3814265 -4928145 -17437469 -29682276 -34240404 -29919470
1244 -29919470 -17856746 -1735587 11274011 15305023 10437427 405885 -10853424
1237 -10853424 -18616162 -19547937 -18284037 -24686222 -38415875 -43454744 -27059782 920114
1229 920114 17922798 15024986 3209879 -5087321 -9385348 -14251748 -18811280 -18328898
1221 -18328898 -11653670 -3677839 -1903112 -9751845 -20807878 -23144305 -14430812 -8612096
1213 -8612096 -19646723 -41540552 -54334180 -48931694 -35245610 -24584614 -15474264 -1913876
1205 -1913876 13345194 20853080 15448496 992728 -12400415 -14386922 -2987213 11217831
1197 11217831 15055293 7606605 -1686479 -9011942 -19099941 -30099047 -29713137 -14300178
1189 -14300178 745661 1175204 -5659908 -4214949 3453794 1891550 -11712561 -23073322
1181 -23073322 -22461199 -14427681 -3873574 10643962 24408247 24470582 10106475 725959
1173 725959 9990047 23435926 17487727 -7350116 -29347671 -36499596 -35918014 -33458526
1165 -33458526 -24149444 -8051086 2219226 -705723 -7459337 -8676884 -10662561 -21353231
1157 -21353231 -31184595 -24630449 -5523091 6338186 3404235 -638011 6587052 18310287
1149 18310287 20222914 10540174 542508 -296448 6161680 10150946 4362297 -7578330
1141 -7578330 -13396588 -5900731 7817544 15943504 17173591 17942867 17365258 7487755
1133 7487755 -10078105 -20953915 -17034852 -8059256 -7259881 -14366269 -20358585 -21654707
1125 -21654707 -21835734 -24971551 -33532889 -47138426 -58212657 -56344281 -42905707 -32936596
1117 -32936596 -35322565 -40153147 -34701952 -22824732 -17392832 -21495030 -29296431 -37858367
1109 -37858367 -44249608 -38263773 -15097757 9072041 12642742 -1496570 -10287397 -5714836
1101 -5714836 -5193163 -20515329 -36174609 -31634922 -11568067 1471670 -2344662 -10913144
1093 -10913144 -10036120 -1508013 1496665 -7998101 -21739155 -26151331 -20203848 -17637897
1085 -17637897 -27421337 -39243712 -37970359 -26650091 -21193136 -24947282 -25620791 -18893485
1077 -18893485 -16222307 -22334550 -23252840 -9028438 6578670 5037303 -8741498 -14533593
1069 -14533593 -7335856 -2146625 -9165863 -20173687 -23067866 -17780488 -12030694 -9172232
1061 -9172232 -6428309 -1563295 3390983 4870892 2864408 2274920 7085687 13137739
1053 13137739 11039374 -1653112 -15798750 -21615337 -19766375 -17149882 -16078507 -13933630
1045 -13933630 -11204833 -12994266 -21395834 -30244113 -29573465 -15537389 3707568 13830928
1037 13830928 9295710 770726 2255662 12342429 16369636 7594033 -3709739 -5934178
1029 -5934178 -1721693 -1974308 -11222261 -24635487 -33890350 -31646093 -16769293 224554
1021 224554 3585218 -10996313 -31834192 -45579071 -47761660 -37975139 -18289374 -1665844
1013 -1665844 -6208190 -30624743 -49192602 -43222382 -24205771 -12270681 -6730659 3339058
1005 3339058 12832549 9027103 -1828780 -1870489 7708287 8373895 -3670321 -12444277
997 -12444277 -12362060 -18050861 -36190317 -50620635 -46873412 -32212797 -19213330 -7090804
989 -7090804 6975070 13856071 6007491 -6578517 -9649548 -5347197 -5161376 -9546602
981 -9546602 -9386356 -3457725 -639154 -5908271 -14774198 -21314918 -23796213 -22599551 -18209423
972 -18209423 -10855005 49910 12915238 19972612 13819281 301280 -4688315 4150012
964 4150012 14125261 13610405 7229623 3743716 540930 -7802920 -15182060 -12515914 -4357842
955 -4357842 -2834355 -9229559 -14974042 -17332998 -20164966 -21450375 -14976461 -4904640
947 -4904640 -4528582 -17330021 -30678124 -32030435 -22206747 -10020648 -2847028 -5112988
939 -5112988 -16863502 -29946028 -33427942 -26562318 -19612694 -19133220 -20213041 -16958864
931 -16958864 -12525657 -12914856 -17214599 -20811274 -23987521 -30239448 -37961337 -40284324
923 -40284324 -33846938 -23524806 -16832291 -15811130 -16539491 -16434638 -19336071 -29867197
915 -29867197 -43147541 -46137681 -33698273 -19045061 -20778271 -39975109 -57279418 -54951341
907 -54951341 -36275574 -19306774 -14988858 -16807788 -12496600 -1769964 2323187 -8973163
899 -8973163 -25458986 -27175914 -8247743 15353563 24890768 19364014 11696679 9841547
891 9841547 9463258 3440411 -8501259 -19916464 -22736740 -12803443 5290935 19321711
883 19321711 19170188 5355018 -13677307 -29830709 -38556749 -38606637 -33420002 -28930981
875 -28930981 -25378677 -16049703 616883 14147151 15183448 9193363 6544518 4390301
867 4390301 -7828818 -27262447 -37641081 -32658513 -25205964 -27924005 -36247429 -37746555
859 -37746555 -29317585 -17886774 -10694710 -11211224 -19258545 -29547152 -34288623 -31378633
851 -31378633 -25890892 -20856186 -12217323 3545571 22063887 35115247 38003647 31052258
843 31052258 18799563 8836290 4956267 439150 -13596586 -31523973 -35608167 -19807410
835 -19807410 -333574 5177832 -778138 -4922315 -5786584 -13476056 -29961241 -42760333
827 -42760333 -40477716 -26175971 -12512720 -8759221 -14241975 -20569086 -18852199 -7362681
819 -7362681 6622711 13127141 7636847 -5882809 -17701590 -19299504 -12018563 -8179350
811 -8179350 -18153101 -36586186 -47763575 -44028075 -30741736 -13828764 5659184 22434002
803 22434002 26427274 17968621 10906491 12158339 10503069 -3677821 -19896598 -23058535
795 -23058535 -17519430 -19191934 -30479071 -40210177 -43993389 -46797846 -47428419 -38880770
787 -38880770 -25252486 -20753061 -28165638 -33967301 -29603873 -22820381 -21946238 -23286324
779 -23286324 -22177908 -23706368 -32192006 -39756207 -35974064 -22468937 -9234515 -2132558
771 -2132558 -1544249 -7257253 -16148323 -19559656 -11244489 4789744 20239303 32107982
763 32107982 40094438 39562766 26187764 5529334 -10402981 -15952914 -14785676 -11094213
755 -11094213 -5395470 93032 -550449 -9743718 -21756364 -29245816 -31607469 -32951733
747 -32951733 -33848816 -30363587 -21896642 -14561767 -13022614 -13026587 -8231062 -2209082 -5057758
738 -5057758 -17122395 -25780892 -22854146 -15791531 -14252866 -14661506 -8940586 -1369065
730 -1369065 -2771006 -11630724 -16005733 -13620435 -14670965 -22064778 -23748260 -10943221
722 -10943221 7448530 15341905 6054388 -15344355 -36683190 -42669771 -26110177 -161521
714 -161521 12342548 6949637 1740494 7380513 9738500 -5758487 -28148822 -36521748
706 -36521748 -30400921 -25536456 -26689064 -24709934 -17756878 -15726517 -22018552 -27430214
698 -27430214 -25594437 -21221035 -20063858 -22319028 -27684964 -35033740 -35709556 -20592639
690 -20592639 3001091 14935460 7754578 -3995290 -5758989 -1343399 -905608 -2790290
682 -2790290 372374 5536192 2890964 -7432922 -14410438 -12227781 -7755701 -9401912
674 -9401912 -15292059 -16529497 -8960745 1966913 7648781 5127180 -2081912 -10454003
666 -10454003 -19447642 -26582095 -25377756 -14344154 -4162474 -6971889 -19060949 -23624873
658 -23624873 -12770444 2366096 7768111 4426560 3131962 7308666 9792746 5092739
650 5092739 -2613049 -5427330 -1717071 2271826 256642 -5899779 -7864750 -1760367
642 -1760367 5796590 6345576 1028137 -3138077 -6183905 -14822827 -28027296 -33536415
634 -33536415 -24277154 -10045000 -5400301 -11625757 -18507815 -19936248 -19217074 -20642874
626 -20642874 -24102055 -28933757 -36499732 -46307986 -53591690 -53477500 -45969076 -35617950
618 -35617950 -27563238 -24613828 -26885728 -32594568 -38530293 -40737975 -37151265 -30618807
610 -30618807 -26911653 -27577119 -27252467 -21091067 -11944387 -5649585 -1989926 3415772 10135041
601 10135041 13445340 13393441 15091196 18940645 19065701 14017032 10615909 12885171 14665465
592 14665465 8967441 -865270 -5208567 -50641 9306205 13728543 7266107 -7661729
584 -7661729 -20682756 -23336479 -18836319 -16471979 -17298903 -14230855 -6686519 -3890870
576 -3890870 -10273714 -18570199 -22139118 -23323449 -24246998 -20892184 -13195722 -9434970 -12593029
567 -12593029 -13998829 -9155503 -7163572 -13955400 -19622127 -15360828 -9581002 -11754072
559 -11754072 -13631066 -5119780 3688258 -1365801 -10611148 -4281548 12510305 16141326
551 16141326 3147765 -6121385 -3551397 -3325820 -10511939 -9616357 4346669 11264865
543 11264865 -1790155 -17783097 -17393063 -8446064 -7616965 -11199939 -6916261 -573140
535 -573140 -6557190 -20630427 -25291146 -17197952 -8645793 -5246177 -1546065 3017922
527 3017922 2152283 -3250582 -5155385 -2903396 -3367304 -6903333 -7476147 -6454361 -11070631
518 -11070631 -18141245 -15126632 -1088959 8003487 797507 -14548821 -23119472 -20642347
510 -20642347 -12013380 -1934301 5394074 4235415 -6779828 -19654761 -23688210 -16494378
502 -16494378 -6430353 -5105645 -16655167 -31694662 -34086466 -18384086 1652519 7581893
494 7581893 -3143138 -17630284 -25160119 -25123573 -19657843 -10053283 -1756679 -2051973 -9424623
485 -9424623 -14227224 -13083262 -13851533 -22592629 -34053288 -39593021 -37289043 -30176495
477 -30176495 -21763001 -17290061 -21731352 -31562774 -35521172 -28521010 -17951763 -11368813
469 -11368813 -6082886 2189988 8319526 5175299 -2887939 -4355073 3149607 9563707
461 9563707 5548822 -7679637 -22049550 -30594049 -31024292 -26028209 -21459585 -21508104 -24882316
452 -24882316 -27313643 -27514721 -29152033 -37096527 -51952295 -67263122 -73171139 -66048437
444 -66048437 -53863653 -47346213 -45978169 -39172230 -22666998 -5778926 1936100 3634942
436 3634942 7757888 13402485 12272791 2994078 -5504904 -6084505 -2403932 -3384666 -12440283
427 -12440283 -24437640 -31566930 -30740540 -25453980 -21011269 -19656617 -21979931 -30010773
419 -30010773 -43352184 -53710193 -51408597 -38789013 -28585204 -25909251 -21548968 -8899346
411 -8899346 2808485 2064765 -6362580 -8994958 -4679033 -4386983 -12112176 -19966663 -23188293
402 -23188293 -26478189 -31653761 -31202469 -20502107 -7082715 -663192 -959398 -1910080
394 -1910080 -1830220 -2382778 -2301581 571063 3858740 3493410 37056 -2827949 -3945265
385 -3945265 -4032882 -1734749 4254213 10508868 11599588 6970916 561073 -5696891 -12888475
376 -12888475 -19556660 -20666269 -14254615 -5219407 -7637 -289054 -4126836 -10681676
368 -10681676 -20350006 -31365265 -39658248 -42558978 -40448895 -34401624 -24831268 -14056494
360 -14056494 -7734309 -10165020 -18364806 -24227481 -23723879 -20931721 -20982284 -22240026 -19449554
351 -19449554 -12849684 -8885820 -11085987 -14899220 -14235244 -9954451 -8362097 -12733390
343 -12733390 -19758399 -24315113 -24929376 -23673351 -22839544 -23348315 -25184785 -27160819 -26175454
334 -26175454 -19059038 -6868509 3921528 6939216 2671534 -2206067 -2232426 2318931
326 2318931 8043066 11668270 9413001 -2212584 -20695441 -35378576 -36321131 -24997456
318 -24997456 -12325499 -6499289 -6539514 -7153012 -5008253 494967 7830398 12706986 10453278
309 10453278 1067103 -10684064 -20859620 -28524357 -32194377 -29861131 -24734498 -24644287
301 -24644287 -31139938 -34632702 -26645482 -12648383 -5054275 -6185276 -7147735 -3025471
293 -3025471 708479 -690798 -3315557 -3214044 -4790508 -12508186 -19862747 -16796766 -6181756
284 -6181756 -2583490 -13057170 -28113968 -35413888 -34698672 -33673787 -35557084 -38277506
276 -38277506 -41802842 -47200287 -49527206 -40919396 -23004717 -8643815 -7172330 -13560738
268 -13560738 -16963010 -15177661 -14404145 -17771780 -21575089 -22660197 -22528460 -21995919 -17682603
259 -17682603 -8064967 638732 -47715 -10157492 -20286419 -21989008 -16008765 -9083170
251 -9083170 -5858123 -6582757 -10137229 -14716821 -15948808 -9724681 795341 5588953
243 5588953 -659089 -10736684 -13858503 -9669637 -6173865 -5122014 519783 11540223
235 11540223 15096792 464065 -24285821 -41051119 -43541095 -39879377 -35100252 -24106043
227 -24106043 -6036448 6247857 700214 -16144474 -26327359 -23262377 -17642971 -19885435
219 -19885435 -26115640 -26308698 -19676926 -14769550 -16715969 -21117234 -21225527 -16371149 -11575425
210 -11575425 -11881672 -18284156 -26418477 -28440381 -20123494 -8135941 -5823066 -17531687
202 -17531687 -30499058 -28136318 -10059822 6980132 8233527 -4474814 -18041750 -22214932
194 -22214932 -16211307 -6381339 -1079379 -4917568 -14738601 -22444679 -23037364 -18339512
186 -18339512 -13303435 -11999944 -16435282 -24112959 -26884630 -18754307 -5643460 151603
178 151603 -3151328 -4509952 2280800 9484849 10139500 10134529 15022756 15139412 -1105045
169 -1105045 -25147906 -36084489 -28913213 -19163226 -18413826 -20884921 -18524968 -14845892
161 -14845892 -16197238 -20585943 -23670907 -27164350 -32793421 -35090892 -29174436 -20491904
153 -20491904 -17797063 -19650019 -16744930 -6703666 1660090 760825 -5016917 -5207545
145 -5207545 2347639 8070684 3864229 -4266277 -3764719 4730060 5471181 -9368688 -25470818
136 -25470818 -25886911 -15757077 -12061908 -14646710 -7395041 11860896 24010165 17270207
128 17270207 3624982 -2996202 -7100954 -17214892 -26855958 -26200432 -20774380 -21121387
120 -21121387 -22823194 -14825312 -1376972 2737378 -4402366 -10746665 -11178814 -12510675
112 -12510675 -17009403 -17337736 -10990333 -5476769 -5114998 -5079081 -2435412 -1376615 -3469121
103 -3469121 -4068755 -2847466 -6549085 -15798865 -20130715 -13159537 -3119304 -407853
95 -407853 -2906337 -2490258 495145 -826182 -7107053 -11415393 -10053143 -7423581 -8860116
86 -8860116 -13299286 -15090524 -11213860 -5155862 -3063474 -6125716 -8796614 -6254249 -981284
77 -981284 1346729 -169440 -2325098 -3960814 -5948178 -7212757 -6931548 -8621329 -15102613
68 -15102613 -21344795 -20181086 -13639197 -10265890 -12773685 -17411877 -23313124 -31084247
60 -31084247 -33891781 -24173880 -9846491 -8111509 -19946129 -27369536 -21757742 -16924010
52 -16924010 -24225193 -32475424 -27535589 -17100972 -17603036 -26782231 -28749132 -19925970
44 -19925970 -10881557 -6148956 -1041262 2839342 -2539683 -14958285 -22060858 -20756746
36 -20756746 -20625831 -24783274 -23727154 -13699272 -5334243 -6163671 -8750734 -5479605 -1954104
27 -1954104 -4703596 -7518810 -3180724 966769 -5924358 -18423662 -21914877 -15719070
19 -15719070 -13026839 -18316559 -20789551 -13478579 -4682994 -4335306 -10541492 -16989676 -23972994
10 -23972994 -33223767 -39391056 -36810141 -30213415 -28862935 -32495072 -32420573 -25507077 -17788297
1 -17788297 -13531169
0 -13531169
$$ Imaginary data points
##PAGE= N=2
##DATA TABLE= (X++(I..I)), XYDATA
65535 -16935301 -14320868 -7642765 -501598 3812971 7112636 11729175 16353649 19315033
65527 19315033 20653513 18141222 7641550 -8430266 -19634774 -20217789 -17239031 -19355519
65519 -19355519 -23618255 -21982522 -15521535 -11408512 -9320621 -3110525 5241468 6629660
65511 6629660 1355338 1252567 10634620 17663543 12364533 2588732 1849766 8873156
65503 8873156 10802186 2872198 -6297731 -8423416 -5012766 -1464941 688742 1969594
65495 1969594 69807 -8167350 -20018518 -25688845 -17613117 -1543196 6186257 -3286785
65487 -3286785 -19574203 -25702944 -19615522 -14042517 -16426625 -20756289 -21145951 -20576705
65479 -20576705 -20681345 -15325219 -2955647 5477724 1486388 -6938867 -7503993 -1873265
65471 -1873265 598506 307689 4319853 10704770 11125760 6834449 7275470 13207999 15496794
65462 15496794 11526551 8957818 11210673 12630701 10904862 11102874 13732574 12062779
65454 12062779 6225672 6618767 16448763 23511124 18044596 7628862 4286312 6274108
65446 6274108 4015880 -2958036 -6730615 -4440821 -654031 1172311 1126973 -909645
65438 -909645 -4076386 -4013568 1736355 8399150 10292309 9400733 11258101 15713746 18889411
65429 18889411 21059214 24486684 25602177 18117625 4032931 -5881431 -3926807 7089748
65421 7089748 18297932 22306418 17303809 8447879 4562844 9545080 18363555 24627824
65413 24627824 28470897 32359045 33884318 29805442 23321973 18991245 13631001 1953794
65405 1953794 -10822272 -13031004 -3472252 6370846 8488455 6348942 4679016 2494408
65397 2494408 558976 4749618 15271342 21837557 17486236 9534275 8500303 12906690
65389 12906690 14217528 11143504 8740469 7237334 2862899 -1726070 1189994 11580737
65381 11580737 19738971 19633449 16063287 15036533 14075058 7213254 -4750723 -14293125
65373 -14293125 -16197229 -13463348 -14084052 -22101564 -31290635 -29764317 -13619624 6465547
65365 6465547 16801306 16321778 13985138 12691854 6146468 -6321110 -13123698 -5751163
65357 -5751163 7343359 11247214 4022807 -3468991 -3880850 215438 5118681 11235564
65349 11235564 17619036 19387003 14100861 5305255 -2771047 -9039904 -12276593 -10115040
65341 -10115040 -4635362 -3236211 -9058141 -14717462 -10980163 1004839 11462135 14448252
65333 14448252 13276518 13527756 15415110 15041733 10695490 5484757 3697394 5554689
65325 5554689 6782898 3900204 -1680556 -6504285 -9846549 -12109922 -10614083 -3119324
65317 -3119324 4727089 3114664 -8295158 -17798868 -16833614 -10563348 -7615790 -6625414
65309 -6625414 -1646882 4701085 4431681 -2144804 -7243348 -9584324 -15826048 -26008294
65301 -26008294 -29404960 -20447167 -8907966 -6376394 -9935823 -8487903 -547491 4510777
65293 4510777 1716132 -2706828 -1966810 1537287 1702677 -720501 994418 8919989
65285 8919989 15762854 13156599 2437466 -6012576 -4295285 4776315 12293176 13777793
65277 13777793 12387383 12664183 14449815 13993404 9252234 2895237 399286 4974797
65269 4974797 13721167 19531420 17988858 11929333 8300310 11136578 18120497 22946918
65261 22946918 21035249 14969767 13880534 23311137 35126177 33486753 13907684 -9692666
65253 -9692666 -21541734 -21186332 -17584791 -13050477 -3884269 6903964 10453622 6200463
65245 6200463 3548814 6632541 7841591 1159440 -6956682 -6358138 3061672 12373810
65237 12373810 14791375 11370147 7679805 7430176 8519236 6160284 1585087 3092264
65229 3092264 13038302 19901624 13441939 2482513 3146059 12298253 11100004 -3631448
65221 -3631448 -12620048 -5905296 -352424 -11907158 -28481654 -28690316 -14239368 -3426651
65213 -3426651 -1387474 2029073 9300878 11001670 4628340 -224911 2017547 6112772
65205 6112772 7752362 9378702 11888909 12002685 10220310 11284649 15138754 16669660
65197 16669660 14671955 11691029 6336537 -2956026 -7961382 1772073 20418999 28748365
65189 28748365 18356076 539149 -11520899 -16102982 -15103868 -7398348 3382122 7027585
65181 7027585 591972 -5880547 -4096369 1658773 4465563 5309372 6863780 6678206
65173 6678206 4056110 4599782 10437373 14627493 12431235 9062504 8819037 6296667
65165 6296667 -2733771 -11002598 -10216111 -3789733 582230 3047200 6200109 5851928
65157 5851928 -1255797 -7712515 -5587661 -92593 -725043 -4670067 -2433626 4866694
65149 4866694 8157385 6894261 8042140 10417159 5343639 -6553003 -13792445 -11710030
65141 -11710030 -8664801 -11304837 -15401564 -15275727 -11925741 -7878375 -3403642 -1238806
65133 -1238806 -5624354 -13111617 -13716071 -4987482 4486365 9545769 16032453 27977013
65125 27977013 37177558 34078692 21985336 11804654 7538507 4982561 1219842 -2379739
65117 -2379739 -5005725 -7906878 -11149824 -12537264 -9301833 457719 15452872 29218430
65109 29218430 34687775 32680340 30982549 32515165 30169866 17477631 -918842 -14567641
65101 -14567641 -18630631 -14824791 -5346260 7461029 17931730 20462711 15933717 10115299
65093 10115299 6080211 2028429 -3887299 -9927750 -11788941 -5734913 7285918 19138464
65085 19138464 19981906 9560336 -753326 -1411281 3603197 3916769 -1843874 -4978010
65077 -4978010 176830 8945358 12552875 6290316 -8518329 -25095482 -33389897 -27601360
65069 -27601360 -13302640 -2659050 -1482142 -5284127 -8256875 -9982913 -11435186 -10786549
65061 -10786549 -7225157 -4201408 -4362066 -4453593 612567 10753384 20702433 24716162
65053 24716162 19519470 6717302 -4909559 -4823982 6499681 15045815 10189691 -35914
65045 -35914 630894 13613889 23797213 21576016 15099402 15986098 22998255 27381611
65037 27381611 26500851 22828298 15104684 1751012 -9232343 -5782492 10579584 22253261
65029 22253261 15282571 -5045688 -22686241 -28811260 -25451406 -16030944 -975930 16761791
65021 16761791 28816354 28674006 19881166 12880148 12713214 13008381 5417120 -6832328
65013 -6832328 -10673865 -77567 14839949 19997930 13641912 4557910 -1200891 -3533779
65005 -3533779 -1824964 4202209 8341401 4017787 -2906627 63743 11143956 13573978
64997 13573978 1648343 -8054736 -2303434 6311685 -1399553 -20199770 -28439007 -21731751
64989 -21731751 -17265698 -24223797 -30987734 -27687254 -22770329 -26583517 -32918353 -29908477
64981 -29908477 -19512833 -12749825 -11411249 -7373016 2268942 10595428 11632436 7057594
64973 7057594 780305 -6615664 -15801211 -24977527 -30036367 -27304255 -17077200 -5654498
64965 -5654498 -1082029 -4301983 -7427374 -3808316 3682544 8448350 10377028 14064075
64957 14064075 19135895 19820352 14567098 9134257 7511939 5474331 -2297460 -12083619
64949 -12083619 -13883381 -4415161 7382177 10509845 4678998 -1341729 -2990728 -5065831
64941 -5065831 -10863699 -12846915 -1855596 17441711 29875557 29283489 25409046 28004108
64933 28004108 32966370 30616699 20692442 10692511 3625451 -3506449 -10590426 -12508385
64925 -12508385 -7583315 -1394114 142418 -2555148 -4517521 -1829285 5051407 11113419
64917 11113419 10523610 3531636 -1385751 3832295 16548971 25881975 25425552 19512965
64909 19512965 16497171 19882656 27073823 33108681 33844309 28101233 18615176 10039298
64901 10039298 5726292 6772502 12043622 17158163 16693884 11676547 11901981 24276096
64893 24276096 40161192 42175433 24657574 -147696 -18384226 -28797727 -36402519
64886 -36402519 -40623046 -38223446 -32548167 -29416705 -25531025 -11739269 9991617 22670120
64878 22670120 13778601 -7097598 -17918799 -9634125 5082535 9062130 -104563 -11470419
64870 -11470419 -16058793 -14219279 -9372160 -2198038 5903409 9299172 4019018 -4947107
64862 -4947107 -8136980 -3509386 1330049 19171 -4511057 -5737996 -3019134 -964993
64854 -964993 -2011439 -4683990 -8165093 -13174673 -17675601 -17039788 -11096768 -6620653
64846 -6620653 -8552657 -11686483 -6754427 5849876 14691484 11994196 4562451 5145128
64838 5145128 15510669 23985206 20175082 7079229 -3829801 -6191199 -4120914 -5480430
64830 -5480430 -12929491 -22031910 -26640639 -25269447 -21791103 -19572974 -16364282 -7626632
64822 -7626632 5477475 15629738 18691897 19277513 23117375 27283763 24065367 13475873
64814 13475873 4963032 4849790 8154593 6667284 203697 -5626541 -9340686 -13925092
64806 -13925092 -17867923 -13782714 803423 17052404 24098085 21447448 17554365 18672626
64798 18672626 24076125 30095439 32862642 28342743 16744496 6988620 8750592 18154739
64790 18154739 20068087 8650322 -3658828 -4716871 -1150573 -6902546 -19506473 -22592242
64782 -22592242 -11479417 -1704218 -7539199 -23242895 -32190792 -26816919 -13159770 -1344805
64774 -1344805 2866182 1295392 2001340 10392233 19496763 15478515 -4304072 -26252079
64766 -26252079 -37310083 -38328673 -35659632 -29464640 -19063195 -11163748 -11357645 -13159873
64758 -13159873 -7091396 3348894 6192271 -1560670 -12229530 -20233784 -24333210 -19588206
64750 -19588206 -1765988 19502660 26825272 17993724 9324148 11362618 15314481 11239070
64742 11239070 5736516 9071185 14979922 8890897 -8096604 -18543883 -12647817 -588659
64734 -588659 2692458 -4072518 -10388699 -8352579 332319 8330005 8752146 -860740
64726 -860740 -15503889 -23469116 -15253047 5246798 21857884 23135543 16384838 18503924
64718 18503924 32972585 44227823 38587060 22624792 13506532 17264284 25879324 31425458
64710 31425458 31953517 25301982 9459062 -9164279 -18659192 -16192492 -10803541 -9075358
64702 -9075358 -7706579 -3827269 -2096983 -5598474 -9229794 -9380050 -11508169 -19766935
64694 -19766935 -27019819 -25080632 -18521679 -17304515 -20271338 -17976977 -9775347 -5534918
64686 -5534918 -9215507 -12387705 -8506148 -4327288 -9949171 -22615522 -28197423 -18155911
64678 -18155911 849852 16254428 24360990 31115610 39340720 42490136 35538719 26053534
64670 26053534 25586779 32643686 34998223 29411666 26641295 32142753 34082553 20118673
64662 20118673 -2703805 -16326581 -14764690 -7563265 -3272732 -970624 1899158 3529066
64654 3529066 2028263 -1359724 -5462153 -10371394 -14251993 -13902000 -10159319 -9189774
64646 -9189774 -16580051 -31090923 -43971941 -44951338 -32557063 -18919532 -18372661 -29412507
64638 -29412507 -35808737 -29298809 -20984065 -22398424 -25729577 -15910732 4404314 17347940
64630 17347940 15088903 7882541 6151008 7958030 7543681 5258852 4613390 7234907
64622 7234907 13389664 20618530 21145883 8763412 -10678291 -23615343 -24392568 -19031503
64614 -19031503 -14293510 -12312192 -15188606 -23692219 -31019556 -29641092 -25067623 -29468648
64606 -29468648 -39811506 -37950407 -17742369 3506594 9145855 4548558 3625748 6704910
64598 6704910 5539569 1240751 2281233 8920946 12260694 7074776 -3629497 -14731717
64590 -14731717 -22210291 -23128704 -18922941 -15091697 -12125238 -2460465 16838904 34956052
64582 34956052 39496056 32282463 24095143 18921439 13140633 5801565 -685681 -6896585
64574 -6896585 -13714279 -16512941 -11731179 -5810282 -6977885 -11155392 -7792023 2070549
64566 2070549 6220173 175323 -6467028 -4919278 2109861 7599722 8811102 5574953
64558 5574953 -1503096 -7635131 -6112110 2375493 8606846 5580421 -4896595 -17149712
64550 -17149712 -26434173 -28003706 -19668079 -8038294 -4625265 -11985220 -20302717 -21616153
64542 -21616153 -20980567 -27907785 -40840501 -46370054 -34284607 -11191563 2517045 -7614300
64534 -7614300 -32108309 -44888121 -33490580 -15261665 -14310502 -28568742 -33994018 -19221632
64526 -19221632 987552 9779457 8557513 5460830 -962826 -13582859 -22870283 -16602092
64518 -16602092 888226 12176405 8391593 -2665608 -9597420 -9584230 -6390073 -3449060
64510 -3449060 -1581788 117766 2507842 3808279 -298084 -11853958 -27218702 -40286811
64502 -40286811 -47502576 -48626805 -45203391 -39426188 -31723471 -19475441 -2448785 11380024
64494 11380024 12966053 6046658 4344033 11312588 12979513 -1933616 -23744560 -33180330
64486 -33180330 -24705434 -8915196 3266672 8820989 8930044 7228324 9539452 16307938
64478 16307938 17574007 4476778 -16584308 -30699114 -33131417 -31100808 -28896879 -23246087
64470 -23246087 -14044695 -7851393 -7940982 -10817707 -14822106 -21659242 -26463125 -18297214
64462 -18297214 2966319 20190665 17844573 808493 -13226550 -14788581 -8530082
64455 -8530082 -2198639 2135269 6268317 10456737 11004229 3214654 -11074737 -20591725
64447 -20591725 -15652909 -1916188 5627493 3930572 5801104 17293036 23810961 10113350
64439 10113350 -14824936 -27314883 -19247721 -4977160 837412 -1399441 -4729106 -6878285
64431 -6878285 -8106357 -7187097 -4813346 -4137518 -4147260 201766 7232623 6022356 -9176630
64422 -9176630 -28752696 -39203088 -39184502 -35947838 -30616927 -17939301 -2045 10621565
64414 10621565 5451965 -8552831 -16106911 -8195892 12294391 34480857 45883672
64407 45883672 39631784 20160334 -156166 -12870744 -19239311 -21904932 -16626897 547969
64399 547969 21036962 28398772 17108813 -851770 -10971721 -10456206 -3352759 10095529
64391 10095529 29929910 46924589 48380016 34974824 22749786 24485807 35589799
64384 35589799 42487765 39193164 30179915 21163151 13562354 6496680 -1151264 -10078520
64376 -10078520 -17713904 -17235007 -4838875 11776673 17975633 8005890 -7466947 -12956122
64368 -12956122 -5101688 5371973 7708116 3352995 2568730 10949242 22412104 26281313
64360 26281313 18694673 4306946 -11504956 -26949914 -39235534 -41718776 -31224497
64353 -31224497 -15528503 -7074408 -9010065 -12855739 -11076980 -6413598 -5940718 -10848513
64345 -10848513 -16947277 -22269121 -28003318 -31720939 -25254838 -3142904 27989907 51395371
64337 51395371 53247662 34391632 9321333 -6615338 -9160811 -5183022 -3132332 -5503968
64329 -5503968 -9442588 -11153135 -8639510 -2662067 3528237 7136718 9239488 13032043
64321 13032043 18334175 21464332 21687085 22829890 25655544 24540570 17468681 13624404
64313 13624404 21272014 30540783 20552936 -13311888 -49895522 -65923024 -60528756 -48714283
64305 -48714283 -38722782 -27782751 -16250117 -11810030 -16894440 -22654208 -20737240 -13704609
64297 -13704609 -8469882 -5799678 -2913662 -1676284 -6005339 -12766098 -13237012 -5178899
64289 -5178899 2487119 166820 -10711781 -19639135 -18871133 -10597743 -3075757 -2263507
64281 -2263507 -7852561 -15528821 -21108129 -22625099 -20294980 -15666767 -10223737 -4327906
64273 -4327906 1500060 4460091 1744385 -3575351 -3209152 5487217 13059563 9146065
64265 9146065 -2331962 -8264726 -6272635 -8018284 -18914999 -26649950 -18672294 -1531988
64257 -1531988 8707871 8449032 5866741 3137807 -4946900 -15096537 -14341508 755101
64249 755101 16703865 21037820 17100729 14714543 15825603 16412481 14232441 7837007
64241 7837007 -4198219 -16778547 -19851449 -13177872 -9352935 -13915710 -14579155 -2315008
64233 -2315008 9298117 3217049 -11957434 -13164721 1730053 12718798 11072113 9218758
64225 9218758 12394943 5586056 -19086791 -43114144 -46301847 -34991492 -28247008 -28518376
64217 -28518376 -24671964 -14811076 -6567537 -396191 8553958 15183768 9317019 -5296333
64209 -5296333 -13933376 -12619512 -10221462 -9038429 -1989141 8528748 9098701 -884750
64201 -884750 -3232242 10814646 23777394 16999096 -1821997 -11737590 -8028017 -2071796
64193 -2071796 -162446 384381 -481994 -4183038 -3932860 6624028 17105314 10267508
64185 10267508 -11144362 -25019932 -20708274 -11924223 -12670139 -17279504 -14974296 -9916275
64177 -9916275 -12502786 -20034688 -20950201 -13449013 -6346572 -3607050 -389810 5565354
64169 5565354 9666375 9418033 8486480 8994368 7398854 1845911 -2288866 1159362 10447712
64160 10447712 17484449 16656302 10005530 4763800 6914485 16031110 25451152 27854690
64152 27854690 20801053 7391128 -6169156 -12796390 -7901141 5863841 18801246
64145 18801246 22487854 17504478 11431174 11312259 19713742 34032066 45619732 43559229
64137 43559229 25600252 3743133 -6499389 -1112777 12374481 25943474 34883093
64130 34883093 34040571 21140607 4637478 -1698076 4914901 13169877 13259311 7345261
64122 7345261 1554543 -3551301 -9614386 -15242637 -19441296 -23669062 -25949993 -20428787
64114 -20428787 -8044974 323118 -2120734 -8474207 -9370431 -5802127 -2937344 166604
64106 166604 4973151 6180121 1523865 479667 9537123 16967987 9208231 -4211673
64098 -4211673 -2690366 11768845 16309886 4065817 -5794244 -1955580 244337 -12487914
64090 -12487914 -26639047 -25378117 -18793255 -26868468 -44131695 -47021140 -31058468 -15302533
64082 -15302533 -9900367 -3494561 11954897 25506614 25955963 19104129 15181508 12649533
64074 12649533 6485026 1612028 5116631 12937265 16987939 19431822 26698850 33861811
64066 33861811 30185514 19618194 19610732 34353731 43322918 27300827 -2932440 -17369606
64058 -17369606 -3797397 18871407 26683318 18378174 9832249 9714914 12687579 14019102
64050 14019102 17719874 26319708 32799106 29984356 21583410 16028264 13624834 8362994
64042 8362994 298779 -3050556 1464522 7192167 6858497 1721310 -1292683 2270034
64034 2270034 11121922 19641817 21100044 13011206 542141 -8848565 -14586029 -21950149
64026 -21950149 -31019339 -33578963 -25367256 -15552210 -16790895 -28149130 -35299662 -28673583
64018 -28673583 -15524855 -10550983 -17615074 -25084913 -19657597 -2096221 12717914 10776449
64010 10776449 -7458347 -27905799 -35302401 -25013546 -5596214 8913175 11595671
64003 11595671 8936197 12202309 22243038 27982408 22338083 12800457 10167007 12907555
63995 12907555 12074972 7811449 8813421 15031699 13434833 -3683282 -25267034 -33453914
63987 -33453914 -23895099 -8522265 -1620861 -7449487 -18653561 -23488125 -16819764 -5388975
63979 -5388975 790112 1514141 4737449 12066492 15241564 10261539 5310185 8219154
63971 8219154 14192337 14289606 10037291 10228984 16404021 20167437 14308588 787703
63963 787703 -11711324 -14964846 -8539224 -2265956 -6645353 -18559408 -24042630 -18726005
63955 -18726005 -14780479 -20121068 -22987416 -10751817 5517132 3465042 -17311688 -32911208
63947 -32911208 -27020762 -8745176 4452320 6195470 -1260536 -13948989 -22749216 -15717958
63939 -15717958 5979787 23393816 20803453 4928079 -5190239 -1089817 11263804
63932 11263804 24712801 36688381 43392822 39003765 24206587 9941257 8309880
63925 8309880 19985692 31812564 28541857 9022780 -10440142 -12507697 2001318
63918 2001318 15760560 15178080 3055742 -9335574 -15679394 -17423673 -18911175 -22696371
63910 -22696371 -25747669 -19930825 -2174000 16199179 19185078 6614096 -5380118
63903 -5380118 -7659138 -9645493 -20414011 -30350114 -24200692 -5077320 8392868 6418925
63895 6418925 -2350071 -5506667 -1137760 4560917 6815952 6670390 8844369 15450266
63887 15450266 20946103 17146787 5347888 -2748810 -275071 6083913 8426723 9548580
63879 9548580 13211549 12009720 -918744 -14732722 -12601430 2278380 10853868 8803904
63871 8803904 12580668 29159096 40378180 30408687 12431341 10086599 22431252 27115467
63863 27115467 14881441 1554938 2914168 13854936 19830574 17258404 13081661 11394970
63855 11394970 10564052 10210123 11651479 11864320 5276484 -6655178 -14538474 -13007093
63847 -13007093 -8018072 -7788149 -11021400 -10001738 -2490546 6051698 10941160 12447137
63839 12447137 11638523 8642005 5867144 6435118 7880905 4040402 -4690600 -9861549
63831 -9861549 -6410478 1618673 9756583 18684145 26250885 23965826 10185532 -1517510
63823 -1517510 1728337 13431120 16557069 7088973 -3365347 -6437736 -5880301 -6788790
63815 -6788790 -6956414 -1745625 9774922 24278976 33558308 27213574 5155819 -15497945
63807 -15497945 -17804712 -7637577 -5563933 -16621118 -24166288 -16742012 -4170234 266557
63799 266557 -1622288 -2018785 -1449248 -2412135 228132 9541309 15950375 9802657 -1974487
63790 -1974487 -5064288 1406328 6539232 6370630 6808696 9336491 8018157 2469720
63782 2469720 1145015 7608010 13694636 11638223 5582790 5700856 15873296 31585001
63774 31585001 46228164 55390382 56941532 50135082 35082905 13703330 -7908584
63767 -7908584 -20734873 -20602342 -13949064 -11667393 -16822835 -21772209 -17952599 -5757500
63759 -5757500 6115199 9538411 4757496 -283021 1068565 6808323 10548502 11573420
63751 11573420 14511728 18571535 15643330 3351287 -8105198 -8989359 -3167022 -78728
63743 -78728 266295 3950213 9175744 7994621 1351964 524143 10935192 23972169
63735 23972169 28752608 25014583 20485357 20536305 23702656 24343241 18462191 9205629
63727 9205629 4920221 7826010 8093721 -3592228 -19994873 -23160759 -6516984 17426376
63719 17426376 32272000 32352557 21514111 6701794 -4863112 -10376114 -15353769 -25127844
63711 -25127844 -32997453 -28582621 -18469696 -22134089 -41430474 -51970563 -37347321
63704 -37347321 -15925849 -14801725 -28270573 -25699263 2889017 33722237 45724277
63697 45724277 46891306 52655108 56613443 41360119 9119163 -17474882 -23660523 -16240354
63689 -16240354 -7631804 -331647 7495593 12778547 12985353 13613421 20508564 28669793
63681 28669793 28429501 21070167 18185183 24571336 31610355 31062794 26222388 23564219
63673 23564219 21505648 15862489 10473283 12186377 18243800 19066542 13034136 8375113
63665 8375113 8879673 7455691 -2100422 -14807815 -21571634 -21569532 -22449650 -30925703 -46209624
63656 -46209624 -59937262 -60950325 -44637849 -20303532 -4914413 -5996845 -14190891
63649 -14190891 -15905793 -9413448 -3924657 -5417430 -8806814 -4754141 8658934 22828054
63641 22828054 27834412 24417415 23706694 32778909 44688051 48262266 43773729 40053270
63633 40053270 38163472 29606712 12648852 -1140771 -1659876 7870022 18758687 26652363
63625 26652363 27665241 16341361 -2523609 -9971864 5829272 30042942 36041346
63618 36041346 16926081 -9420328 -24029621 -23267106 -13060528 -391422 6993795
63611 6993795 3905096 -4526645 -6176996 3357520 15541395 20528947 17671050 12299867
63603 12299867 8040878 4901731 898421 -5304037 -10161426 -6146351 7487102 18749821
63595 18749821 16884377 9272102 12376641 26702280 34995915 27822459 15832412 10377693
63587 10377693 6703902 -3039356 -12277999 -9374681 2980726 11620185 12064511 11136128
63579 11136128 12825756 14126999 15059226 21323043 34343198 47223201 53114596 50864174
63571 50864174 41384157 26346654 12442512 8444767 13779650 17081862 11331707 4181161
63563 4181161 6370256 14612378 15130044 3480615 -8087187 -6311449 6610140 17811130
63555 17811130 21174363 22604495 27869556 32450129 27759485 13515110 -1132828 -7484111
63547 -7484111 -4703292 1023647 1097042 -9364356 -24674951 -29633723 -14431990 11410810
63539 11410810 27329255 25099383 15999030 12372439 12008196 7396771 1639118 4141657
63531 4141657 14264514 20200231 14283197 906052 -11897847 -21167556 -26722404 -26179383
63523 -26179383 -16578207 774938 18686704 26843089 18472903 -2143411 -20491988
63516 -20491988 -24934480 -18460305 -12977441 -13117993 -11890358 -2931137 9430135 15303662
63508 15303662 10329145 -1002370 -10341968 -12062318 -7051607 -857503 3265509 7728369
63500 7728369 13895874 15215898 4042161 -15431853 -28951158 -28268874 -18253157 -6824011
63492 -6824011 2986817 7531623 -116701 -18703278 -32158401 -25431166 -4106763 11344590
63484 11344590 9717159 -1389885 -10017471 -14347336 -19470041 -26765136 -31883278 -30550886
63476 -30550886 -22897068 -13249767 -7203839 -7488678 -11721417 -15211116 -15812407 -14517365
63468 -14517365 -12112335 -8027936 -2697092 1445366 2285202 279462 -1776140 -869546
63460 -869546 3131495 5870460 2274103 -6646941 -13597477 -13693299 -10025751 -7783879 -7073413
63451 -7073413 -5971248 -6258809 -9774055 -12832322 -12136874 -13234560 -23362686 -37226072
63443 -37226072 -41226758 -33154097 -25787575 -26825756 -27116641 -16500239 -1349344 4241470
63435 4241470 -1502059 -7674933 -7122920 -3199429 -1247965 -2188604 -5247495 -10390402
63427 -10390402 -16921448 -23846655 -31095248 -36928728 -36666446 -28488641 -17358553 -8050228
63419 -8050228 1447360 12787187 18649276 11446087 -2403723 -8763641 -5814506 -5602235
63411 -5602235 -14325798 -23998173 -27584316 -29629520 -35142089 -39347833 -37135805 -32838761
63403 -32838761 -30746884 -24778237 -9478535 5760011 7481587 -546048 -1422735 9798072
63395 9798072 19273835 15549038 4614368 -2286646 -5330957 -11952988 -22841461 -31446186
63387 -31446186 -34408858 -34198234 -31980723 -25154887 -13964571 -5462199 -6947826 -16735536
63379 -16735536 -24258345 -20003774 -4212458 14826300 29449571 37204200 37797164 30601671
63371 30601671 18219997 8466482 7039609 9396856 5759145 -5363344 -14558496 -14545844
63363 -14545844 -10136136 -10748710 -16933250 -20231561 -15194702 -5885119 277099 164478
63355 164478 -5635428 -16209750 -28292951 -33597470 -25301876 -8761909 452458 -6442265
63347 -6442265 -20896977 -29056598 -30008506 -33105773 -39133457 -36730534 -21447869 -6026610
63339 -6026610 -2255608 -1940420 10687323 32354803 41741935 27906303 4220548 -9985550
63331 -9985550 -10142111 -3556972 2857069 3662032 -6849353 -26195054 -38832157 -31142628
63323 -31142628 -9210499 8220541 13064375 13737515 17646412 19819923 13921175 5027362
63315 5027362 3166148 9023136 14230764 14261360 13906618 18900309 27238059 31580919 28046344
63306 28046344 20174909 14542641 14119793 16960066 20659781 25396509 30743639 32202461
63298 32202461 25736246 15461510 11007648 15053206 19188136 16306226 11465023 13413404
63290 13413404 19482474 18805270 9945176 4463867 9704126 18042485 19478786 16146106
63282 16146106 15190649 13910098 4033976 -11713308 -20012877 -15718617 -9368532 -11667406
63274 -11667406 -19169894 -20973799 -13017397 88478 12107073 18089293 14699939 4154387
63266 4154387 -4775159 -5310823 -486932 1790246 -1119491 -5809732 -9051420 -9282306
63258 -9282306 -4340643 6058733 16566625 20408673 16850092 9992365 1751476 -8307069
63250 -8307069 -17213573 -19366217 -14092029 -7199176 -3829041 -4235128 -7320517 -13093928
63242 -13093928 -19419639 -20741205 -13807593 -3279769 1082306 -6197017 -19611476 -26612929
63234 -26612929 -20836757 -10669495 -9804679 -19071220 -25341357 -21432437 -17197923 -23021969
63226 -23021969 -31431171 -27545729 -12231313 -414963 1775185 3452330 11255519 19136065
63218 19136065 19915009 15352177 9985674 5122480 3214468 7854652 14723804 13339646
63210 13339646 3771974 717027 12967583 28610720 30313526 17685038 4264514
63203 4264514 -2080648 -5490694 -12042135 -22132707 -31555839 -34281056 -26168834 -10210691
63195 -10210691 4814572 13753472 18545855 20410404 16412988 7762537 2576288 4246964
63187 4246964 5446818 367747 -5900317 -7608295 -8103705 -10241324 -7789001 1355130
63179 1355130 3509031 -13310490 -37232386 -45489963 -36204249 -29544264 -37316360 -48444018
63171 -48444018 -47965601 -35850085 -21738198 -12443478 -9814194 -11752642 -10840040 323265
63163 323265 18574201 31120270 29342140 16548320 2125410 -5781742 -3036046 7039913
63155 7039913 13464616 8714783 -625491 -2073663 5471652 11297026 7941680 -2692695
63147 -2692695 -16417999 -29630230 -36467725 -33491371 -25940867 -19856204 -11983013 671641
63139 671641 7181046 -4471820 -24548671 -31255171 -22323180 -15489408 -16373319 -10396286
63131 -10396286 7410586 20169284 18302148 16984415 28286381 36898809 23772492
63124 23772492 -2180430 -17252791 -16084713 -11532818 -10995702 -12556091 -17069651 -24827446
63116 -24827446 -26079211 -13277582 2315662 4251761 -3605170 -3770963 6472792 13191716
63108 13191716 10866744 9109035 12514366 12971282 7009625 4342135 12177844 23481475
63100 23481475 27054343 19780236 5226158 -10409273 -18434010 -13773421 -3598399 -573648
63092 -573648 -6049549 -9963216 -8118624 -7199672 -9717994 -6645298 9067897 31273919
63084 31273919 48390674 54666042 50206997 38202927 25664268 18892978 15472852 8878437
63076 8878437 1897520 4203233 14428001 18363587 10496115 3363067 6692292 10418632
63068 10418632 1021814 -15429310 -21569948 -14165734 -5969944 -4266966 -2361743 5532175
63060 5532175 13639914 14215906 8671795 2456617 -5009734 -17487370 -31679494 -37811059
63052 -37811059 -31663688 -20001165 -11141113 -5515370 -409382 1525382 -2301200 -3517895
63044 -3517895 9438620 30237397 35625185 15480278 -10876144 -20077953 -14779735 -12534043
63036 -12534043 -14575194 -7620642 6428066 6930706 -13837742 -35831657 -37829830 -23336824
63028 -23336824 -9403631 -2716165 1037482 3353410 858964 -7231308 -17485936 -24540973
63020 -24540973 -21865562 -7533578 7944070 9699100 -1240137 -6998001 2620018 17456149
63012 17456149 25685792 30387161 36799369 37656435 26190221 12338458 9540709 13990903
63004 13990903 13356456 8404566 8370394 11011562 6489889 -2054786 -1158470 9866270
62996 9866270 16385617 10677420 673527 -5280787 -6843601 -3092185 8006362 18112434
62988 18112434 13081443 -5299957 -17297264 -11424522 1685370 8371203 9785655 11478091
62980 11478091 9780159 1168047 -6143798 -3715751 1852543 -1891173 -14411554 -24209464
62972 -24209464 -25271284 -20946038 -15300875 -10523470 -9435940 -11174425 -7778291 5537004
62964 5537004 19964415 22648257 13996162 5735444 3946033 4247392 2600745 456804
62956 456804 -933752 -1693074 1336779 10475328 17776338 10630967 -10262092 -28402710
62948 -28402710 -31038204 -22506727 -13898266 -8516539 -3863012 -307254 248925 -145791
62940 -145791 1950398 6448893 12041531 19287453 26746388 28953236 23861575 17606251
62932 17606251 15810915 15119871 10352485 4547834 2435550 -1517562 -16147136 -35725987
62924 -35725987 -42115427 -27750203 -5588587 8092794 10997036 9773816 7480137 3923474
62916 3923474 1291924 731971 -2179426 -10927679 -20700493 -24474390 -22911042 -21160247
$$ [...]
##END NTUPLES=NMR SPECTRUM
##END=
