##TITLE=31Pdec_LR-664-R3-RM3
 CH2Cl2, 24 sc
 1.4.2019
##JCAMPDX= 6.0         $$ Bruker NMR JCAMP-DX V2.0
##DATA TYPE= NMR SPECTRUM
##DATA CLASS= NTUPLES
##ORIGIN= UXNMR, Bruker Analytische Messtechnik GmbH
##OWNER= root
$$ XWIN-NMR		Version 3.5
$$ Mon Apr  1 15:41:14 2019 Russian Standard Time (UT+4h)  she@DPX200
##.OBSERVE FREQUENCY= 81.013821
##.OBSERVE NUCLEUS= ^31P
##.ACQUISITION MODE= SIMULTANEOUS
##.ACQUISITION SCHEME= undefined
##.AVERAGES= 24
##.DIGITISER RES= 17
##SPECTROMETER/DATA SYSTEM= spect
##.PULSE SEQUENCE= zgpg30
##.SOLVENT NAME= CDCl3
##.SHIFT REFERENCE= (INTERNAL, CDCl3, 0, 182.463)
##AUDIT TRAIL= $$ (NUMBER, WHEN, WHO, WHERE, WHAT)
$$ ##TITLE= Audit trail, XWIN-NMR		Version 3.5
$$ ##JCAMPDX= 5.01
$$ ##ORIGIN= Bruker BioSpin GmbH
$$ ##OWNER= she
$$ F:/spectra/data/she/nmr/P31/1/pdata/1/auditp.txt
$$ ##AUDIT TRAIL=  $$ (NUMBER, WHEN, WHO, WHERE, WHAT)
(   1,<2019-04-01 15:39:41.68 +0400>,<she>,<DPX200>,
      <created by zg, POWCHK disabled, PULCHK disabled
       configuration hash MD5:
       00 E9 B6 7A A2 85 ED C7 34 08 36 98 17 FE 4E 26
       data hash MD5: 32K
       A7 AC 5A F3 C3 91 E4 3E 2E 19 CC F0 D7 EB 15 CA>)
(   2,<2019-04-01 15:39:48.73 +0400>,<she>,<DPX200>,
      <Start of raw data processing
       efp BC_mod = 2 LB = 1 FT_mod = 6 PKNL = 1 PHC0 = -1727.77 PHC1 = -36.80104 SI = 64K 
       data hash MD5: 64K
       A7 3F AF CC 49 E5 BA EF 41 DE 11 A7 8F BE C2 CC>)
(   3,<2019-04-01 15:40:20.92 +0400>,<she>,<DPX200>,
      <pk PHC0 = -85.9222 PHC1 = 104.8 
       data hash MD5: 64K
       8E 7B 9F 42 37 D8 8C AD A7 F8 78 E2 21 5F B0 11>)
(   4,<2019-04-01 15:40:24.40 +0400>,<she>,<DPX200>,
      <abs ABSG = 5 
       data hash MD5: 64K
       E3 55 AC A9 8A 92 8A 29 EA 04 20 E5 C1 31 63 C5>)
$$ ##END=
$$ 
$$ hash MD5
$$ 43 3D 2C 79 0E A6 34 AC 00 14 BC A7 EC 3B 48 AD
##$RELAX= 
##$RELAX= 
##$RELAX= 
##$RELAX= 
##$RELAX= 
##$RELAX= 
##$RELAX= 
##$RELAX= 
$$ Bruker specific parameters
$$ --------------------------
##$DU= <F:/spectra>
##$EXPNO= 1
##$NAME= <P31>
##$PROCNO= 1
##$TYPE= <nmr>
##$USER= <she>
##$AMP= (0..31)
100 100 100 100 100 100 100 100 100 100 100 100 100 100 100 100 100 100 
100 100 100 100 100 100 100 100 100 100 100 100 100 100 
##$AQSEQ= 0
##$AQ_mod= 1
##$AUNM= <au_zg>
##$AUTOPOS= <>
##$BF1= 81.014009
##$BF2= 200.13
##$BF3= 200.13
##$BF4= 200.13
##$BF5= 200.13
##$BF6= 200.13
##$BF7= 200.13
##$BF8= 200.13
##$BYTORDA= 1
##$CFDGTYP= 0
##$CFRGTYP= 5
##$CHEMSTR= <none>
##$CNST= (0..31)
1 1 145 1 1 1 1 1 1 1 1 1 1 1 1 1 1 1 1 1 1 1 1 1 1 1 1 1 1 1 1 1 
##$CPDPRG= <waltz16>
##$CPDPRG1= <>
##$CPDPRG2= <waltz16>
##$CPDPRG3= <>
##$CPDPRG4= <mlev>
##$CPDPRG5= <mlev>
##$CPDPRG6= <mlev>
##$CPDPRG7= <mlev>
##$CPDPRG8= <mlev>
##$CPDPRGB= <>
##$CPDPRGT= <>
##$D= (0..31)
0 1 0 0 0 0 0 0 0 0 0 0.03 2e-05 3e-06 0 0 0 0 0 0 0 0 0 0 0 0 0 0 0 0 
0 0 
##$DATE= 1554118781
##$DBL= (0..7)
120 120 120 11 120 120 24 19 
##$DBP= (0..7)
150 150 150 150 150 150 150 150 
##$DBP07= 0
##$DBPNAM0= <>
##$DBPNAM1= <>
$$ [...]
##$SUBNAM3= <"">
##$SUBNAM4= <"">
##$SUBNAM5= <"">
##$SUBNAM6= <"">
##$SUBNAM7= <"">
##$SUBNAM8= <"">
##$SUBNAM9= <"">
##$SW= 369.568048894756
##$SWIBOX= (0..15)
0 1 3 0 0 0 0 0 0 0 0 0 0 0 0 0 
##$SW_h= 29940.119760479
##$TD= 32768
##$TD0= 1
##$TE= 0
##$TE2= 300
##$TE3= 300
##$TEG= 300
##$TL= (0..7)
0 120 53 12 22 120 120 120 
##$TP= (0..7)
150 150 150 150 150 150 150 150 
##$TP07= 0
##$TPNAME0= <>
##$TPNAME1= <>
##$TPNAME2= <>
##$TPNAME3= <>
##$TPNAME4= <>
##$TPNAME5= <>
##$TPNAME6= <>
##$TPNAME7= <>
##$TPOAL= (0..7)
0.5 0.5 0.5 0.5 0.5 0.5 0.5 0.5 
##$TPOFFS= (0..7)
0 0 0 0 0 0 0 0 
##$TUNHIN= 0
##$TUNHOUT= 0
##$TUNXOUT= 0
##$USERA1= <user>
##$USERA2= <user>
##$USERA3= <user>
##$USERA4= <user>
##$USERA5= <user>
##$V9= 5
##$VALIST= <valist>
##$VCLIST= <CCCCCCCCCCCCCCC>
##$VD= 0
##$VDLIST= <DDDDDDDDDDDDDDD>
##$VPLIST= <PPPPPPPPPPPPPPP>
##$VTLIST= <TTTTTTTTTTTTTTT>
##$WBST= 1024
##$WBSW= 4
##$XGAIN= (0..3)
0 0 0 0 
##$XL= 0
##$YL= 0
##$YMAX_a= 24041
##$YMIN_a= -27583
##$ZGOPTNS= <>
##$ZL1= 120
##$ZL2= 120
##$ZL3= 120
##$ZL4= 120
##$ABSF1= 182.463
##$ABSF2= -187.1042
##$ABSG= 5
##$ABSL= 3
##$ALPHA= 0
##$AQORDER= 0
##$ASSFAC= 0
##$ASSFACI= 0
##$ASSFACX= 0
##$ASSWID= 0
##$AUNMP= <proc_1d>
##$AZFE= 0.1
##$AZFW= 0.5
##$BCFW= 0
##$BC_mod= 2
##$BYTORDP= 0
##$COROFFS= 0
##$CY= -3
##$DATMOD= 1
##$DC= 0
##$DFILT= <>
##$DTYPP= 0
##$F1P= 0
##$F2P= 0
##$FCOR= 1
##$FTSIZE= 65536
##$FT_mod= 6
##$GAMMA= 0
##$GB= 0
##$INTBC= 1
##$INTSCL= 5.30512e-09
##$ISEN= 30
##$LB= 1
##$LEV0= 0
##$LPBIN= 0
##$MAXI= 10000
##$MC2= 0
##$MEAN= 0
##$ME_mod= 0
##$MI= 50
##$NCOEF= 0
##$NC_proc= -4
##$NLEV= 6
##$NOISF1= 182.463
##$NOISF2= 159.3651
##$NSP= 0
##$NTH_PI= 0
##$NZP= 0
##$OFFSET= 182.463
##$PC= 4
##$PHC0= -1813.692
##$PHC1= 67.99896
##$PH_mod= 1
##$PKNL= yes
##$PPARMOD= 0
##$PSCAL= 0
##$PSIGN= 0
##$REVERSE= no
##$SF= 81.0140089999434
##$SI= 65536
##$SIGF1= 159.3651
##$SIGF2= -187.1042
##$SINO= 113.3802
##$SIOLD= 16384
##$SREGLST= <1H.CDCl3>
##$SSB= 0
##$STSI= 65536
##$STSR= 0
##$SW_p= 29940.119760479
##$SYMM= 0
##$S_DEV= 0
##$TDeff= 32768
##$TDoff= 0
##$TI= <>
##$TILT= no
##$TM1= 0
##$TM2= 0
##$TOPLEV= 0
##$USERP1= <user>
##$USERP2= <user>
##$USERP3= <user>
##$USERP4= <user>
##$USERP5= <user>
##$WDW= 1
##$XDIM= 65536
##$YMAX_p= 415914756
##$YMIN_p= -3303488
$$ End of Bruker specific parameters
$$ ---------------------------------
##NTUPLES= NMR SPECTRUM
##VAR_NAME=  FREQUENCY,     SPECTRUM/REAL,   SPECTRUM/IMAG
##SYMBOL=    X,             R,               I
##VAR_TYPE=  INDEPENDENT,   DEPENDENT,       DEPENDENT
##VAR_FORM=  AFFN,          ASDF,            ASDF
##VAR_DIM=   65536,         65536,           65536
##UNITS=     HZ,            ARBITRARY UNITS, ARBITRARY UNITS
##FACTOR=    0.456856943014862, 1,           1
##FIRST=     14782.0589164792, 0,            0
##LAST=      -15158.0608439998, 0,           0
##MIN=       -15158.0608439998, -3303488,    0
##MAX=       14782.0589164792, 415914756,    0
$$ Real data points
##PAGE= N=1
##DATA TABLE= (X++(R..R)), XYDATA
$$ [...]
##PAGE= N=2
##DATA TABLE= (X++(I..I)), XYDATA
60565A13213K8726J65592L8005p9199k229K08611L45869K15358j38618l71411
60555E23917k14278J37297K84564J91495J25052J09520p4117l38973l05624Q289
60545D47142R3145k19624m07918r6018L05886K67205l7231j22755j4267l7211
60535A78354j02422R3524L44736J61354l35494m88701j39671J40526K9992m9334
60525a67136K59625N89122M64641Q9619k3577J32281J61476k2509j20374j6726
60515A346442M2894j06171k83189k41132J4734K68922L23427J59167l8907m8640
60505A437547J20933K10700M7802k22716l59539l32570k50780j30079N6488J98652
60495G76438J43331p1151k46070k44582n8363K43933M78626L84438q4055n74512
$$ plain form
60565 113213 141939 307531 345536 266337 264108 472719 818588 1033946 895328 523917
60555 523917 309639 446936 731500 922995 1048047 1157567 1083450 744477 438853 447142
60545 447142 540287 320663 -87255 -183273 122613 389818 352587 229832 215565 178354
60535 178354 75932 169456 514192 675546 340052 -148649 -288320 -147794 -117802 -167136
60525 -167136 92489 681611 1146252 1235871 1212294 1344575 1506051 1483542 1363168 1346442
60515 1346442 1389336 1283165 999976 758844 773578 1042500 1365927 1525094 1486187 1437547
60505 1437547 1558480 1769180 1816982 1594266 1234727 902157 651377 521298 577786 776438
60495 776438 919769 848618 602548 357966 299603 543536 1022162 1406600 1322545 748033
60485G48033o58577k99322J54675L62259K29419j09691l52379k04493K68428N95480
60475G33832M52442J04325l015Q6623m858k80475l32140m3080J93904J14758l4667
60464I87649l278K340k83654o23449n25425N9691O32830P26271L65221n4823j93241
60453A090132l3492J98480L27183L59985K96227K488m96352p75676m50368J92063
60443G10670M39552R1922l04469k80304j5642J29142J60662J95688J02564j79234
60433A050551l30326j18747J41575P4776j22301o7587P0410j24489m58671l08148
60423a92957L49647P88292N45337l3409m29726n45978m47425r4920L47681M47666
60413G34208J16809j38355M2118K88231R5536l54568m87289k09483M1726J4430
$$ plain form
60485 748033 89456 -209866 -55191 307068 536487 426796 74417 -130076 138352 733832
60475 733832 1186274 1290599 1287584 1374207 1369349 1088874 756734 713654 907558 1022316 987649
60464 987649 984371 986711 703057 79608 -445817 -386126 246704 972975 1338196 1283373 1090132
60453 1090132 1056640 1255120 1582303 1942288 2238515 2241003 1744651 968975 518607 710670
60443 710670 1150222 1242144 937675 657371 641729 770871 931533 1127221 1229785 1050551
60433 1050551 720225 601478 743053 817829 695528 627941 698351 573862 115191 -192957
60423 -192957 156690 944982 1490319 1456910 1027184 481206 33781 -61139 286542 734208
60413 734208 851017 712662 754780 1043011 1138547 783979 296690 87207 128933 143363
60403A43363q6531l1663J39468K90185L33510J92442j08220l21343k21694M8057
60393C77574J50493M8667K8366K16328L81066K81281l2172l22867l82441j40033
60383F06262K24837L20627l1916m59442m52971q9652Q1104j07385k12034L6286
60373h4284K66144J05610j93734k14900o2469o5412j01591J65283N48048M97297
60363H59992j3111l89054k98125o1013O475N9387K42944K80387l8913l71213k99369
60352b1613p676L1505j51708r5867K83532M95507J99574k94741m64308k25612
60342b51407P3074J44515L2551n8310m1159J646M264N3988K28685L52470J55858
60331F96175k55612l94303n5862L07341K17405p9371K0875M91698O45109J68411
$$ plain form
60403 143363 56832 25169 164637 454822 788332 980774 872554 551211 329517 377574
60393 377574 528067 576734 605100 821428 1202494 1483775 1451603 1128736 746295 606262
60383 606262 831099 1151726 1119810 660368 207397 117745 198849 91464 -120570 -84284
60373 -84284 181860 287470 93736 -121164 -183633 -249045 -350636 -185353 362695 859992
60363 859992 846881 457827 159702 98689 105164 164551 407495 687882 648969 277756 -21613
60352 -21613 -29289 2216 -149492 -245359 38173 533680 733254 438513 -25795 -251407
60342 -251407 -178333 -33818 -1267 -59577 -100736 -99090 -94826 -40838 187847 540317 696175
60331 696175 440563 46260 -9602 297739 515144 435773 456648 948346 1593455 1761866
60321A761866l80777l90900m6501M7910k01258l04894J9872M14885L60598j55848
60311A124953o40630o91212m24044k29920k17619j25557J81187M23173L33852
60302b65817J15401J15649K38801J34566j23309r3924K57441M18522J42633j47657
60292G92306o6210J24374O055k93952l58291j46552N1626J26365J80867K02790
60282F19378R1455r3440k22631k96549k89848l7246M00440N49479J39226l57742
60272E02522l17067J16735K75524j9700l24729l79189l67183l32793l4230M41518
60262d38592N71186J95203j30376O9789N06797O13959L29997O977j60312k30081
60252A334547k54508k51767k71155k51126k3349L28828L95444N197m06132l42115
$$ plain form
60321 1761866 1381089 990189 943688 991598 790340 485446 505318 920203 1280801 1124953
60311 1124953 484323 -206889 -630933 -860853 -1078472 -1204029 -1022842 -599669 -265817
60302 -265817 -150416 -34767 204034 338600 215291 121367 378808 797330 939963 792306
60292 792306 726096 850470 856525 562573 204282 57730 109356 235721 416588 619378
60282 619378 710833 617393 394762 98213 -191635 -228881 171559 721038 860264 502522
60272 502522 185455 302190 577714 558014 233285 -145904 -513087 -845880 -880110 -438592
60262 -438592 132594 327797 197421 267210 774007 1387966 1717963 1724940 1564628 1334547
60252 1334547 1080039 828272 557117 305991 282642 611470 1006914 1012111 605979 263864
60242B63864N4335K34018L2110j81923j08940R6859J19198j01644l34571l07162
60232b33856M3761M85580O77569N14807K18891K9616o3708j87077l30874l82903
60222G71806k97754r9719J67523L75486L42592P2878j88902k85486l42046m48561
60212F7817l80086N3202N35362N23283o438m48028l07057K18371N35579L42579
60202A134584j33592m52239l63961K8879L84019M05386J05059k12608k70634j04614
60192E20279K9097M992l4429N3776J54132P8478p3695j0259K71989M00504J51014
60181A545878k31136m26613m58585m46660k67887J44508M48617L34582R2050J66369
60171I01123L39293N4297n31235o45879j44341K23833N1560j00950K23367N27430
$$ plain form
60242 263864 318199 552217 584327 402404 293464 390323 509521 407877 73306 -233856
60232 -233856 -190095 295485 973054 1487861 1706752 1736368 1672660 1485583 1154709 771806
60222 771806 474052 374333 541856 917342 1259934 1332812 1143910 858424 516378 67817
60212 67817 -312269 -259067 276295 799578 793140 345112 38055 256426 792005 1134584
60202 1134584 1000992 548753 184792 213671 597690 1003076 1108135 895527 624893 520279
60192 520279 549376 554368 519939 573715 727847 806325 732630 722371 994360 1394864 1545878
60181 1545878 1314742 888129 429544 -17116 -285003 -140495 308122 642704 734754 901123
60171 901123 1240416 1294713 763478 117599 -26742 197091 248651 147701 371068 898498
60161H98498K48470k13727j73258J76160J63484j70619k26739K1847O875l50425
60151C80566m43550j8280L90330L16658L09j37908j07459j09811j22171l7132
60141A11552R3667J88892K44055J73593j33900m73466m03196J35477O01954M98380
60131A037008j6330l69483k45459J61112M21839K87795o9872k19664J711K20371
60121A209028L1568l58648l97699l5976J83664l4940l15860k35191O5512J85219
60111B96677N8058o8558l7796R1580J80793J10535j06152k27222q571M03340N65399
60100A258083L07407p3538k70374k95039k43318r1930J01760J42160K8513J4600
60090H78324J51227J35416j61097m04091l24398j47056j43561j30936J39745M07473
$$ plain form
60161 898498 1146968 933241 759983 936143 1099627 929008 702269 724116 730991 380566
60151 380566 -62984 -81264 309066 625724 626033 488125 380666 270855 148684 111552
60141 111552 205219 394111 638166 811759 677859 204393 -198803 -63326 538628 1037008
60131 1037008 1020678 651195 405736 566848 988687 1276482 1206610 986946 988657 1209028
60121 1209028 1240596 881948 484249 448273 631937 596997 281137 45946 111458 296677
60111 296677 354735 286177 248381 339961 520754 631289 525137 297915 289344 692684 1258083
60100 1258083 1565490 1491952 1221578 926539 683221 591291 693051 835211 863724 878324
60090 878324 1029551 1164967 1003870 599779 275381 128325 -15236 -146172 -6427 401046
60080D01046K42188k17842m01337j23266K05662K13910L376j38306j30430p0369
60070a5368k6803J2020Q1469J84228K56674K32996J67232J77431K35333J84830
60060A490042J8401r0450r2733j11860j03766J35338M44136K62938n10980j087622
60050C53444p36715J51365N68651K47894j39971p3346K07760K70047Q2792j46864
60040G85057k86172k47331k0507J42366l8404l54313k70111K52666N82875L22989
60030H69115r4367q8602K00161K15763j09496l00867j02146K10170L15428K36981
60020A352140J27289J222j48420k21561j87346k05883l73325m81809k64694J81599
60010b20788M60707L75530J40689K6701J3335n4526j57364j70227j13822q5235
$$ plain form
60080 401046 643234 425392 24055 -99211 106451 320361 323737 185431 55001 -15368
60070 -15368 -42171 -30151 51318 235546 492220 725216 892448 1069879 1305212 1490042
60060 1490042 1508443 1417993 1325260 1213400 1109634 1244972 1689108 1952046 1441066 353444
60050 353444 -383271 -231906 336745 584639 444668 371322 579082 849129 931921 785057
60040 785057 498885 251554 231047 373413 335009 -19304 -289415 -36749 546126 869115
60030 869115 774748 686146 886307 1102070 992574 691707 589561 799731 1115159 1352140
60020 1352140 1479429 1480651 1332231 1110670 923324 717441 344116 -137693 -402387 -220788
60010 -220788 239919 615449 756138 782839 796174 741648 584284 414057 300235 215000
60000B15000k9854J31045K17036m710l38611l23606K8000J46496k00944m42027
59990f02175n6497N36530N63331R8818m5151M01404P40543L71734l35307o16442
59980A056788l41018l0713q4642l81479n61368m03614M5760N12934O79735M66491
59970I58874J04256j43993k36829k55752k10527r3563n290l9141j03315k5188
59960e0468J95723L78173L80948K15499k9272k40957k85194j13208J05498J10820
59950F67562j15794k82249j63721P2170J07872k5451K7523L58323N44813K34314
59940A425362k65128l62153l6833J55035l2465j76265N3270K74900p770n44989
59930D82964o47791k00408K21989K50818J70436L07465M71173L09928j05506l95747
$$ plain form
60000 215000 185146 316191 533227 528517 189906 -133700 -105700 40796 -160148 -602175
59990 -602175 -658672 -122142 441189 540007 494856 896260 1636803 2008537 1673230 1056788
59980 1056788 715770 685057 600415 218936 -342432 -746046 -700286 -187352 492383 958874
59970 958874 1063130 919137 682308 426556 216029 122466 117176 78035 -25280 -50468
59960 -50468 145255 523428 904376 1119875 1090603 849646 564452 451244 556742 667562
59950 667562 551768 269519 105798 177968 285840 260389 287912 646235 1191048 1425362
59940 1425362 1160234 798081 761248 916283 883818 707553 760823 1035723 1027953 482964
59930 482964 -164827 -365235 -143246 107572 278008 585473 1056646 1366574 1261068 865321
59920H65321l93441k60101j70618j15645m866J70902K84540J58193k07161m81901
59910a54777k76268L40499P68155N02677k57877q06628o85501j02389L90039M76361
59900A94291K81516R9768N7605P8750Q1686P0311K5028j30945l56872m21530j69857
59889a90249K09943L64007J98733l0468o7438M6580P2001j04866k95498j86380
59879A6365K53960O09033M51784n3469k86474j4425K65900P9107l14982l76762
59869F30037j44496p4441k02120j13737K47257L98611J08003k11428j55510J03490
59859E85666K09295J67494J54119J17316n7792k30444k01689n8128j6270o9302
59849F00265o2418L136k471q8166j25530k4641J96642M22381M43179J21125l54604
$$ plain form
59920 865321 471880 211779 41161 -74484 -79350 91552 376092 534285 327124 -154777
59910 -154777 -431045 -90546 677609 1180286 922409 115781 -569720 -672109 -282070 194291
59900 194291 475807 575575 633180 711930 793616 863927 888955 758010 401138 -20392 -190249
59889 -190249 19694 383701 582434 551966 484528 531108 603109 498243 202745 16365
59879 16365 270325 879358 1331142 1277673 991199 976774 1242674 1321781 1006799 630037
59869 630037 485541 411100 208980 95243 342500 741111 849114 637686 482176 585666
59859 585666 794961 962455 1116574 1233890 1176098 945654 743965 685837 669567 600265
59849 600265 537847 540983 538512 450346 324816 300175 496817 919198 1362377 1483502 1128898
59838A128898n71638l68133j7555J42570M5454k02193m56283m78156q8736M62938
59828d02834O41511L26706o69R499Q9784r2729l44980l36312j90655j93168k27557
59817g21404m7714J54656M1774k00163r2618L39969O02959N04856L12754J62154
59807A057223p7926l15511k36597Q5938J83815l6585j12876J45044K50910j58126
59797G85309o44403n81615o7107K91714K58233J32499J62424K47179K16900O2247
59787H63380j31660k34143q8136K73312M80504J86907m08554o80826l16160K91816
59777B36440N26051K67403n6133p5234Q5515O3243k00865l72817j79399K42394
59767E36598N48194N81453M10563J08669k64360n15429m29038q2899J60962P4882
$$ plain form
59838 1128898 557260 189127 171572 314142 359596 157403 -298880 -777036 -865772 -402834
59828 -402834 238677 565383 564714 574213 663997 571268 226288 -110024 -300679 -493847 -721404
59817 -721404 -769118 -614462 -572688 -772851 -865469 -525500 77459 582315 895069 1057223
59807 1057223 979297 663786 427189 513127 696942 660357 547481 692525 943435 785309
59797 785309 140906 -440709 -507816 -216102 42131 174630 337054 584233 801133 863380
59787 863380 731720 497577 409441 682753 1163257 1350164 941610 260784 -55376 236440
59777 236440 762491 1029894 973761 898527 984042 1047285 846420 473603 294204 536598
59767 536598 1084792 1666245 2076808 2185477 1921117 1405688 976650 893751 1054713 1129595
59757A129595j79396k95018j80102J0473Q5314k4149k23989l15180j67264J28361
59747c1355L47603L72429K53029P4466r5116j61604r5513m3231j37298k23278
59737B60132n4010K38019K22577j66365m40161k55715O6448P3576r1243K4407
59727a22335L62698L97032j3799l74132k98681j1302J38825J88850K45291R5950
59717F08397l57314o15326j84808M98645N03020j97243n53149K8946P72963P16509
59707A220640J41362m236L32427L41699j84099m97893k12901K9952l12937p30995
59697A23019m98404J48000M27514K01682k1708j3259J540l0504R7034L06883K42602
59686I84399j08869l40749k51726n5613R5431K92905M82363L90242j1930m05476
$$ plain form
59757 1129595 950199 655181 475079 485552 570866 546717 322728 7548 -159716 -31355
59747 -31355 316248 688677 941706 1016172 921056 759452 663939 620708 483410 260132
59737 260132 206122 444141 666718 500353 60192 -195523 -129075 -55499 -146742 -122335
59727 -122335 240363 637395 623596 249464 -49217 -60519 78306 267156 512447 608397
59717 608397 251083 -364243 -549051 -50406 452614 255371 -297778 -268832 504131 1220640
59707 1220640 1362002 1357766 1690193 2031892 1847793 1349900 1136999 1166951 854014 123019
59697 123019 -375385 -227385 200129 401811 380103 366844 368384 337880 434914 741797 984399
59686 984399 875530 534781 283055 227442 322873 615778 1098141 1488383 1476453 1070977
59676A070977o05249p04717o55258k31172M05474O52905K80068j83798k01555
59667a72325O5644J74669J09566J20931J79352Q7195o4877k6337J40881J41205
59657G55904o1107j96655j13709P0333K19865K91840K05146j14558n14921o72270
59647a30132m44569l0275K63771L08491J93779P7681L0711J4706R386Q5529K50106
59636F29184L06710Q1187k52364l37898j37991L2382J3735l742J09651K00831
59626F41685J91367K67157M69699M77854J10371k96104l66291k32612k16545k64969
59616G81612j55746p330o5222j59444O4665M52669M49463n4346n02787m40038
59606C63496p0945J27905L1391j00767j1098K79676M79457K98752j66456m28896
$$ plain form
59676 1070977 465728 -238989 -894247 -1125419 -719945 -67040 213028 29230 -172325
59667 -172325 -106681 67988 177554 298485 477837 565032 500155 473818 614699 755904
59657 755904 694797 498142 384433 454766 674631 966471 1171617 1057059 542138 -130132
59647 -130132 -574701 -604976 -341205 -32714 161065 238746 269457 284163 293549 379078 629184
59636 629184 935894 1017081 764717 426819 288828 321210 334945 331203 440854 641685
59626 641685 833052 1100209 1569908 2047762 2158133 1862029 1495738 1263126 1046581 781612
59616 781612 625866 618536 553314 393870 458535 911204 1360667 1306321 803534 363496
59606 363496 292551 420456 451847 351080 339982 619658 1099115 1397867 1231411 802515
59596H02515j88756K23671K75854l3745k50256j80769q6005j45868j98792j26096
59586I1753q1376j64861k09528p1827J39345K65273K73567J40294j48631l85482
59576a51473k66851J33002L55487J87885m9486m3995N4974L401o7073P5840K80495
59565E12206K29424j646k4115K56043M77327L23506q5421l89019l97164k24152
59555F76989j02138j10873r7780Q1108K76638J88262j73824m21047l14580r8195
59545i5440q2799j50129L870L07434L89900J63937n6976o1086m399n9953j05498
59534B48861M6344L03656L85494J71147j78068m00822l68528j85518q5794j67397
59524b30625k47064r7717J95001L10369J62443N5525K35775N00279M77014J58284
$$ plain form
59596 802515 613759 837430 1113284 1079539 829283 648514 562509 416641 217849 91753
59586 91753 10377 -154484 -364012 -435839 -296494 -31221 242346 382640 234009 -151473
59576 -151473 -418324 -285322 70165 258050 208564 164569 219543 222944 155871 231711 512206
59565 512206 741630 739984 715869 971912 1449239 1772745 1687324 1298305 901141 676989
59555 676989 574851 463978 366198 447306 723944 912206 738382 317335 2755 -95440
59545 -95440 -178239 -328368 -324498 -17064 372836 536773 479797 418711 414312 354359 248861
59534 248861 295205 598861 984355 1155502 977434 576612 208084 22566 -63228 -230625
59524 -230625 -477689 -575406 -380405 -70036 92407 147932 383707 883986 1361000 1519284
59514A519284j13109j40892p8064r1326r3782L2176J39351j4513l48499m44605
59504C66021n4844M95711N81866J075o89239p21131j9982O37311N22454j54615
59494I64627n48807k94440J05493J14404q1039j0745K35453J57807k77527m95718
59484a30492j44830M16904O60962N15012K17685q8398l24736l38904j28205K3422
59474F78420o0972j41462L2814K43899J34709j68525k34802k9363O8523n7142
59464D66099q2577J49043L33855K27877L9248K9478P9761k0625j39507k9438J99354
59453A252568K23971L3741p3567j5355o8750l82234o61087n56874j65686J23364
59443b89909J73207K01467L32592L57848J02812k11547k49422n8770M2313J7695
$$ plain form
59514 1519284 1406175 1265283 1187219 1095893 1002111 1034287 1173638 1159125 810626 366021
59504 366021 311177 806888 1388754 1389829 700590 -20541 -40523 596788 1119242 964627
59494 964627 415820 121380 226873 341277 260238 249493 484946 642753 365226 -130492
59484 -130492 -275322 141582 802544 1317556 1535241 1446843 1122107 783203 654998 678420
59474 678420 617448 475986 508800 752699 887408 718883 484081 454718 523241 466099
59464 466099 383522 532565 866420 1094297 1133545 1163023 1242784 1222159 1082652 1053214 1252568
59453 1252568 1476539 1510280 1436713 1421358 1352608 970374 309287 -247587 -413273 -289909
59443 -289909 -116702 84765 417357 775205 878017 666470 417048 358278 400591 418286
59433D18286J48503M45530M63410m4074o31987o88352k30213J93512K46177P3474
59423C94266q2594j55198j39823l7915N3717M6260L4250J28686J91736L6961j83182
59412B87164j48719J07377K37138J35563N1485R8721Q6848n1396q2317J07072
59402H28936K76225K12561K9057r5650j70689k17374j42420L7041J25905O9507
59392I53099N6580J64808K12159J01159k0656q5501k25095m10644l78810j11801
59382B55298L4038r2491j72975J0984K21219K68917L45567M80110K55407m20514
59372A185560q40348m60277J65315J86587k24224k48414J82215L61873Q4782p8439
59362C14630J18253J85995j35955l69397j41026J93509K14819J07440J85328K77546
$$ plain form
59433 418286 566789 1012319 1475729 1431655 799668 111316 -118897 74615 320792 394266
59423 394266 311672 156474 16651 -21264 32453 78713 112963 241649 433385 470346 287164
59412 287164 138445 245822 482960 618523 670008 768729 855577 804181 721864 828936
59402 828936 1105161 1317722 1346779 1251129 1080440 863066 720646 757687 883592 953099
59392 953099 1009679 1174487 1386646 1487805 1467149 1381648 1156553 745909 367099 255298
59382 255298 289336 196845 23870 34854 256073 524990 870557 1350667 1606074 1185560
59372 1185560 345212 -115065 50250 236837 12613 -235801 -53586 308287 393069 314630
59362 314630 432883 618878 482923 113526 -27500 166009 380828 488268 673596 951142
59352I51142R5566j96410k64312j38219l8697L5407J47330J38253r1342k74653
59342C64065j60522L0978m6442k66201k16725J45118M53875M71581K81374R322
59332A066423k73834m06942k54057K7261J43687Q7273R5094K03171J85060k2041
59322H51095j72953j04124L3804P6047J08911K50189L76413K85545J0060k11297
59312A503690k00564L0880L13633L81536N8438m65282p06792m53201r8582j33844
59302B29912m22232l82030J17969N24199M24676J31438R1925J37891j47151n81070
59292A25527n63206m9118L18195J74847p6322J7776L11719M54108M32620L46699
59282A492845R6503k65000l09467J24804M72546K11031k78610l02499R981k3342
$$ plain form
59352 951142 1046708 850298 585986 447767 409070 444477 591807 730060 638718 364065
59342 364065 203543 234521 188079 -78122 -294847 -149729 304146 775727 1057101 1066423
59332 1066423 792589 385647 131590 158851 302538 389811 484905 688076 873136 851095
59322 851095 678142 574018 607822 683869 792780 1042969 1419382 1704927 1714987 1503690
59312 1503690 1303126 1334006 1647639 2029175 2087613 1622331 915539 462338 363756 229912
59302 229912 -192320 -574350 -456381 67818 492494 623932 715857 853748 706597 125527
59292 125527 -437679 -486797 -168602 6245 -70077 -52301 259418 713526 1146146 1492845
59282 1492845 1589348 1324348 1014881 1139685 1612231 1823262 1544652 1242153 1252134 1228792
59272A228792m11715m48014P7095N00952L33715r5446l06371k89010j67169R8432
59262E21261L55707K47427j23064j68034J95787K68838k54517o14827j70242M61710
59252G20046L22375l59371n53026m0670L72385J96039j32217r8158J90910L60143
59242I78456K45937j18431n18678n38207k8855M42688K30449l43511l25329L97560
59232D22079Q04818K49098n47405n63617O8473L88326K9636m08477l42497M1691
59222A42125J63991j60170n04550l39496L18457Q46418P16039J53723j59907J0093
59212A186723K37220J54534o9594j60417j92235l00759l12665o0025J98876J01779
59202G83437k20876k77463J00095N39727O18626L24544j6936j28006n2406p4117
$$ plain form
59272 1228792 817077 369063 446158 947110 1280825 1185379 879008 589998 422829 521261
59262 521261 876968 1124395 1001331 833297 1029084 1297922 1043405 428578 258336 720046
59252 720046 1042421 683050 130024 89354 461739 657778 525561 427403 618313 978456
59242 978456 1224393 1105962 587284 49077 20222 462910 693359 349848 24519 422079
59232 422079 1226897 1475995 928590 364973 433446 821772 851408 442931 100434 142125
59222 142125 306116 145946 -358604 -698100 -379643 466775 1182814 1336537 1176630 1186723
59212 1186723 1423943 1578477 1508883 1348466 1156231 855472 542807 482782 681658 783437
59202 783437 562561 285098 385193 924920 1543546 1868090 1851154 1723148 1670742 1596625
59192A596625l24080n30189l55555O0899K36531N5535p6961N7622J10074k06119
59182F24382n60549n17090k15094k8823J20764N02026Q58424O64727L2186l39878
59172A141075j88280j0244j94800m42610l44238k7410J41943J30668J35954J72374
59162E14432J08113m1674j22368l7913K06521N10169O32010L71771q3868k64326
59152A792867k7109K08915M1728l78584o34601n98105m12586j50943J69792L86912
59142C98286L44195J63932Q5927J13526P4549n8552j72438k46851l14224k71772
59132A16578k9186K13918J49758j82873m07256k88702L8276L19906M14151K84415
59122F28985K8453q7771R6647L27237K05589k05667m07133j81453R8084O9178
$$ plain form
59192 1596625 1272545 742356 386801 447700 684231 739766 662805 720427 830501 624382
59182 624382 63833 -453257 -668351 -697174 -576410 -74384 784040 1448767 1480953 1141075
59172 1141075 952795 942551 747751 305141 -39097 -66507 75436 206104 342058 514432
59162 514432 622545 580871 458503 420590 627111 1137280 1769290 2141061 2057193 1792867
59152 1792867 1765758 1974673 2016401 1637817 1003216 405111 -7475 -158418 11374 398286
59142 398286 742481 906413 992340 1105866 1180415 1121863 949425 702574 388350 116578
59132 116578 87392 301310 451068 268195 -139061 -427763 -389487 -69581 344570 628985
59122 628985 657438 569667 666314 993551 1199140 993473 586340 404887 502971 572149
59112E72149p9933J2446K45356K06459j57926m32259l28349o3741n771j58235
59102a89804k00292M7762L85436M92786L08754M9126r8417j48042j57831p4770
59092D14708J23084K62032J63982n4318j07444L2418Q0331j26881l76365l87576
59082B3971j85783m781M9020O1701J18891K06626K78309L05826K68702J58794
59072A281276q562k00213l41794l10228n9282K36468L01826Q4986j57360j71156
59062F55961N133J42075J13984o197q6768p8660k5732K2976Q9633K10069K92983
59051A335457J70204j12243k18131N2517L94136L46283o1040l56638l08283j67554
59041A074708j68764j86420o4282O3300R474j63954k82513k75352j21458J55648
$$ plain form
59112 572149 492216 504662 750018 956477 798551 366292 37943 -25798 -31569 -189804
59102 -189804 -390096 -342334 43102 535888 844642 893768 795351 647309 489478 414708
59092 414708 537792 799824 963806 909488 802044 834462 914793 787912 411547 23971
59082 23971 -161812 -166593 -117573 -55872 63019 269645 547954 853780 1122482 1281276
59072 1281276 1272714 1072501 730707 420479 361197 597665 899491 984477 827117 655961
59062 655961 661094 803169 917153 910956 824188 745528 719796 742772 832405 1042474 1335457
59051 1335457 1505661 1393418 1175287 1227804 1621940 1968223 1907183 1550545 1242262 1074708
59041 1074708 905944 719524 655242 718542 728016 564062 281549 6197 -115261 40387
59031D0387L27807J38572k12918j75302L36656O73782L50937k09235k91295R6434
59021A075825L52794K03638n6813j41021r7651q4605j72339l36122l98621j39871
59011B05214L02112M34332J21841q9886J98526N27463K99412j86845j93475K44421
59001A863115M21097J25360j77970k73411l98918n07602k59591J49095J12050
58992A053225k57496j38466N66057Q79395L03749l35655k55101O8141j21773n15034
58982A247042l66014J74465L83877J77829K4004o312j69160l13281j25509J18182
58972A145123n7273l84853k25362K72044L48336p8817k98393m4252J29205r2608
58962G13150k71373p6835J57792J16205K4608J13084J83936R0015N5634J63845
$$ plain form
59031 40387 368194 506766 293848 118546 455202 1128984 1479921 1270686 979391 1075825
59021 1075825 1428619 1632257 1575444 1434423 1336772 1252167 1079828 743706 345085 205214
59011 205214 507326 941658 1063499 973613 1172139 1699602 1999014 1812169 1618694 1863115
59001 1863115 2284212 2409572 2231602 1958191 1559273 1051671 792080 941175 1053225
58992 1053225 795729 657263 1223320 2102715 2406464 2070809 1815708 1883849 1762076 1247042
58982 1247042 881028 1055493 1439370 1617199 1641203 1634891 1465731 1152450 1026941 1145123
58972 1145123 1087850 702997 477635 749679 1098015 1019198 720805 676553 805758 713150
58962 713150 441777 364942 522734 638939 663547 776631 960567 1050582 1106216 1270061
58952A270061J05671j93915k93994O320K20824l2738l57556k54780L5081J4263
58942E19237j72290m4503K94972L12808j6175j58879Q0000K85427J68598k4946
58932A244249m5262n3776k22211l33141j35056J84805K50790O5765k3177J25362
58922A058348K58335J49879n8235r7602K2130O9267k5437q9547m0576m8190k38761
58911I59611m46178m49470k99050j76956o0251J97324N14940O14468M06883R2263
58901A353584j37539k51681k39013r0449N2388J3012j11771m5022K16305L45549
58891A105363J68727r7496j88667p9936J52404M23560M97373J41830m08104n51180
58881A163874j17434L32333K84728n4826k18112j88846j96604j51517J40179M22252
$$ plain form
58952 1270061 1375732 1181817 887823 894143 1114967 1082229 724673 469893 504974 519237
58942 519237 346947 302444 597416 910224 894049 735170 815170 1100597 1269195 1244249
58932 1244249 1198987 1145211 923000 589859 454803 639608 890398 956163 932986 1058348
58922 1058348 1316683 1466562 1408327 1310725 1332855 1402122 1376685 1287138 1246562 1198372 959611
58911 959611 513433 63963 -235087 -412043 -472294 -274970 239970 854438 1261321 1353584
58901 1353584 1216045 964364 725351 634902 687290 700302 588531 543509 759814 1105363
58891 1105363 1274090 1176594 987927 907991 1060395 1483955 1981328 2123158 1715054 1163874
58881 1163874 1046440 1378773 1663501 1608675 1390563 1201717 1005113 853596 993775 1416027
58871A416027K64101j98641l80023r9280K15129K24762P2183k7538r6780j35798
58861A254142j054K46044K61017p5084m06672m00468j76790k195J24524K77278
58851A100742K92673L6776k27677j54293J20684J37537j88144m22755k39924J52016
58841F07635L48725K58196R5573L9677P0953P7586P990n7684K3554K42930L35154
58830B050289O2552l99086n98106l98758j59889j63522j63599J84254O64361P09871
58820A788367K20884k66896l20214j23650p7624k18193l03117k39999j39506q1307
58810B38745p2363j23101j50283N6185N18733Q52076O57285P2629l60525l51136
58800A338245r6152J08521J75563J11060q4539k85574k73883m3547J28478L9964
$$ plain form
58871 1416027 1680128 1481487 1101464 1002184 1217313 1442075 1514258 1486720 1389940 1254142
58861 1254142 1253088 1499132 1760149 1685065 1278393 877925 701135 698940 823464 1100742
58851 1100742 1393415 1430191 1202514 1048221 1168905 1306442 1118298 695543 455619 607635
58841 607635 956360 1214556 1310129 1349806 1420759 1498345 1506335 1448651 1472205 1715135 2050289
58830 2050289 2112841 1713755 1115649 716891 557002 393480 229881 414135 1078496 1788367
58820 1788367 2009251 1742355 1422141 1298491 1220867 1002674 699557 459558 320052 238745
58810 238745 166382 43281 -107002 -50817 467916 1319992 1977277 2049906 1689381 1338245
58800 1338245 1242093 1350614 1526177 1637237 1552698 1267124 993241 949694 1078172 1118136
58790A118136j85339l09316k62169j03036J17010L09278L22278J31773m4504J7820
58780A111931K47998L42138J22763k40788m00667k18448N1784O3033j46355j77791
58770G55598J26032L77390J96360j86188k71375n8624K3472j28994j73130R879
58760F70420J10457J1512K5080K48601K67652j13401l84157q2905M09005M31680
58750A593944O9623o6121J19524J06457l04808o37438m80885m6930K43539L01684
58740H98589K51117J17177q2177j79629o9800O9053j763k24766l13715j42988
58730C21098R9156J74028R1775N8632J60152K27417J00385r2579j08295J6927
58720A048696J3880j59787k23420m2635J47248J79169K57431N21232O43783K92800
$$ plain form
58790 1118136 932797 623481 361312 258276 375286 684564 1006842 1138615 1094111 1111931
58780 1111931 1359929 1702067 1824830 1584042 1183375 964927 1016711 1079744 933389 755598
58770 755598 881630 1259020 1455380 1269192 997817 939193 962665 833671 660541 670420
58760 670420 780877 792389 817469 1066070 1333722 1220321 836164 753259 1162264 1593944
58750 1593944 1663567 1597446 1716970 1823427 1518619 881181 400296 353366 596905 898589
58740 898589 1149706 1266883 1184706 1005077 935277 1004330 1002567 777801 464086 321098
58730 321098 420254 594282 686057 744689 904841 1132258 1232643 1140064 1031769 1048696
58720 1048696 1062576 902789 679369 636734 783982 963151 1220582 1741814 2385597 2678397
58710B678397k57147m64890l21041k73754m16767l29309J73524O57252O67004
58701B113269L15547J3564q8272j27662k22763l76923n33155n34115j93490L83232
58691G49232O94911L36368m23357q01174l54198M57865P50045K52300l56782l32966
58681I72244J39382K54662j74394l99063Q9297O84202N36496j44411m28009q1908
58671A448498K06456M4558j10283J17823L31834Q3534l26617l47338l8516J48368
58661A558317J31914J54421J92189K534l41478m98652l99951k63817j23981J49201
58651E60697L75349J88286k69164l61582R9210M86314K86049j06719k5258M15683
58641A648865N27623J20830k85573l15591j72675r8679J1775J98439J70041j71621
$$ plain form
58710 2678397 2421250 1956360 1635319 1361565 944798 615489 789013 1446265 2113269
58701 2113269 2428816 2442380 2354108 2226446 2003683 1626760 1093605 559490 366000 749232
58691 749232 1444143 1780511 1357154 555980 201782 659647 1409692 1661992 1305210 972244
58681 972244 1111626 1366288 1191894 792831 882128 1566330 2102826 1958415 1530406 1448498
58671 1448498 1654954 1699512 1589229 1707052 2038886 2122420 1795803 1448465 1409949 1558317
58661 1558317 1690231 1844652 2036841 2039375 1697897 1199245 799294 535477 411496 560697
58651 560697 936046 1124332 855168 493586 592796 1079110 1365159 1258440 1233182 1648865
58641 1648865 2176488 2297318 2011745 1696154 1523479 1424800 1436575 1635014 1805055 1633434
58631A633434l88030j39135K16550J92563J8308K39960O78951N94291q9671n50560
58621B406661l18152K1644j67447n39721m02413R5149J97800k33487n12213j84754
58611C63067L46918M65766J39857j82290j90921K2566J93984J94614J08577N0057
58601A512195k5816j98740l08063q7426L48700N17313K65735N6928K30393L98731
58591B709950P6105m50670n23292j57284L9736r1331q3478K07316K64521j77377
58581A814196n62507l12747K92149N35698K49072j06092j58700nJ09865P0256
58571A931185n5220j56923j57655o5822L2599N3101k7837j46922j48626P6839
58561A334719L60955L52156J8497j84013O3026L92279K52936k27253m19266j60022
$$ plain form
58631 1633434 1245404 1106269 1322819 1515382 1533690 1773650 2452601 3046892 2957221 2406661
58621 2406661 2088509 2110153 1942706 1402985 1000572 1095721 1293521 1060034 547821 363067
58611 363067 709985 1175751 1315608 1133318 942397 964963 1158947 1353561 1462138 1512195
58601 1512195 1486379 1287639 979576 892150 1240850 1758163 2023898 2080826 2311219 2709950
58591 2709950 2786055 2335385 1812093 1654809 1694545 1603214 1519736 1727052 1991573 1814196
58581 1814196 1251689 938942 1231091 1766789 2015861 1909769 1751069 1751064 1860929 1931185
58571 1931185 1875965 1719042 1561387 1495565 1528164 1581265 1553428 1406506 1257880 1334719
58561 1334719 1695674 2047830 2066327 1882314 1945340 2337619 2590555 2363302 1944036 1784014
58551A784014M5901j41886m27396m12983j29183J80860M02520M67365K86578l1250
58541B024540j93536j05945L1530Q4088J21089J48991O3016q9273j58309k00883
58531A725308l30571l34047K5368L91531J91674l56608m17394J43107M87407J56393
58521A682168k24438o8063K27396J12473j18626L9599L21122K02682j06749q0835
58511A986729J18281l9122m13851m10154n8509K9004k53508l34283L1998L66348
58501A022933K55234r6294k95677k30840M2267M15571O09237L64676j30205l84699
58491A572203k44852l5192l1857j57407k27845j60466P0968L69110M50556J87347
58481A792565r0061k3789J66910K106m25357n13984r0556K97837J96466j49415
$$ plain form
58551 1784014 1829915 1688029 1260633 847650 718467 899327 1301847 1769212 2055790 2024540
58541 2024540 1831004 1725059 1756589 1840677 1961766 2110757 2173773 2084500 1926191 1725308
58531 1725308 1394737 1060690 1086058 1477589 1669263 1312655 895261 1038368 1525775 1682168
58521 1682168 1457730 1389667 1617063 1729536 1610910 1650509 1971631 2174313 2067564 1986729
58511 1986729 2105010 2065888 1652037 1241883 1183374 1212378 958870 624587 656585 1022933
58501 1022933 1278167 1181873 886196 655356 697623 1113194 1722431 2087107 1956902 1572203
58491 1572203 1327351 1292159 1260302 1102895 875050 714584 785552 1154662 1605218 1792565
58481 1792565 1702504 1678715 1845625 1847731 1422374 908390 817834 1115671 1312137 1162722
58471A162722k38506J6218L06182L46982R0589k76985m35576k15472J65726L39868
58461A261748K50795J47448J51391J28029K65j06618r0910n805P6916J33804J16203
58450B063266J276j00267n8985R2745K26515K55170R7923k66954n64174l72903
58440A373612K16743M88764N3164m71283k88204L68508N51703j2088n76790m70857
58430A233272Q6796M29173K42316k31277m86023k09100L28760M71169L0810l53112
58420A542784j30670K73062J33987l48042l58562J61320M13997P4380k22269K8050
58410A568037M55373N29764L16683J14356q1387l41906m99957m36661l04463k22029
58400A097810j17253k2579r2187k07381o2595K40018K46091n7691j34536J98817
$$ plain form
58471 1162722 924216 940434 1246616 1593598 1684187 1407202 971626 756154 921880 1261748
58461 1261748 1512543 1659991 1811382 1939411 1939676 1833058 1742148 1736343 1813259 1947063 2063266
58450 2063266 2064542 1964275 1905290 1998035 2224550 2479720 2577643 2310689 1746515 1373612
58440 1373612 1590355 2079119 2132283 1661000 1372796 1741304 2293007 2280919 1704129 1233272
58430 1233272 1320068 1749241 1991557 1760280 1274257 1065157 1393917 1865086 1895896 1542784
58420 1542784 1412114 1685176 1819163 1471121 1112559 1273879 1687876 1762256 1539987 1568037
58410 1568037 2023410 2553174 2869857 2984213 2902826 2560920 2060963 1624302 1319839 1097810
58400 1097810 980557 957978 865791 658410 595815 835833 1081924 1024233 889697 1088514
58390A088514M13722J36989k35629j89941J66251M15644M31053K90361J0939k85315
58380B242588l26844j05029M7423M574K2136J70048J35824j50620k75140l7184
58370A727776J87319J23066M0161J39877J18894j89475l47679l2130L30936K32904
58360B331649j05448j89994o9474p3711j39939l8714P2102n1210j81249K5394
58350A579406L79817M53314K73162J62185J26449k9052j96792j47978k7868j23668
58340B448975l07899k36627N3039K35426K27406J67305M8561j68703k81308j34248
58330B051927K7515n4328j76673o9615M0066j64510m01592j78482L12706L89656
58320A776670q1330m91572l74686O6613L88059M04899J99938j9016n0354P1227
$$ plain form
58390 1088514 1502236 1639225 1403596 1213655 1379906 1795550 2226603 2516964 2527903 2242588
58380 2242588 1915744 1810715 1858138 1862712 1884848 2054896 2190720 2040100 1764960 1727776
58370 1727776 1915095 2038161 2078322 2218199 2337093 2147618 1799939 1767809 2098745 2331649
58360 2331649 2226201 2036207 1966733 1893022 1753083 1714369 1786471 1735261 1554012 1579406
58350 1579406 1959223 2412537 2685699 2847884 2974333 2945281 2748489 2600511 2572643 2448975
58340 2448975 2141076 1904449 1957488 2192914 2420320 2587625 2636186 2467483 2186175 2051927
58330 2051927 2079442 2025114 1848441 1778826 1818892 1654382 1252790 1074308 1387014 1776670
58320 1776670 1695340 1203768 829082 895695 1283754 1688653 1888591 1869575 1819221 1890448
58310A890448Q5303n6141n2956J64685J52395l11804o71300l78143J86693L08442
58300A317622Q2654J08725L20172J14966m35700n51274m3449L26538Q5320k41439
58290A084135p9401K92000L19961P4589j2135R9482J20996J4027P065J31176J42125
58279B194020o7246k45979r0391L24900N56437L13335j20970k12461R0658K89712
58269C032015R4329j75424j72189m9488n5436n1518J07622J50233j11553k75305
58259B493286J6946L27809O0893m70325m60395J04069M72281L44856J46686Q4799
58249C120905j25427m57044m05352J07018M59538K76437p4401k17408k94280m18339
58239A971647k99391J60847M90382L08471j14529l37602l30921k37239l1242K15340
$$ plain form
58310 1890448 1975751 1919610 1866654 2031339 2183734 1871930 1200630 822487 1009180 1317622
58300 1317622 1400276 1509001 1829173 1944139 1508439 957165 913716 1240254 1325574 1084135
58290 1084135 1004734 1296734 1616695 1691284 1679149 1778631 1899627 1913654 1920719 2051895 2194020
58279 2194020 2126774 1880795 1790404 2115304 2671741 2985076 2864106 2651645 2742303 3032015
58269 3032015 3126344 2950920 2778731 2729243 2673807 2622289 2729911 2880144 2768591 2493286
58259 2493286 2510232 2838041 2898934 2428609 1968214 2072283 2544564 2889420 3036106 3120905
58249 3120905 2995478 2538434 2133082 2240100 2699638 2976075 2901674 2684266 2389986 1971647
58239 1971647 1672256 1833103 2323485 2631956 2517427 2179825 1848904 1611665 1580423 1795763
58229A795763J89007j49652l24078k1101L70795L27889l4817k04885m8375R3881
58219A994427l2817k90283l70474j28669K63321M30689J84396j98387k79409k0560
58209A552234K24810K43208J42214J3529j87265l74717l34912p1549J91757L82229
58199A781538N80455O59463L71011j56287m53078l28665n3451J12444J47774K6941
58189B688145k64511m49113k06085K58382M06554J57917o6874q9763j34682k20382
58179B079588r7193J25281L4509k58660j43301M16589O52010J73916l97782m09436
58169B175521m8639K10471L35699M04712K00418l02552o06382l78064K6851J72546
58159B190581J30461M9567k08034n20242l16809M45383Q39733K59748n13808m25001
$$ plain form
58229 1795763 1984770 1835118 1511040 1489939 1860734 2188623 2153806 1948921 1900546 1994427
58219 1994427 1961610 1671327 1300853 1172184 1435505 1866194 2050590 1852203 1572794 1552234
58209 1552234 1777044 2020252 2162466 2175995 1988730 1614013 1279101 1207552 1399309 1781538
58199 1781538 2361993 3021456 3392467 3236180 2783102 2454437 2400986 2513430 2661204 2688145
58189 2688145 2423634 1974521 1768436 2026818 2433372 2591289 2524415 2434652 2299970 2079588
58179 2079588 1982395 2107676 2142185 1883525 1740224 2156813 2808823 2982739 2584957 2175521
58169 2175521 2126882 2337353 2673052 3077764 3278182 2975630 2369248 1991184 2018035 2190581
58159 2190581 2321042 2370609 2162575 1642333 1325524 1770907 2610640 2870388 2356580 1931579
58149A931579K46358M08430j03232m16080r8329L22080L82034K83377K55509J10215
58139C321941k49644m81840l08715N3076K50561K56419K31571J88143L4834j86268
58129C110078l07765k46020r6120l910J4728N7086J14893J9719k51405l89953
58119B021331j44842K46532L65165K22410J38624J23261q5067l92426l67615L7207
58109B164580L60944L36398J64612R457j82292k87226r9681J00583j75909o77619
58099A713847n91577J39534O21310M22938J75685L24383L51812j06946m00548
58090B650438M3568O23546M95281r5469l46050j81830r1671j56736j16895k3643
58080B800539n7565n4026J37485K41261P7393l6113M5246r7361n43112n59760
$$ plain form
58149 1931579 2177937 2586367 2483135 2067055 1968726 2290806 2672840 2956217 3211726 3321941
58139 3321941 3072297 2590457 2281742 2334818 2585379 2841798 3073369 3261512 3296346 3110078
58129 3110078 2802313 2556293 2460173 2456263 2470991 2528077 2642970 2662689 2411284 2021331
58119 2021331 1876489 2123021 2488186 2710596 2849220 2972481 2887414 2494988 2127373 2164580
58109 2164580 2525524 2861922 3026534 3035991 2853699 2566473 2466792 2567375 2391466 1713847
58099 1713847 1122270 1261804 1883114 2306052 2481737 2806120 3157932 3050986 2650438
58090 2650438 2694006 3317552 3812833 3717364 3371314 3189484 3097813 2941077 2824182 2800539
58080 2800539 2742974 2688948 2826433 3067694 3145087 3108974 3154220 3056859 2513747 1953987
58070A953987J77875P61639M02395k34245j56598K86553J48709l82325m00395
58061B557595O8416K53075J05348J72888L07722o3945n99040m27297K30678L03259
58051B908699k89999n07789L190M20560K87555J47361L16301L33570K6556q5591
58041C560413J37801J23659k75046m08241j8322K66883O6078j61326q6855n7442
58031C147602k20396j28651K89487L79266q3111l73602n0029K74296N4041k18681
58021C070222O0323N19224M76500N4976j64588q7355K0615J55651M03756N10751
58011E020075K21854k36306m73230m39956k76031k4614J88841J16235j71277k45578
58001C680013j047J28917p7561k20082K6370L46489L33200J18174K9912M8503
$$ plain form
58070 1953987 2131862 2893501 3295896 3061651 2905053 3191606 3340315 2957990 2557595
58061 2557595 2626011 2879086 2984434 3157322 3465044 3401099 2802059 2374762 2605440 2908699
58051 2908699 2618700 2110911 2114101 2534661 2822216 2969577 3285878 3619448 3646004 3560413
58041 3560413 3698214 3821873 3546827 3138586 3120264 3387147 3453225 3291899 3205044 3147602
58031 3147602 2927206 2798555 3088042 3467308 3384197 3010595 2960566 3234862 3288903 3070222
58021 3070222 3130545 3649769 4126269 4181245 4016657 3929302 3949917 4105568 4509324 5020075
58011 5020075 5241929 5005623 4532393 4092437 3816406 3791792 3980633 4096868 3925591 3680013
58001 3680013 3678966 3807883 3730322 3510240 3536610 3883099 4216299 4334473 4364385 4412888
57991D412888J1260j4493N6532P3154o9413j92457j34986N7P6225Q7371j570k03530
57979D101038k67364M6152M32470L52826q7238k20997J25159L82665K29057O5544
57969E159312J96049K55353j03726n47253n64537k03300J10103J58558M2459k8537
57959D474481J14361L95317M35478M1419l60585k54606J60633L01358J57278J77845
57949E642979L36458J72408k69301m43777k82193k48642l75247k10095J81459
57940D504049J97676j44306r9703M82514P83649L41463k21006k23161J70289M54797
57930F246261M20377K0539o09780q73037l21964M07107L00944l97033m97727J44094
57920D839781M11314q0833l68363K0491K26727k50128n77154j57201K66321K2078
$$ plain form
57991 4412888 4424148 4409655 4466187 4539341 4469928 4277471 4142485 4142542 4218767 4306138 4304568 4101038
57979 4101038 3833674 3879826 4312296 4665122 4577884 4356887 4482046 4864711 5093768 5159312
57969 5159312 5355361 5610714 5506988 4959735 4395198 4191898 4302001 4460559 4503018 4474481
57959 4474481 4588842 4984159 5419637 5461056 5100471 4845865 5006498 5307856 5465134 5642979
57949 5642979 5979437 6151845 5882544 5438767 5156574 4907932 4532685 4322590 4504049
57940 4504049 4701725 4557419 4457716 4940230 5723879 6065342 5844336 5621175 5791464 6246261
57930 6246261 6666638 6687177 6077397 5204360 4882396 5289503 5590447 5193414 4695687 4839781
57920 4839781 5251095 5170262 4801899 4822390 5049117 4798989 4221835 4064634 4330955 4353033
57910D353033k99041n1613L09902K74896K72207O20939O74295N4897m07260m5838
57900E756417M43023K51376j81747j46955Q2485N9069J22975M64149L78623l86257
57890F843158p49159j2474P57819M41810k60071j76271K82474J00221l48624p9956
57880F798927N59741N36904L5686k9953J92042q4545n96606m78572M8958R9294
57870G081876j84980m087M16253J90255m74523n52180k8763J53377j48028j40956
57860F308244L19192M96325J68805o9821M3184J64615J93996L24368L59280k159
57850H306029l94565k71554J33848K69459K50539M16393M52424J6959l46932m7555
57840H785045M20842L16896m8764k4274J25515q9173k46969J12969L51749j37753
$$ plain form
57910 4353033 4053992 4002379 4312281 4587177 4859384 5480323 6154618 6209515 5802255 5756417
57900 5756417 6199440 6450816 6269069 6122114 6204599 6263668 6386643 6850792 7229415 6843158
57890 6843158 6093999 6081525 6839344 7281154 7021083 6844812 7127286 7227507 6878883 6798927
57880 6798927 7358668 7895572 7931258 7901305 8093347 8008802 7412196 6933624 6982582 7081876
57870 7081876 6896896 6892809 7309062 7499317 7024794 6472614 6443851 6597228 6449200 6308244
57860 6308244 6627436 7123761 7292566 7222745 7265929 7430544 7624540 7948908 8308188 8306029
57850 8306029 7911464 7639910 7773758 8043217 8293756 8710149 9162573 9179532 8832600 8785045
57840 8785045 9205887 9522783 9474019 9449745 9575260 9486087 9239118 9352087 9703836 9566083
57830I566083n89608j61743M12935J26625l65546N1864P75774N15380l32106m17449
57820I582209J67777L20446P4114K16355M19827r9684p00576k68038O01418N78588
57810A0892436M7137K44525P31950K58676n69008k19408P61301N57456n53619
57801A2151446o37350L80318O86218l2745k39808L68644M64760q0075L5444P43512
57791A3840364N64797m06538m84488L87172M62684m43912n60569M61846R20940
57782A4742296L20873J28361P29329P59189K8782k4699O57396N06234m22932k91290
57772A7133539R17174J123454O4381j68708Q27908R84703j73902n73792L54546
57763B0489303O36990j98820j31269J157559J320161j13518n52600Q38538J542034
$$ plain form
57830 9566083 8976475 8814732 9227667 9354292 8988746 9040610 9816384 10331764 9999658 9582209
57820 9582209 9749986 10070432 10144546 10360901 10780728 10681044 9980468 9712430 10313848 10892436
57810 10892436 10939573 11184098 11916048 12174724 11605716 11386308 12147609 12705065 12151446
57801 12151446 11514096 11894414 12580632 12547887 12308079 12676723 13141483 13061408 13096852 13840364
57791 13840364 14405161 13998623 13514135 13901307 14363991 13920079 13359510 13821356 14742296
57782 14742296 15063169 15191530 15920859 16680048 16708830 16684131 17341527 17847761 17424829 17133539
57772 17133539 18050713 19174167 19238548 19069840 19897748 20882451 20708549 20134757 20489303
57763 20489303 21126293 20927473 20796204 21953763 23273924 23160406 22607806 23446344 24988378
57754B4988378M91927j8790J035267J456630L53379j6560J151321J508158L78235
57745C1327945L04674J805081J903542J9573l65826J718259K554738P75910J36346
57736D0180242K234075L268307J510391Q60564L077711M000356J838728J219733
57728E8190107M127601N410101K767346J881876N329362O621230K711248J236454
57720H8275325O425413J0051110P064175O490147J3499707J6379054Q970761P872464
57712A65028156K0830580J4998193m3833671j25021943j50872164r2260463p916683
57705b19047995L1129904K2182050R676376J3723833J7681755J1260315O158052
57698a07235710R029732J0094134M307100P02584M297792P248035M316875J592947
$$ plain form
57754 24988378 25480305 25461515 26496782 27953412 28306791 28290231 29441552 30949710 31327945
57745 31327945 31632619 33437700 35341242 35360815 34994989 36713248 39267986 40043896 40180242
57736 40180242 42414317 45682624 47193015 48053579 51131290 55131646 56970374 58190107
57728 58190107 62317708 67727809 70495155 72377031 77706393 84327623 87038871 88275325
57720 88275325 94700738 104751848 111816023 118306170 131805877 148184931 157155692 165028156
57712 165028156 185858736 200856929 157023258 32001315 -118870849 -211131312 -219047995
57705 -219047995 -187918091 -165736041 -156059665 -142335832 -124654077 -113393762 -107235710
57698 -107235710 -98205978 -88111844 -83804744 -83102160 -78804368 -71556333 -67239458 -65646511
57690f5646511L634207N339432K756389M28253K013357L582009J867408L70170
57682d5655286J956300L263319J498772k54617P84317K035655J047202J16381
57674c5207957J286151K217017R97016m5012R38637J648706L00202p12848N83172
57665b7994916J863952Q47896n34288R6989J326862R82717R0548M23148J071468
57656b1825624O09146k6976L28025O29491q9443n34558L38690J157956P27521
57647a8685772K24944O58939P94106k03999p45831K82765J217695N34392m62451
57638a6385212k00730L81189L157l95512K89047R44755L64601l47899J09984P43827
57628a4492793K54458m27414P000P06073L57311l08362n5819M58898J31996l33789
$$ plain form
57690 -65646511 -62012304 -56672872 -53916483 -53488230 -51474873 -47892864 -46025456 -45655286
57682 -45655286 -43698986 -40435667 -38936895 -39191512 -38407195 -36371540 -35324338 -35207957
57674 -35207957 -33921806 -31704789 -30707773 -30752785 -29814148 -28165442 -27865240 -28578088 -27994916
57665 -27994916 -26130964 -25283068 -25817356 -25720367 -24393505 -23410788 -23320240 -22897092 -21825624
57656 -21825624 -21216478 -21243454 -20915429 -20285938 -20375381 -20909939 -20571249 -19413293 -18685772
57647 -18685772 -18460828 -17801889 -17007783 -17211782 -17957613 -17674848 -16457153 -15922761 -16385212
57638 -16385212 -16585942 -16204753 -16201596 -16597108 -16308061 -15363306 -14998705 -15346604 -15236620 -14492793
57628 -14492793 -14238335 -14665749 -14658749 -13952676 -13595365 -13903727 -13959546 -13500648 -13368652 -13702441
57618a3702441J13374O85481K60814l88499p9771N01702K00233l31150M6661O91303
57608a2002293M33799j67987o937L76012m6165o14457j76929O46942N75606o79
57598a0983088N8748M15113J08698l39189J02872P95174M45846m67482m93459
57589a0356767K62281N48668K77381L02500M77012M0313n51537k52883N39760
57580h713272N80106j1070q9420L39986K71040k92004m16312r6934j54567m86585
57570i069032k56662L44794L30599k31312l40228R4653K44735O1268K67614P47324
57560g806247O44676L6053j53921J25118N0899l66787k49946M10098O11640J01548
57550f596869k55732n8381J20776j2329o5804L0022j08669l40886j36823K88535
$$ plain form
57618 -13702441 -13589067 -12903586 -12642772 -13031271 -13111042 -12609340 -12409107 -12740257 -12693596 -12002293
57608 -12002293 -11568494 -11736481 -11743418 -11367406 -11413571 -12028028 -12204957 -11558015 -10982409 -10983088
57598 -10983088 -10924340 -10509227 -10400529 -10739718 -10636846 -9841672 -9395826 -9863308 -10356767
57589 -10356767 -10094486 -9545818 -9268437 -8965937 -8488925 -8448612 -9000149 -9253032 -8713272
57580 -8713272 -8133166 -8144236 -8233656 -7893670 -7622630 -7914634 -8330946 -8427880 -8582447 -9069032
57570 -9069032 -9325694 -8980900 -8650301 -8881613 -9221841 -9127188 -8882453 -8821185 -8553571 -7806247
57560 -7806247 -7161571 -7125518 -7279439 -7154321 -7103422 -7470209 -7720155 -7310057 -6698417 -6596869
57550 -6596869 -6852601 -6910982 -6790206 -6802535 -6868339 -6838317 -6946986 -7287872 -7424695 -7136160
57540g136160K42338r5853O4249N65095M43413l37885p54142m26171m7168K8200
57530g454084K07234N02860L63711j09629j33110L38652M76521P8332j25997J07778
57520e747732J73914p5913m0287L14346K37763l32918m76164R7490M97305K26149
57510e126047m4751J34664J41867m61598r97986p73128j17172L63225O46723P94173
57500e440030N14832j32579m66254j93585J15289M4986n5226O5090N3333j73842
57490e667986o7952M50671N68919m5863m89509p9169M20800M9440p08849o98040
57480f267538O8318N36742K96153J4117K14158N49828M87300O6279k78798k98982
57470d612423j21448L336K0286P9486K14339K08125k6806j94415q1267J5345j90074
$$ plain form
57540 -7136160 -6893822 -6989675 -6925426 -6360331 -5916918 -6254803 -7008945 -7435116 -7482284 -7454084
57530 -7454084 -7246850 -6743990 -6380279 -6489908 -6623018 -6284366 -5807845 -5729513 -5855510 -5747732
57520 -5747732 -5573818 -5649731 -5690018 -5375672 -5137909 -5470827 -5946991 -5849501 -5352196 -5126047
57510 -5126047 -5170798 -5036134 -4894267 -5355865 -6353851 -7126979 -7244151 -6880926 -6234203 -5440030
57500 -5440030 -4925198 -5057777 -5524031 -5717616 -5602327 -5557341 -5612567 -5547477 -5494144 -5667986
57490 -5667986 -5735938 -5285267 -4716348 -4762211 -5251720 -5330889 -4910089 -4860649 -5569498 -6267538
57480 -6267538 -6199220 -5662478 -5366325 -5352208 -5138050 -4588222 -4100922 -4034643 -4313441 -4612423
57470 -4612423 -4733871 -4730535 -4710249 -4630763 -4416424 -4208299 -4235105 -4429520 -4510787 -4495442 -4685516
57459d685516l39917J4951N11073M37295p8835k66595m568Q4077j54768j75963
57449d658766J14185P9035m37485o61422j23060N69130O95877L69790L7539k03357
57439d218534l34542j87142R2716N0709k50822j89556K92114M09666j61298o26289
57429e122978l09514L03322M31426J44258n5740j07183j50754l8461K53136L05150
57419d347338l4192k33257L1407K40575m8205l45844p3025L84737L28712p6306
57409d172736j73617N0149Q8261j24803k03468n5320Q7375J89416L29551L18644
57399c666548N688k79234j80310M8466l5257k73341j82379J94947L65128J89420
57389c813420K2840R8839K57959K65065N8990k32218l17108q756L69396K39574
$$ plain form
57459 -4685516 -5025433 -5010482 -4499409 -4062114 -4140949 -4407544 -4412112 -4328035 -4482803 -4658766
57449 -4658766 -4544581 -4465546 -4903031 -5564453 -5687513 -5118383 -4422506 -4052716 -4015177 -4218534
57439 -4218534 -4553076 -4740218 -4647502 -4596793 -4847615 -5037171 -4745057 -4335391 -4496689 -5122978
57429 -5122978 -5432492 -5129170 -4697744 -4553486 -4609226 -4716409 -4867163 -4905624 -4652488 -4347338
57419 -4347338 -4381530 -4614787 -4583380 -4342805 -4391010 -4736854 -4809879 -4425142 -4096430 -4172736
57409 -4172736 -4346353 -4296204 -4207943 -4332746 -4536214 -4591534 -4504159 -4314743 -3985192 -3666548
57399 -3666548 -3660860 -3940094 -4120404 -4071938 -4107195 -4380536 -4562915 -4367968 -4002840 -3813420
57389 -3813420 -3790580 -3691741 -3433782 -3168717 -3109727 -3341945 -3659053 -3667809 -3298413 -3058839
57379c058839l54135o45252k40320K69742K36770r6493j36217J09900K53502K50335
57369c411007K66251K05048k7251j55371Q843J42743j5919j38698Q2666L13698
57359b728997J95156K6255J23870R5408m10046p99191l67499M29694N94474J23656
57349b717220j50615Q760Q2337r6298j65925j02468k15947l39026n4207L29438
57339c421171J20548m56751m78395J07974L70699L4304q0842L74274O00412J32956
57329b695992k62750J6164K70988k31422q18987m51023M83817P06612L2786m54530
57319c404337j53892L11237L03301R9431J61290K59891m8141n35984n60168m2647
57309c610019L81051K73084l973J38115O18579P67401K55328m50195o99320m18756
$$ plain form
57379 -3058839 -3412974 -4058226 -4298546 -4028804 -3792034 -3888527 -4024744 -3914844 -3661342 -3411007
57369 -3411007 -3144756 -2939708 -2966959 -3122330 -3113487 -2970744 -2986663 -3125361 -3042695 -2728997
57359 -2728997 -2533841 -2507586 -2383716 -2288308 -2698354 -3497545 -3865044 -3435350 -2840876 -2717220
57349 -2717220 -2867835 -2859075 -2776738 -2873036 -3038961 -3141429 -3357376 -3696402 -3750609 -3421171
57339 -3421171 -3300623 -3757374 -4235769 -4127795 -3757096 -3722792 -3803634 -3429360 -2828948 -2695992
57329 -2695992 -2958742 -2942578 -2671590 -2903012 -3721999 -4173022 -3689205 -2982593 -2949807 -3404337
57319 -3404337 -3558229 -3246992 -2943691 -2844260 -2682970 -2423079 -2471220 -3007204 -3567372 -3610019
57309 -3610019 -3228968 -2955884 -2959857 -2821742 -2203163 -1435762 -1180434 -1630629 -2329949 -2748705
57299b748705k8644J51699J22810L087p8377M690J83535J31512l01536p13827
57289c273756n76202L3657N02137M70269J77155j2328m4314l9240l5103j2449
57279b810174K5754Q7740J67714J96203J62996J98848L34240L19912k5120m25210
57269a767097m66935k08008p0298j85507k77933j87902o1121K9715J97439L68768
57259b628879K47428j65464m07753j59806K89228M33721J91374r0166j25965J6237
57249b400045P1309r3137l05726k73828K5823K61657J79096l9805o1453J03859
57239b532250J72386M7630r3987j18903n6141M3053J08765P916k37841l22984
57229b982356n5899K66342K43958j3434p7530J19912K59104K00097R9981R752
$$ plain form
57299 -2748705 -2777349 -2625650 -2502840 -2499753 -2578130 -2573440 -2389905 -2258393 -2559929 -3273756
57289 -3273756 -3849958 -3816301 -3314164 -2843895 -2666740 -2679068 -2723382 -2762622 -2797725 -2810174
57279 -2810174 -2784420 -2696680 -2528966 -2332763 -2169767 -1970919 -1636679 -1316767 -1341887 -1767097
57269 -1767097 -2234032 -2442040 -2512338 -2697845 -2975778 -3163680 -3224801 -3195086 -2997647 -2628879
57259 -2628879 -2381451 -2546915 -2954668 -3114474 -2825246 -2391525 -2200151 -2290317 -2416282 -2400045
57249 -2400045 -2328736 -2421873 -2727599 -3001427 -2975604 -2713947 -2534851 -2574656 -2636109 -2532250
57239 -2532250 -2359864 -2312234 -2406221 -2525124 -2581265 -2538212 -2429447 -2421531 -2659372 -2982356
57229 -2982356 -3038255 -2771913 -2527955 -2541389 -2618919 -2499007 -2239903 -2039806 -1939825 -1930073
57219a930073j62048l07014k23258m6991q1205k16164o6424L07449M09470J14549
57209b201709j37285q0645L8988L6517Q5729K13695R6237l27573n75312l10955
57199c162313J45145L29989K29748M8035j64528l09347j23152L44362N48809J67693
57189a945559l66393m72191k15558m8481o0253Q663K00525K66988Q9036j72805
57179b716028k86223j01071L39849O78232N01503p2494m12224k22271L2898r9982
57169b357811l20502j15119L37359M40777J40770n7929M7028J19351n1167k29395
57159b046638k10771j24308q9983L887J82865K10706l4271k89627k56925j4946
57149b670011J40205J18830P9975J25386J51119K7924j74776k13489M6505L75536
$$ plain form
57219 -1930073 -2092121 -2399135 -2622393 -2669384 -2750589 -2966753 -3033177 -2725728 -2316258 -2201709
57209 -2201709 -2338994 -2419639 -2380651 -2344134 -2258405 -2044710 -1948473 -2276046 -2851358 -3162313
57199 -3162313 -3017168 -2687179 -2457431 -2409396 -2573924 -2883271 -3006423 -2662061 -2113252 -1945559
57189 -1945559 -2311952 -2784143 -2999701 -3048182 -3108435 -3099772 -2899247 -2632259 -2543223 -2716028
57179 -2716028 -3002251 -3103322 -2763473 -2085241 -1583738 -1656232 -2068456 -2290727 -2257829 -2357811
57169 -2357811 -2678313 -2793432 -2456073 -2015296 -1874526 -1932455 -1885427 -1766076 -1817243 -2046638
57159 -2046638 -2257409 -2381717 -2471700 -2467813 -2284948 -2074242 -2108513 -2398140 -2655065 -2670011
57149 -2670011 -2529806 -2410976 -2331001 -2205615 -2054496 -2026572 -2201348 -2414837 -2368332 -1992796
57139a992796L25180k33755p95645o82905J18608Q22804P21924L4994l94822j83239
57129b259652J80615J18040k24994l00458l4466J45813J00045J78392M75527M94523
57119a126615n4281o29312n72143p2053J89790Q0739K2746J31101R2752j14498
57109b051774j19876J18511J80489n1903j56894O2917K18368M7019j09644P6937
57099a785850L55304L53315J44514l9311k12795l52461j77467L10753N12690J5359
57089h75949o61436p04761j38785K95461K29883K3631N1753J91584J38795j33671
57079a583495l73572l33015k5038K31350J40559j37646j39507K13748M39433K14351
57069a352832j31880j60753L3693J28194J42287K21987J71644k33228o74781o08798
$$ plain form
57139 -1992796 -1667616 -1901371 -2697016 -3379921 -3261313 -2438509 -1716585 -1681591 -2076413 -2259652
57129 -2259652 -2079037 -1960997 -2185991 -2486449 -2520915 -2375102 -2275057 -2096665 -1621138 -1126615
57119 -1126615 -1180896 -1810208 -2382351 -2454404 -2264614 -2183875 -2161129 -2030028 -1937276 -2051774
57109 -2051774 -2171650 -2053139 -1872650 -1924553 -2081447 -2018530 -1800162 -1753143 -1862787 -1785850
57099 -1785850 -1430546 -1077231 -932717 -972028 -1184823 -1537284 -1714751 -1403998 -891308 -875949
57089 -875949 -1537385 -2242146 -2380931 -2085470 -1855587 -1831956 -1780203 -1588619 -1449824 -1583495
57079 -1583495 -1957067 -2290082 -2315120 -2083770 -1943211 -2080857 -2220364 -2006616 -1567183 -1352832
57069 -1352832 -1484712 -1645465 -1611772 -1483578 -1341291 -1119304 -947660 -1180888 -1855669 -2464467
57059b464467n1793M53305N80246M58199K48528k8496k60931k82255j60694r5603
57049a603961o2826Q1814K18131P9611k76318m96334m18726j95033L8503K71263
57039b363876M32167M16283K75643J26966l7744k06070k04219p113O0693j76762
57029a684032l35037o2330K43640j6336n58731m83128L49097J003849P67284M5372
57019g30352l78544l89547l76388m39512k98025J57302O18647O90633K99206k26039
57009a072619m47667k60710J933M396j68367j97703M017K58628M08551L71385
56999a098156Q5090k90084l35358O4721L63490O4655m23844k96269L97166P41199
56989g27390K68905m34015o46928l92351r3729R4699K36778K88141J85765L0233
$$ plain form
57059 -2464467 -2516260 -2062955 -1482709 -1024510 -775982 -804478 -1065409 -1347664 -1508358 -1603961
57049 -1603961 -1666787 -1584973 -1366842 -1287231 -1563549 -2059883 -2478609 -2673642 -2635139 -2363876
57039 -2363876 -1931709 -1515426 -1239783 -1112817 -1150561 -1356631 -1560850 -1567963 -1507270 -1684032
57029 -1684032 -2019069 -2081399 -1837759 -1854095 -2412826 -2895954 -2546857 -1543008 -775724 -730352
57019 -730352 -1108896 -1498443 -1874831 -2314343 -2612368 -2455066 -1836419 -1145786 -846580 -1072619
57009 -1072619 -1520286 -1780996 -1779063 -1774667 -1943034 -2140737 -2136720 -1878092 -1469541 -1098156
56999 -1098156 -1013066 -1303150 -1638508 -1573787 -1210297 -1145642 -1569486 -1865755 -1468589 -727390
56989 -727390 -458485 -892500 -1539428 -1931779 -2025508 -1930809 -1694031 -1405890 -1220125 -1189892
56979a189892m6611j0945J37444L00972J90713l16753p66375n64723J43967N84753
56969a537450M03925L4810r2174o3040j2568J86311M55225L56313k03465o48022
56959a120135n05288k8079L05609M09066L49751M4880l79904m58063p9140J86312
56949a274991n5337l62011k03338J62142K05493M1609Q6740K02805j804l02753
56939a501445j50105L18579M05954k1356l43653k14740k6698j42803l19308j99376
56929b194951J06984K61543J89304O6976L0049O2479M8925j05411k94255k48621
56919b076978N8727K27855m9017m58206m38078M3540M93528N77110L71680K4691
56909a225148l64734n42013k60180K82535N65907L72565l4700l33684l83502j26926
$$ plain form
56979 -1189892 -1236503 -1247448 -1110004 -809032 -618319 -935072 -1701447 -2266170 -2122203 -1537450
56969 -1537450 -1133525 -1098715 -1190889 -1253929 -1266497 -1080186 -624961 -268648 -472113 -1120135
56959 -1120135 -1625423 -1653502 -1347893 -938827 -589076 -544196 -924100 -1382163 -1461303 -1274991
56949 -1274991 -1330328 -1692339 -1895677 -1733535 -1528042 -1486433 -1399693 -1196888 -1198692 -1501445
56939 -1501445 -1651550 -1332971 -927017 -948373 -1292026 -1506766 -1533464 -1676267 -1995575 -2194951
56929 -2194951 -2087967 -1826424 -1637120 -1570144 -1540095 -1477616 -1428691 -1534102 -1828357 -2076978
56919 -2076978 -2018251 -1790396 -1839413 -2297619 -2735697 -2692157 -2198629 -1621519 -1249839 -1225148
56909 -1225148 -1589882 -2131895 -2392075 -2109540 -1543633 -1171068 -1205768 -1539452 -1922954 -2049880
56899b049880L07266M73430Q3725m25723l61366J97526M63127J07419l20859l40457
56889a865792j90658j99083j64841J35259L73373J83181j54706j32570J61725
56880a854112K25476l1952j99642l4660K57715M06470L50683J34365j47001k96820
56870a189478j84440N9947K23842K76277K32776l6816n18059p61285l58741L54589
56860a901388N86075J25091l86207l59282K8126K65029K38054J73126J35127n75
56850a096824k04486k94981k56826k42898k38281k5649M03618O59194L93847j81194
56840a084480m69287k01551K25912K56561j22880m06857k72287K9204J14201L5492
56830a895972J03199K88430K23625j64119m37267k64258R5043K19004J55672K20749
$$ plain form
56899 -2049880 -1742614 -1269184 -1185459 -1611182 -1972548 -1775022 -1311895 -1204476 -1525335 -1865792
56889 -1865792 -2056450 -2255533 -2420374 -2285115 -1911742 -1728561 -1883267 -2015837 -1854112
56880 -1854112 -1628636 -1660588 -1860230 -1894890 -1637175 -1230705 -880022 -745657 -892658 -1189478
56870 -1189478 -1373918 -1313971 -1090129 -813852 -581076 -617892 -1135951 -1897236 -2255977 -1901388
56860 -1901388 -1315313 -1190222 -1576429 -1935711 -1907585 -1642556 -1404502 -1231376 -1096249 -1096824
56850 -1096824 -1301310 -1596291 -1853117 -2096015 -2334296 -2359945 -1956327 -1297133 -903286 -1084480
56840 -1084480 -1553767 -1755318 -1529406 -1272845 -1395725 -1802582 -2074869 -2045665 -1931464 -1895972
56830 -1895972 -1792773 -1504343 -1280718 -1444837 -1882104 -2146362 -2051319 -1832315 -1676643 -1455894
56820a455894L52705J84497k44859l85228J7849M54245L31362j71975l49483O2987
56810a203794N65287N61134L5365n27394o83017l79830Q4028L43139K60932K373
56800i41777j83663k00777r0013R4292K59100K29061o9726m15565m73013j78495
56790a970576K00933L79846K86468L0812j83594j60625P6863K14563L630l50453
56780a472133m11882j03518K21611L02350K31991J48257K3910j07214o8545J27132
56770a108041J82029l6004k45701j89303j8870K6446L1604J57112K44552P3003
56760h83173j84393j90607m195L3953r6680p3581J67995K72034L0811k71848k85182
56749a484866o6163Q3168L5151j13923k52869l11947k10752O4160L60765M70715
$$ plain form
56820 -1455894 -1103189 -918692 -1163551 -1548779 -1530930 -1076685 -745323 -917298 -1266781 -1203794
56810 -1203794 -638507 -77373 -42008 -569402 -1252419 -1632249 -1548221 -1205082 -944150 -941777
56800 -941777 -1125440 -1326217 -1416230 -1321938 -1062838 -833777 -903503 -1319068 -1792081 -1970576
56790 -1970576 -1769643 -1389797 -1103329 -1072517 -1256111 -1416736 -1339873 -1125310 -1121680 -1472133
56780 -1472133 -1884015 -1987533 -1765922 -1463572 -1231581 -1083324 -1059414 -1166628 -1235173 -1108041
56770 -1108041 -926012 -962016 -1207717 -1397020 -1415890 -1389444 -1357840 -1200728 -956176 -883173
56760 -883173 -1067566 -1258173 -1262368 -1228415 -1325095 -1398676 -1230681 -958647 -927836 -1199684 -1484866
56749 -1484866 -1551029 -1467861 -1432710 -1546633 -1799502 -2111449 -2322201 -2258041 -1897276 -1426561
56739a426561L41144J15451l0866o2082r3607k30575l91604l46119J8206N05677
56729a600936P59456N87307J18050l13913m19902j88866Q3225R6512q2683j04315
56719a066065J56255L89872L01660M4537l6877P6857J24800L5725K1924J89781
56709B38469L42715K56748l9894l37765m67862m18623l30982l63069m67964l83783
56699a972010J3456M43430N09955J94963j49048k53201j47705M3741K51878L64047
56689g00494K35179q9222l32163k77204M271K79318M00612L64993K15080k3588
56679G6782k99106m65713l52558K244K64168J53588j42821j92654L0414R3219
56669h32437j76927l67976j54376J48153J07497j35580k07569j87665l41012m31974
$$ plain form
56739 -1426561 -1085417 -969966 -1000832 -1062914 -1156521 -1387096 -1778700 -2124819 -2106613 -1600936
56729 -1600936 -841480 -254173 -136123 -450036 -869938 -1058804 -975579 -879067 -961750 -1066065
56719 -1066065 -909810 -519938 -218278 -173741 -210618 -133761 -8961 26764 48688 238469
56709 238469 581184 837932 798038 460273 -7589 -426212 -757194 -1120263 -1588227 -1972010
56699 -1972010 -1958554 -1515124 -1005169 -810206 -959254 -1212455 -1360160 -1316419 -1064541 -700494
56689 -700494 -465315 -554537 -886700 -1163904 -1159633 -880315 -479703 -114710 100370 76782
56679 76782 -222324 -688037 -1040595 -1038351 -774183 -620595 -763416 -956070 -925656 -832437
56669 -832437 -1009364 -1377340 -1531716 -1383563 -1276066 -1411646 -1619215 -1806880 -2147892 -2579866
56659b579866k8812O13009P23718J32736m66267m89133q9481L20483N66434N50388
56649g46791J93601k23841k19158J62193L17708J4581k58034j45314J8569q6357
56639i72843j49653J51641M78012L80513P0243r89O4621r1377l17019k01232J26588
56628d61495J67992j01170k52703j92396k19228l10946r0394L71990M41084j13622
56618g60888o34760m53412J95116N52039L33284o6658k11181r1633K3639m4150
56608a158604k35569l67227l33468j81632N5J80468L16530L06261J31497n3236
56598a394925j00918l2325R3161K86946M55563L57637r383k30338l3072K06264
56588d01390j3951m63983m39827J38825N25182K17212l42725m65043j50499R0421
$$ plain form
56659 -2579866 -2608678 -1995669 -1271951 -1139215 -1605482 -2094615 -2184096 -1863613 -1297179 -746791
56649 -746791 -553190 -777031 -996189 -833996 -516288 -501707 -759741 -905055 -886486 -972843
56639 -972843 -1122496 -970855 -492843 -112330 -42087 -43076 21545 -69832 -386851 -588083 -461495
56628 -461495 -293503 -394673 -647376 -839772 -1059000 -1369946 -1460340 -1088350 -647266 -760888
56618 -760888 -1395648 -1849060 -1653944 -1101905 -768621 -835279 -1046460 -1138093 -1114454 -1158604
56608 -1158604 -1394173 -1761400 -2094868 -2276500 -2276445 -2095977 -1779447 -1473186 -1341689 -1394925
56598 -1394925 -1495843 -1528168 -1435007 -1148061 -692498 -334861 -344244 -574582 -607654 -401390
56588 -401390 -415341 -879324 -1319151 -1180326 -655144 -437932 -780657 -1245700 -1396199 -1305778
56578a305778M4638m0725L1579J50952J58896P0545k6474j06003j64968j59295
56568a346633n0241J09209J80837Q7034m2489J8536K51584L13419o966l83042
56558h68752l12559J54485M20755J61763k24269k01660J57039L20462M6510l34048
56548f80274l80855o3581K60611K83449O7648q2553k4501P1565L3077k7862N7393
56537d85883J40132n8290m16248m61937n8698L31456K75314n6679k09967q2298
56527a083098P1873Q6068J348j39211k93827k91210p033L58571M66470K86323
56517e43726Q1656k9307j67958l19840k43200Q9648K96290Q7818k78421l52543
56507a379583j26310K8686l5401q7345O645M1590j22378k46033q3551J66332J41735
$$ plain form
56578 -1305778 -1261140 -1301865 -1270286 -1119334 -960438 -889893 -916367 -1022370 -1187338 -1346633
56568 -1346633 -1396874 -1287665 -1106828 -1019794 -1062283 -1043747 -792163 -478744 -485710 -868752
56558 -868752 -1181311 -1026826 -606071 -444308 -668577 -870237 -713198 -392736 -346226 -680274
56548 -680274 -1061129 -1124710 -864099 -580650 -513002 -595555 -620056 -548491 -515414 -543276 -485883
56537 -485883 -345751 -404041 -820289 -1282226 -1340924 -1009468 -734154 -790833 -1000800 -1083098
56527 -1083098 -1011225 -925157 -923809 -1063020 -1356847 -1648057 -1655090 -1296519 -830049 -543726
56517 -543726 -462070 -491377 -659335 -979175 -1222375 -1132727 -836437 -748619 -1027040 -1379583
56507 -1379583 -1505893 -1477207 -1512608 -1599953 -1593308 -1551718 -1674096 -1920129 -2003680 -1837348 -1695613
56496a695613p7331o5908K33951L44960j8193m42626l71528R7653L82066K56870
56486a355699Q5749J86587L90148L92394K09127L6939j00031k84712m34326l82343
56476a256167j79679n1938m9127K4011K64746M69494M06204J48125l5306n8532
56466c18169j02441k82312m03476k01480K33812M71382K55351j36976k20700P1571
56456f33438L03058J24168k52536l42091m0163K51141J70852j44730k83098r0840
56446i37677J98591L14464K17365l823k86168n20854n01124j52325K54253L28286
56436a089012J0908l62442m61622k69848J8932K30238K84262K11205J68980K96238
56426i62161M74996M01285j7204m97800p18191o39629l81246Q623M54282P13205
$$ plain form
56496 -1695613 -1772944 -1838852 -1604901 -1259941 -1278134 -1720760 -2092288 -1994635 -1612569 -1355699
56486 -1355699 -1269950 -1083363 -693215 -300821 -91694 -54755 -154786 -439498 -873824 -1256167
56476 -1256167 -1435846 -1487784 -1536911 -1512900 -1248154 -778660 -372456 -224331 -259637 -318169
56466 -318169 -420610 -702922 -1106398 -1307878 -1074066 -602684 -347333 -484309 -705009 -633438
56456 -633438 -330380 -206212 -458748 -800839 -841002 -589861 -419009 -563739 -846837 -937677
56446 -937677 -739086 -424622 -207257 -211080 -497248 -1018102 -1519226 -1671551 -1417298 -1089012
56436 -1089012 -1078104 -1440546 -1902168 -2172016 -2153084 -1922846 -1638584 -1427379 -1258399 -962161
56426 -962161 -487165 -85880 -103084 -600884 -1319075 -1958704 -2339950 -2331327 -1877045 -1163840
56416a163840O03395K77070L4215n5547j20584j74740j14816J4594M3164k6506
56406f83595j3702R8514P3636k24208n87335o95856m61638n8682K78356M18970
56396a855540L86563K92913J90436L2815j59710k21455p8723O3883O52j19489
56386a467655m584K76638L46696Q8577j87869k24563j18691k4667J07438L03537
56376i05143L77267K15844J7554j1975k996j84454m48149m43005n5069M30555
56366a009571O24071L44865k69188p99551q00721k36584L86852N31963K42570
56357i85294L7326J98889M16841K44398k73430o24147m48277L5858L17479K10553
56347h69804J3976L6344J77080J55513r865n1751O0987L5940k49879m79570l17691
$$ plain form
56416 -1163840 -560445 -283375 -249160 -304707 -425291 -600031 -714847 -700253 -657089 -683595
56406 -683595 -697297 -598783 -525147 -749355 -1336690 -2032546 -2494184 -2552866 -2274510 -1855540
56396 -1855540 -1468977 -1176064 -985628 -952813 -1112523 -1333978 -1412701 -1348818 -1348166 -1467655
56386 -1467655 -1472239 -1195601 -848905 -760328 -948197 -1172760 -1291451 -1316118 -1208680 -905143
56376 -905143 -527876 -312032 -294478 -306453 -309449 -493903 -942052 -1385057 -1440126 -1009571
56366 -1009571 -385500 -40635 -309823 -1109374 -1910095 -2146679 -1759827 -1227864 -985294
56357 -985294 -947968 -749079 -332238 -87840 -361270 -985417 -1433694 -1397836 -1080357 -869804
56347 -869804 -855828 -819484 -642404 -486891 -496756 -548507 -487520 -451580 -701459 -1181029 -1498720
56336a498720J10495L78996K68670o6902l34129l39017r5475J62985J77600j4776
56326a250273q7145J32931M00845M04690J86944j0671j38196k66654k67775L7498
56316h57806M25662L84320j83901p11372o43600j24253K57848K34341N8610R345
56306a150806L8601N333k9223M8187J36112O4420p7586m3918J49911K24815J17798
56295e16356J13436L20993L80594Q410m68280n47534l03406j93306k51636p4174
56285a531259L84702O30239M10665J00971L7394O531k44629m72089l52927n6674
56275a087076O6242N1365J10423J48637n449j42423J0798K17805N8450l13214
56265h84442l56000k6579J64440J6387q3995J09973L05666K32505O3769q138j29834
$$ plain form
56336 -1498720 -1388225 -1009229 -740559 -807461 -1141590 -1480607 -1576082 -1413097 -1235497 -1250273
56326 -1250273 -1337418 -1204487 -803642 -398952 -212008 -222679 -360875 -627529 -895304 -857806
56316 -857806 -432144 -47824 -231725 -943097 -1586697 -1710950 -1453102 -1218761 -1160151 -1150806
56306 -1150806 -1112205 -1106872 -1136095 -1087908 -951796 -887376 -964962 -1008880 -858969 -634154 -516356
56295 -516356 -402920 -81927 298667 307077 -161203 -708737 -1012143 -1205449 -1457085 -1531259
56285 -1531259 -1146557 -516318 -105653 -4682 32712 39243 -205386 -677475 -1030402 -1087076
56275 -1087076 -1020834 -969469 -859046 -710409 -715858 -858281 -847483 -629678 -571228 -884442
56265 -884442 -1240442 -1267021 -1102581 -1086194 -1170189 -1060216 -754550 -522045 -458276 -466414 -596248
56254e96248l80162m37979o3081M20850N41080L28144J52247J07131j9199k65980
56244b13197l99628k92240q9129K8222K1686n7018j07835m211K39048L72272J86641
56233c15389j68380l53171k69188r2889O1260K24647L34819K39430O880q6730
56223d18711L47k4886k63622l51544l1211L11629J51717l17526l95498O7930M31682
56212h39693K50274r3558r9413M2141j00860l40749j59907L23958M38225K7716
56202e51866k84534j04539J46583R221k41389r5136L46714N71302M28686J87902
56192D12944N97j94098l30517k44596j3942J09252P9111M5064K9865l9974o0911
56181b07205J11007K94853J53877k56398m82805k75237J24032L45966K74422L0830
$$ plain form
56254 -596248 -976410 -1414389 -1477470 -1056620 -515540 -187396 -35149 71982 52783 -213197
56244 -213197 -612825 -905065 -994194 -965972 -944286 -1001304 -1109139 -1113350 -874302 -502030 -315389
56233 -315389 -483769 -836940 -1106128 -1199017 -1137757 -913110 -578291 -338861 -331981 -418711
56223 -418711 -418364 -443250 -706872 -1058416 -1089627 -777998 -626281 -943807 -1339305 -1271375 -839693
56212 -839693 -589419 -682977 -782390 -740249 -841109 -1181858 -1341765 -1017807 -579582 -551866
56202 -551866 -836400 -940939 -794356 -785135 -1026524 -1121660 -774946 -203644 225042 412944
56192 412944 413541 219443 -111074 -355670 -369612 -260360 -181249 -136185 -106320 -146294 -207205
56181 -207205 -96198 198655 352532 96134 -386671 -661908 -537876 -191910 82512 113342
56171A13342j67995j38214N3332O8877k45757n29389l78318J0269J29102k9417
56161a114168j9579K36207L08227L9912j65271m8398R9823J9541p3896L8339J55293
56150e23970P9114J4125J40881K02498m5872l35557k90731k7797J04700R5877
56140e86732J13982N8533k04213l83595j17218L45026L84225q8397n06177m54620
56130a439186j17262J67393L36435M26676L45852N7387k21323k10921J04533M17339
56120a33077L53903j31901n95849n34434o5245J44162j68186l95716K4438O41482
56110h60423N92372o1143l95158k6753L63039J50935l12873l45656N5258L54834
56100d85568K87998M1405j60226k39311j73701m1867l8735k00214k73902q8463
$$ plain form
56171 113342 -54653 -192867 -139535 -70658 -316415 -845804 -1224122 -1213853 -1084751 -1114168
56161 -1114168 -1133747 -897540 -589313 -549401 -714672 -763070 -663247 -643706 -717602 -679263 -523970
56150 -523970 -444856 -430731 -289850 -87352 -133224 -468781 -759512 -787309 -682609 -586732
56140 -586732 -472750 -414217 -618430 -1002025 -1119243 -774217 -389992 -478389 -984566 -1439186
56130 -1439186 -1556448 -1389055 -1052620 -625944 -280092 -222705 -444028 -654949 -550416 -133077
56120 -133077 220826 88925 -506924 -1041358 -1106603 -962441 -1130627 -1526343 -1501905 -860423
56110 -860423 -268051 -329194 -724352 -751105 -388066 -237131 -550004 -895660 -840402 -485568
56100 -485568 -197570 -156165 -316391 -555702 -729403 -771270 -810005 -1010219 -1284121 -1372584
56090a372584J64326K67042L33377M98654N19860J25299m20572n99522l97949
56081h82069k69033l52615k82162J26978N31418O13037M96126L39816p717n55996
56071b42217q03823l65137L14810M64165O0839k14135o3201O2576j65564l72268
56061a323955j25024L41939N03608K95805L8245j27266k59656k83615j12694K8371
56051a024242j10994k88393m5444N17693P75315M54371k9878k52226k95000l70613
56041f69411l85893j91121Q1980K32094K65072K17294j906l40223m82405k85597
56031a560116m3447j7518r840K44597N49386N34656K54335N0271k3901j87175
56021b08752m26758m57126j86294J40607K83299K12334R092j75878j44323R4927
$$ plain form
56090 -1372584 -1208258 -941216 -607839 -109185 410675 535974 115402 -484120 -882069
56081 -882069 -1151102 -1503717 -1785879 -1658901 -1127483 -514446 -18320 321496 313779 -242217
56071 -242217 -1046040 -1411177 -1096367 -632202 -571363 -785498 -848699 -786123 -951687 -1323955
56061 -1323955 -1448979 -1107040 -603432 -307627 -269382 -396648 -656304 -939919 -1052613 -1024242
56051 -1024242 -1135236 -1423629 -1469073 -951380 -176065 278306 248428 -3798 -298798 -669411
56041 -669411 -1055304 -1246425 -1164445 -932351 -667279 -449985 -451891 -792114 -1274519 -1560116
56031 -1560116 -1603563 -1621081 -1630921 -1386324 -836938 -302282 -47947 2324 -21577 -208752
56021 -208752 -635510 -1092636 -1278930 -1138323 -855024 -642690 -633598 -809476 -953799 -858872
56011h58872K06407l5806l36676k60947J17732L59054L26513K53574K18220N7885
56001D7084j92382k73466j62593j00512j18734j2476J75922J64149r894O761K04496
55990b71645J50994j99714l00873O0574K95315m6671m60677k48898L50086N20144
55980a51365R7707k89732k33514j2509J7649p2772p8793l0283n1680j21775j47519
55969a074586j08790l1830N1913Q3409L0956l5190l2529J0108K8015M3531R0535
55958i44458J11175N8496p456m7446j13649j59636K822L56304N28021K71412j18925
55947f3340k10398n3452m780j00132q2484L2429m3250k69796k22918J96711M79888
55936c41522K08274l33256n55264l08682P6531L06701L67115L37904K35578N5805
$$ plain form
56011 -858872 -652465 -688271 -1024947 -1285894 -1168162 -809108 -482595 -229021 -10801 47084
56001 47084 -145298 -418764 -581357 -681869 -800603 -813079 -637157 -473008 -482902 -476141 -271645
55990 -271645 -120651 -320365 -621238 -560664 -265349 -312020 -772697 -1021595 -671509 -151365
55980 -151365 -53658 -343390 -576904 -589413 -571764 -644536 -723329 -753612 -805292 -927067 -1074586
55969 -1074586 -1183376 -1215206 -1163293 -1079884 -1048928 -1084118 -1116647 -1106539 -1078524 -1034993 -944458
55958 -944458 -833283 -774787 -782243 -829689 -943338 -1102974 -1100152 -743848 -215827 55585 -63340
55947 -63340 -273738 -327190 -331970 -432102 -514586 -482157 -525407 -795203 -1018121 -821410 -341522
55936 -341522 -133248 -466504 -1021768 -1330450 -1253919 -947218 -580103 -242199 -6621 49184
55926D9184j60788l21465l16792j27172J03165K06647J97974J95407J64715m1033
55916e0158l67416n25958l50229J4271L20744M10295J92593k55585n34858k51917
55906a398218L63654N78281J11157m36291m15931M655K34545J55153Q1488P8203
55896f43304n8501k30611q9663K88761L75813k162l50981k43800Q3566J70791
55886g00091j352j20453n6538N4216P0965n3354k86245m47684l11794N9053K98148
55875a495129K16911M8623L0096N1440k9880o3630O8485J26432p4305k15383O1670
55864a274670M82158M92619J26328r7835m9202q7057k81767k54128N3931J53552
55854g36071j56290l69046p3940L80357M75763K92286J86480J22123j20531l81975
$$ plain form
55926 49184 -111604 -433069 -749861 -877033 -773868 -567221 -369247 -173840 -9125 -50158
55916 -50158 -417574 -943532 -1293761 -1279490 -958746 -548451 -355858 -611443 -1146301 -1398218
55906 -1398218 -1034564 -456283 -345126 -781417 -1197348 -1192693 -958148 -802995 -721507 -643304
55896 -643304 -701805 -932416 -1022079 -733318 -357505 -359667 -710648 -954448 -870882 -700091
55886 -700091 -701443 -821896 -878434 -824218 -753253 -806607 -1092852 -1540536 -1852330 -1793277 -1495129
55875 -1495129 -1278218 -1229595 -1199499 -1148059 -1177939 -1241569 -1173084 -1046652 -1120957 -1336340 -1274670
55864 -1274670 -792512 -299893 -173565 -271400 -320602 -407659 -689426 -943554 -889623 -736071
55854 -736071 -892361 -1261407 -1335347 -954990 -479227 -186941 -461 121662 1131 -380844
55844c80844l41154q9861K8870j2845n292K8987n5045r6405J56313M91001M30369
55833A54094l6178m11115l83579j16157J52420L42045L75358K27471J11615J80307
55823E96281J29460l63445q92716o98937J60455P40997N00402m4934k34713j40418
55813b47568j16549j10648M6405J54412K990j61925m3781J77600K21374K49807
55803A72117M78470N69356P2881p13185j000124n80950m6788R5861k4650p3139
55793a050151O447J17111K53972M10969M57856K64968j45846n97851q31386o72950
55783a786861k54266P6261J86418K81266M31831L34404j30317m54325j25600N37031
55773i04158P39406K88010k49865m10632k91797j24714N0744J79245J45095M9891
$$ plain form
55844 -380844 -721998 -811859 -782989 -795834 -801126 -772139 -827184 -923589 -767276 -276275 154094
55833 154094 117916 -293199 -676778 -792935 -640515 -298470 76888 304359 415974 596281
55823 596281 725741 362296 -530420 -1229357 -1068902 -327905 172497 127563 -107150 -247568
55813 -247568 -364117 -474765 -428360 -273948 -270958 -432883 -476664 -299064 -77690 172117
55803 172117 650587 1219943 1292824 579639 -420485 -1001435 -1048223 -952362 -977012 -1050151
55793 -1050151 -1043704 -926593 -672621 -261652 196204 461172 315326 -282525 -1113911 -1786861
55783 -1786861 -2041127 -1964866 -1778448 -1497182 -1065351 -730947 -861264 -1315589 -1441189 -904158
55773 -904158 -164752 123258 -126607 -537239 -829036 -953750 -903006 -723761 -578666 -528775
55763e28775J03417J77246n3322m56303m83342j2873M04813L68847J47220Q8430
55753b44642O0596j27542k31361J6834L63643L98041J81864M1907k3273k22154
55743B13913m32802l24631M1096K32981J00028m3898K6851J16055j169j69924
55733b41500r3670J83921K88534L509m15094n10596j76120J99415K15607m0122
55723e86116j72298o4252K3775m5119n7086J26265K58600R1183j92362k29610
55713h47020J096K03275J84553l2k19586l44422k53826J1652K09261J99169J43701
55702g12179J99203K16820L2189j58136q0343J16122O6543j91939k66051n3659
55692h31430J14321L7562r0168r8371j00854j65432j11647J27418K71851R3587
$$ plain form
55763 -528775 -425358 -248112 -301434 -757737 -1241079 -1253952 -849139 -480292 -333072 -244642
55753 -244642 -184046 -311588 -542949 -526115 -162472 235569 417433 459340 436067 213913
55743 213913 -218889 -543520 -502424 -269443 -169415 -213313 -186462 -70407 -71576 -241500
55733 -241500 -335170 -151249 137285 140794 -274300 -784896 -961016 -761601 -545994 -586116
55723 -586116 -758414 -822666 -798891 -844010 -901096 -774831 -516231 -425048 -617410 -847020
55713 -847020 -845924 -642649 -458096 -458128 -677714 -1022136 -1275962 -1264310 -1055049 -855880 -712179
55702 -712179 -512976 -296156 -263967 -422103 -502446 -386324 -319781 -511720 -777771 -831430
55692 -831430 -717109 -679547 -769715 -868086 -968940 -1134372 -1246019 -1118601 -846750 -753163
55682g53163k10544l10268j90928n2646M6956J73609K80042K54999J25527M575
55672f31841p3248r8941j4025J28832J10457j14202k16703N0027L76713K86755
55662a96176j07989k29813P6724L08290J08495k05771k24009r5329j69892l26644
55652a062114j83708K08417M24840L47083K57237K47339Q4837k22756k86438R93
55642a84270J71829j02865m57983m18480j42313o3598j17617O3582L87058M06163
55632d58494J24800R751J54684J24457k08172l69209j21548P1979j43484l51195
55622a166431p8194L29929K46230j71724k22101J95883M50948K10685j18208j43823
55612d66806m9920j24917k42408j61380K0410N7671m7745j35153j73215k07558
$$ plain form
55682 -753163 -963707 -1273975 -1464903 -1517549 -1470593 -1296984 -1016942 -761943 -636416 -631841
55672 -631841 -705089 -804030 -818055 -689223 -578766 -692968 -909671 -859644 -482931 -196176
55662 -196176 -304165 -533978 -457254 -148964 -40469 -246240 -470249 -565578 -735470 -1062114
55652 -1062114 -1245822 -1037405 -612565 -265482 -8245 239094 323931 101175 -185263 -184270
55642 -184270 -12441 -115306 -573289 -991769 -1134082 -1197680 -1315297 -1251715 -864657 -458494
55632 -458494 -333694 -323943 -169259 -44802 -252974 -622183 -743731 -671752 -815236 -1166431
55622 -1166431 -1244625 -914696 -668466 -840190 -1062291 -866408 -415460 -204775 -322983 -466806
55612 -466806 -516726 -641643 -884051 -1045431 -1025021 -967350 -1015095 -1150248 -1323463 -1531021
55602a531021j78704j3481K18445L95525M67231L87951J17915j97398k81120j13277
55592g27934j9660j77227k95718o9833K87386L24806J8599k34182k25525j40183
55582a259471j21627k5189K50568M91792M35634J19232k14310m08975m31293k56316
55572a419955P2721L43290L43149J33388j3450L2708J29840J41805J65814L24045
55562B53355M45504K07489l71459q13451p13813k44863P6554M0485q4894k5158
55552a230251J39257J96423J48852J32990J37234K6449k03635l83926l74878j82756
55542a594241R3782L09720L20436J32123l9031j7653P1340r417k01393j88607
55532a122941J16267L90940L32387M7258j49302j49162p8015l5913r843K5486
$$ plain form
55602 -1531021 -1709725 -1723206 -1504761 -1109236 -642005 -254054 -136139 -333537 -614657 -727934
55592 -727934 -747594 -924821 -1220539 -1290372 -1002986 -678180 -659581 -893763 -1119288 -1259471
55582 -1259471 -1381098 -1406287 -1155719 -663927 -228293 -109061 -323371 -732346 -1163639 -1419955
55572 -1419955 -1347234 -1003944 -660795 -527407 -540857 -508149 -378309 -236504 -70690 253355
55562 253355 698859 906348 534889 -278562 -992375 -1237238 -1160684 -1120199 -1205093 -1230251
55552 -1230251 -1090994 -894571 -745719 -612729 -475495 -449046 -652681 -1036607 -1411485 -1594241
55542 -1594241 -1500459 -1190739 -870303 -738180 -777211 -794864 -723524 -732941 -934334 -1122941
55532 -1122941 -1006674 -615734 -283347 -236089 -385391 -534553 -612568 -648481 -658324 -632838
55522f32838Q4234J91041K97381K62203N5215j27094j18550m0814q6307j52412
55512b67941J5538L53782M75772J94555k31310m61007m25809k28697L7697K31613
55502c05807J77186p8634k39467j62235n8833j08717j38625M3088K51437K22647
55492c97960J05840K28894M85931M28440k8245m39204m65575k81119j99788k43436
55482h06222k61643j98923o5664J16084J99838J4152k83995k65545J57839M93032
55472i01047L18962j00505k11089L7222J99523L4283k21823k84448j66700j1364
55462a306986J39444K84985L66152L34703K09232J7361k04447l35921k34208Q1024
55452f48661L99940N18031L97451J38699j25657l03313l78966l96460l83989l23528
$$ plain form
55522 -632838 -548604 -357563 -60182 202021 257236 130142 11592 -29222 -115529 -267941
55512 -267941 -252403 101379 577151 771706 540396 79389 -346420 -575117 -537420 -305807
55502 -305807 -128621 -207255 -446722 -608957 -667790 -776507 -915132 -872044 -620607 -397960
55492 -397960 -292120 -63226 422705 851145 822900 383696 -81879 -362998 -562786 -806222
55482 -806222 -1067865 -1266788 -1332452 -1216368 -1016530 -1002378 -1286373 -1551918 -1394079 -901047
55472 -901047 -582085 -682590 -893679 -856457 -656934 -622651 -844474 -1128922 -1295622 -1306986
55462 -1306986 -1167542 -882557 -516405 -181702 27530 44891 -159556 -495477 -729685 -648661
55452 -648661 -248721 269310 666761 805460 679803 376490 -2476 -398936 -782925 -1106453
55442a106453k03901l8679J79758M39963N98901M51190q938n01974p07297n10273
55432a407703j8941M95497O87853M22299L512j50693q8224j99376m70029l97857
55422a123662J28456M73753K06568j70339m0672K85266J31332l24612l23652J56394
55412f01168L46034k0102l23005j73761J5341q8635j49386Q7592K30573j6322
55402f92839k26271J8238L60699K99452N2515P4067J68932j02459m77039l21665
55392h46370K55278M84077J13147k80310k49948l3960K6497j2887k6408j09075
55382f79959k58051j99791J67436M91155M05299K0365k48698j79408P7013J83704
55372b20935n9985m53024n08638m2292M77590M85345J02451o9859J20333J97232
$$ plain form
55442 -1106453 -1310354 -1349033 -1169275 -729312 -130411 320779 311841 -190133 -897430 -1407703
55432 -1407703 -1426644 -931147 -243294 179005 182517 31824 -56400 -255776 -725805 -1123662
55422 -1123662 -995206 -521453 -314885 -485224 -525896 -240630 -109298 -433910 -757562 -601168
55412 -601168 -255134 -275236 -598241 -772002 -756661 -845296 -994682 -907090 -676517 -692839
55402 -692839 -919110 -900872 -540173 -240721 -188206 -114139 54793 -47666 -524705 -846370
55392 -846370 -591092 -107015 6132 -274178 -524126 -558086 -531589 -544476 -570884 -679959
55382 -679959 -938010 -1137801 -970365 -479210 -73911 -53546 -302244 -481652 -404639 -220935
55372 -220935 -280920 -733944 -1242582 -1284874 -807284 -321939 -219488 -289347 -169014 28218
55362B8218j09523m09407k69026J67236M70045M87182L31559J08852p3759q5352
55352F46025J0526l2431k26033k52847l269J51623p5291l91594l70412j03291
55342f46994J6188o6024j04739q5375k09896l83117k02947M17119R81253R49483
55332F64951L38630l36906n89537l58088Q420J23943l3122j37165K6835K70248
55322b1791K89960R1622p0613o2339K7418O6380k1139k47596m83520m88384j94841
55311a114843J45949K61770J63146N484j39252j86042J2508L48769L91540j2161
55301a23132l75555k54543L0261o9107l59856k25839K48956L48335n4367k58102
55291a092949O2076L17929P1937k19745r1771Q2210j52339l86997l3451N35806
$$ plain form
55362 28218 -81305 -490712 -759738 -592502 -122457 364725 696284 805136 731377 646025
55352 646025 656551 624120 398087 145240 141971 293594 218303 -173291 -543703 -646994
55342 -646994 -630806 -696830 -801569 -886944 -1096840 -1479957 -1682904 -1265785 -284532 664951
55332 664951 1003581 666675 77138 -280950 -272530 -148587 -181709 -318874 -292039 -21791
55322 -21791 268169 359791 289178 226839 254257 320637 299498 51902 -431618 -920002 -1114843
55311 -1114843 -968894 -707124 -543978 -538494 -677746 -863788 -851280 -502511 -110971 -123132
55301 -123132 -498687 -753230 -722969 -792076 -1151932 -1377771 -1128815 -780480 -834847 -1092949
55291 -1092949 -1030873 -712944 -641007 -860752 -952523 -870313 -1022652 -1409649 -1443100 -907294
55281i07294M92089q0171k97623J18914N02179L93028J53090J59955J60700j55625
55271E39242n15498m62866m9830K71236K30232o2229l30746l66186j77455J6436
55261i07664Q7536K09631M95842N91205J18626n52939o35358r2204K36223p5573
55251e24675l73364j3338N69985N67021O8472j56431J04311K83324K599m24367
55241A03537n54422l45625j962K91142L60348J21225k30561l68613k25562j1662
55231h62155J20600J73333J29502k0954j33138p4872L2613L3856O1228K69233
55221b70754M03677J16746l83687n42436k81374k7422R3559L94430Q04140O74468
55211I81347j84512r37607p79230q0235J76749j96183m55739j11621M16941M79658
$$ plain form
55281 -907294 -415205 -495376 -792999 -674085 -171906 221122 374212 534167 694867 539242
55271 539242 23744 -439122 -488952 -217716 12516 -49713 -380459 -746645 -924100 -907664
55261 -907664 -820128 -610497 -114655 476550 595176 42237 -593121 -685325 -449102 -524675
55251 -524675 -898039 -911377 -341392 225629 294101 137670 241981 525305 527904 103537
55241 103537 -450885 -796510 -798472 -507330 -146982 -25757 -256318 -624931 -850493 -862155
55231 -862155 -741555 -568222 -438720 -459674 -592812 -667684 -635071 -601215 -539987 -270754
55221 -270754 132923 249669 -134018 -676454 -957828 -985250 -891691 -497261 306879 981347
55211 981347 796835 -140772 -920002 -1000237 -823488 -1019671 -1475410 -1587031 -1170090 -690432
55201f90432O1935k89334j87682J67737K71963n5689m07417k76190K48876N59852
55191e96381L59843M7061N6041J90135P151l86288m38455n837L71283J78696m08012
55180f24763p60300n30389K3209L98746M11369K99056K78455J99895j28062m33043
55170h65827k46692K95251M58866m3998n39770l34431K82731N35161L12735J47430
55160A456K19112J41318k20640m25272j76412J87870K26726j323j68522j82506
55150c98193j61293j42592r2318m7927m5786k4892N5374J17902Q3900k6663j47893
55139h30381j87355j8113L43783N91658M31001J3519k41954k44254k59506l32953
55129g34555j72856K41842M45173J60559k39228k89137p0203P8019J20935J71436
$$ plain form
55201 -690432 -628497 -917831 -1105513 -937776 -665813 -721502 -1128919 -1405109 -1156233 -596381
55191 -596381 -236538 -189477 -133436 56699 63850 -322438 -760893 -766730 -395447 -216751 -624763
55180 -624763 -1385063 -1915452 -1892243 -1493497 -1082128 -783072 -504617 -304722 -432784 -865827
55170 -865827 -1112519 -817268 -358402 -402400 -942170 -1276601 -993870 -458709 -145974 1456
55160 1456 220568 361886 141246 -284026 -460438 -272568 -45842 -47165 -215687 -398193
55150 -398193 -559486 -702078 -794396 -842323 -888109 -913001 -857627 -739725 -655825 -682488 -830381
55139 -830381 -1017736 -1035849 -692066 -100408 330593 344112 102158 -142096 -401602 -734555
55129 -734555 -907411 -665569 -220396 -59837 -299065 -588202 -658405 -580386 -459451 -288015
55119b88015R1765k39328n01383l19085Q3616J75037l7454m9194K64623M47080
55109c72338K58861O5888J67549K78556N1864l09477l87463j79931K7496J60831
55099b38164K83829K41262j12541m45970k62993L04307N55435J93089k80828l57990
55089a20564k12136k40700l48549j85132J73748L22449J84032N8439N0612m1457
55079c59258k30225k41484m2380K3364j63003k22751R6280M38391L57124j8095
55069c62037k38508j94824r8301j7609J22082K25533J46762J8803N8250J46345
55059a93504K3909k02074k07997l0380R320q2014J9607K98363L30395k834k95714
55048c32923l02837k87036m22634m02769j7103L59542L11405L8737p190J49759
$$ plain form
55119 -288015 -196250 -435578 -936961 -1256046 -1172430 -997393 -1034847 -1084041 -819418 -372338
55109 -372338 -113477 -47589 119960 398516 450380 140903 -246560 -426491 -398995 -238164
55099 -238164 45665 286927 174386 -271584 -534577 -230270 325165 518254 237426 -120564
55089 -120564 -332700 -573400 -921949 -1107081 -933333 -610884 -426852 -368413 -317801 -359258
55079 -359258 -589483 -830967 -873347 -849983 -1012986 -1235737 -1139457 -701066 -343942 -362037
55069 -362037 -600545 -795369 -893670 -911279 -789197 -563664 -416902 -398099 -339849 -193504
55059 -193504 -169595 -371669 -579666 -610046 -600726 -682740 -663133 -364770 -34375 -37209 -332923
55048 -332923 -635760 -922796 -1345430 -1748199 -1765302 -1405760 -1094355 -1055618 -1062808 -913049
55038i13049J48742m6726j23055M5383K68720M03404M57814L66276K9091l89039
55028B47561n19536k39867J49852K79757J08009q2787k3335K17625K72856n7917
55018C52218m48415m07991M635K04371p4282l85335k70392P6069K09301J28528
55008f11293J06915J26231O425j13104J9248K15165Q5426k32193k07385J72103
54998d32462K69406k06878o60469m40853K04149M83711J57989k01609n7586L64380
54988e20222M02061j33645o52050n05442J62262N87132L86471L220j2116K33186
54978d9143K75577N4151j05414j05106j71769l64560m37328k51432L6922K56429
54968h61673L69839L18068M4587k75351l30657n6437L15306N62348N77134K67069
$$ plain form
55038 -913049 -764307 -811033 -934088 -888705 -619985 -216581 241233 607509 636600 247561
55028 247561 -271975 -511842 -361990 -82233 25776 -57011 -80346 137279 410135 352218
55018 352218 -96197 -504188 -499553 -295182 -369464 -754799 -1025191 -949122 -739821 -611293
55008 -611293 -504378 -378147 -371722 -484826 -465578 -250413 -164987 -397180 -604565 -432462
54998 -432462 -163056 -369934 -1030403 -1471256 -1267107 -783396 -625407 -827016 -884602 -520222
54988 -520222 -118161 -251806 -903856 -1409298 -1247036 -659904 -273433 -270213 -282329 -49143
54978 -49143 226434 280585 175171 70065 -101704 -466264 -903592 -1155024 -1118102 -861673
54968 -861673 -491834 -173766 -129179 -404530 -735187 -791624 -476318 86030 663164 930233
54958I30233k99507p28554o77529l39509j46907r9969R9689L46720K28743j43561
54948h30151j45251L22971N42121P8732n02924n19242j58898r81l1606J60439
54938a084790N16925N57685J79801k10769l42793l23755k28999M7385M19618N03328
54928C3636Q6109n20849p61625l87685K92207O63491L88618j93791m03638l8963
54918h42490L76544L23321l7160k09712j19577q9936j97330j25672K75414O60836
54908A4238N97091J11617l22671l10170L2650K17617n942l13887k84322p1513
54898c35292j78133n61153n48718J11376P02651M99748j82799m77721j73459J93629
54888i49871K47145J17038l5765k05288k32258J03476N83198O52879J67304l92657
$$ plain form
54958 930233 630726 -97828 -775357 -1114866 -1261773 -1361742 -1262053 -915333 -686590 -830151
54948 -830151 -975402 -652431 -110310 -31578 -534502 -1053744 -1212642 -1213623 -1245229 -1084790
54938 -1084790 -567865 -10180 169621 -41148 -383941 -707696 -936695 -889310 -469692 33636
54928 33636 119745 -401104 -1162729 -1550414 -1258207 -594716 -206098 -399889 -803527 -842490
54918 -842490 -465946 -142625 -179785 -389497 -509074 -599010 -796340 -922012 -646598 14238
54908 14238 611329 722946 400275 90105 122755 340372 334430 20543 -263779 -335292
54898 -335292 -513425 -1074578 -1623296 -1511920 -809269 -309521 -492320 -970041 -1143500 -949871
54888 -949871 -702726 -585688 -621453 -826741 -1058999 -955523 -372325 280554 447858 55201
54878E5201n69880m16136k20624j17925q8101n0899J10888L67948M27326J16906
54868c85296k22143j58278J22817P9218k73670l62003k0216K51963J82169J41576
54858f43863L42058L36779j79263o80796n34125M6841L84625L18228J75872O3649
54848c69995j52644l33007j91908J13640J20618j97827l53016o7149L70496N49068
54838e11724L61243n4713m36764m51475l493M85417M86974P8404j55390L8321
54828a63200K87355K38099K6619q2241j04770j36797r8702M4099J03693j9425
$$ plain form
54878 55201 -514679 -930815 -1151439 -1269364 -1357465 -1408364 -1297476 -929528 -502202 -385296
54868 -385296 -607439 -765717 -642900 -563682 -837352 -1199355 -1219571 -967608 -785439 -643863
54858 -643863 -301805 34974 -144289 -825085 -1359210 -1312369 -927744 -609516 -433644 -369995
54848 -369995 -522639 -855646 -1047554 -933914 -813296 -1011123 -1364139 -1431288 -1060792 -511724
54838 -511724 -150481 -205194 -641958 -1093433 -1096926 -611509 -124535 -46131 -201521 -163200
54828 -163200 124155 362254 388873 306632 201862 65065 -33637 10462 114155 94730
$$ [...]
##END NTUPLES=NMR SPECTRUM
##END=
