##TITLE=31Pdec_LR-662-RM2A
 , 124 sc
 15.3.2019
##JCAMPDX= 6.0         $$ Bruker NMR JCAMP-DX V2.0
##DATA TYPE= NMR SPECTRUM
##DATA CLASS= NTUPLES
##ORIGIN= UXNMR, Bruker Analytische Messtechnik GmbH
##OWNER= root
$$ XWIN-NMR		Version 3.5
$$ Fri Mar 15 16:21:55 2019 Russian Standard Time (UT+4h)  she@DPX200
##.OBSERVE FREQUENCY= 81.013821
##.OBSERVE NUCLEUS= ^31P
##.ACQUISITION MODE= SIMULTANEOUS
##.ACQUISITION SCHEME= undefined
##.AVERAGES= 124
##.DIGITISER RES= 17
##SPECTROMETER/DATA SYSTEM= spect
##.PULSE SEQUENCE= zgpg30
##.SOLVENT NAME= D2O
##.SHIFT REFERENCE= (INTERNAL, D2O, 0, 182.463)
##AUDIT TRAIL= $$ (NUMBER, WHEN, WHO, WHERE, WHAT)
$$ ##TITLE= Audit trail, XWIN-NMR		Version 3.5
$$ ##JCAMPDX= 5.01
$$ ##ORIGIN= Bruker BioSpin GmbH
$$ ##OWNER= she
$$ F:/spectra/data/she/nmr/P31/1/pdata/1/auditp.txt
$$ ##AUDIT TRAIL=  $$ (NUMBER, WHEN, WHO, WHERE, WHAT)
(   1,<2019-03-15 16:20:00.10 +0400>,<she>,<DPX200>,
      <continue with go, POWCHK disabled, PULCHK disabled
       configuration hash MD5:
       00 E9 B6 7A A2 85 ED C7 34 08 36 98 17 FE 4E 26
       data hash MD5: 32K
       45 C6 2A 85 B7 49 02 B8 3C 57 D4 49 E6 91 F3 54>)
(   2,<2019-03-15 16:20:28.23 +0400>,<she>,<DPX200>,
      <Start of raw data processing
       efp BC_mod = 2 LB = 1 FT_mod = 6 PKNL = 1 PHC0 = -1854.223 PHC1 = 103.1989 SI = 64K 
       data hash MD5: 64K
       9E DA 08 A1 61 C3 56 81 0A C9 38 7C 2B 8F B0 72>)
(   3,<2019-03-15 16:20:59.15 +0400>,<she>,<DPX200>,
      <pk PHC0 = -17.00311 PHC1 = 176 
       data hash MD5: 64K
       DD 3E 9D FC 58 DF 9E 1F 57 A4 2B 58 3F E8 59 6E>)
(   4,<2019-03-15 16:21:22.78 +0400>,<she>,<DPX200>,
      <pk PHC0 = 45.82901 PHC1 = -191.5999 
       data hash MD5: 64K
       D3 1B 13 13 85 12 D1 54 BF B3 99 A3 2D 51 6F 8E>)
$$ ##END=
$$ 
$$ hash MD5
$$ 93 72 54 13 1D 56 BE 21 0F CB 76 6A 58 CA 69 36
##$RELAX= 
##$RELAX= 
##$RELAX= 
##$RELAX= 
##$RELAX= 
##$RELAX= 
##$RELAX= 
##$RELAX= 
$$ Bruker specific parameters
$$ --------------------------
##$DU= <F:/spectra>
##$EXPNO= 1
##$NAME= <P31>
##$PROCNO= 1
##$TYPE= <nmr>
##$USER= <she>
##$AMP= (0..31)
100 100 100 100 100 100 100 100 100 100 100 100 100 100 100 100 100 100 
100 100 100 100 100 100 100 100 100 100 100 100 100 100 
##$AQSEQ= 0
##$AQ_mod= 1
##$AUNM= <au_zg>
##$AUTOPOS= <>
##$BF1= 81.014009
##$BF2= 200.13
##$BF3= 200.13
##$BF4= 200.13
##$BF5= 200.13
##$BF6= 200.13
##$BF7= 200.13
##$BF8= 200.13
##$BYTORDA= 1
##$CFDGTYP= 0
##$CFRGTYP= 5
##$CHEMSTR= <none>
##$CNST= (0..31)
1 1 145 1 1 1 1 1 1 1 1 1 1 1 1 1 1 1 1 1 1 1 1 1 1 1 1 1 1 1 1 1 
##$CPDPRG= <waltz16>
##$CPDPRG1= <>
##$CPDPRG2= <waltz16>
##$CPDPRG3= <>
##$CPDPRG4= <mlev>
##$CPDPRG5= <mlev>
##$CPDPRG6= <mlev>
##$CPDPRG7= <mlev>
##$CPDPRG8= <mlev>
##$CPDPRGB= <>
##$CPDPRGT= <>
##$D= (0..31)
0 1 0 0 0 0 0 0 0 0 0 0.03 2e-05 3e-06 0 0 0 0 0 0 0 0 0 0 0 0 0 0 0 0 
0 0 
##$DATE= 1552652205
##$DBL= (0..7)
120 120 120 11 120 120 24 19 
##$DBP= (0..7)
150 150 150 150 150 150 150 150 
##$DBP07= 0
##$DBPNAM0= <>
$$ [...]
##$SUBNAM2= <"">
##$SUBNAM3= <"">
##$SUBNAM4= <"">
##$SUBNAM5= <"">
##$SUBNAM6= <"">
##$SUBNAM7= <"">
##$SUBNAM8= <"">
##$SUBNAM9= <"">
##$SW= 369.568048894756
##$SWIBOX= (0..15)
0 1 3 0 0 0 0 0 0 0 0 0 0 0 0 0 
##$SW_h= 29940.119760479
##$TD= 32768
##$TD0= 1
##$TE= 0
##$TE2= 300
##$TE3= 300
##$TEG= 300
##$TL= (0..7)
0 120 53 12 22 120 120 120 
##$TP= (0..7)
150 150 150 150 150 150 150 150 
##$TP07= 0
##$TPNAME0= <>
##$TPNAME1= <>
##$TPNAME2= <>
##$TPNAME3= <>
##$TPNAME4= <>
##$TPNAME5= <>
##$TPNAME6= <>
##$TPNAME7= <>
##$TPOAL= (0..7)
0.5 0.5 0.5 0.5 0.5 0.5 0.5 0.5 
##$TPOFFS= (0..7)
0 0 0 0 0 0 0 0 
##$TUNHIN= 0
##$TUNHOUT= 0
##$TUNXOUT= 0
##$USERA1= <user>
##$USERA2= <user>
##$USERA3= <user>
##$USERA4= <user>
##$USERA5= <user>
##$V9= 5
##$VALIST= <valist>
##$VCLIST= <CCCCCCCCCCCCCCC>
##$VD= 0
##$VDLIST= <DDDDDDDDDDDDDDD>
##$VPLIST= <PPPPPPPPPPPPPPP>
##$VTLIST= <TTTTTTTTTTTTTTT>
##$WBST= 1024
##$WBSW= 4
##$XGAIN= (0..3)
0 0 0 0 
##$XL= 0
##$YL= 0
##$YMAX_a= 80578
##$YMIN_a= -126235
##$ZGOPTNS= <>
##$ZL1= 120
##$ZL2= 120
##$ZL3= 120
##$ZL4= 120
##$ABSF1= 0
##$ABSF2= 0
##$ABSG= 0
##$ABSL= 0
##$ALPHA= 0
##$AQORDER= 0
##$ASSFAC= 0
##$ASSFACI= 0
##$ASSFACX= 0
##$ASSWID= 0
##$AUNMP= <proc_1d>
##$AZFE= 0.1
##$AZFW= 0.5
##$BCFW= 0
##$BC_mod= 2
##$BYTORDP= 0
##$COROFFS= 0
##$CY= -3
##$DATMOD= 1
##$DC= 0
##$DFILT= <>
##$DTYPP= 0
##$F1P= 0
##$F2P= 0
##$FCOR= 1
##$FTSIZE= 65536
##$FT_mod= 6
##$GAMMA= 0
##$GB= 0
##$INTBC= 1
##$INTSCL= 5.30512e-09
##$ISEN= 30
##$LB= 1
##$LEV0= 0
##$LPBIN= 0
##$MAXI= 10000
##$MC2= 0
##$MEAN= 0
##$ME_mod= 0
##$MI= 50
##$NCOEF= 0
##$NC_proc= -8
##$NLEV= 6
##$NOISF1= 182.463
##$NOISF2= 159.3651
##$NSP= 0
##$NTH_PI= 0
##$NZP= 0
##$OFFSET= 182.463
##$PC= 4
##$PHC0= -1825.397
##$PHC1= 87.59901
##$PH_mod= 1
##$PKNL= yes
##$PPARMOD= 0
##$PSCAL= 0
##$PSIGN= 0
##$REVERSE= no
##$SF= 81.0140089999434
##$SI= 65536
##$SIGF1= 159.3651
##$SIGF2= -187.1042
##$SINO= 113.3802
##$SIOLD= 16384
##$SREGLST= <1H.CDCl3>
##$SSB= 0
##$STSI= 65536
##$STSR= 0
##$SW_p= 29940.119760479
##$SYMM= 0
##$S_DEV= 0
##$TDeff= 32768
##$TDoff= 0
##$TI= <>
##$TILT= no
##$TM1= 0
##$TM2= 0
##$TOPLEV= 0
##$USERP1= <user>
##$USERP2= <user>
##$USERP3= <user>
##$USERP4= <user>
##$USERP5= <user>
##$WDW= 1
##$XDIM= 65536
##$YMAX_p= 287999907
##$YMIN_p= -323279540
$$ End of Bruker specific parameters
$$ ---------------------------------
##NTUPLES= NMR SPECTRUM
##VAR_NAME=  FREQUENCY,     SPECTRUM/REAL,   SPECTRUM/IMAG
##SYMBOL=    X,             R,               I
##VAR_TYPE=  INDEPENDENT,   DEPENDENT,       DEPENDENT
##VAR_FORM=  AFFN,          ASDF,            ASDF
##VAR_DIM=   65536,         65536,           65536
##UNITS=     HZ,            ARBITRARY UNITS, ARBITRARY UNITS
##FACTOR=    0.456856943014862, 1,           1
##FIRST=     14782.0589164792, 0,            0
##LAST=      -15158.0608439998, 0,           0
##MIN=       -15158.0608439998, -323279540,  0
##MAX=       14782.0589164792, 287999907,    0
$$ Real data points
##PAGE= N=1
##DATA TABLE= (X++(R..R)), XYDATA
$$ [...]
$$ plain form
40906 35052412 53100362 52549143 36497546 22023901 18424378 20764735 22661879 24224935
40898 24224935 25282053 21553906 12652623 4981816 1515294 -1969099 -5048891 794760
40890 794760 14838475 20131848 8658818 982017 19868043 52495559 64361680 48738542
40882 48738542 34407364 39501861 46598460 36738301 21735687 21879666 31796668 33179825
40874 33179825 27217429 27779065 31530838 23373614 8660934 10984822 33771734 50700763
40866 50700763 44016289 29231592 27664933 33769315 28607203 13053672 6298744 15350765
40858 15350765 24846210 20035105 6864972 3236356 16817184 36937133 46965518
40851 46965518 41937991 32415634 30285699 33932290 32790715 24762388 19738546 23111836
$$ packed form
40906C5052412J8047950n51219j6051597j4473645l599523K340357J897144J563056
40898B4224935J057118l728147q901283p670807l466522l484393l079792N843651
40890G94760J4043715N293373j1473030p676801J8886026L2627516J1866121j5623138
40882D8738542j4331178N094497P096599r860159j5002614J43979R917002J383157
40874C3179825n962396N61636L751773q157224j4712680K323888K2786912J6929029
40866E0700763o684474j4784697j566659O104382n162112j5553531o754928R052021
40858A5350765R495445m811105j3170133l628616J3580828K0119949J0028385
40851D6965518n027527r522357k129935L646591j141575q028327n023842L373290
$$ plain form
40843 23111836 25533987 16240481 -332609 -10065530 -7371336 809872 7387784 12976001
40835 12976001 20549825 28844702 33549542 31735690 23779224 13032522 4296151 1659213
40827 1659213 7682389 23186285 44189988 59431936 57283267 38423588 17149252
40820 17149252 7178372 10772968 23655008 42263183 60323620 66605757 56176037
40813 56176037 39632190 31813228 34547959 39480285 43726199 50654807 56856350 52394720
40805 52394720 37250564 25542540 27315174 34866233 33947504 22563976 12170380 13626149
40797 13626149 26704582 41285914 46217638 39308656 29776123 28037046 33531615 37146223
40789 37146223 34599939 30644463 30169593 33291527 40091529 50735955 58512800 53427329
$$ packed form
40843B3111836K422151r293506j6573090r732921K694194Q181208O577912N588217
40835A2976001P573824Q294877M704840j813852p956466j0746702q736371k636938
40827A659213O023176J5503896K1003703J5241948k148669j8859679k1274336
40820A7149252r970880L594596J2882040J8608175J8060437O282137j0429720
40813E6176037j6543847p818962K734731M932326M245914O928608O201543m461630
40805E2394720j5144156j1708024J772634P551059r18729j1383528j0393596J455769
40797A3626149J3078433J4581332M931724o908982r532533j739077N494569L614608
40789C7146223k546284l955476m74870L121934O800002J0644426P776845n085471
$$ plain form
40781 53427329 37685140 27227631 31049925 39043817 38951250 35049406 37817686 43511363
40773 43511363 39776627 27734507 21931528 27491886 32373100 26406555 15158968 8750265
40765 8750265 7738965 8039250 11411788 21485765 34031145 40280474 38284519 33726660
40757 33726660 30109063 25058197 17861456 14712842 21721367 34421922 39220731 27997764
40749 27997764 9276591 625588 9180958 23999392 30252396 26277871 21308030 20147983
40741 20147983 18519557 13552045 10375648 14561275 23390595 28682886 25272317 14290037
40733 14290037 1243567 -7061797 -6901447 -905535 5824549 13256871 25043748 38229787
40725 38229787 41407113 28440821 9299177 668570 7605400 19551079 23095387 14019625
$$ packed form
40781E3427329j5742189j0457509L822294P993892r2567l901844K768280N693677
40773D3511363l734736j2042120n802979N560358M881214n966545j1247587o408703
40765H750265j011300L00285L372538J0073977J2545380O249329j995955m557859
40757C3726660l617597n050866p196741l148614P008525J2700555M798809j1222967
40749B7997764j8721173q651003Q555370J4818434O253004l974525m969841j160047
40741B0147983j628426m967512l176397M185627Q829320N292291l410569j0982280
40733A4290037j3046470q305364J60350N995912O730084P432322J1786877J3186039
40725C8229787L177326j2966292j9141644q630607O936830J1945679L544308r075762
$$ plain form
40717 14019625 -2160087 -16471167 -22375444 -18583076 -7774156 6872969 22226091
40710 22226091 33171551 35139777 30396583 26170551 23465243 14825203 -918703 -9630816
40702 -9630816 1361182 21798063 27429444 11150149 -7871684 -10583811 -1572594 2186582
40694 2186582 -2885471 -4281924 6260650 20523264 24369412 14581303 1774760 -1727485
40686 -1727485 4749694 9727851 3768810 -7003440 -6606905 9894827 27497301 28972627
40678 28972627 17205603 11619395 22709025 38277553 38821412 21810881 5237127
40671 5237127 7352339 26540124 43565743 43025249 29440147 19859609 23342674 33456210
40663 33456210 40812277 45012231 49871112 53923473 53698629 52386618 55789355 60602225
$$ packed form
40717A4019625j6179712j4311080n904277L792368J0808920J4647125J5353122
40710B2226091J0945460J968226m743194m226032k705308q640040j5743906q712113
40702i630816J0991998K0436881N631381j6279295j9021833k712127R011217L759176
40694B186582n072053j396453J0542574J4262614L846148r788109j2806543l502245
40686a727485O477179M978157n959041j0772250L96535J6501732J7602474J475326
40678B8972627j1767024n586208J1089630J5568528N43859j7010531j6573754
40671E237127K115212J9187785J7025619n40494j3585102r580538L483065J0113536
40663C3456210P356067M199954M858881M052361k24844j312011L402737M812870
$$ plain form
40655 60602225 56256480 40241175 23093308 14565459 12495849 11006502 13318911 27689461
40647 27689461 52164879 71467759 72259801 58263945 46991751 51248590 65298017
40640 65298017 71172764 59121083 38964551 28283974 31939986 38768906 37779037 30458116
40632 30458116 24673854 23048471 22530669 21325862 20393810 19654850 17524631 14211544
40624 14211544 12632689 15909901 24703277 35623282 42304996 41353088 37498114 37809417
40616 37809417 39628329 31540041 10641518 -8611799 -10633301 1205614 9871116 7336939
40608 7336939 2129065 4422418 13285104 21432490 24914801 23848630 18756347 10626360
40600 10626360 2032250 -4658085 -8799667 -10350009 -8960843 -4251263 4261671 15572488
$$ packed form
40655F0602225m345745j6015305j7147867q527849k069610j489347K312409J4370550
40647B7689461K4475418J9302880P92042j3995856j1272194M256839J4049427
40640F5298017N874747j2051681k0156532j0680577L656012O828920r89869p320921
40632C0458116n784262j625383n17802j204807r32052p38960k130219l313087
40624A4211544j578855L277212Q793376J0920005O681714r51908l854974L11303
40616C7809417J818912q088288k0898523j9253317k021502J1838915Q665502k534177
40608G336939n207874K293353Q862686Q147386L482311j066171n092283q129987
40600A0626360q594110o690335m141582j550342J389166M709580Q512934J1310817
$$ plain form
40592 15572488 23609651 19812692 4718065 -7357754 -3729421 8962557 12743533 3791517
40584 3791517 -1797059 8892857 27681303 36736446 29373021 12642825 -3201011 -9949073
40576 -9949073 -2727363 14375354 27514588 26556038 17140406 11960777 13096520 12339064
40568 12339064 7842698 9433416 23611521 41239250 46252181 33213946 11708429
40561 11708429 -4607987 -9092960 -3010883 9800205 25636973 39199875 43484054
40554 43484054 35254104 20377600 10536765 13120173 25274345 37755498 43078160 40460970
40546 40460970 35036897 32191918 31650157 29173761 25579694 29001865 42827409 56321427
40538 56321427 56239473 45168652 37866054 40307323 44423209 44902015 47655181 56438162
$$ packed form
40592A5572488Q037163l796959j5094627j2075819L628333J2691978L780976q952016
40584C791517n588576J0689916J8788446R055143p363425j6730196j5843836o748062
40576i949073P221710J7102717J3139234r58550r415632n179629J135743p57456
40568A2339064m496366J590718J4178105J7627729N012931j3038235k1505517
40561A1708429j6316416m484973O082077J2811088J5836768J3562902M284179
40554D3484054q229950j4876504r840835K583408J2154172J2481153N322662k617190
40546D0460970n424073k844979n41761k476396l594067L422171J3825544J3494018
40538E6321427q1954j1070821p302598K441269M115886M78806K753166Q782981
$$ plain form
40530 56438162 63364676 60459748 51247648 43803182 40877810 42662484 49074857 52814495
40522 52814495 42019547 18596407 2239620 6363158 21908195 35165661 46799298
40515 46799298 59183840 61388925 47402633 35754653 46068303 65557239 66289346
40508 66289346 49948878 45359923 62422126 79911960 83372021 83296497 85608905 75243255
40500 75243255 46247437 21623094 21586354 32718009 31304687 20432013 19495924 29296798
40492 29296798 33368611 27914831 26329229 34503353 41460268 37161971 25236839 15251967
40484 15251967 12087211 13754053 13088420 4047184 -8127436 -8926492 6886395 27142830
40476 27142830 40334993 50594002 63490450 69491154 58367358 40872302 36928323
$$ packed form
40530E6438162O926514k904928r212100p444466k925372J784674O412373L739638
40522E2814495j0794948k3423140j6356787M123538J5545037J3257466J1633637
40515D6799298J2384542K205085j3986292j1647980J0313650J9488936P32107
40508F6289346j6340468m588955J7062203J7489834L460061p5524K312408j0365650
40500G5243255k8995818k4624343l6740J1131655j413322j0872674r36089R800874
40492B9296798M071813n453780j585602Q174124O956915m298297j1925132r984872
40484A5251967l164756J666842o65633r041236j2174620p99056J5812887K0256435
40476B7142830J3192163J0259009J2896448O000704j1123796j7495056l943979
$$ plain form
40469 36928323 47428443 56086988 55239579 50911030 45032412 33118563 20435814 20780172
40461 20780172 35115531 47940730 48977356 43681263 39298632 36150505 36606821 46567316
40453 46567316 61819608 67181880 56121706 39300583 28369366 23483017 21514096
40446 21514096 23179170 26163965 24453320 20877709 26956865 43212873 53338003 46466688
40438 46466688 32271111 24803299 24193527 24356836 25685420 28048736 23545407 10422347
40430 10422347 4013150 18465856 44822115 61597885 61092274 51993668 42834711 37788414
40422 37788414 42979045 60102338 76246980 75822566 61872528 51389982 50622504 50079345
40414 50079345 44028361 38719185 38208873 37220350 33258560 32213003 35568520 34655484
$$ packed form
40469C6928323J0500120Q658545q47409m328549n878618j1913849j2682749L44358
40461B0780172J4335359J2825199J036626n296093m382631l148127M56316R960495
40453D6567316J5252292N362272j1060174j6821123j0931217m886349j968921
40446B1514096J665074K984795j710645l575611O079156J6256008J0125130o871315
40438D6466688j4195577p467812o09772J63309J328584K363316m503329j3123060
40430A0422347o409197J4452706K6356259J6775770n05611r098606r158957n046297
40422C7788414N190631J7123293J6144642m24414j3950038j0482546p67478n43159
40414E0079345o050984n309176n10312r88523l961790j045557L355517r13036
$$ plain form
40406 34655484 25552552 18526707 23096228 32743610 34989834 29772373 26481492 27006615
40398 27006615 23346894 11116351 -4489477 -16688979 -22443861 -18886061 -3723720
40391 -3723720 17066334 30084283 29270396 24167828 26516226 33458213 33540986 26817861
40383 26817861 26271295 36123078 41321544 27771502 4207086 -8333035 -4065865 4018922
40375 4018922 6762057 10047533 19964809 30693307 35245141 37898566 45837444 55221308
40367 55221308 56193334 48357478 41558810 41847264 44160576 39930404 27564860 14978142
40359 14978142 13652854 28289431 50546936 66120936 69423485 66627181 63292967 57331129
40351 57331129 48403754 44691991 51372757 58947296 53525551 35656203 19915201 17748452
$$ packed form
40406C4655484r102932p025845M569521R647382K246224n217461l290881N25123
40398B7006615l659721j2230543j5605828j2199502n754882L557800J5162341
40391c723720K0790054J3017949q13887n102568K348398O941987Q2773o723125
40383B6817861n46566R851783N198466j3550042k3564416j2540121M267170Q084787
40375D018922K743135L285476R917276J0728498M551834K653425P938878R383864
40367E5221308R72026p835856o798668K88454K313312m230172j2365544j2586718
40359A4978142j325288J4636577K2257505J5574000L302549k796304l334214n961838
40351E7331129q927375l711763O680766P574539n421745j7869348j5741002k166749
$$ plain form
40343 17748452 28322045 43957989 56747107 61356326 58477620 54726054 54465093 54838744
40335 54838744 53078069 52397402 54177027 52131725 43621421 38715563 45723147 55168608
40327 55168608 53618219 47730927 55796237 77047989 89284108 79771131 60101487 45332437
40319 45332437 36006980 28258755 25101371 27354169 26998096 20567217 17817681 26305743
40311 26305743 37542249 39614947 34859728 33952804 39853638 48027285 55664346 60502125
40303 60502125 57325428 46304867 38732275 43662172 54133809 57101330 51597362 45947792
40295 45947792 42361295 37259387 33680832 39742936 54660555 67528326 71025639 67569932
40287 67569932 62101345 57253105 54971431 54473505 49643681 37195051 26331309 31058604
$$ packed form
40343A7748452J0573593J5635944J2789118M609219k878706l751566k60961L73651
40335E4838744j760675o80667J779625k045302q510304m905858P007584R445461
40327E5168608j550389n887292Q065310K1251752J2236119r512977j9669644j4769050
40319D5332437r325457p748225l157384K252798l56073o430879k749536Q488062
40311B6305743J1236506K072698m755219r06924N900834Q173647P637061M837779
40303F0502125l176697j1020561p572592M929897J0471637K967521n503968n649570
40295D5947792l586497n101908l578555O062104J4917619J2867771L497313l455707
40287F7569932n468587m848240k281674m97926m829824j2448630j0863742M727295
$$ plain form
40279 31058604 53137885 80757192 102284911 112046373 105550348 82523405 55709323
40272 55709323 43443837 49384261 59821938 63845166 64890540 68705118 72489548 72937028
40264 72937028 74191496 79315079 82727850 80014858 77357210 81259237 85227830 77721850
40256 77721850 59793927 44473821 40361719 44960474 52923021 61482500 67416671 67598610
40248 67598610 64730352 65313751 69517518 69759688 62657313 56186306 59790281 71309236
40240 71309236 79446648 77652465 70290318 64674404 61603638 56591461 48342385 42188658
40232 42188658 43810392 51603403 58196357 59823752 61004296 67054667 74057627 72071915
40224 72071915 60506193 54661417 69668415 98838422 116576232 106935912 82531726
$$ packed form
40279C1058604K2079281K7619307K1527719R761462o496025k3026943k6814082
40272E5709323j2265486N940424J0437677M023228J045374L814578L784430M47480
40264G2937028J254468N123583L412771k712992k657648L902027L968593p505980
40256G7721850j7927923j5320106m112102M598755P962547Q559479N934171J81939
40248F7598610k868258N83399M203767K42170p102375o471007L603975J1518955
40240G1309236Q137412j794183p362147n615914l070766n012177q249076o153727
40232D2188658J621734P793011O592954J627395J180544O050371P002960j985712
40224G2071915j1565722n844776J5006998K9170007J7737810r640320k4404186
$$ plain form
40217 82531726 68122907 70608304 75570415 71474835 63930870 61929725 62394937 57807953
40209 57807953 50879091 50317270 56467244 62250704 66059045 72585110 81200148 84591332
40201 84591332 81015400 78259434 82262286 90038154 96945117 102679838 106242875 103362845
40193 103362845 94509234 88437423 91381033 98102182 99753112 95864008 92294195 91412377
40185 91412377 91146436 91257933 93931814 98548049 100556729 96227129 87057296 80128881
40177 80128881 83050703 94785933 103146631 98488647 88861952 90890729 104621818 111947665
40169 111947665 105468370 101741524 113442273 125095792 116868691 100508060 104942596
40162 104942596 129709556 141490774 122756966 97608091 96279322 115329909 130610658
$$ packed form
40217H2531726j4408819K485397M962111m095580p543965k001145M65212m586984
40209E7807953o928862n61821O149974N783460L808341O526065Q615038L391184
40201H4591332l575932k755966M002852P775868O906963N734721L563037k880030
40193A03362845q853611o071811K943610O721149J650930l889104l569813q81818
40185I1412377k65941J11497K673881M616235K008680m329600r169833o928415
40177H0128881K921822J1735230Q360698m657984r626695K028777J3731089P325847
40169A11947665o479295l726846J1700749J1653519q227101j6360631M434536
40162A04942596K4766960J1781218j8733808k5148875j328769J9050587J5280749
$$ plain form
40155 130610658 133736854 134846713 138328535 137214662 129916529 124961069 126891196 129924435
40147 129924435 127854696 120932361 112152063 105216080 105887861 116320512 128087931 130121704
40139 130121704 123940029 121512350 127279965 132594902 129995833 122320791 114203471 105692451
40131 105692451 100166452 107569640 130066212 152033435 155470983 142032032 130258084
40124 130258084 132670667 144095459 152098226 151019536 144428627 139706009 142033996 150050327
40116 150050327 156860028 157943022 156407369 156705410 156225481 149729580 140282570 136986846
40108 136986846 140746009 141356226 133040499 125113886 130082715 145722035 156950616 154343547
40100 154343547 143911864 137518825 139038347 142849289 143098570 141046856 142917641 151486232
$$ packed form
40155A30610658L126196J109859L481822j113873p298133m955460J930127L033239
40147A29924435k069739o922335q780298o935983O71781J0432651J1767419K033773
40139A30121704o181675k427679N767615N314937k599069p675042q117320q511020
40131A05692451n525999P403188K2496572K1967223L437548j3438951j1773948
40124A30258084K412583J1424792Q002767j078690o590909m722618K327987Q016331
40116A50050327O809701J082994j535653K98041m79929o495901r447010l295724
40108A36986846L759163O10217q315727p926613M968829J5639320J1228581k607069
40100A54343547j0431683o393039J519522L810942K49281k051714J870785Q568591
$$ plain form
40092 151486232 160730167 160314559 146662065 128699859 120230692 125518543 133853652 130626963
40084 130626963 114164296 99068827 100102338 114215195 123694610 118314890 107875193
40077 107875193 107705699 117755664 125485701 126508708 129635368 139040070 144341727 136300680
40069 136300680 122549473 117058466 120500566 122823207 121105842 121685214 125587015 125645682
40061 125645682 121015691 122195747 135804089 154003518 165527933 168959812 168051888 161766261
40053 161766261 148255210 133476235 125944286 125241997 124133905 120392088 118434973 120148097
40045 120148097 122092631 122050427 120954658 117567077 108530397 95566571 86095333 84166806
40037 84166806 86320095 88788568 93058388 100915197 109173725 113913680 116515898 120840301
$$ packed form
40092A51486232R243935m15608j3652494j7962206q469167N287851Q335109l226689
40084A30626963j6462667j5095469J033511J4112857R479415n379720j0439697
40077A07875193j69494J0049965P730037J023007L126660R404702N301657q041047
40069A36300680j3751207n491007L442100K322641j717365N79372L901801N8667
40061A25645682m629991J180056J3608342J8199429J1524415L431879r07924o285627
40053A61766261j3511051j4778975p531949p02289j108092l741817j957115J713124
40045A20148097J944534m2204j095769l387581r036680j2963826r471238j928527
40037H4166806K153289K468473M269820P856809Q258528M739955K602218M324403
$$ plain form
40029 120840301 126067625 126273504 117424043 103593909 96109711 104755873 126807583 146232558
40021 146232558 148774741 137674032 129018631 131846206 140368284 146844935 151986878 157257123
40013 157257123 156289498 143305087 124591426 112284375 109921132 112175043 115251428 118325348
40005 118325348 117530463 109235092 98944522 96988885 104684399 113934232 120731863 128454292
39997 128454292 136491999 137805212 131811385 127545683 127554024 120550236 99660851 77711176
39989 77711176 71997398 80992116 89557964 92593040 98790395 111972623 123331617 125323882
39981 125323882 121434924 117514377 113130293 106996641 103056968 105031593 110474884 115265543
39973 115265543 118976530 121417536 119430248 112576373 107139392 108184958 111286862 108777566
$$ packed form
40029A20840301N227324K05879q849461j3830134p484198Q646162K2051710J9424975
40021A46232558K542183j1100709q655401K827575Q522078O476651N141943N270245
40013A57257123r67625j2984411j8713661j2307051k363243K253911L076385L073920
40005A18325348p94885q295371j0290570j955637P695514R249833O797631P722429
39997A28454292Q037707J313213n993827m265702Q341p003788k0889385k1949675
39989G7711176n713778Q994718Q565848L035076O197355J3182228J1358994J992265
39981A25323882l888958l920547m384084o133652l939673J974625N443291M790659
39973A15265543L710987K441006j987288o853875n436981J045566L101904k509296
$$ plain form
39965 108777566 101833938 99485021 106214590 116652182 123375187 125409657 127765264 135404691
39957 135404691 147964114 158202280 156769295 141773246 122549308 110058776 104615547
39950 104615547 98172106 88342211 83178984 89153042 100458592 105866720 102959652 99514898
39942 99514898 101905626 108139719 113059713 114558562 111894622 103128126 89631175 80123055
39934 80123055 83013779 94093003 98530772 88648868 74608080 72039613 82390871 92630395
39926 92630395 93714500 91093012 93506233 98362886 95809774 85059099 78431117 86319159
39918 86319159 103289675 114130848 112062541 105785665 107147921 116106949 122069554 118497653
39910 118497653 110848858 108271497 111545147 113224235 108166001 99805992 95282268 96854841
$$ packed form
39965A08777566o943628k348917O729569J0437592O723005K034470K355607P639427
39957A35404691J2559423J0238166j432985j4996049j9223938j2490532n443229
39950A04615547o443441r829895n163227N974058J1305550N408128k907068l444754
39942I9514898K390728O234093M919994J498849k663940q766496j3496951r508120
39934H0123055K890724J1079224M437769r881904j4040788k568467J0351258J0239524
39926I2630395J084105k621488K413221M856653k553112j0750675o627982P888042
39918H6319159J6970516J0841173k068307o276876J362256Q959028N962605l571901
39910A18497653p648795k577361L273650J679088n058234q360009m523724J572573
$$ plain form
39902 96854841 99596220 97020674 88484093 80653244 80902962 89720226 101214721 110135028
39894 110135028 115006351 115162364 110651981 106475574 109784056 119041448 123223047 117397627
39886 117397627 111221923 113704188 117796147 112524205 103969351 107816988 123195937 131602202
39878 131602202 123733972 110177014 101384493 95204236 91528040 100064599 120688150 132980881
39870 132980881 122320382 103224224 97844549 101926371 94276846 74132806 64990440
39863 64990440 80013689 104674336 119039272 120347869 117042513 114576507 114439286 116401290
39855 116401290 115624887 106517814 93380748 87850732 92815629 99147080 100894069 101601499
39847 101601499 102050035 95821359 83768806 79003759 87402493 94828771 86018035 67802230
$$ packed form
39902I6854841K741379k575546q536581p830849K49718Q817264J1494495Q920307
39894A10135028M871323J56013m510383m176407L308482R257392M181599n825420
39886A17397627o175704K482265M091959n271942q554854L847637J5378949Q406265
39878A31602202p868230j3556958q792521o180257l676196Q536559K0623551J2292731
39870A32980881j0660499j9096158n379675M081822p649525k0144040r142366
39863F4990440J5023249K4660647J4364936J308597l305356k466006j37221J962004
39855A16401290p76403r107073j3137066n530016M964897O331451J746989P07430
39847A01601499M48536o228676j2052553m765047Q398734P426278q810736j8215805
$$ plain form
39839 67802230 60837215 73260041 93894841 108446068 112468251 109918062 106931184 106537501
39831 106537501 104931658 95592711 80541544 72144080 78718000 93920191 105823059
39824 105823059 110269462 109045163 101975384 89472188 77577830 71606626 68596909 63462588
39816 63462588 57756605 54491524 49973583 40425531 31897893 32839809 40090776 43067999
39808 43067999 39744565 37833390 41235366 45606743 47386223 48103547 49351966 50998800
39800 50998800 53672438 56272400 53803414 45551000 41153985 48294348 58652335 58948761
39792 58948761 52687771 55296692 68162521 74936690 67256785 57091880 56356435 59924971
39784 59924971 59218273 59045073 67199925 76621592 73106417 56956279 43792607 44489859
$$ packed form
39839F7802230o965015J2422826K0634800J4551227M022183k550189k986878l93683
39831A06537501j605843r338947j5051167q397464O573920J5202191J1902868
39824A05823059M446403j224299p069779j2503196j1894358n971204l009717n134321
39816F3462588n705983l265081m517941r548052q527638R41916P250967K977223
39808D3067999l323434j911175L401976M371377J779480P17324J248419J646834
39800E0998800K673638K599962k468986q252414m397015P140363J0357987K96426
39792E8948761o260990K608921J2865829O774169p679905j0164905p35445L568536
39784E9924971p06698j73200Q154852R421667l515175j6150138j3163672O97252
$$ plain form
39776 44489859 54721601 64720123 69968116 70053479 65080938 58219132 57240762 67382310
39768 67382310 82778547 89801886 81923471 68527334 64059954 69609761 72721831 67177189
39760 67177189 63284489 71884558 86871164 93905660 89786066 80800160 67698879 48628866
39752 48628866 34792338 43879198 73108647 95187912 89358786 64471511 43963979
39745 43963979 39337635 46239952 55728496 59763876 53721470 42190902 36131221 38789317
39737 38789317 42451282 43345188 48002881 57971303 61281874 49592780 32450382 22983390
39729 22983390 19998596 16450244 14597558 18156734 19678688 12867789 9169853 23064654
39721 23064654 46437183 57540753 52449060 47110359 48817703 47444530 38821491 35823900
$$ packed form
39776D4489859J0231742R998522N247993Q5363m972541o861806r78370J0141548
39768F7382310J5396237P023339p878415j3396137m467380N549807L112070n544642
39760F7177189l892700Q600069J4986606P034496m119594q985906j3101281j9070013
39752D8628866j3836528R086860K9229449K2079265n829126k4887275k0507532
39745D3963979m626344O902317R488544M035380o042406j1530568o059681K658096
39737C8789317L661965Q93906M657693R968422L310571j1689094j7142398r466992
39729B2983390k984794l548352j852686L559176J521954o810899l697936J3894801
39721B3064654K3372529J1103570n091693n338701J707344j373173q623039k997591
$$ plain form
39713 35823900 47322664 62526257 66660799 60304079 54122580 54324584 60906266 70720286
39705 70720286 75014030 63560942 39436618 21160030 21410697 30656292 30572025 17712335
39697 17712335 4858683 3164408 11835745 23410675 31560955 33781037 31765638 30135878
39689 30135878 32680467 39775925 48946891 55458907 53633272 42596303 30398784 26533790
39681 26533790 30320926 33276799 32590916 33322952 36200602 34123117 25160011 18847775
39673 18847775 22901640 32021067 37052932 37627029 37693287 35641958 28755723 22768974
39665 22768974 26604390 39233549 50189454 52244978 46470769 35881629 21888716
39658 21888716 8085894 1093439 4545968 14842580 24427168 28347164 27598957 26481305
$$ packed form
39713C5823900J1498764J5203593M134542o356720o181499K02004O581682R814020
39705G0720286M293744j1453088k4124324j8276588K50667R245595q4267j2859690
39697A7712335j2853652j694275Q671337J1574930Q150280K220082k015399j629760
39689C0135878K544589P095458R170966O512016j825635j1036969j2197519l864994
39681B6533790L787136K955873o85883P32036K877650k077485q963106o312236
39673A8847775M053865R119427N031865N74097O6258k051329o886235n986749
39665B2768974L835416J2629159J0955905K055524n774209j0589140j3992913
39658B1888716j3802822o992455L452529J0296612R584588L919996p48207j117652
$$ plain form
39650 26481305 26471553 24695764 21150850 23669306 37837264 53346307 51782883 31598120
39642 31598120 14324439 18847786 38551786 52491196 51077982 40432740 28415896
39635 28415896 19342425 18757611 29482781 42429717 43348313 31373655 21052480 22408037
39627 22408037 27565159 22414399 5616133 -9963672 -12292161 -1978211 11104104
39620 11104104 20382531 29006148 41858258 53758855 52490117 35538816 16593853
39613 16593853 10228513 15987222 23702011 28487311 32136049 34513061 33774929 32931971
39605 32931971 36267507 39886389 35229086 22548774 12375102 12211280 18883692 24960279
39597 24960279 26007230 20957848 12137129 5828069 6942387 13046521 18788835 23819336
$$ packed form
39650B6481305r752j775789l544914K518456J4167958J5509043j563424k0184763
39642C1598120j7273681M523347J9704000J3939410j413214j0645242j2016844
39635B8415896r073471n84814J0725170J2946936R18596j1974658j0321175J355557
39627B2408037N157122n150760j6798266j5579805k328489J0313950J3082315
39620A1104104R278427Q623617J2852110J1900597j268738j6951301j8944963
39613A6593853o365340N758709P714789M785300L648738K377012p38132q42958
39605C2931971L335536L618882m657303j2680312j0173672j63822O672412O076587
39597B4960279J046951n049382q820719o309060J114318O104134N742314N030501
$$ plain form
39589 23819336 29296707 30349527 22617751 13886118 16063094 25340394 24780120 10115936
39581 10115936 -1415362 5382144 24268582 40537417 51807415 64124596 75238313
39574 75238313 74797154 58843130 34983277 14684167 6636302 14485113 34090815 54644442
39566 54644442 67471714 71928567 70431901 63641857 55034843 52806543 58990283 61700274
39558 61700274 47482661 19254446 -5776099 -14578516 -8221255 4392820 15184112
39551 15184112 19746625 18106267 13973603 10506427 8114045 8247888 14505394 25435283
39543 25435283 31429661 25588435 14042214 8513332 11796274 17895844 23479769 30527820
39535 30527820 38766825 43855010 43873992 41505285 39332602 37609583 35942806 33377723
$$ packed form
39589B3819336N477371J052820p731776q731633K176976R277300n60274j4664184
39581A0115936j1531298O797506J8886438J6268835J1269998J2317181J1113717
39574G5238313m41159j5954024k3859853k0299110q047865P848811J9605702K0553627
39566E4644442J2827272M456853j496666o790044q607014k228300O183740K709991
39558F1700274j4217613k8228215k5030545q802417O357261J2614075J0791292
39551A5184112M562513j640358m132664l467176k392382J33843O257506J0929889
39543B5435283N994378n841226j1546221n528882L282942O099570N583925P048051
39535C0527820Q239005N088185J8982k368707k172683j723019j666777k565083
$$ plain form
39527 33377723 29192486 27019222 32975677 44592909 49024414 40696981 32726885 38595865
39519 38595865 49809163 48286123 36523630 35236291 50086160 61869826 56376389
39512 56376389 44675125 42868915 47967312 47489354 40321008 33236298 26260484 16728367
39504 16728367 11331649 19248605 36771505 51044674 55580269 51174056 37142102 15603548
39496 15603548 333585 5173575 23869762 36197262 34699199 30181783 29110022 23346109
39488 23346109 9212619 102300 7858387 23193671 28429614 22665164 20871132 31721176
39480 31721176 48857155 63075111 71738899 74606383 69922061 58660195 47021013
39473 47021013 41274823 42629340 47514583 49881131 44391015 32088969 22326512 23899665
$$ packed form
39527C3377723m185237k173264N956455J1617232M431505q327433p970096N868980
39519C8595865J1213298j523040j1762493j287339J4849869J1783666n493437
39512E6376389j1701264j806210N098397m77958p168346p084710o975814r532117
39504A6728367n396718P916956J7522900J4273169M535595m406213j4031954k1538554
39496A5603548j5269963M839990J8696187J2327500j498063m517416j071761n763913
39488B3346109j4133490r110319P756087J5335284N235943n764450j794032J0850044
39480C1721176J7135979J4217956Q663788K867484m684322j1261866j1639182
39473D7021013n746190J354517M885243K366548n490116j2302046r762457J573153
$$ plain form
39465 23899665 34611914 45056902 51697982 58198634 63167198 57370464 39269140 24519858
39457 24519858 29786726 50938972 67442265 67550027 59548078 56557936 59565994 60532561
39449 60532561 55687088 48803138 43993884 41320735 39524614 39387869 43708899 55036478
39441 55036478 72069673 87137225 90391920 80038059 66307928 60795207 62676326
39434 62676326 60549538 48629133 35630446 33987281 43862858 53414644 54614419 53053001
39426 53053001 58487469 69216189 72405343 61020518 44266237 36289161 38297092 38905505
39418 38905505 31387692 22918647 24409006 37360301 54133040 65966112 67153568 56977659
39410 56977659 42876369 37163165 44445321 55378419 58297296 53371536 49076656 48607968
$$ packed form
39465B3899665J0712249J0444988O641080O500652M968564n796734j8101324j4749282
39457B4519858N266868K1152246J6503293J07762q001949k990142L008058R66567
39449F0532561m845473o883950m809254k673149j796121j36745M321030J1327579
39441E5036478J7033195J5067552L254695j0353861j3730131n512721J881119
39434F2676326k126788j1920405j2998687j643165R875577R551786J199775j561418
39426E3053001N434468J0728720L189154j1384825j6754281p977076K007931O08413
39418C8905505p517813q469045J490359J2951295J6772739J1833072J187456j0175909
39410E6977659j4101290n713204P282156J0933098K918877m925760m294880m68688
$$ plain form
39402 48607968 47777514 43986716 39258358 36059669 37663095 49719578 71836132 90145330
39394 90145330 90411362 78134212 72254938 77408825 77650413 62865539 45706054 42357459
39386 42357459 49641863 53925277 52545359 52066807 52515826 48621959 42803360 42165244
39378 42165244 44124833 38956732 26896572 19617222 22957512 30443760 36849787 46118319
39370 46118319 60607033 72919676 75514398 70935655 65726581 60227355 51360914 41137640
39362 41137640 35422553 36466449 42140105 50802217 61590647 70402623 70744660 60828108
39354 60828108 47798058 42422190 48567581 58510655 60448578 51298710 40064196 37279234
39346 37279234 43616989 51167141 53562367 51732389 50926535 54241144 58099236 54431028
$$ packed form
39402D8607968q30454l790798m728358l198689J603426J2056483K2116554J8309198
39394I0145330K66032j2277150n879274N153887K41588j4784874j7159485l348595
39386D2357459P284404M283414j379918m78552M49019l893867n818599o38116
39378D2165244J959589n168101j2060160p279350L340290P486248O406027R268532
39370D6118319J4488714J2312643K594722m578743n209074n499226q866441j0223274
39362D1137640n715087J043896N673656Q662112J0788430Q811976L42037r916552
39354F0828108j3030050n375868O145391R943074J937923r149868j1234514k784962
39346C7279234O337755P550152K395226j829978q05854L314609L858092l668208
$$ plain form
39338 54431028 41284938 30432053 35989515 53415627 61167969 49901088 37857847
39331 37857847 45544800 66076009 77075606 73955252 70960405 72552397 66525212 48519464
39323 48519464 32154501 27696291 29021154 30105476 36848366 51938027 64104893 64756838
39315 64756838 61143541 60603925 56420419 44089116 37120090 47694354 62782838 60766339
39307 60766339 44486952 35365077 38180057 35314255 18266773 2817067 4870879 18480788
39299 18480788 28646637 33749808 43054417 58174430 68549811 65872003 56498132 55258010
39291 55258010 66735909 77186189 71402574 55148725 48929846 57802872 63746541 56113950
39283 56113950 50876966 62945989 76483869 67775770 46551844 44439115 65603417
$$ packed form
39338E4431028j3146090j0852885N557462J7426112P752342j1266881j2043241
39331C7857847P686953K0531209J0999597l120354k994847J591992o027185j8005748
39323D8519464j6364963m458210J324863J084322O742890J5089661J2166866O51945
39315F4756838l613297n39616m183506j2331303o969026J0574264J5088484k016499
39307F0766339j6279387r121875K814980k865802j7047482j5449706K053812J3609909
39299A8480788J0165849N103171R304609J5120013J0375381k677808r373871j240122
39291E5258010J1477899J0450280n783615j6253849o218879Q873026N943669p632591
39283E6113950n236984J2069023J3537880q708099k1223926k112729K1164302
$$ plain form
39276 65603417 80530092 72894233 61501178 64839693 72752568 70692333 67873543 78822578
39268 78822578 93817773 91293260 70077946 48931688 40441040 42881478 52409112 66402547
39260 66402547 77989759 82137990 85090213 95393529 108378186 111217896 100628687
39253 100628687 84911621 71848436 64827632 66698736 76433784 85611706 88555301 91642672
39245 91642672 102297262 114374090 116339859 108711900 101084891 97540367 98044869 106993319
39237 106993319 123697469 130807252 112644076 82281254 68812515 77638916 85939459
39230 85939459 80277497 74006081 78900643 83484052 74474624 60849445 58670506 65293939
39222 65293939 66682983 61413351 60311733 67325952 75323130 77965099 74497127 66204588
$$ packed form
39276F5603417J4926675p635859j1393055L338515P912875k060235k818790J0949035
39268G8822578J4995195k524513k1215314k1146258q490648K440438R527634J3993435
39260F6402547J1587212M148231K952223J0303316J2984657K839710j0589209
39253A00628687j5717066j3063185p020804J871104R735048R177922K943595L087371
39245I1642672J0654590J2076828J965769p627959p627009l544524N04502Q948450
39237A06993319J6704150P109783j8163176l0362822j3468739Q826401Q300543
39230H5939459n661962o271416M894562M583409r009428j3625179k178939O623433
39222F5293939J389044n269632j101618P014219P997178K641969l467972q292539
$$ plain form
39214 66204588 57857918 58144364 68854753 78406058 76022516 67246889 64732925 68802835
39206 68802835 69290774 62811191 55299409 49745799 44480604 42599797 49700215 61334614
39198 61334614 65326475 58621740 50175961 45199654 39548112 33726912 38384886 56994060
39190 56994060 73885514 71310076 53164011 41312430 50006976 71570762 87051802
39183 87051802 85818169 74642785 70278994 82117779 100989355 107964029 95172244
39176 95172244 73293892 57100257 50500217 49753911 53799619 63682983 76395838 87202002
39168 87202002 95282031 100476741 98459985 87518745 76671825 76935944 86364253 94482463
39160 94482463 99949953 109997707 121079456 116900840 93564698 71735829 71182889 84503136
$$ packed form
39214F6204588q346670K86446J0710389R551305k383542q775627k513964M069910
39206F8802835M87939o479583p511782n553610n265195j880807P100418J1634399
39198F1334614L991861o704735q445779m976307n651542n821200M657974J8609174
39190E6994060J6891454k575438j8146065j1851581Q694546K1563786J5481040
39183H7051802j233633j1175384m363791J1838785J8871576O974674j2791785
39176I5172244k1878352j6193635o600040p46306M045708R883364J2712855J0806164
39168H7202002Q080029N194710k016756j0941240j0846920K64119R428309Q118210
39160I4482463N467490J0047754J1081749m178616k3336142k1828869n52940J3320247
$$ plain form
39152 84503136 90813900 86238313 82592595 81444408 71332946 52180892 41202112 47159551
39144 47159551 56843957 57289839 54923272 59344751 63389328 57625156 53426320 69169295
39136 69169295 98009009 112511449 103011826 89669722 89863292 93540547 82931343 61342259
39128 61342259 47120518 48353917 58106877 68826854 77639961 80709506 75552902 68402394
39120 68402394 68340737 74447411 79026505 82861789 94827496 114035133 125340223 119550685
39112 119550685 107950676 106956106 114733924 114372893 98503241 79877441 74481552 81895817
39104 81895817 88234141 84987103 78444359 79647186 89812119 99702435 102160257 100563582
39096 100563582 102622789 108962294 112208938 106915205 96096315 86594148 81484157 79504179
$$ packed form
39152H4503136O310764m575587l645718j148187j0111462j9152054j0978780N957439
39144D7159551R684406M45882k366567M421479M044577n764172m198836J5742975
39136F9169295K8839714J4502440r499623j3342104J93570L677255j0609204k1589084
39128F1342259j4221741J233399R752960J0719977Q813107L069545n156604p150508
39120F8402394o1657O106674M579094L835284J1965707J9207637J1305090n789538
39112A19550685j1600009r94570P777818l61031j5869652j8625800n395889P414265
39104H1895817O338324l247038o542744J202827J0164933R890316K457822j596675
39096A00563582K059207O339505L246644n293733j0818890r502167n109991j979978
$$ plain form
39088 79504179 79321359 80904495 83592548 85731126 86129537 84021878 78587815 71193519
39080 71193519 67091124 70747721 78945799 83023703 80252888 78960752 88460443 106506449
39072 106506449 121183802 123914007 116459514 106268722 99682790 99180998 101865371 99969562
39064 99969562 88173963 71857076 63119874 67124598 77593533 87086008 94722581 100834944
39056 100834944 102058875 97530928 93071939 92308049 89979533 81993340 75588943 79116640
39048 79116640 86910954 86829234 79873348 78420799 85126883 88121513 80501178 71394811
39040 71394811 72002835 81624171 93578473 104788789 112492021 110693075 98312824 84555447
39032 84555447 79551928 85290414 99624526 119942957 137003895 136325424 115999311 94688819
$$ packed form
39088G9504179j82820J583136K688053K138578L98411k107659n434063p394296
39080G1193519m102395L656597Q198078M077904k770815j292136R499691J8046006
39072A06506449J4677353K730205p454493j0190792o585932n01792K684373j895809
39064I9969562j1795599j6316887q737202M004724J0468935R492475P636573O112363
39056A00834944J223931m527947m458989p63890k328516p986193o404397L527697
39048G9116640P794314q1720o955886j452549O706084K994630p620335r106367
39040G1394811O08024R621336J1954302J1210316P703232j798946j2380251j3757377
39032H4555447n003519N738486J4334112K0318431J7060938o78471k0326113k1310492
$$ plain form
39024 94688819 90852768 100687581 107281014 104424119 98814032 94841815 91702709 91957431
39016 91957431 98242408 103385241 98578767 90598517 95026357 110798048 118095144 106772107
39008 106772107 91432294 89800158 99259675 105760868 105704186 105862539 107459102 103865631
39000 103865631 93557384 84837227 85418669 93852152 103331569 109242052 110894908 109720653
38992 109720653 109110349 114195073 127230287 141206897 141527451 119967298 87815286 68946543
38984 68946543 75556314 95165332 106795491 105672815 104409005 112112701 121498494 118610981
38976 118610981 99281533 73780233 58900058 65798684 91327489 120162185 137887260
38969 137887260 141914313 138891508 135387876 134113712 134472337 132500583 125231219 118790340
$$ packed form
39024I4688819l836051R834813O593433k856895n610087l972217l139106K54722
39016I1957431O284977N142833m806474p980250M427840J5771691P297096j1323037
39008A06772107j5339813j632136R459517O501193n6682J58353J596563l593471
39000A03865631j0308247q720157N81442Q433483R479417N910483J652856j174255
38992A09720653o10304N084724J3035214J3976610L20554k1560153l2152012j8868743
38984F8946543O609771J9609018J1630159j122676j263810P703696R385793k887513
38976A18610981j9329448k5501300j4880175O898626K5528805K8834696J7725075
38969A37887260M027053l022805l503632j274164L58625j971754p269364o440879
$$ plain form
38961 118790340 123999269 138247240 143069169 130107341 117258400 123366161 138008236
38954 138008236 137271492 121462075 112352805 117269975 123775589 129581242 146076604 166115431
38946 166115431 161997902 130044225 105779708 113903662 131351272 126308777 109154363
38939 109154363 111916096 134511461 147300026 138602200 125674548 121173137 119689260
38932 119689260 118139433 121293293 124905668 119513446 112974312 122467340 141198288 142065502
38924 142065502 121130559 107654103 119387675 136922738 139013751 136171918 146803198
38917 146803198 162661728 164935257 158524356 161348450 168809726 158233505 127390116
38910 127390116 102894332 105709634 127380330 145440924 146755853 131015720 106004215
$$ packed form
38961A18790340N208929J4247971M821929j2961828j2848941O107761J4642075
38954A38008236p36744j5809417r109270M917170O505614N805653J6495362K0038827
38946A66115431m117529l1953677k4264517Q123954J7447610n042495j7154414
38939A09154363K761733K2595365J2788565q697826j2927652m501411j483877
38932A19689260j549827L153860L612375n392222o539134R493028J8730948Q67214
38924A42065502k0934943j3476456J1733572J7535063K091013k841833J0631280
38917A46803198J5858530K273529o410901K824094P461276j0576221l0843389
38910A27390116k4495784K815302K1670696J8060594J314929j5740133k5011505
$$ plain form
38903 106004215 86449847 85976405 102123979 116661678 116669583 109181826 110110643 124484731
38895 124484731 142884411 153191021 151047930 141574290 134826592 137918357 148756783
38888 148756783 158497530 161167641 158638206 155051192 149754633 139108802 123979470 111947412
38880 111947412 110896377 121459998 136501584 147669852 152113020 153197132 155556235
38873 155556235 159902020 162453784 159362532 151730837 145212771 143423211 143372731 140531936
38865 140531936 136920729 138563247 144761882 147332735 143034965 138515722 138518059 139017095
38857 139017095 139461188 149918068 172180989 183896681 162180955 119877937 96129607
38850 96129607 108027338 132651991 143057846 140091702 137092077 134126486 125896469 120277437
$$ packed form
38903A06004215j9554368m73442J6147574J4537699P905p487757R28817J4374088
38895A24484731J8399680J0306610k143091r473640o747698L091765J0838426
38888A48756783R740747K670111k529435l587014n296559j0645831j5129332j2032058
38880A11947412j051035J0563621J5041586J1168268M443168J084112K359103
38873A55556235M345785K551764l091252p631695o518066j789560n0480k840795
38865A40531936l611207J642518O198635K570853m297770m519243K337M99036
38857A39017095M44093J0456880K2262921J1715692k1715726m2303018k3748330
38850I6129607J1897731K4624653J0405855k966144k999625k965591q230017n619032
$$ plain form
38842 120277437 128144364 143433458 152379532 156041777 164717966 174765157 171315316 153463342
38834 153463342 137619361 133238689 132245440 126961722 123035045 127708830 137442199 144573309
38826 144573309 147571811 149131611 151506185 157351435 167395208 174633268 169802317 155614642
38818 155614642 145793466 146005977 146123176 137359677 127292599 129378400 144134146 158949287
38810 158949287 162731257 154768501 142498101 134988800 135404285 137331735 132719059 124035967
38802 124035967 121368050 126640026 131167167 132067488 138507897 154484871 167934596 168002778
38794 168002778 162499337 164513608 170172975 165875912 152381882 143975655 144817926 143611320
38786 143611320 134190755 125223309 124483412 128310382 133568243 145881261 165859339 179028619
$$ packed form
38842A20277437P866927J5289094Q946074L662245Q676189J0047191l449841j7851974
38834A53463342j5843981m380672r93249n283718l926677M673785R733369P131110
38826A44573309K998502J559800K374574N845250J0043773P238060m830951j4187675
38818A55614642r821176K12511J17199q763499j0067078K085801J4755746J4815141
38810A58949287L781970p962756j2270400p509301M15485J927450m612676q683092
38802A24035967k667917N271976M527141R00321O440409J5976974J3449725O8182
38794A68002778n503441K014271N659367m297063j3494030q406227Q42271j206606
38786A43611320r420565q967446p39897L826970N257861J2313018J9978078J3169280
$$ plain form
38778 179028619 172477575 154035861 142246634 142501967 145741806 146950955 150558032 157439621
38770 157439621 160702440 158709153 160881089 173683065 188666408 191886165 180829163
38763 180829163 166125066 159329128 163002500 169837041 168666545 155233127 139344199
38756 139344199 135735940 145020177 151864781 147707117 145321965 159571706 181211655 185559241
38748 185559241 165424854 139866802 128399334 131234027 139284978 148989154 159099467
38741 159099467 164755236 164356673 163546568 164742409 162657176 157908817 162124518 177562176
38733 177562176 184884760 168557382 144165673 139265250 153160436 159730521 149245026
38726 149245026 141399987 150672306 163349586 161827821 151618149 147484494 148073858 143654801
$$ packed form
38778A79028619o551044j8441714j1789227K55333L239839J209149L607077O881589
38770A57439621L262819j993287K171936J2801976J4983343L219757j1057002
38763A80829163j4704097o795938L673372O834541j170496j3433418j5888928
38756A39344199l608259R284237O844604m157664k385152J4249741K1639949M347586
38748A85559241k0134387k5558052j1467468K834693Q050951R704176J0110313
38741A59099467N655769l98563q10105J195841k085233m748359M215701J5437658
38733A77562176P322584j6327378k4391709m900423J3895186O570085j0485495
38726A49245026p845039R272319J2677280j521765j0209672m133655N89364m419057
$$ plain form
38718 143654801 139224624 149417271 173432213 192589106 194034080 183910907 175418182
38711 175418182 174608816 180093531 187503419 190858234 185626211 173107196 158771714 147176528
38703 147176528 142110132 148233852 165605362 184338134 192143306 187159825 177665682 170609052
38695 170609052 167220611 168244799 174398237 180579113 178427325 168253606 161853254 169126972
38687 169126972 186210745 200425301 203566062 197218340 188051587 181659131 179943952 181663607
38679 181663607 184874649 189240813 195789078 204354560 211288230 209948915 195954462 175042343
38671 175042343 163367033 173207852 197595898 216253027 218601317 212387691 206750780
38664 206750780 199093784 187259671 182354202 194291154 211947789 215192165 204035439
$$ packed form
38718A43654801m430177J0192647K4014942J9156893J444974j0123173q492725
38711A75418182q09366N484715P409888L354815n232023j2519015j4335482j1595186
38703A47176528n066396O123720J7371510J8732772P805172m983481r494143p056630
38695A70609052l388441J024188O153438O180876k151788j0173719o400352P273718
38687A69126972J7083773J4214556L140761o347722r166753o392456j715179J719655
38679A81663607L211042M366164O548265Q565482O933670j339315j3994453k0912119
38671A75042343j1675310R840819K4388046J8657129K348290o213626n636911
38664B06750780p656996j1834113m905469J1936952J7656635L244376j1156726
$$ plain form
38657 204035439 198322284 207935690 221127740 226507381 229076851 235959216 241152271 236234971
38649 236234971 225820746 220629218 222499347 226577588 231606459 237235700 236574436 223173039
38641 223173039 203245574 191121060 193223620 203630320 213371018 216907009 211894236
38634 211894236 200798117 191947024 191824662 196642070 197297864 191379446 184583855 182425804
38626 182425804 186924473 198905440 215829553 229252691 233001098 232679017 237724698 244671163
38618 244671163 239753161 220588356 203567157 203540247 215671798 225503223 229425412 235032898
38610 235032898 245566047 255082214 258766571 258461962 255847010 248190288 235168093 224065177
38602 224065177 222456345 228449082 233206949 231815214 227162118 223862323 223358854 225685652
$$ packed form
38657B04035439n713155R613406J3192050N379641K569470O882365N193055m917300
38649B36234971j0414225n191528J870129M078241N028871N629241o61264j3401397
38641B23173039j9927465j2124514K102560J0406700R740698L535991n012773
38634B11894236j1096119q851093j22362M817408O55794n918418o795591k158051
38626A82425804M498669J1980967J6924113J3423138L748407l22081N045681O946465
38618B44671163m918002j9164805j7021199k6910J2131551R831425L922189N607486
38610B35032898J0533149R516167L684357l04609k614952p656722j3022195j1102916
38602B24065177j608832N992737M757867j391735m653096l299795n03469K326798
$$ plain form
38594 225685652 231035773 237227325 239702651 237142709 233743699 232784500 231831657 228782347
38586 228782347 228605414 237307633 251617251 262456733 267719821 273062080 279597230 280557740
38578 280557740 273435432 266365648 267000844 272256290 274772457 272838024 267720638 257913229
38570 257913229 243807317 232580029 229988104 231581375 230411968 229182117 235118567 246060616
38562 246060616 252511697 252266131 251943314 253466872 250329059 240668427 234168057 239841796
38554 239841796 253052959 260787801 257318029 250501637 252500706 264871336 273847478 264698554
38546 264698554 242245716 229299955 238616550 255333268 258541051 252098307 256643956
38539 256643956 274742047 285676418 278719988 270107438 276234266 287999907 287117322 274857732
$$ packed form
38594B25685652N350121O191552K475326k559942l399010r59199r52843l049310
38586B28782347j76933Q702219J4309618J0839482N263088N342259O535150R60510
38578B80557740p122308p069784O35196N255446K516167j934433n117386r807409
38570B57913229j4105912j1227288k591925J593271j169407j229851N936450J0942049
38562B46060616O451081k45566l22817J523558l137813r660632o500370N673739
38554B39841796J3211163P734842l469772o816392J999069J2370630Q976142r148924
38546B64698554k2452838j2945761R316595J6716718L207783o442744M545649
38539B56643956J8098091J0934371o956430q612550O126828J1765641q82585j2259590
$$ plain form
38531 274857732 267106855 268726121 270138584 265734743 259869132 255315079 249543990 243460733
38523 243460733 242051571 244635587 244839200 242219947 243870781 251238738 254859617 248020457
38515 248020457 238992238 242273182 259567605 275400540 273982645 258700514 250605040
38508 250605040 263788770 285265476 287994712 265109290 240130128 236690171 248926348
38501 248926348 253589557 243560587 233697916 235942059 244619277 249169839 248542003 248000664
38493 248000664 250723987 256371711 260595804 254564799 234054515 210518396 202361436 211937466
38485 211937466 222212808 220783841 215363327 218276018 227235488 232396717 233822628 239004489
38477 239004489 247473223 250377065 244486597 236283808 231160901 226717142 218868847 208894009
$$ packed form
38531B74857732p750877J619266J412463m403841n865611m554053n771089o083257
38523B43460733j409162K584016K03613k619253J650834P367957L620879o839160
38515B48020457r028219L280944J7294423J5832935j417895j5282131q095474
38508B50605040J3183730K1476706K729236k2885422k4979162l439957J2236177
38501B48926348M663209j0028970r862671K244143Q677218M550562o27836n41339
38493B48000664K723323N647724M224093o031005k0510284k3536119q156960R576030
38485B11937466J0275342j428967n420514K912691Q959470N161229J425911N181861
38477B39004489Q468734K903842n890468q202789n122907m443759p848295r974838
$$ plain form
38469 208894009 201994354 201573045 205659534 208076223 205184760 202495557 209825716 226723598
38461 226723598 238462134 232481099 214334749 200314553 197879424 201441129 204855351
38454 204855351 208319961 212440071 214361895 212568567 209143168 204887003 197862076 189112562
38446 189112562 184152406 185285443 186924764 182662115 174282312 169959342 174623809 184853338
38438 184853338 193070487 195008779 192256603 187815197 181284552 171700871 164422723 168647165
38430 168647165 184331660 197650003 196450345 186146704 181798682 187222015 192368545
38423 192368545 190827294 187661205 186424329 180214892 163136441 142030274 128220552
38416 128220552 123852243 124844652 131466402 145563999 160870684 167343453 164620783 161364943
$$ packed form
38469B08894009o899655m21309M086489K416689k891463k689203P330159J6897882
38461B26723598J1738536n981035j8146350j4020196k435129L561705L414222
38454B04855351L464610M120110J921824j793328l425399m256165p024927q749514
38446A89112562m960156J133037J639321m262649q379803m322970M664467J0229529
38438A84853338Q217149J938292k752176m441406o530645r583681p278148M224442
38430A68647165J5684495J3318343j199658j0303641m348022N423333N146530
38423A92368545j541251l166089j236876o209437j7078451k1106167j3809722
38416A28220552m368309R92409O621750J4097597J5306685O472769k722670l255840
$$ plain form
38408 161364943 161382094 160748090 159547462 164234625 173612460 174090685 157632821 135914538
38400 135914538 126163088 128684666 130101019 125860186 126627343 140848235 161959467 176890951
38392 176890951 179070473 169363898 152243448 135894703 128830552 130619569 132036860 129367913
38384 129367913 130618666 140203384 146271937 135314635 113848125 101491487 104601867
38377 104601867 111634592 115281051 122726382 138089322 149860913 146751721 135668743
38370 135668743 131837401 137753886 144042007 147190440 153924922 167514079 179188166 176094831
38362 176094831 153992592 122630561 101284533 104665135 127408850 145919034 141764611
38355 141764611 120174054 100068440 91668841 92372475 98436009 107690286 113070980 107422931
$$ packed form
38408A61364943J7151o34004j200628M687163R377835M78225j6457864k1718283
38400A35914538r751450K521578J416353m240833P67157J4220892K1111232J4931484
38392A76890951K179522r706575j7120450j6348745p064151J789017J417291k668947
38384A29367913J250753R584718O068553j0957302k1466510j2356638L110380
38377A04601867P032725L646459P445331J5362940J1771591l109192j1082978
38370A35668743l831342N916485O288121L148433O734482J3589157J1674087l093335
38362A76094831k2102239l1362031k1346028L380602K2743715J8510184m154423
38355A41764611k1590557k0105614q399599P03634O063534R254277N380694n648049
$$ plain form
38347 107422931 96019362 92050906 97721570 102154317 100958616 104243271 118852262 135001240
38339 135001240 139513778 132577433 121885343 108844814 91835419 77022297 73944436
38332 73944436 82911514 96335844 109953663 123339495 131925932 129708806 120363101 115424038
38324 115424038 118731568 121231530 115298364 107186590 108991040 121152265 128672326 116329826
38316 116329826 86697924 61419587 61599088 85675975 110538947 117548397 112407328
38309 112407328 113022421 122839002 128055806 121506254 115463877 122871125 135897712 135532637
38301 135532637 118207035 99442266 90494963 85198044 76120284 71256001 82013727
38294 82013727 101708183 111823301 108675096 107537294 116419840 122677758 115876028 108748153
$$ packed form
38347A07422931j1403569l968456N670664M432747j195701L284655J4608991J6148978
38339A35001240M512538o936345j0692090j3040529j7009395j4813122l077861
38332G3944436Q967078J3424330J3617819J3385832Q586437k217126r345705m939063
38324A15424038L307530K499962n933166q111774J804450J2161225P520061j2342500
38316A16329826k9631902k5278337J79501K4076887K4862972P009450n141069
38309A12407328O15093R816581N216804o549552o042377P407248J3026587l65075
38301A35532637j7325602j8764769q947303n296919r077760m864283J0757726
38294H2013727J9694456J0115118l148205j137802Q882546O257918o801730p127875
$$ plain form
38286 108748153 118467118 136728323 139132958 121585153 106607910 110554944 123309502
38279 123309502 127013119 118378071 103859234 87951186 77360847 83577113 107818755
38272 107818755 132502203 139593645 129573779 112667659 92815344 73551006 67848155
38265 67848155 83694941 107186786 118438940 118616913 121889146 125973353 114439841 88075585
38257 88075585 68985490 67830479 70062771 63997995 60603358 71321000 84958926 84895424
38249 84895424 76313254 77286872 90880164 104337965 111301983 117108107 122940883 121017149
38241 121017149 108708564 95204335 89661580 91310935 95010992 99244688 104106490 106681417
38233 106681417 103794142 97592907 94364223 96958950 100322558 97097314 88145015 83764214
$$ packed form
38286A08748153R718965J8261205K404635j7547805j4977243L947034J2754558
38279A23309502L703617q635048j4518837j5908048j0590339O216266K4241642
38272A07818755K4683448P091442j0019866j6906120j9852315j9264338n702851
38265F7848155J5846786K3491845J1252154J77973L272233M084207j1533512k6364256
38257H8075585j9090095j155011K232292o064776l394637J0717642J3637926o3502
38249H4895424q582170R73618J3593292J3457801O964018N806124N832776j923734
38241A21017149j2308585j3504229n542755J649355L700057M233696M861802K574927
38233A06681417k887275o201235l228684K594727L363608l225244q952299m380801
$$ plain form
38225 83764214 90897762 102875813 108440894 108008274 111064007 117837667 115966993 99450680
38217 99450680 79389721 69137435 68653312 71098250 75039606 80584066 82432039 78266054
38209 78266054 76864916 85575896 95513366 92400738 78042602 67403033 66704554 68026796
38201 68026796 64817348 59482667 55144646 52401356 54896423 65187980 73930485 67398997
38193 67398997 49284480 40841075 53332499 73108280 81424416 77262083 71657902 70313402
38185 70313402 72856195 80806902 93845513 103244867 100623727 90356448 83218089 80236620
38177 80236620 73179305 60060633 49983829 51303997 62986098 78657079 91274846
38170 91274846 92487960 76787481 51559717 36174111 43499619 64463857 76735783
$$ packed form
38225H3764214P133548J1978051N565081m32620L055733O773660j870674j6516313
38217I9450680k0060959j0252286m84123K444938L941356N544460J847973m165985
38209G8266054j401138Q710980R937470l112628j4358136j0639569o98479J322242
38201F8026796l209448n334681m338021k743290K495067J0291557Q742505o531488
38193F7398997j8114517q443405J2491424J9775781Q316136m162333n604181j344500
38185G0313402K542793P950707J3038611R399354k621140j0267279p138359k981469
38177H0236620p057315j3118672j0076804J320168J1682101J5670981J2617767
38170I1274846J213114j5700479k5227764j5385606P325508K0964238J2271926
$$ plain form
38163 76735783 68365662 48641912 35648708 37468726 47462040 54760346 55672798 55003300
38155 55003300 58957033 68112049 76470445 76703323 66843777 52155845 40379165 36052472
38147 36052472 39894931 50547714 63022075 68056776 60605508 50110175 54151745 77283984
38139 77283984 103049189 113284090 109107731 104509519 104664807 102310539 94138507 88347827
38131 88347827 92334497 101542258 105199319 98223241 84978187 75189918 76277034 84846275
38123 84846275 87173259 75031637 59309897 58420515 73622366 87179073 86587720 78128424
38115 78128424 72328743 69166936 65245920 63875432 67932987 71856387 71247061 72573718
38107 72573718 82065284 91660065 88647976 75080997 64810748 62961980 60489069 49931691
$$ packed form
38163G6735783q370121j9723750j2993204J820018R993314P298306R12452o69498
38155E5003300L953733R155016Q358396K32878r859546j4687932j1776680m326693
38147C6052472L842459J0652783J2474361N034701p451268j0495333M041570K3132239
38139G7283984K5765205J0234901m176359m598212J55288k354268q172032n790680
38131H8347827L986670R207761L657061o976078j3245054r788269J087116Q569241
38123H4846275K326984j2141622j5721740q89382J5201851J3556707n91353q459296
38115G8128424n799681l161807l921016j370488M057555L923400o09326J326657
38107G2573718R491566R594781l012089j3566979j0270249j848768k472911j0557378
$$ plain form
38099 49931691 36374313 29998590 34241347 43335160 48269654 46212371 46170343 60047173
38091 60047173 83797352 95503835 80811459 53000398 36496868 36637297 39631013
38084 39631013 38073727 39547707 49360392 60732232 66227828 66297521 62801403 56010327
38076 56010327 51563768 57868792 71589809 77527636 68728776 55962527 51934345 57440218
38068 57440218 68485188 83563002 95650150 91067885 68634107 48382408 47130278
38061 47130278 54985374 51793582 38733792 34520462 43858662 50232803 42749597 32052476
38053 32052476 32568830 43176647 54507163 64541007 76308015 86753801 88385763
38046 88385763 79634539 66151457 53354015 43405170 37742151 36656725 37199482 37042396
$$ packed form
38099D9931691j3557378o375723M242757R093813M934494k057283m2028J3876830
38091F0047173K3750179J1706483j4692376k7811061j6503530J40429K993716
38084C9631013j557286J473980R812685J1371840N495596O9693l496118o791076
38076E6010327m446559O305024J3721017N937827q798860j2766249m028182N505873
38068E7440218J1044970J5077814J2087148m582265k2433778k0251699j252130
38061D7130278P855096l191792j3059790m213330R338200O374141p483206j0697121
38053C2052476N16354J0607817J1330516J0033844J1767008J0445786J631962
38046H8385763q751224j3483082j2797442r948845n663019j085426N42757j57086
$$ plain form
38038 37042396 40018164 51696369 68400847 77260811 71050508 57731732 49758357 48353099
38030 48353099 46472495 44561988 51413271 66688264 74949064 65385026 47867341 38155480
38022 38155480 34675824 24295364 6644368 -4100660 -1350467 7024715 16266947 31126327
38014 31126327 48928340 54988541 45389603 37275778 43171560 51230443 47324619 40676416
38006 40676416 45787329 52440377 41464317 22921033 26926905 55308781 73776475
37999 73776475 61068730 37586241 30940590 38138416 41151099 39194484 41999391 45653653
37991 45653653 40319293 33172803 38776548 51251294 51088632 39395898 39904766 60959714
37983 60959714 78982815 72123109 52160435 46622730 60611686 73583163 69257672
$$ packed form
38038C7042396K975768J1678205J6704478Q859964o210303j3318776p973375j405258
38030D8353099j880604j910507O851283J5274993Q260800r564038j7517685r711861
38022C8155480l479656j0380460j7650996j0745028K750193Q375182R242232J4859380
38014C1126327J7802013O060201r598938q113825N895782Q058883l905824o648203
38006D0676416N110913O653048j0976060j8543284M005872K8381876J8467694
37999G3776475j2707745k3482489o645651P197826L012683j956615K804907L654262
37991D5653653n334360p146490N603745J2474746j62662j1692734N08868K1054948
37983F0959714J8023101o859706j9962674n537705J3988956J2971477m325491
$$ plain form
37976 69257672 53736572 43984084 49227150 65268024 79771503 82019712 72733895 64104783
37968 64104783 65590619 71967999 72002613 66309684 66288064 74287877 76528136 62294598
37960 62294598 41381091 32681297 39804428 47917510 43756433 30088742 19497828 20996918
37952 20996918 34158152 50249501 57954050 54064350 49404351 57367637 75890318 89277177
37944 89277177 89331999 83933202 81151844 77973385 72424559 72888945 82066150 83490585
37936 83490585 62070423 30853537 17598193 28212360 43984924 53532138 63646407
37929 63646407 74791993 71690174 50167519 31303903 32601055 43082502 45174075
37922 45174075 44665934 55954100 69850992 63621714 39032439 23431399 30016016 40824055
$$ packed form
37976F9257672j5521100r752488N243066J6040874J4503479K248209r285817q629112
37968F4104783J485836O377380L4614n692929k1620P999813K240259j4233538
37960F2294598k0913507q699794P123131Q113082m161077j3667691j0590914J499090
37952B0996918J3161234J6091349P704549l889700m659999P963286J8522681J3386859
37944H9277177N4822n398797k781358l178459n548826M64386R177205J424435
37936H3490585k1420162l1216886j3255344J0614167J5772564R547214J0114269
37929F3646407J1145586l101819k1522655j8863616J297152J0481447K091573
37922D5174075n08141J1288166J3896892o229278k4589275j5601040O584617J0808039
$$ plain form
37914 40824055 36801599 24380844 20364463 25445843 26586498 17163479 2883582 -7714837
37906 -7714837 -9812107 -2572009 10322632 22259725 29830520 35027709 39249161 39369653
37898 39369653 32807271 22855021 16008563 16239097 22759428 30534171 33443594 31055804
37890 31055804 31234194 40829476 55272253 63924725 64144049 62070438 61008320 58971221
37882 58971221 57385783 60886419 67189429 68944974 67618046 72280022 81094817 79160567
37874 79160567 61799393 44882359 41611928 43063083 35167323 22706032 19964244 26524154
37866 26524154 30323969 29326259 31895557 38042181 38540348 33791932 36693898 52647896
37858 52647896 70699500 79389525 79296678 74894394 65675885 52197649 41551125 39342588
$$ packed form
37914D0824055m022456j2420755m016381N081380J140655r423019j4279897j0598419
37906g714837k097270P240098J2894641J1937093P570795N197189M221452J20492
37898C9369653o562382r952250o846458K30534O520331P774743K909423k387790
37890C1055804J78390R595282J4442777Q652472K19324k073611j062118k037099
37882E8971221j585438L500636O303010J755545j326928M661976Q814795j934250
37874G9160567j7361174j6917034l270431J451155p895760j2461291k741788O559910
37866B6524154L799815r97710K569298O146624M98167m748416K901966J5953998
37858E2647896J8051604Q690025r2847m402284r218509j3478236j0646524k208537
$$ plain form
37850 39342588 42575250 46070218 49847800 54886927 57281178 52448022 41751601 31117993
37842 31117993 25945510 28782318 37444184 44448077 44232102 41909301 47427867 59525471
37834 59525471 65026753 58146254 50190563 52350469 57514661 50048065 29089381 11080184
37826 11080184 9778095 22259655 35130939 37790629 29101002 17455107 15857809 31377306
37818 31377306 56360662 73129646 70267012 53613688 40171180 41362712 52231881
37811 52231881 57182387 47136994 30073280 21778486 26777602 33739919 31857883 25803594
37803 25803594 28662081 43285832 57638453 58778655 46203107 30243358 21516316
37796 21516316 23800041 33770005 44224646 48192436 42666926 30130459 16607359 7478629
$$ packed form
37850C9342588L232662L494968L777582N039127K394251m833156j0696421j0633608
37842C1117993n172483K836808Q661866P003893k15975k322801N518566J2097604
37834E9525471N501282o880499p955691K159906N164192p466596k0958684j8009197
37826A1080184j302089J2481560J2871284K659690q689627j1645895j597298J5519497
37818C1377306K4983356J6768984k862634j6653324j3442508J191532J0869169
37811E2231881M950506j0045393j7063714q294794M999116O962317j882036o054289
37803B5803594K858487J4623751J4352621J140202j2575548j5959749q727042
37796B1516316K283725R969964J0454641L967790n525510j2536467j3523100r128730
$$ plain form
37788 7478629 4523692 6937711 14335348 26265296 38045908 41162077 32094724 18599614
37780 18599614 12021988 14465931 19429435 24433738 34869434 52781400 69557157 75032211
37772 75032211 68650680 56568359 42751452 29301084 21595497 24828795 35509515
37765 35509515 42661913 39115793 28223931 18614314 14876944 14398252 12425564 9513649
37757 9513649 11867441 21451769 28282203 19906850 -653092 -15373864 -13803086 -6034108
37749 -6034108 -5609061 -8013032 1650388 23614271 39690050 36102145 19679844 7970356
37741 7970356 10872360 25324287 41693738 51221274 50814011 43466264 32890622 19385636
37733 19385636 4581077 -3371730 2503479 15923899 22062440 16014323 8112168 8230849
$$ packed form
37788G478629k954937K414019P397637J1929948J1780612L116169r067353j3495110
37780A8599614o577626K443943M963504N004303J0435696J7911966J6775757N475054
37772G5032211o381531j2082321j3816907j3450368p705587L233298J0680720
37765C5509515P152398l546120j0891862r609617l737370m78692j972688k911915
37757I513649K353792R584328O830434q375353k0559942j4720772J570778P768978
37749f034108M25047k403971R663420K1963883J6075779l587905j6422301j1709488
37741G970356K902004J4451927J6369451R527536m07263p347747j0575642j3504986
37733A9385636j4804559p952807N875209J3420420O138541o048117p902155J18681
$$ plain form
37725 8230849 13597223 16761011 17313641 18675274 19489763 16677166 13853837 18343021
37717 18343021 29657519 37080120 30828327 13194928 -2605721 -4594375 5947867
37710 5947867 14764286 9189165 -7931896 -22290822 -25272786 -21194782 -16653832 -10332053
37702 -10332053 2175836 19248240 34499193 43299023 43705564 35581466 23957776 18368822
37694 18368822 22162097 26460143 22084049 13751374 13393488 21660537 26764974 22434415
37686 22434415 16414353 17485988 23190671 26077290 24813573 22112351 16952547 6951415
37678 6951415 -3922283 -7568375 -1857530 6758111 11179642 10538252 9707880 15437675
37670 15437675 31104887 50286263 57799537 45244532 25641503 22564946 40709945
$$ packed form
37725H230849N366374L163788N52630J361633Q14489k812597k823329M489184
37717A8343021J1314498P422601o251793j7633399j5800649j988654J0542242
37710E947867Q816419n575121j7121061j4358926k981964M078004M540950O321779
37702a0332053J2507889J7072404J5250953Q799830M06541q124098j1623690n588954
37694A8368822L793275M298046m376094q332675l57886Q267049N104437m330559
37686B2434415o020062J071635N704683K886619j263717k701222n159804j0001132
37678F951415j0873698l646092N710845Q615641M421531o41390q30372N729795
37670A5437675J5667212J9181376P513274j2555005j9603029l076557J8144999
$$ plain form
37663 40709945 57452364 51859550 33047892 26526607 37272385 43299548 28253570
37656 28253570 4327156 -5798205 1973903 13202350 16076735 10650050 1683674 -5924581
37648 -5924581 -6628891 401411 6632132 4367280 -420017 3534500 13077897 12870707
37640 12870707 -1031793 -14025413 -14384393 -8289570 -5447071 -2161054 9439563 23999585
37632 23999585 28270065 20002382 9980443 7020512 10575194 16630436 21573101 21057955
37624 21057955 14261508 9410778 16059596 30462309 37293137 29145092 17079989 17059518
37616 17059518 30674911 44324434 45145547 33395726 19207312 10276482 5169718 -1154581
37608 -1154581 -8334759 -10987097 -6831146 1261846 11721262 25605741 39366970 45078305
$$ packed form
37663D0709945J6742419n592814j8811658o521285J0745778O027163j5045978
37656B8253570k3926414j0125361P772108J1228447K874385n426685q966376p608255
37648e924581p04310P030302O230721k264852m787297L954517R543397k07190
37640A2870707j3902500j2993620l58980O094823K842499L286017J1600617J4560022
37632B3999585M270480q267683j0021939k959931L554682O055242M942665n15146
37624B1057955o796447m850730O648818J4402713O830828q148045j2065103k0471
37616A7059518J3615393J3649523Q21113j1749821j4188414q930830n106764o324299
37608a154581p180178k652338M155951Q092992J0459416J3884479J3761229N711335
$$ plain form
37600 45078305 42831882 43519146 51352392 53346521 38345945 18426337 14912184 26942709
37592 26942709 32534606 21966160 11126165 15415256 27639209 32573116 29813575 28805160
37584 28805160 30654511 28982759 23166008 17433384 10260517 -2274760 -13620628 -9994157
37576 -9994157 11107407 35607436 49450765 52360860 51251501 47948628 40492134 32096039
37568 32096039 30043403 34567916 35254650 23275760 4595835 -5424607 -1974704 1458863
37560 1458863 -8758367 -25489705 -27959309 -8969423 16106496 30374553 34152946
37553 34152946 36198586 37055170 32422025 26312373 27636834 35646112 40170129 35897224
37545 35897224 26300244 14420927 1851049 -2484569 12717640 41290127 57946697
$$ packed form
37600D5078305k246423O87264P833246J994129j5000576j9919608l514153J2030525
37592B6942709N591897j0568446j0839995M289091J2223953M933907k759541j008415
37584B8805160J849351j671752n816751n732624p172867j2535277j1345868L626471
37576i994157K1101564K4500029J3843329K910095j109359l302873p456494q396095
37568C2096039k052636M524513O86734j1978890j8679925j0020442L449903L433567
37560A458863j0217230j6731338k469604J8989886K5075919J4268057L778393
37553C4152946K045640Q56584m633145o109652J324461Q009278M524017m272905
37545C5897224r596980j1879317j2569878m335618J5202209K8572487J6656570
$$ plain form
37538 57946697 47176639 24505715 16311187 24641746 27361801 12408018 -4196805
37531 -4196805 -937288 20517060 40017655 46393129 48216332 56903320 69063746 70747389
37523 70747389 54488563 27467587 5021407 -817571 10681398 27594845 33428946
37516 33428946 22050620 5339200 1588697 15103687 31581484 35460716 26997397
37509 26997397 18539490 18149528 22810889 26303884 27542428 29398899 33071907 36062309
37501 36062309 34411429 25991683 12857279 1135551 -2402317 5003152 19648506 32601375
37493 32601375 34753359 24418386 11187383 8395694 18510458 28833743 25869376
37486 25869376 11877816 1946026 5216584 14785119 17873717 11296757 3495131 3579474
$$ packed form
37538E7946697j0770058k2670924q194528Q330559K720055j4953783j6604823
37531d196805L259517K1454348J9500595O375474J823203Q686988J2160426J683643
37523G0747389j6258826k7020976k2446180n838978J1498969J6913447N834101
37516C3428946j1378326j6711420l750503J3514990J6477797L879232q463319
37509B6997397q457907l89962M661361L492995J238544J856471L673008K990402
37501C6062309j650880q419746j3134404j1721728l537868P405469J4645354J2952869
37493C2601375K151984j0334973j3231003k791689J0114764J0323285k964367
37486B5869376j3991560r931790L270558R568535L088598o576960p801626Q4343
$$ plain form
37478 3579474 11532171 19096343 19085486 13519471 11739292 19403397 30766074 34511190
37470 34511190 26705337 15111204 10803793 18210656 32707151 44123915 42852124 27753779
37462 27753779 9823776 3302923 10419187 18968899 17758726 9624189 4856994 6723415
37454 6723415 10444154 13270764 16540168 17841851 10900409 -2796037 -10195413 -1260493
37446 -1260493 17274575 29645294 29734428 25023196 23688164 25833516 28140808 29278457
37438 29278457 27957955 22583170 16611409 17569119 25561140 29269387 20731769 8733837
37430 8733837 7974643 18060234 24284651 19178473 12017365 13710764 21815936 25567787
37422 25567787 18552399 1929355 -17800353 -29513805 -23668149 -4312210 11526133
$$ packed form
37478C579474P952697P564172j0857n566015j780179P664105J1362677L745116
37470C4511190p805853j1594133m307411P406863J4496495J1416764j271791j5098345
37462B7753779j7930003o520853P116264Q549712j210173q134537m767195J866421
37454F723415L720739K826610L269404J301683o941442j3696446p399376Q934920
37446a260493J8535068J2370719Q9134m711232j335032K145352K307292J137649
37438B9278457j320502n374785n971761R57710P992021L708247q537618j1997932
37430H733837p59194J0085591O224417n106178p161108J693399Q105172L751851
37422B5567787p015388j6623044j9729708j1713452N845656J9355939J5838343
$$ plain form
37415 11526133 13039152 7641220 6592210 6731040 -2060867 -16831861 -23237004 -16351996
37407 -16351996 -6329134 -1050084 4492361 16179145 28110814 30012460 22469168 18063204
37399 18063204 28278205 51581280 72923989 75233094 55208627 28026806 12579413
37392 12579413 12551826 16490957 14675414 8532000 3381564 332050 -1723029 -2474092
37384 -2474092 -1861072 -1056983 -80813 2027486 5281989 11205588 23717742 40100506
37376 40100506 45691074 29934314 5657250 -2581110 9789961 23286382 24608055
37369 24608055 22388329 26103650 29059094 24645954 21863764 28876202 36179026 33783285
37361 33783285 31551876 42378970 57128263 59279124 54720476 60457388 69767107 58994150
$$ packed form
37415A1526133J513019n397932j049010J38830q791907j4770994o405143O885008
37407a6351996J0022862N279050N542445J1686784J1931669J901646p543292m405964
37399A8063204J0215001K3303075K1342709K309105k0024467k7181821j5447393
37392A2579413k7587L939131j815543o143414n150436l049514k055079p51063
37384b474092O13020Q04089R76170K108299L254503N923599J2512154J6382764
37376D0100506N590568j5756760k4277064q238360J2371071J3496421J321673
37369B4608055k219726L715321K955444m413140k782190P012438P302824k395741
37361C3783285k231409J0827094J4749293K150861m558648N736912R309719j0772957
$$ plain form
37353 58994150 29985953 14689580 28554255 46932211 42310901 22385189 13309413
37346 13309413 22284382 35974477 44424851 47980577 47217922 41949238 36714279 35450334
37338 35450334 34194967 28058860 20330061 16299561 14309221 11465905 11161196 15641113
37330 15641113 18688453 16279357 17064119 29898824 46967395 52681962 45518099 38169731
37322 38169731 38827554 44726381 51897536 58342420 58274939 45882662 26193925 12140502
37314 12140502 9993179 15925699 24978538 33121008 32812005 19693169 4207190 3494755
37306 3494755 18800547 32036364 28039557 10632737 -5586081 -9452037 2414990
37299 2414990 23922473 38656978 31697657 7097233 -15171984 -22294826 -18469713 -10323301
$$ packed form
37353E8994150k9008197j5296373J3864675J8377956m621310j9925712r075776
37346A3309413Q974969J3690095Q450374L555726p62655n268684n234959j263945
37338C5450334j255367o136107p728799m030500j990340k843316l04709M479917
37330A5641113L047340k409096P84762J2834705J7068571N714567p163863p348368
37322C8169731O57823N898827P171155O444884o7481j2392277j9688737j4053423
37314A2140502k147323N932520R052839Q142470l09003j3118836j5485979p12435
37306C494755J5305792J3235817l996807j7406820j6218818l865956J1867027
37299B414990K1507483J4734505o959321k4600424k2269217p122842L825113Q146412
$$ plain form
37291 -10323301 2806747 18031233 23341595 13870749 2760672 4148494 13865862 18580959
37283 18580959 16430221 15726512 18810993 21050526 23367528 32018652 44536120 47269412
37275 47269412 31484847 5599550 -12402311 -11981991 1574275 13347908 12528394 485446
37267 485446 -14584693 -27342429 -34685042 -30030498 -10016867 13131711 20446287 11845273
37259 11845273 7752156 17730468 24953828 15205415 3688089 11725735 29712256 30217225
37251 30217225 12616959 5493472 21421224 36922586 28310002 5333652 -5909656
37244 -5909656 2069877 15651990 21599783 16719511 3723242 -9417480 -10733232 4193013
37236 4193013 24660236 36145663 35408686 28897672 22090603 16686649 12200145 4072706
$$ packed form
37291a0323301J3130048J5224486N310362r470846j1110077J387822R717368M715097
37283A8580959k150738p03709L084481K239533K317002Q651124J2517468K733292
37275D7269412j5784565k5885297j8001861M20320J3556266J1773633q19514j2042948
37267D85446j5070139j2757736p342613M654544K0013631K3148578P314576q601014
37259A1845273m093117R978312P223360r748413j1517326Q037646J7986521N04969
37251C0217225j7600266p123487J5927752J5501362q612584k2976350j1243308
37244e909656P979533J3582113N947793m880272j2996269j3140722j315752J4926245
37236D193013K0467223J1485427p36977o511014o807069n403954m486504q127439
$$ plain form
37228 4072706 -12987351 -33413667 -40793842 -27701422 -7473318 3096648 4508981
37221 4508981 7083284 11438818 10954937 7629618 9013682 11969886 6101548 -6541004
37213 -6541004 -11491072 -4231582 2719773 -470820 -8378619 -13189302 -16192325 -18505307
37205 -18505307 -13481356 715809 11418934 6955049 -5186930 -8059482 1750111 12896913
37197 12896913 17517470 17912303 16068689 9529700 326645 -2775292 4323253 15025658
37189 15025658 21543869 23764065 24442268 22044019 14222472 4269030 -1464510 -219213
37181 -219213 6792693 17286435 27017410 29757004 23726009 15359326 10916850 7187502
37173 7187502 -2145878 -13224390 -15373574 -8943573 -8480730 -21945595 -35801612 -30354526
$$ packed form
37228D072706j7060057k0426316p380175J3092420K0228104J0569966J412333
37221D508981K574303M355534m83881l325319J384064K956204n868338j2642552
37213f541004m950068P259490O951355l190593p907799m810683l003023k312982
37205a8505307N023951J4197165J0703125m463885j2141979k872552R809593J1146802
37197A2896913M620557L94833j843614o538989r203055l101937P098545J0702405
37189A5025658O518211K220196O78203k398249p821547r953442n733540J245297
37181b19213P011906J0493742R730975K739594o030995q366683m442476l729348
37173G187502r333380j1078512k149184O430001M62843j3464865j3856017N447086
$$ plain form
37165 -30354526 -5105114 20885328 31860146 29748445 26525368 30838444 42677493
37158 42677493 53196668 48974863 25227804 -3207273 -13562134 -1810049 11728888
37151 11728888 8981018 -3935669 -10440596 -9399769 -12786103 -22068722 -23802667 -11071609
37143 -11071609 5254203 13243884 16611998 25495677 37995329 41666619 31052602 14853575
37135 14853575 5090366 5068149 9025544 9467699 3886659 -3065798 -4099663 1843593
37127 1843593 6849527 3813433 -2774841 -1599198 9657534 19644988 17294617 5237809
37119 5237809 -4551292 -4017581 6810443 24423879 43246226 54424017 51448009 38081796
37111 38081796 24388837 14442605 5395209 -692220 4923794 22070458 34486526 28167938
$$ packed form
37165c0354526K5249412K5990442J0974818k111701l223077M313076J1839049
37158D2677493J0519175m221805k3747059k8435077j0354861J1752085J3538937
37151A1728888k747870j2916687o504927J040827l386334r282619j733945J2731058
37143a1071609J6325812P989681L368114Q883679J2499652L671290j0614017j6199027
37135A4853575r763209k2217L957395M42155n581040o952457j033865N943256
37127A843593N005934l036094o588274J175643J1256732R987454k350371j2056808
37119E237809r789101N33711J0828024J7613436J8822347J1177791k976008j3366213
37111C8081796j3692959r946232r047396o087429N616014J7146664J2416068o318588
$$ plain form
37103 28167938 10550277 935890 6145297 16411248 22119294 22754682 20706906 18166724
37095 18166724 19784362 26496056 27520675 12663198 -7173081 -8877796 10095685 26725554
37087 26725554 27008586 24519978 31931768 36106676 23232335 11443467 29187011 68207490
37079 68207490 87814731 67617717 30334813 6878966 2610003 7710280 19163842
37072 19163842 36483316 49569880 47539452 33884364 21865185 18940898 22497653
37065 22497653 25749182 22767843 13422653 6255736 8732454 13554787 7062711 -6037237
37057 -6037237 -3588291 19544283 36089723 21876829 -7195589 -14694918 7623335
37050 7623335 32893775 38610415 30665917 24452324 22442580 19869544 17263933 15650485
$$ packed form
37103B8167938j7617661r614387N209407J0265951N708046O35388k047776k540182
37095A8166724J617638O711694J024619j4857477j9836279j704715J8973481J6629869
37087B6725554K83032k488608P411790M174908j2874341j1788868J7743544L9020479
37079F8207490J9607241k0197014l7282904k3455847m268963N100277J1453562
37072A9163842J7319474J3086564k030428j3655088j2019179k924287L556755
37065B2497653L251529k981339r345190p166917K476718M822333o492076j3099948
37057f037237K448946K3132574J6545440j4212894k9072418p499329K2318253
37050G623335K5270440N716640p944498o213593k009744k573036k605611j613448
$$ plain form
37042 15650485 10032341 -321154 -3159291 11513158 31476777 32437579 10222333 -9928631
37034 -9928631 -3097691 25412934 49528746 55545931 52576246 51023239 46699584 33667059
37026 33667059 19660963 15857099 19548249 21350303 23556442 34103726 45337995 39590023
37018 39590023 19024958 8910076 22125258 39195823 36794558 20090536 10274199
37011 10274199 12479597 15180835 13620669 14204991 18551638 20582651 19116400 18691553
37003 18691553 18011365 11177246 743535 -3166488 2559647 11785676 20959575 30802313
36995 30802313 36513793 30287989 15905911 7961233 12862295 21397140 22994926 16735393
36987 16735393 5848635 -7272496 -17277191 -18211266 -13362149 -12058164 -13426370 -5427771
$$ packed form
37042A5650485n618144j0353495k838137J4672449J9963619R60802k2215246k0150964
37034i928631O830940K8510625K4115812O017185k969685j553007m323655j3032525
37026C3667059j4006096l803864L691150J802054K206139J0547284J1234269n747972
37018C9590023k0565065j0114882J3215182J7070565k401265j6704022r816337
37011A0274199K205398K701238j560166N84322M346647K031013j466251m24847
37003A8691553o80188o834119j0433711l910023N726135R226029R173899R842738
36995C0802313N711480o225804j4382078p944678M901062Q534845J597786o259533
36987A6735393j0886758j3121131j0004695r34075M849117J303985j368206P998599
$$ plain form
36979 -5427771 14977466 32855058 33646077 20472296 6173116 -2417624 -4906247 -1261120
36971 -1261120 5848653 9214129 5379240 -229473 -1798371 -723698 -391816 -1059800
36963 -1059800 -4574784 -14856378 -27402125 -28540273 -14236622 -640875 -4704662 -20663790
36955 -20663790 -27280591 -14606532 6643235 19457680 15312323 -2306975 -20223908
36948 -20223908 -23793460 -11080161 3252063 5499433 1048160 6220759 24448686 40479052
36940 40479052 38866537 20430120 -916906 -11848951 -9300051 -1104193 2246645 -1478347
36932 -1478347 -5488767 -5336222 -4931637 -6844903 -4119116 9540684 26554199 32730025
36924 32730025 25404665 14823099 8947799 6417644 4104765 2179842 806482 102596
$$ packed form
36979e427771K0405237J7877592P91019j3173781j4299180q590740k488623L645127
36971a261120P109773L365476l834889n608713j568898J074673L31882o67984
36963a059800l514984j0281594j2545747j138148J4303651J3595747m063787j5959128
36955b0663790o616801J2674059K1249767J2814445m145357j7619298j7916933
36948b0223908l569552J2713299J4332224K247370m451273N172599J8227927J6030366
36940D0479052j612515j8436417k1347026j0932045K548900Q195858L350838l724992
36932a478347m010420J52545M04585j913266K725787J3659800J7013515O175826
36924C2730025p325360j0581566n875300k530155k312879j924923j373360p03886
$$ plain form
36916 102596 3958936 15337384 27012625 26758146 14663814 5919561 11357877 23254701
36908 23254701 27155448 21550453 17244330 20006992 22874124 17482334 6788707 2002831
36900 2002831 8887196 21190678 28337457 26815098 21986888 20260719 21882086 20918808
36892 20918808 11106721 -6218570 -18275798 -9590021 19650309 47528961 50957175
36885 50957175 30968127 9104280 457809 1849062 6634910 15774529 28064313 33154475
36877 33154475 24376267 9314152 -848523 -3700645 -378220 10146773 21740106
36870 21740106 18732145 -3430378 -25664198 -28404921 -17828365 -12628222 -14092881 -9409489
36862 -9409489 1794562 6869373 4211572 5822094 14445224 18847652 15140716 13261189
$$ packed form
36916A02596L856340J1378448J1675241k54479j2094332q744253N438316J1896824
36908B3254701L900747n604995m306123K762662K867132n391790j0693627m785876
36900B002831O884365J2303482P146779j522359m828210j726169J621367r63278
36892B0918808r812087j7325291j2057228Q685777K9240330K7878652L428214
36885E0957175j9989048k1863847q646471J391253M785848R139619J2289784N090162
36877C3154475q778208j5062115j0162675k852122L322425J0524993J1593333
36870B1740106l007961k2162523k2233820k740723J0576556N200143j464659M683392
36862i409489J1204051N074811k657801J610522Q623130M402428l706936j879527
$$ plain form
36854 13261189 17802162 21176757 20840888 24082694 29250906 22267433 1305355 -14316758
36846 -14316758 -12094783 -5488694 -10506845 -19023254 -13291646 4452540 15805655 13237869
36838 13237869 6485752 5018692 7962361 10178240 8261442 2255022 -1902927 3357810
36830 3357810 14337063 16011799 3665833 -5609075 4173188 22562801 26749524 15335437
36822 15335437 9332874 19810979 32679073 30865669 17622349 9657741 15490776 28123518
36814 28123518 35215177 31488175 22261733 16299625 15029329 11392144 1314120 -8663861
36806 -8663861 -10337490 -5821537 -3497755 -5390720 -6723608 -6167251 -7906987 -13127415
36798 -13127415 -16726034 -14274180 -7530418 -1857393 -886520 -3255518 -3098091 3310549
$$ packed form
36854A3261189M540973L374595l35869L241806N168212o983473k0962078j5622113
36846a4316758K221975O606089n018151q516409N731608J7744186J1353115k567786
36838A3237869o752117j467060K943669K215879j916798o006420m157949N260737
36830C357810J0979253J674736j2345966r274908R782263J8389613M186723j1414087
36822A5335437o002563J0478105J2868094j813404j3243320p964608N833035J2632742
36814B8123518P091659l727002r226442n962108j270296l637185j0078024r977981
36806h663861j673629M515953K323782j892965j332888N56357j739736n220428
36798a3127415l598619K451854O743762N673025R70873k368998J57427O408640
$$ plain form
36790 3310549 9956815 6095167 -7654238 -15913617 -7798981 7829687 14898404 10907142
36782 10907142 4808332 789723 -2419550 -275306 14108607 35176723 47625795 46006559
36774 46006559 39688958 36573646 34378242 30836950 29179992 28165740 19417595 2608998
36766 2608998 -7566711 518332 18362557 28678570 27929498 26480143 29519643 29921439
36758 29921439 21913026 12152866 11284141 18947683 23578780 17037978 4515315 -2761142
36750 -2761142 -1165699 3952296 8661684 14632337 21531490 23880945 20562880 19556076
36742 19556076 25533737 29628729 21617711 7114070 599070 3978053 4906168 -3572873
36734 -3572873 -14261153 -18666274 -17128524 -13022541 -7479720 -3595237 -5805519 -10833020
$$ packed form
36790C310549O646266l861648j3749405q259379Q114636J5628668P068717l991262
36782A0907142o098810m018609l209273K144244J4383913K1068116J2449072j619236
36774D6006559o317601l115312k195404l541292j656958j014252q748145j6808597
36766B608998j0175709Q085043J7844225J0316013p49072j449355L039500M01796
36758B9921439q008413r760160q68725P663542M631097o540802j2522663p276457
36750b761142J595443N117995M709388N970653O899153K349455l318065j006804
36742A9556076N977661M094992q011018j4503641o515000L378983R28115q479041
36734c572873j0688280m405121J537750M105983N542821L884483k210282n027501
$$ plain form
36726 -10833020 -8928085 1167269 7860925 2321671 -10815426 -23469268 -34494196
36719 -34494196 -43085312 -42443118 -30262071 -17586456 -15867482 -20378110 -17495978 -5093302
36711 -5093302 5105507 4322624 -3436012 -8465051 -4909427 6883272 21184288 29603846
36703 29603846 27834655 19728726 11648150 5353304 633169 888308 8808058 18256817
36695 18256817 18151759 5441756 -10651151 -17617910 -9620298 9152235 25954513 26968354
36687 26968354 10564518 -7574639 -9478687 5141324 20761542 27048593 28457417
36680 28457417 31022497 30726145 22311068 11639729 9195234 14935425 19381327 18422799
36672 18422799 17063618 17483256 14002730 4689560 -1514064 2548012 9559488 8295140
$$ packed form
36726a0833020J904935J0095354O693656n539254j3137097j2653842j1024928
36719c4494196q591116O42194J2181047J2675615J718974m510628K882132J2402676
36711e093302J0198809p82883p758636n029039L555624J1792699J4301016Q419558
36703B9603846j769191q105929q080576o294846m720135K55139P919750R448759
36695A8256817j05058j2710003j6092907o966759P997612J8772533J6802278J013841
36687B6968354j6403836j8139157j904048J4620011J5620218O287051J408824
36680B8457417K565080k96352q415077j0671339k444495N740191M445902r58528
36672A8422799j359181M19638l480526r313170o203624M062076P011476j264348
$$ plain form
36664 8295140 2163058 3944341 13060240 13529814 -685939 -12920237 -6249506 12603185
36656 12603185 24423216 24430693 23705793 28638001 34308263 37038169 38857334 38393489 30824801
36647 30824801 19105934 12371491 10529417 3929150 -7830392 -11525963 -1553709 8863723
36639 8863723 7770107 3186761 9082256 22406994 28542730 23865868 18804447 20580093
36631 20580093 24629505 22927081 12510861 -2884252 -12962594 -6454663 15149336
36624 15149336 33261363 31018078 13586322 207258 -964205 1177469 -1448325 -4791736
36616 -4791736 -1902700 6315558 13522747 14593971 7794366 -3398139 -9457169 -2879051
36608 -2879051 10949715 17723998 11499133 1601798 -639487 4207965 7437704 5118894
$$ packed form
36664H295140o132082J781283R115899M69574j4215753j2234298O670731J8852691
36656A2603185J1820031P477p24900M932208N670262K729906J819165m63845p568688
36647C0824801j1718867o734443j842074o600267j1759542l695571R972254J0417432
36639H863723j093616m583346N895495J3324738O135736m676862n061421J775646
36631B0580093M049412j702424j0416220j5395113j0078342O507931K1603999
36624A5149336J8112027k243285j7431756j3379064j171463K141674k625794l343411
36616d791736K889036Q218258P207189J071224o799605j1192505o059030O578118
36608b879051J3828766O774283o224865r897335k241285M847452L229739k318810
$$ plain form
36600 5118894 1755284 2579824 6367451 6913272 911308 -6227410 -4141756 11264617
36592 11264617 31708421 43588274 39977875 24398920 5828610 -6841805 -8256219
36585 -8256219 386595 11537949 17092819 14144631 5174236 -4359609 -7987838 -2567820
36577 -2567820 7354087 14354433 18755987 27354637 38889494 40467644 25379111 6155775
36569 6155775 812473 12113317 28989149 41890553 46592536 38888081 18043302 -6817527
36561 -6817527 -23887355 -30079264 -27968835 -17823785 -2875206 5304070 954204 -2424672
36553 -2424672 10968352 33403933 42715784 34024821 22067847 12719804 -4452289 -30521984
36545 -30521984 -47144544 -42468123 -28267747 -19637947 -14336072 -5318835 1456581 -2324981
$$ packed form
36600E118894l363610Q24540L787627N45821o001964p138718K085654J5406373
36592A1264617K0443804J1879853l610399j5578955j8570310j2670415j414414
36585h256219Q642814J1151354N554870k948188q970395r533845l628229N420018
36577b567820R921907P000346M401554Q598650J1534857J578150j5088533j9223336
36569F155775n343302J1300844J6875832J2901404M701983p704455k0844779k4860829
36561f817527j7069828o191909K110429J0145050J4948579Q179276m349866l378876
36553b424672J3393024K2435581R311851q690963j1956974r348043j7172093k6069695
36545c0521984j6622560M676421J4200376Q629800N301875R017237O775416l781562
$$ plain form
36537 -2324981 -9722800 -7428279 4342410 14053938 15758532 12611710 8386312 5761227
36529 5761227 8988685 19137097 29769269 34135054 33009124 30615158 28245197 26143856
36521 26143856 24957089 21774613 13220720 5308267 8660422 20180355 24170047 17861232
36513 17861232 18384984 33943174 46658149 39885340 25607333 24637918 33586866 34340763
36505 34340763 25592554 20057452 17611995 7410031 -6628487 -8694130 563316 4054389
36497 4054389 -1029718 2010564 18514058 31295346 28980929 22049351 19540476 12540201
36489 12540201 -4240913 -15002744 -5774071 11243650 16539765 14323748 23141132 43261821
36481 43261821 55648227 51292570 41247998 35156313 27344790 10721383 -8082324
$$ packed form
36537b324981p397819K294521J1770689R711528J704594l146822m225398k625085
36529E761227L227458J0148412J0632172M365785j125930k393966k369961k101341
36521B6143856j186767l182476q553893p912453L352155J1519933L989692o308815
36513A7861232N23752J5558190J2714975o772809j4278007r69415Q948948P53897
36505C4340763q748209n535102k445457j0201964j4038518k065643R257446L491073
36497D054389n084107L040282J6503494J2781288k314417o931578k508875p000275
36489A2540201j6781114j0761831R228673J7017721N296115k216017Q817384K0120689
36481D3261821J2386406m355657j0044572o091685p811523j6623407j8803707
$$ plain form
36474 -8082324 -15656432 -7437866 9088771 22560023 25757928 19370348 10873387 7437154
36466 7437154 8472464 7450752 1699682 -2906201 757251 10897686 16991754 11339759
36458 11339759 -774971 -5060116 6471405 26293237 39621364 39784887 32352496 26338996
36450 26338996 26080562 30560367 35280364 34718095 27767511 20683223 19990814 23632620
36442 23632620 25226909 25615832 31380688 41177963 43666931 33301515 19808373 16109114
36434 16109114 22992632 31468465 35259294 35370808 36143125 41422361 51150679 58387330
36426 58387330 54445491 40765792 30304621 32293296 40654065 42804914 34833868 21638936
36418 21638936 6999502 -7802478 -17467452 -13786106 4328147 26557778 39348506
$$ packed form
36474h082324p574108Q218566J6526637J3471252L197905o387580q496961l436233
36466G437154J035310j021712n751070m605883L663452J0140435O094068n651995
36458A1339759j2114730m285145J1531521J9821832J3328127J63523p432391o013500
36450B6338996k58434M479805M719997n62269o950584p084288o92409L641806
36442B3632620J594289L88923N764856R797275K488968j0365416j3493142l699259
36434A6109114O883518Q475833L790829J11514P72317N279236R728318P236651
36426E8387330l941839j3679699j0461171J988675Q360769K150849p971046j3194932
36418B1638936j4639434j4801980r664974L681346J8114253K2229631J2790728
$$ plain form
36411 39348506 37230697 26219468 17014200 14424929 14281345 12567980 14190128 25696181
36403 25696181 40847621 44281897 32700834 21447144 23362720 31377394 32073340 27936182
36395 27936182 32438295 46901607 56469619 50037847 32816601 16620434 7157305 4167192
36387 4167192 5655788 7168992 3222506 -5105887 -8139420 1496174 18023858 27600254
36379 27600254 24575285 18873257 24309117 40494411 50572252 40334736 17262292
36372 17262292 4532123 14957124 36462886 46527457 36613347 18378908 8781800
36365 8781800 13031668 21251868 20528375 11207373 8658945 23529949 43897613 48632932
36357 48632932 38327642 36644946 54140051 67867856 51987971 16202277 -5977411
$$ packed form
36411C9348506k117809j1011229r205268k589271j43584j713365J622148J1506053
36403B5696181J5151440L434276j1581063j1253690J915576Q014674O95946m137158
36395B7936182M502113J4463312R568012o431772j7221246j6196167r463129k990113
36387D167192J488596J513204l946486q328393l033533R635594J6527684R576396
36379B7600254l024969n702028N435860J6185294J0077841j0237516k3072444
36372A7262292j2730169J0425001K1505762J0064571r914110j8234439r597108
36365H781800M249868Q220200p23493r321002k548428J4871004K0367664M735319
36357D8632932j0305290j682696J7495105J3727805j5879885l5785694k2179688
$$ plain form
36350 -5977411 -1283688 11533780 13324896 7568712 6345073 10445076 13846800 17089650
36342 17089650 24634372 33325972 32711567 17573591 -3589246 -14592715 -7736996 6445026
36334 6445026 10798715 4256707 3610574 17004552 27912294 18208186 -3460214 -14443341
36326 -14443341 -11956389 -12236937 -18969673 -17815908 -5602974 757353 -6363798 -11033286
36318 -11033286 -2514697 3550173 -9052877 -28109191 -31097537 -19062897 -10088030 -8544165
36310 -8544165 -4300596 2674610 787043 -9867117 -13746785 -3258358 11139747 18779743
36302 18779743 22320752 28634967 38377971 49169770 58777531 61815955 53363859 38686192
36294 38686192 29513215 28584510 28363698 26580899 30141877 39729301 44088982 36811273
$$ packed form
36350e977411M693723J2817468J791116n756184j223639M100003L401724L242850
36342A7089650P544722Q691600o14405j5137976k1162837j1003469O855719J4182022
36334F445026M353689o542008o46133J3393978J0907742r704108k1668400j0983127
36326a4443341K486952k80548o732736J153765J2212934O360327p121151m669488
36318a1033286Q518589O064870j2603050j9056314k988346J2034640Q974867J543865
36310h544165M243569O975206j887567j0654160l879668J0488427J4398105P639996
36302A8779743L541009O314215R743004J0791799R607761L038424q452096j4677667
36294C8686192r172977r28705k20812j782799L560978R587424M359681p277709
$$ plain form
36286 36811273 27112063 25215366 26880958 22076343 10828637 198903 -7823138 -14415366
36278 -14415366 -15047505 -4991087 7732888 7056909 -10526144 -28777492 -29999515 -15406151
36270 -15406151 -1917870 -489721 -3142320 5575037 26878437 43853005 42206038 29176917
36262 29176917 24227829 33541815 43440732 40010520 25468051 11429700 4823993 5782779
36254 5782779 11590297 16204162 12576390 2261858 -3580891 357261 4482479 -252723
36246 -252723 -5472947 2963279 20879850 28721296 18931180 5804215 4123434 10946544
$$ packed form
36286C6811273r699210j896697J665592m804615j1247706j0629734q022041o592228
36278a4415366o32139J0056418J2723975o75979j7583053j8251348j222023J4593364
36270a5406151J3488281J428149k652599Q717357K1303400J6974568j646967j3029121
36262B9176917m949088R313986R898917l430212j4542469j4038351o605707R58786
36254E782779N807518M613865l627772j0314532n842749L938152M125218m735202
36246b52723n220224Q436226J7916571P841446r790116j3126965j680781O823110
$$ [...]
##END NTUPLES=NMR SPECTRUM
##END=
