##TITLE=31Pdec_LR-662-RM2
 , 124 sc
 15.3.2019
##JCAMPDX= 6.0         $$ Bruker NMR JCAMP-DX V2.0
##DATA TYPE= NMR SPECTRUM
##DATA CLASS= NTUPLES
##ORIGIN= UXNMR, Bruker Analytische Messtechnik GmbH
##OWNER= root
$$ XWIN-NMR		Version 3.5
$$ Fri Mar 15 14:52:14 2019 Russian Standard Time (UT+4h)  she@DPX200
##.OBSERVE FREQUENCY= 81.013821
##.OBSERVE NUCLEUS= ^31P
##.ACQUISITION MODE= SIMULTANEOUS
##.ACQUISITION SCHEME= undefined
##.AVERAGES= 124
##.DIGITISER RES= 17
##SPECTROMETER/DATA SYSTEM= spect
##.PULSE SEQUENCE= zgpg30
##.SOLVENT NAME= CDCl3
##.SHIFT REFERENCE= (INTERNAL, CDCl3, 0, 182.463)
##AUDIT TRAIL= $$ (NUMBER, WHEN, WHO, WHERE, WHAT)
$$ ##TITLE= Audit trail, XWIN-NMR		Version 3.5
$$ ##JCAMPDX= 5.01
$$ ##ORIGIN= Bruker BioSpin GmbH
$$ ##OWNER= she
$$ F:/spectra/data/she/nmr/P31/1/pdata/1/auditp.txt
$$ ##AUDIT TRAIL=  $$ (NUMBER, WHEN, WHO, WHERE, WHAT)
(   1,<2019-03-15 14:48:33.26 +0400>,<she>,<DPX200>,
      <continue with go, POWCHK disabled, PULCHK disabled
       configuration hash MD5:
       00 E9 B6 7A A2 85 ED C7 34 08 36 98 17 FE 4E 26
       data hash MD5: 32K
       A6 95 A0 99 D4 42 39 8F 5D 11 33 88 D3 69 23 2B>)
(   2,<2019-03-15 14:51:18.00 +0400>,<she>,<DPX200>,
      <Start of raw data processing
       efp BC_mod = 2 LB = 1 FT_mod = 6 PKNL = 1 PHC0 = -1833.574 PHC1 = 135.1989 SI = 64K 
       data hash MD5: 64K
       DC 33 22 74 4D 36 E8 3A BA 7D 7F 27 EE F9 75 37>)
(   3,<2019-03-15 14:51:35.14 +0400>,<she>,<DPX200>,
      <pk PHC0 = 12.84383 PHC1 = -32 
       data hash MD5: 64K
       41 2B B5 D4 EB 53 EA 9F 30 CE 61 27 1C 83 9A 62>)
(   4,<2019-03-15 14:51:38.64 +0400>,<she>,<DPX200>,
      <abs ABSG = 5 
       data hash MD5: 64K
       29 48 5E 5A 12 BA 3C 3D E0 5D B4 4C 6B FC 81 C1>)
$$ ##END=
$$ 
$$ hash MD5
$$ D6 17 83 C8 65 AF 40 8E 9D 25 4C DB F7 42 D8 A5
##$RELAX= 
##$RELAX= 
##$RELAX= 
##$RELAX= 
##$RELAX= 
##$RELAX= 
##$RELAX= 
##$RELAX= 
$$ Bruker specific parameters
$$ --------------------------
##$DU= <F:/spectra>
##$EXPNO= 1
##$NAME= <P31>
##$PROCNO= 1
##$TYPE= <nmr>
##$USER= <she>
##$AMP= (0..31)
100 100 100 100 100 100 100 100 100 100 100 100 100 100 100 100 100 100 
100 100 100 100 100 100 100 100 100 100 100 100 100 100 
##$AQSEQ= 0
##$AQ_mod= 1
##$AUNM= <au_zg>
##$AUTOPOS= <>
##$BF1= 81.014009
##$BF2= 200.13
##$BF3= 200.13
##$BF4= 200.13
##$BF5= 200.13
##$BF6= 200.13
##$BF7= 200.13
##$BF8= 200.13
##$BYTORDA= 1
##$CFDGTYP= 0
##$CFRGTYP= 5
##$CHEMSTR= <none>
##$CNST= (0..31)
1 1 145 1 1 1 1 1 1 1 1 1 1 1 1 1 1 1 1 1 1 1 1 1 1 1 1 1 1 1 1 1 
##$CPDPRG= <waltz16>
##$CPDPRG1= <>
##$CPDPRG2= <waltz16>
##$CPDPRG3= <>
##$CPDPRG4= <mlev>
##$CPDPRG5= <mlev>
##$CPDPRG6= <mlev>
##$CPDPRG7= <mlev>
##$CPDPRG8= <mlev>
##$CPDPRGB= <>
##$CPDPRGT= <>
##$D= (0..31)
0 1 0 0 0 0 0 0 0 0 0 0.03 2e-05 3e-06 0 0 0 0 0 0 0 0 0 0 0 0 0 0 0 0 
0 0 
##$DATE= 1552646678
##$DBL= (0..7)
120 120 120 11 120 120 24 19 
##$DBP= (0..7)
150 150 150 150 150 150 150 150 
##$DBP07= 0
##$DBPNAM0= <>
##$DBPNAM1= <>
##$DBPNAM2= <>
$$ [...]
##$SUBNAM3= <"">
##$SUBNAM4= <"">
##$SUBNAM5= <"">
##$SUBNAM6= <"">
##$SUBNAM7= <"">
##$SUBNAM8= <"">
##$SUBNAM9= <"">
##$SW= 369.568048894756
##$SWIBOX= (0..15)
0 1 3 0 0 0 0 0 0 0 0 0 0 0 0 0 
##$SW_h= 29940.119760479
##$TD= 32768
##$TD0= 1
##$TE= 0
##$TE2= 300
##$TE3= 300
##$TEG= 300
##$TL= (0..7)
0 120 53 12 22 120 120 120 
##$TP= (0..7)
150 150 150 150 150 150 150 150 
##$TP07= 0
##$TPNAME0= <>
##$TPNAME1= <>
##$TPNAME2= <>
##$TPNAME3= <>
##$TPNAME4= <>
##$TPNAME5= <>
##$TPNAME6= <>
##$TPNAME7= <>
##$TPOAL= (0..7)
0.5 0.5 0.5 0.5 0.5 0.5 0.5 0.5 
##$TPOFFS= (0..7)
0 0 0 0 0 0 0 0 
##$TUNHIN= 0
##$TUNHOUT= 0
##$TUNXOUT= 0
##$USERA1= <user>
##$USERA2= <user>
##$USERA3= <user>
##$USERA4= <user>
##$USERA5= <user>
##$V9= 5
##$VALIST= <valist>
##$VCLIST= <CCCCCCCCCCCCCCC>
##$VD= 0
##$VDLIST= <DDDDDDDDDDDDDDD>
##$VPLIST= <PPPPPPPPPPPPPPP>
##$VTLIST= <TTTTTTTTTTTTTTT>
##$WBST= 1024
##$WBSW= 4
##$XGAIN= (0..3)
0 0 0 0 
##$XL= 0
##$YL= 0
##$YMAX_a= 68055
##$YMIN_a= -129707
##$ZGOPTNS= <>
##$ZL1= 120
##$ZL2= 120
##$ZL3= 120
##$ZL4= 120
##$ABSF1= 182.463
##$ABSF2= -187.1042
##$ABSG= 5
##$ABSL= 3
##$ALPHA= 0
##$AQORDER= 0
##$ASSFAC= 0
##$ASSFACI= 0
##$ASSFACX= 0
##$ASSWID= 0
##$AUNMP= <proc_1d>
##$AZFE= 0.1
##$AZFW= 0.5
##$BCFW= 0
##$BC_mod= 2
##$BYTORDP= 0
##$COROFFS= 0
##$CY= -3
##$DATMOD= 1
##$DC= 0
##$DFILT= <>
##$DTYPP= 0
##$F1P= 0
##$F2P= 0
##$FCOR= 1
##$FTSIZE= 65536
##$FT_mod= 6
##$GAMMA= 0
##$GB= 0
##$INTBC= 1
##$INTSCL= 5.30512e-09
##$ISEN= 30
##$LB= 1
##$LEV0= 0
##$LPBIN= 0
##$MAXI= 10000
##$MC2= 0
##$MEAN= 0
##$ME_mod= 0
##$MI= 50
##$NCOEF= 0
##$NC_proc= -8
##$NLEV= 6
##$NOISF1= 182.463
##$NOISF2= 159.3651
##$NSP= 0
##$NTH_PI= 0
##$NZP= 0
##$OFFSET= 182.463
##$PC= 4
##$PHC0= -1820.73
##$PHC1= 103.1989
##$PH_mod= 1
##$PKNL= yes
##$PPARMOD= 0
##$PSCAL= 0
##$PSIGN= 0
##$REVERSE= no
##$SF= 81.0140089999434
##$SI= 65536
##$SIGF1= 159.3651
##$SIGF2= -187.1042
##$SINO= 113.3802
##$SIOLD= 16384
##$SREGLST= <1H.CDCl3>
##$SSB= 0
##$STSI= 65536
##$STSR= 0
##$SW_p= 29940.119760479
##$SYMM= 0
##$S_DEV= 0
##$TDeff= 32768
##$TDoff= 0
##$TI= <>
##$TILT= no
##$TM1= 0
##$TM2= 0
##$TOPLEV= 0
##$USERP1= <user>
##$USERP2= <user>
##$USERP3= <user>
##$USERP4= <user>
##$USERP5= <user>
##$WDW= 1
##$XDIM= 65536
##$YMAX_p= 297739116
##$YMIN_p= -268361923
$$ End of Bruker specific parameters
$$ ---------------------------------
##NTUPLES= NMR SPECTRUM
##VAR_NAME=  FREQUENCY,     SPECTRUM/REAL,   SPECTRUM/IMAG
##SYMBOL=    X,             R,               I
##VAR_TYPE=  INDEPENDENT,   DEPENDENT,       DEPENDENT
##VAR_FORM=  AFFN,          ASDF,            ASDF
##VAR_DIM=   65536,         65536,           65536
##UNITS=     HZ,            ARBITRARY UNITS, ARBITRARY UNITS
##FACTOR=    0.456856943014862, 1,           1
##FIRST=     14782.0589164792, 0,            0
##LAST=      -15158.0608439998, 0,           0
##MIN=       -15158.0608439998, -268361923,  0
##MAX=       14782.0589164792, 297739116,    0
$$ Real data points
##PAGE= N=1
##DATA TABLE= (X++(R..R)), XYDATA
$$ [...]
$$ plain form
40306 46164521 37922486 32455739 33102785 35137342 33157381 27007465 20450681 17186028
40298 17186028 19822609 29687321 43305537 50416215 42107761 23555403 13075779 23302987
40290 23302987 46155914 61178997 56533008 37418272 17016130 5714610 7446281
40283 7446281 18320606 27154917 24051551 11608333 3088666 7114516 18685206 27629655
40275 27629655 30421516 29409501 25521921 18627943 12713334 12941513 16890731 15762875
40267 15762875 7252664 1029683 6128178 17582393 23219313 21418946 22482068 31076735
40259 31076735 37781525 33618484 23634698 17183506 12644762 4001857 -3210559 1484052
40251 1484052 12311567 10395792 -8115790 -24234444 -23991377 -17571290 -19148391 -23009823
$$ packed form
40306D6164521q242035n466747O47046K034557j979961o149916o556784l264653
40298A7186028K636581R864712J3618216P110678q308454j8552358j0479624J0227208
40290B3302987K2852927J5023083m645989j9114736k0402142j1301520J731671
40283G446281J0874325Q834311l103366j2443218q519667M025850J1570690Q944449
40275B7629655K791861j012015l887580o893978n914609K28179L949218j127856
40267A5762875q510211o222981N098495J1454215N636920j800367J063122Q594667
40259C1076735O704790m163041r983786o451192m538744q642905p212416M694611
40251A484052J0827515j915775j8511582j6118654K43067O420087j577101l861432
$$ plain form
40243 -23009823 -15915123 -1398316 7222999 10169026 17267488 25455961 22041951 9865803
40235 9865803 6928536 17100599 22653609 13424464 2748815 2738716 2848087 -10042124
40227 -10042124 -24790297 -19787260 4069126 24070493 26631973 19405282 12139438 3140898
40219 3140898 -9687155 -18592194 -16125821 -7147155 -1578386 45036 5077030 14595304
40211 14595304 19533124 13913879 5680354 7428539 17847043 20825398 6922309 -11714593
40203 -11714593 -16161240 -5424999 5345053 9388623 15900972 29346671 37178316 28703076
40195 28703076 13768052 8607351 11678448 9308985 -214993 -5781367 -4899183 -7498018
40187 -7498018 -15423752 -16048203 -3852654 7271904 4589996 -2910361 1415144 15391111
$$ packed form
40243b3009823P094700J4516807Q621315K946027P098462Q188473l414010j2176148
40235I865803k937267J0172063N553010r229145j0675649j0099J09371j2890211
40227a0042124j4748173N003037K3856386K0001367K561480p226691p265844q998540
40219C140898j2828053q905039K466373Q978666N568769J623422N031994R518274
40211A4595304M937820n619245q233525J748185J0418504K978355j3903089j8636902
40203a1714593m446647J0736241J0770052M043570O512349J3445699P831645q475240
40195B8703076j4935024n160701L071097k369463r523978n566374Q82184k598835
40187g498018p925734o24451J2195549J1124558k681908p500357M325505J3975967
$$ plain form
40179 15391111 21589819 14583537 8735244 15559569 25953243 22615334 3271906 -16824352
40171 -16824352 -23956617 -21082114 -21680519 -31152529 -38439011 -28780413 -3049339 21067330
40163 21067330 29005776 24736078 21665311 23906660 25176344 22998918 22151965 22458848
40155 22458848 15447336 -394607 -11332652 -5308231 9992708 17678716 15626767 16318124
40147 16318124 24127307 28244257 22268310 16633474 22859987 35955998 42817777 40649498
40139 40649498 36354626 33280547 29855509 27631444 29149565 29828613 23241206 13332851
40131 13332851 9700762 10700893 3775669 -15172207 -34812580 -44350310 -44669820 -39113973
40123 -39113973 -26160930 -9096509 -812146 -7549993 -16556827 -12197525 1659123 7729153
$$ packed form
40179A5391111O198708p006282n848293O824325J0393674l337909j9343428k0096258
40171a6824352p132265K874503n98405r472010p286482R658598K5731074K4116669
40163B1067330P938446m269698l070767K241349J269684k177426q46953L06883
40155B2458848p011512j5841943j0938045O024421J5300939P686008k051949O91357
40147A6318124P809183M116950n975947n634836O226513J3096011O861779k168279
40139D0649498m294872l074079l425038k224065J518121O79048o587407r908355
40131A3332851l632089J000131o925224j8947876j9640373r537730l19510N555847
40123c9113973J2953043J7064421Q284363o737847r006834M359302J3856648O070030
$$ plain form
40115 7729153 -134248 -10835743 -12869970 -5710510 5784415 17839986 26766150 29945705
40107 29945705 30116533 32358451 35882447 35089803 29315088 24965751 26958599 33693237
40099 33693237 40713046 43571475 37827323 23368784 8459206 1660561 -116183 -6460579
40091 -6460579 -16165852 -16800617 -5151852 4303625 -553648 -11045992 -10400314 1629842
40083 1629842 9454367 4712152 -3578644 -3709877 3950486 11380581 14798445 15824214
40075 15824214 14636574 9026478 722258 -2511744 5483023 20971652 32794446 33595605
40067 33595605 26312883 18681472 14357967 12130807 10948646 10549111 7870250 -946963
40059 -946963 -12773810 -16818579 -6024692 13349260 27480517 29080070 22316184 14504611
$$ packed form
40115G729153p863401j0701495k034227P159460J1494925J2055571Q926164L179555
40107B9945705J70828K241918L523996p92644n774715m349337J992848O734638
40099C3693237P019809K858429n744152j4458539j4909578o798645j776744o344396
40091f460579r705273o34765J1648765R455477m857273j0492344O45678J2030156
40083A629842P824525m742215q290796j31233P660363P430095L417864J025769
40075A5824214j187640n610096q304220l234002P994767J5488629J1822794Q01159
40067C3595605p282722p631411m323505k227160j182161l99535k678861q817213
40059i46963j1826847m044769J0793887J9373952J4131257J599553o763886p811573
$$ plain form
40051 14504611 7254133 -2075932 -12515678 -16859052 -8592401 9757288 27474117 35215819
40043 35215819 32021195 23029805 14194362 11351308 19641236 37462684 52480207 51025927
40035 51025927 33858892 17487000 16456416 27667196 35609026 30568469 17629633
40028 17629633 8592164 8992908 14243232 15943603 9709406 -2183164 -12815302 -14479786
40020 -14479786 -4221066 10739144 15674754 2639610 -17941002 -26672158 -17557791
40013 -17557791 -3264004 4696866 10739907 22614953 33972288 32711085 21571108
40006 21571108 15422782 18633999 19725683 11362289 2013818 1573926 6438203 6838923
39998 6838923 1038851 -5775318 -11066334 -16005494 -20614113 -23568240 -24089058 -20532998
$$ packed form
40051A4504611p250478r330065j0439746m343374Q266651J8349689J7716829P741702
40043C5215819l194624q991390q835443k843054Q289928J7821448J5017523j454280
40035E1025927j7167035j6371892j030584J1210780P941830n040557j2938836
40028A7629633r037469M00744N250324J700371o234197j1892570j0632138j664484
40020a4479786J0258720J4960210M935610j3035144k0580612q731156R114367
40013a7557791J4293787P960870O043041J1875046J1357335j261203j1139977
40006B1571108o148326L211217J091684q363394r348471m39892M864277M00720
39998F838923n800072o814169n291016m939160m608619k954127n20818L556060
$$ plain form
39990 -20532998 -11041552 1449491 9932910 12517018 15580773 24036674 33884655 38354841
39982 38354841 35845730 27785676 14880976 486036 -8229927 -8176601 -4759952 -4059651
39974 -4059651 -5980972 -8920874 -13954361 -19170934 -17468756 -6335910 7378385 18344515
39966 18344515 29400233 40165497 40356149 26125807 12865334 16260305 27622427
39959 27622427 25374095 7370435 -6473690 -3897906 4996302 6395219 729502 -3947629
39951 -3947629 -4143928 -59133 7536723 13631889 10613659 -909308 -9707016 -6457945
39943 -6457945 7248860 24186651 38123795 43537277 37696072 26119099 18115049 15058345
39935 15058345 11762456 9879113 17415333 31858244 37974352 29314595 18649469 17775831
$$ packed form
39990b0532998R491446J2491043Q483419K584108L063755Q455901R847981M470186
39982C8354841k509111q060054j2904700j4394940q715963N3326L416649P00301
39974d059651j921321k939902n033487n216573J702178J1132846J3714295J0966130
39966A8344515J1055718J0765264J90652j4230342j3260473L394971J1362122
39959B7622427k248332j8003660j3844125K575784Q894208J398917n665717m677131
39951c947629j96299M084795P595856O095166l018230j1522967q797708L249071
39943f457945J3706805J6937791J3937144N413482n841205j1576973q004050l056704
39935A5058345l295889j883343P536220J4442911O116108q659757j0665126q73638
$$ plain form
39927 17775831 19649093 12930445 3193414 3421880 9812241 4862826 -15594880 -33899038
39919 -33899038 -33210467 -17557295 -3738597 -787190 -3630627 -3248706 2710732 9663884
39911 9663884 13342939 14610775 16083917 16538834 12820677 6364529 2172097 828531
39903 828531 -1941779 -6174203 -5687434 1250711 6611491 2833512 -8243578 -21653001
39895 -21653001 -37012551 -52973584 -60764767 -52305868 -31023022 -7391626 12109712
39888 12109712 24818586 26622770 16808579 4819610 2094946 8159364 12958283 11790233
39880 11790233 10172477 14628613 25130236 35435879 36089280 21366889 -397414 -9614958
39872 -9614958 1938350 17064002 13526855 -6320642 -20312472 -17452317 -7570094 -531605
$$ packed form
39927A7775831J873262o718648r737031K28466O390361m949415k0457706j8304158
39919c3899038O88571J5653172J3818698K951407k843437L81921N959438O953152
39911I663884L679055J267836J473142M54917l718157o456148m192432j343566
39903H28531k770310m232424M86769O938145N360780l777979j1077090j3409423
39895b1653001j5359550j5961033p791183Q458899K1282846K3631396J9501338
39888A2109712J2708874J804184r814191j1988969k724664O064418M798919j168050
39880A1790233j617756M456136J0501623J0305643O53401j4722391k1764303r217544
39872i614958J1553308J5125652l537147j9847497j3991830K860155R882223P038489
$$ plain form
39864 -531605 5685993 11907689 10607072 552624 -6049723 -1703865 2930414 -4643769
39856 -4643769 -18523440 -23179140 -16067919 -8804082 -8703974 -10185628 -4458462 9590147
39848 9590147 24101855 27665730 14647179 -6777611 -19566894 -14972694 -643123
39841 -643123 11571667 18908141 23591499 23977720 18844951 14014397 14189581 12979526
39833 12979526 2486431 -10221338 -8600440 11345592 35158701 46919200 42905530
39826 42905530 28333782 11305035 1966492 6954866 20410168 29039806 29516578 31368470
39818 31368470 38156916 37195884 17771728 -8392574 -17650553 -3344525 16871028 23696278
39810 23696278 16870057 9749718 10851444 17378335 23702923 28748032 33169304 34150580
$$ packed form
39864e31605O217598O221696j300617j0054448o602347M345858M634279p574183
39856d643769j3879671m655700P111221P263837J00108j481654N727166J4048609
39848I590147J4511708L563875j3018551k1424790j2789283M594200J4329571
39841f43123J2214790P336474M683358L86221n132769m830554J75184j210055
39833A2979526j0493095j2707769J620898J9946032K3813109J1760499m013670
39826D2905530j4571748j7028747r338543M988374J3455302Q629638M76772J851892
39818C1368470O788446r61032j9424156k6164302r257979J4306028K0215553O825250
39810B3696278o826221p120339J101726O526891O324588N045109M421272R81276
$$ plain form
39802 34150580 27898238 16786226 9478557 11312461 17076137 17263578 11059988 8765277
39794 8765277 19076804 36683398 46299050 39194784 22615739 10827978 9222531 11561716
39786 11561716 12404228 15130742 23002125 28612599 22010125 7284428 -439555 3549180
39778 3549180 6950422 465777 -7729095 -6862316 -1927928 -3420865 -6431009 2845754
39770 2845754 21999746 31332833 20958661 4402581 -227131 9030676 21654546 28719214
39762 28719214 27278990 19387423 12479314 13614448 19640541 20792375 15760996 12351273
39754 12351273 11302417 4496735 -5331579 -728344 23495583 45952484 47009755 37292076
39746 37292076 38860098 49523897 48788083 32691293 18301753 14934531 14446086 12151794
$$ packed form
39802C4150580o252342j1112012p307669J833904N763676J87441o203590k294711
39794H765277J0311527J7606594R615652p104266j6579045j1787761j605447K339185
39786A1561716Q42512K726514P871383N610474o602474j4725697p723983L988735
39778C549180L401242o484645q194872Q66779M934388j492937l010144R276763
39770B845754J9153992R333087j0374172j6556080m629712R257807J2623870P064668
39762B8719214j440224p891567o908109J135134O026093J151834n031379l409723
39754A2351273j048856o805682r828314M603235K4223927K2456901J057271r717679
39746C7292076J568022J0663799p35814j6096790j4389540l367222m88445k294292
$$ plain form
39738 12151794 14378598 19812173 15518970 697475 -5679096 7013777 22719398 22598969
39730 22598969 12431401 10073529 17280024 21787982 20060603 20092099 24440377 26299110
39722 26299110 22904289 20444515 24041212 31861633 39628104 43186928 37328604 20564549
39714 20564549 1566308 -6767826 -1209453 9133386 14298678 12551190 8116346 5266357
39706 5266357 5990582 10018623 15514158 20386629 22628843 20354622 14419707 9731764
39698 9731764 9180668 8525609 5157340 8753424 29335196 54634039 58310357 37735281
39690 37735281 23702920 38910869 65239547 71673911 58998600 51805065 56752284
39683 56752284 57635095 48374253 41757734 42818335 40667768 33138787 34062374 46490235
$$ packed form
39738A2151794K226804N433575m293203j4821495o376571J2692873J5705621j20429
39730B2598969j0167568k357872P206495M507958j727379L1496M348278J858733
39722B6299110l394821k459774L596697P820421P766471L558824n858324j6764055
39714B0564549j8998241q334134N558373J0342839N165292j747488m434844k849989
39706E266357P24225M028041N495535M872471K242214k274221n934915m687943
39698I731764n51096o55059l368269L596084K0581772K5298843L676318k0575076
39690C7735281j4032361J5207949K6328678O434364j2675311p193535M947219
39683E6752284Q82811r260842o616519J060601k150567p528981R23587J2427861
$$ plain form
39675 46490235 52484718 42131777 31088648 34393683 42615565 41454540 37319702 42899255
39667 42899255 51553756 49146305 42109668 49881489 72847986 89411442 85376143 68204641
39659 68204641 50890143 38654443 34604304 42341765 56268520 61437794 50908025
39652 50908025 35740734 31649042 41025091 52937696 57142858 54119961 52446880 57595118
39644 57595118 63797989 60223781 46632846 36857296 41718766 54629311 62004573 62813303
39636 62813303 67352598 79185733 89968281 93314405 93348606 95490530 96316046 88104400
39628 88104400 70365703 53096993 48438982 58638918 72062581 74261699 64305931
39621 64305931 55228542 56112287 61411898 63374941 66155314 77496150 92570617 98218246
$$ packed form
39675D6490235N994483j0352941j1043129L305035Q221882j161025m134838N579553
39667D2899255Q654501k407451p036637P771821K2966497J6563456m035299j7171502
39659F8204641j7314498j2235700m050139P737461J3926755N169274j0529769
39652E0908025j5167291m091692R376049J1912605M205162l022897j673081N148238
39644E7595118O202871l574208j3590935r775550M861470J2910545P375262Q08730
39636F2813303M539295J1833135J0782548L346124L4201K141924Q25516q211646
39628H8104400j7738697j7268710m658011J0199936J3423663K199118r955768
39621F4305931r077389Q83745N299611J963043K780373J1340836J5074467N647629
$$ plain form
39613 98218246 90649676 78101934 67842053 61058307 58796626 61661786 64317211 61350624
39605 61350624 58163182 64630045 78299224 86681462 87154538 90397667 100300498 104610427
39597 104610427 92855722 72320294 57918643 54727489 57983710 62561792 64808110
39590 64808110 61780086 56452509 58229056 71143782 86400563 93128384 91416807 87867934
39582 87867934 83984605 78280950 75937855 84557353 99439034 104150111 91485150 76223956
39574 76223956 78164490 95840882 108231547 104567921 99859588 110944665 127441219
39567 127441219 124647342 102473950 89316567 101203586 119363242 122104317 118498697
39560 118498697 129180135 149535864 158727251 155978332 158841819 168775139 168159666 153382337
$$ packed form
39613I8218246p568570j2547742j0259881o783746k261681K865160K655425k966587
39605F1350624l187442O466863J3669179Q382238M73076L243129R902831M309929
39597A04610427j1754705k0535428j4401651l191154L256221M578082K246318
39590F4808110l028024n327577J776547J2914726J5256781O727821j711577l548873
39582H7867934l883329n703655k343095Q619498J4881681M711077j2664961j5261194
39574G6223956J940534J7676392J2390665l663626m708333J1085077J6496554
39567A27441219k793877k2173392j3157383J1887019J8159656K741075l605620
39560A18498697J0681438K0355729R191387k748919K863487R933320o15473j4777329
$$ plain form
39552 153382337 141634328 138874112 129927773 110507969 100577603 110604457 120587188
39545 120587188 112264741 99775273 105530600 123746089 132648965 129510735 128495896 132805957
39537 132805957 133296291 129671806 130910844 136976637 139065211 136164846 134684601 134201365
39529 134201365 129681959 125233666 129748777 140741394 146941732 144452132 136995838 124968069
39521 124968069 109380548 101201406 108965868 120837709 117699922 101803717 93187692
39514 93187692 98799055 105475767 104465866 101898358 101014841 94373571 80867491 72966322
39506 72966322 78612151 90218095 98947573 106490348 115578829 121653318 121793920 121388767
39498 121388767 125322166 131626569 137934788 144126966 145635019 135827668 118531851 106405506
$$ packed form
39552A53382337j1748009k760216q946339j9419804r930366J0026854R982731
39545A20587188q322447j2489468N755327J8215489Q902876l138230j014839M310061
39537A32805957M90334l624485J239038O065793K088574k900365j480245m83236
39529A34201365m519406m448293M515111J0992617O200338k489600p456294j2027769
39521A24968069j5587521q179142P764462J1871841l137787j5896205q616025
39514I3187692N611363O676712j009901k567508q83517o641270j3506080p901169
39506G2966322N645829J1605944Q729478P542775R088481O074489J40602m05153
39498A21388767L933399O304403O308219O192178J508053r807351j7295817j2126345
$$ plain form
39490 106405506 103994731 104983716 107901294 118430523 132191424 133350206 118255450 103597464
39482 103597464 101418865 102280187 94862577 86801637 91675735 107675458 123574866 135123772
39474 135123772 141509298 136607849 120124387 108466373 116442810 133547797 136359601
39467 136359601 121949671 111121043 117245884 128570945 127624843 116144144 111643759
39460 111643759 124298650 144872519 156049933 151966716 143007812 140874426 144300202
39453 144300202 145085807 143081336 144217694 145571321 136491052 117163703 101771166 97517319
39445 97517319 94425464 84192133 75893479 81734592 97687131 110155726 113791068 111863336
39437 111863336 106685947 100661105 100105429 107286336 113843070 110705373 99033353 85281412
$$ packed form
39490A06405506k410775R88985K917578J0529229J3760901J158782j5094756j4657986
39482A03597464k178599Q61322p417610q060940M874098J5999723J5899408J1548906
39474A35123772O385526m901449j6483462j1658014P976437J7104987K811804
39467A36359601j4409930j0828628O124841J1325061r46102j1480699m500385
39460A11643759J2654891K0573869J1177414m083217q958904k133386L425776
39453A44300202P85605k004471J136358J353627r080269j9327349j5392537m253847
39445I7517319l091855j0233331q298654N841113J5952539J2468595L635342j927732
39437A11863336n177389o024842n55676P180907O556734l137697j1672020j3751941
$$ plain form
39429 85281412 73994969 71262719 82869524 100529771 104147700 89235738 77329318
39422 77329318 85243178 99847569 101154565 94468232 96707162 104460167 103221465 99256524
39414 99256524 111571199 134877202 140997582 120184115 93865157 81113540 77788471
39407 77788471 75811195 78563625 87128317 92496231 92066960 95422962 104590883 107379332
39399 107379332 99965779 96986428 107665485 119650673 118854276 108975558 99297674 89677918
39391 89677918 80569769 81225570 93133454 100793980 94532154 87455199 93018942 100795411
39383 100795411 94069885 78353954 70743187 71438244 68762076 64589446 70534614 82963372
39375 82963372 85859496 78120221 75649293 84457914 92378945 91010692 86798427 85696343
$$ packed form
39429H5281412j1286443k732250J1606805J7660247L617929j4911962j1906420
39422G7329318P913860J4604391J306996o686333K238930P753005j238702l964941
39414I9256524J2314675K3306003O120380k0813467k6318958j2751617l325069
39407G7788471j977276K752430Q564692N367914m29271L356002R167921K788449
39399A07379332p413553k979351J0679057J1985188p96397r878718r677884r619756
39391H9677918r108149O55801J1907884P660526o261826p076955N563743P776469
39383A00795411o725526j5715931p610767O95057k676168m172630N945168J2428758
39375H2963372K896124p739275k470928Q808621P921031j368253m212265j102084
$$ plain form
39367 85696343 84478764 82515840 85487065 91769215 91439558 84840143 85275471 95811345
39359 95811345 101115652 92873544 85821799 93923842 105913503 102986898 89550380 85263858
39351 85263858 92439296 93352434 80153741 67310518 69178084 81497001 92438360 98515598
39343 98515598 100582284 95268092 81716648 69732431 69851901 79014986 85983028 88175639
39335 88175639 92732903 101799436 107924989 106739453 104588232 108422928 115199518 117205766
39327 117205766 112411512 103019945 88293155 67300694 47517769 42090717 55640878
39320 55640878 77626700 92893868 96372021 95246247 98320360 105559007 108738540 102033076
39312 102033076 90176741 83514236 85801696 91705543 96998028 103977355 112632910 114439638
$$ packed form
39367H5696343j217579j962924K971225O282150l29657o599415M35328J0535874
39359I5811345N304307q242108p051745Q102043J1989661k926605j3436518m286522
39351H5263858P175438R13138j3198693j2843223J867566J2318917J0941359O077238
39343I8515598K066686n314192j3551444j1984217J19470R163085O968042K192611
39335H8175639M557264R066533O125553j185536k151221L834696O776590K006248
39327A17205766m794254r391567j4726790k0992461j9782925n427052J3550161
39320E5640878K1985822J5267168L478153j125774L074113P238647L179533o705464
39312A02033076j1856335o662505K287460N903847N292485O979327Q655555J806728
$$ plain form
39304 114439638 103965872 91612934 93327008 108679408 120287164 116354546 103380683
39297 103380683 93715040 90931541 92717577 98930886 108980698 116925658 116429259 107708169
39289 107708169 95638126 85235407 81940866 89754674 104440118 115383620 119404161
39282 119404161 124451059 132407444 128672101 102482688 70624601 62523441 81428193
39275 81428193 98550292 91979740 74871341 72672754 85042915 88952699 75617506
39268 75617506 64271840 73425088 94448040 106179740 105692789 107766836 116555799 116615684
39260 116615684 98733414 79265616 80270073 98982491 112392326 108818216 99136165
39253 99136165 95404754 94018226 86877984 76942355 72446401 73103297 72372562 69548111
$$ packed form
39304A14439638j0473766j2352938J714074J5352400J1607756l932618j2973863
39297A03380683r665643k783499J786036O213309J0049812P944960m96399q721090
39289A07708169j2070043j0402719l294541P813808J4685444J0943502M020541
39282A19404161N046898P956385l735343k6189413l1858087q101160J8904752
39275H1428193J7122099o570552j7108399k198587J2370161L909784j3335193
39268G5617506j1345666R153248K1022952J1731700m86951K074047Q788963N9885
39260A16615684j7882270j9467798J004457J8712418J3409835l574110r682051
39253I9136165l731411j386528p140242r935629m495954O56896p30735k824451
$$ plain form
39245 69548111 70241770 76051281 81268936 80383412 73881533 66062936 60329385 56844593
39237 56844593 53236670 48446470 46319614 52544733 66792180 81017022 86906167 82120055
39229 82120055 69557611 55914775 51025866 60300033 74553191 75572659 57343409
39222 57343409 34881707 25949012 30878316 37994409 42340474 48668692 59216819 69066453
39214 69066453 73766217 73787248 70931291 66367672 62235744 59967692 57542047 53194771
39206 53194771 50534316 54512893 63245934 69467598 69959899 68407619 68533496 68854065
39198 68854065 65255512 55945559 43324273 32297790 25806776 21218961 13741651 4671409
39190 4671409 2508532 13315676 33014343 51381035 60770598 59976915 53604079 48354393
$$ packed form
39245F9548111O93659N809511N217655q85524o501879p818597n733551l484792
39237E6844593l607923m790200k126856O225119J4247447J4224842N889145m786112
39229H2120055j2562444j3642836m888909R274167J4253158J019468j8229250
39222E7343409k2461702q932695M929304P116093M346065O328218J0548127R849634
39214F9066453M699764K1031k855957m563619m131928k268052k425645m347276
39206E3194771k660455L978577Q733041O221664M92301j552280J25877L20569
39198F8854065l598553r309953j2621286j1026483o491014m587815p477310r070242
39190D671409k162877J0807144J9698667J8366692R389563p93683o372836n249686
$$ plain form
39182 48354393 45586507 38912459 25997356 19357455 32587923 56504191 65991423 54508292
39174 54508292 42882834 45727259 50233143 42975345 36835725 48627051 65967372 64253245
39166 64253245 47488346 42635659 55939567 64357712 54262241 41444528 43083783
39159 43083783 52177874 52719727 44295142 38973122 44083531 57127007 69991785 73476689
39151 73476689 65868673 58680825 63807526 75385887 77551556 69528445 66432097 73825726
39143 73825726 79947488 77077667 71599186 66958753 56214070 39923984 32245928 38541854
39135 38541854 45005097 42589756 43351382 58155596 74050502 70996155 49455733 25804884
39127 25804884 10736030 6618386 15454700 33586899 46815258 45430557 37282016 34183273
$$ packed form
39182D8354393k767886o674048j2915103o639901J3230468K3916268R487232j1483131
39174E4508292j1625458K844425M505884p257798o139620J1791326J7340321j714127
39166F4253245j6764899m852687J3303908Q418145j0095471j2817713J639255
39159D3083783R094091N41853q424585n322020N110409J3043476J2864778L484904
39151G3476689p608016p187848N126701J1578361K165669q023111l096348P393629
39143G3825726O121762k869821n478481m640433j0744683j6290086p678056O295926
39135C8541854O463243k415341P61626J4804214J5894906l054347k1540422k3650849
39127B5804884j5068854m117644Q836314J8132199J3228359j384701q148541l098743
$$ plain form
39119 34183273 34207901 29291556 20382670 12598070 5780696 1904792 8891678 23195701
39111 23195701 24077181 3699869 -12262134 2660848 34878762 49274228 39754945
39104 39754945 31901092 39172692 47641215 47041649 47416428 56073262 62827945 59700357
39096 59700357 55198827 56948028 56610582 44223636 24723022 9652328 2939964 3177626
39088 3177626 9605468 17941170 19826368 14017906 10216572 15857639 26576927 34166490
39080 34166490 36118228 33651451 28371569 24014211 23765153 24227340 20273350 15510394
39072 15510394 17326465 22409075 20674477 14046196 15825867 28668309 39300423 39705281
39064 39705281 37066817 36309716 29907781 14720876 3473726 7529758 20534680 30457060
$$ packed form
39119C4183273K4628m916345q908886p784600o817374l875904O986886J4304023
39111B3195701Q81480k0377312j5962003J4922982L2217914J4395466r519283
39104C9754945p853853P271600Q468523n99566L74779Q656834O754683l127588
39096E9700357m501530J749201l37446j2386946j9500614j5070694o712364K37662
39088C177626O427842Q335702J885198n808462l801334N641067J0719288P589563
39080C4166490J951738k466777n279882m357358k49058M62187l953990m762956
39072A5510394J816071N082610j734598o628281J779671J2842442J0632114M04858
39064C9705281k638464p57101o401935j5186905j1247150M056032J3004922R922380
$$ plain form
39056 30457060 36551757 43157595 47446632 45316950 40636942 37924512 34184958 27110411
39048 27110411 21625526 19457765 14078544 6175395 10029300 30493640 47669765 42786134
39040 42786134 27694806 27116391 39786411 41586813 24591617 8368640 9130537 19276608
39032 19276608 24705705 24687012 25418478 27577327 29767221 34331635 41559087 45911220
39024 45911220 44438899 41774648 41292959 38434874 28488311 14964484 5097131 2039166
39016 2039166 5086398 11779318 16495440 13960007 8469088 12135183 27914263 41480951
39008 41480951 38321778 23854844 16726589 24148506 34136092 33993520 27643323 28988087
39000 28988087 42644065 57823696 61355639 52322842 41423554 37562385 38153857 33906167
$$ packed form
39056C0457060O094697O605838M289037k129682m680008k712430l739554p074547
39048B7110411n484885k167761n379221p903149L853905K0464340J7176125m883631
39040D2786134j5091328n78415J2670020J800402j6995196j6222977P61897J0146071
39032A9276608N429097j8693P31466K158849K189894M564414P227452M352133
39024D5911220j472321k664251m81689k858085r946563j3523827r867353l057965
39016B039166L047232O692920M716122k535433n490919L666095J5779080J3566688
39008D1480951l159173j4466934p128255P421917R987586j42572o350197J344764
39000B8988087J3655978J5179631L531943r032797j0899288l861169N91472m247690
$$ plain form
38992 33906167 21549461 9012939 6864412 16209361 27292827 30126755 24436127 18160360
38984 18160360 18339710 25817638 36963295 46252570 47459028 38053901 24958437 20827480
38976 20827480 30219394 43031634 46191411 38560147 29449128 26153719 29086887 35573738
38968 35573738 40692582 37116441 23183183 9942407 11029106 25843496 41531532
38961 41531532 50402734 54593636 54095906 43764595 25296121 9511669 2274707 -155236
38953 -155236 1804445 13992849 31958934 37394346 22847238 7244755 13053806 37481223
38945 37481223 59630792 67493524 63641029 51931322 34775854 19457711 12283961
38938 12283961 8895236 3029184 906341 12624135 32256322 42266474 37798395 32151928
$$ packed form
38992C3906167j2356706j2536522k148527R344949J1083466K833928n690628o275767
38984A8160360J79350P477928J1145657R289275J206458r405127j3095464m130957
38976B0827480R391914J2812240L159777p631264r111019l295409K933168O486851
38968C5573738N118844l576141j3933258j3240776J086699J4814390J5688036
38961D1531532Q871202M190902m97730j0331311j8468474j5784452p236962k429943
38953a55236J959681J2188404J7966085N435412j4547108j5602483N809051K4427417
38945C7481223K2149569P862732l852495j1709707j7155468j5318143p173750
38938A2283961l388725n866052k122843J1717794J9632187J0010152m468079n646467
$$ plain form
38930 32151928 36503794 47017866 54321081 54409533 47856977 38102121 31956731 32750575
38922 32750575 33243248 25211529 14545980 14515187 24660278 30762299 27633965 26584864
38914 26584864 34588158 40151618 29683510 8703515 -3696116 2199131 16733193
38907 16733193 23236746 17129416 11878831 23937938 51110927 72253892 72621360 60666844
38899 60666844 51722691 45994300 36680933 29740983 35345840 44965266 39675909 20824564
38891 20824564 9713137 14297353 19384848 15548598 14110495 23292650 31256785 26446279
38883 26446279 16730772 14157679 16293412 16627476 19099383 28201214 37469228 40632330
38875 40632330 41164995 39143203 24587847 -1756796 -17697768 -7439241 14641555
$$ packed form
38930C2151928M351866J0514072P303215Q8452o552556r754856o145390P93844
38922C2750575M92673q031719j0665549l0793J0145091O102021l128334j049101
38914B6584864Q003294N563460j0468108k0979995j2399631N895247J4534062
38907A6733193O503553o107330n250585J2059107K7172989K1142965L67468j1954516
38899F0666844q944153n728391r313367o939950N604857R619426n289357j8851345
38891B0824564j1111427M584216N087495l836250j438103R182155P964135m810506
38883B6446279r715507k573093K135733L34064K471907R101831R268014L163102
38875D0632330N32665k021792j4555356k6344643j5940972J0258527K2080796
$$ plain form
38868 14641555 26733620 30946843 40301619 49297768 44761831 36396836 46683047 73048025
38860 73048025 87986347 78516807 60755664 51639345 48887568 44705444 39380736 34394639
38852 34394639 28302924 24661991 29216875 36148392 32966397 22032040 20602741 35701279
38844 35701279 55165620 67069822 70965830 66445773 49964024 29372604 22381104
38837 22381104 31783950 39810505 35979139 32206479 39436211 48193570 47082052 43910578
38829 43910578 50955681 62338241 64415553 58840446 56997344 58475987 52993077 40142097
38821 40142097 31501366 34362016 45302070 57718008 65559058 63378770 53041921 46384996
38813 46384996 51275817 59794081 60213258 54551719 52396501 53173207 48222611 36632414
$$ packed form
38868A4641555J2092065M213223R354776Q996149m535937q364995J0286211K6364978
38860G3048025J4938322r469540j7761143r116319k751777m182124n324708m986097
38852C4394639o091715l640933M554884O931517l181995j0934357j429299J5098538
38844C5701279J9464341J1904202L896008m520057j6481749k0591420o991500
38837B2381104R402846Q026555l831366l772660P229732Q757359j111518l171474
38829D3910578P045103J1382560K077312n575107j843102J478643n482910j2850980
38821D0142097q640731K860650J0940054J2415938P841050k180288j0336849o656925
38813D6384996M890821Q518264M19177n661539k155218P76706m950596j1590197
$$ plain form
38805 36632414 25719133 18959238 16073237 20800460 34229754 44342790 38500016 24008771
38797 24008771 19200639 25872966 30069479 30086006 40322471 61695310 72358126 60233809
38789 60233809 43644259 42791023 48663103 41359726 25793573 23960887 37804771 45577004
38781 45577004 36463938 25557490 27647534 35835174 36899146 32350243 30841453 30753303
38773 30753303 25053128 16831417 15322259 19435572 19295195 14145787 15201333 27398535
38765 27398535 40323727 43242391 39168757 36189408 33126824 24101419 12315938 8123611
38757 8123611 14723197 25411054 34725398 42732118 47344787 42871198 30593990 22366657
38749 22366657 27383453 40616400 49806960 49779978 44967087 41381042 40902008 41147523
$$ packed form
38805C6632414j0913281o759895k886001M727223J3429294J0113036n842774j4491245
38797B4008771m808132O672327M196513J6527J0236465K1372839J0662816j2124317
38789F0233809j6589550q53236N872080p303377j5566153j832686J3843884P772233
38781D5577004r113066j0906448K090044Q187640J063972m548903j508790q8150
38773C0753303n700175q221711j509158M113313j40377n149408J055546J2197202
38765B7398535J2925192K918664m073634k979349l062584r025405j1785481m192327
38757H123611O599586J0687857R314344Q006720M612669m473589j2277208q227333
38749B2366657N016796J3232947R190560k6982m812891l586045m79034K45515
$$ plain form
38741 41147523 37771818 29496609 22412464 24565396 34572604 42361120 43993643 46811089
38733 46811089 54339888 56442727 44671380 28982459 25762229 34398214 40454406 39521747
38725 39521747 41580256 50231134 54020848 44819594 31878920 29343417 39166744 53833181
38717 53833181 67386251 75886494 74994629 66582645 62001234 69167392 80096598 80227933
38709 80227933 67771266 55403657 53887019 61557863 69788644 71939975 66029908 54385713
38701 54385713 42936997 37762271 40657691 48662960 56777410 60234037 56851570 49266116
38693 49266116 42527831 38400832 35626384 35887499 42205459 49010066 43558535 24006378
38685 24006378 6868992 6462831 14964561 16127946 12547363 21811374 46421021 66186795
$$ packed form
38741D1147523l375705q275209p084145K152932J0007208P788516J632523K817446
38733D6811089P528799K102839j1771347j5688921l220230Q635985O056192r32659
38725C9521747K058509Q650878L789714r201254j2940674k535503R823327J4666437
38717E3833181J3553070Q500243q91865q411984m581411P166158J0929206J31335
38709H0227933j2456667j2367609j516638P670844Q230781K151331n910067j1644195
38701E4385713j1448716n174726K895420Q005269Q114450L456627l382467p585454
38693D9266116o738285m126999k774448K61115O317960O804607n451531j9552157
38685B4006378j7137386m06161Q501730J163385l580583R264011K4609647J9765774
$$ plain form
38677 66186795 66207300 57115166 58724545 74994843 94407057 105850915 104659341 90779382
38669 90779382 71200559 58622476 58293996 60560076 54262584 41678377 31454943 23903829
38661 23903829 15351477 11199706 19484554 34026357 40610271 40726120 51212382 74576470
38653 74576470 87418605 70717764 38831025 22907820 32518272 49074500 53918941
38646 53918941 47290785 38520611 32275050 30425176 36417412 49213186 59400541 59665696
38638 59665696 55542854 58214803 68567985 75886842 72655658 64023745 60558642 66995338
38630 66995338 81069329 98304218 112579190 115074627 100087347 73395665 49856425
38623 49856425 39951969 41455192 45836741 48939905 52289226 57436215 63688460 69778207
$$ packed form
38677F6186795K0505r092134J609379J6270298J9412214J1443858j191574j3879959
38669I0779382j9578823j2578083l28480K266080o297492j2584207j0223434p551114
38661B3903829q552352m151771Q284848J4541803O583914J15849J0486262K3364088
38653G4576470J2842135j6700841l1886739j5923205R610452J6556228M844441
38646E3918941o628156q770174o245561j849874N992236J2795774J0187355K65155
38638E9665696m122842K671949J0353182P318857l231184q631913l465103O436696
38630F6995338J4073991J7234889J4274972K495437j4987280k6691682k3539240
38623D9856425r904456J503223M381549L103164L349321N146989O252245O089747
$$ plain form
38615 69778207 73660237 72228824 65830342 61751737 67452687 79865592 86718986 79906396
38607 79906396 63268736 46401531 35996482 34793197 42943601 56294330 66992360
38600 66992360 69405507 63653769 53105820 43094777 42025460 55237738 74216297
38593 74216297 80740650 68322444 51898325 48404684 55403455 59190316 56676238 54878824
38585 54878824 52938430 42190273 25877478 22002963 39618556 65131198 80332183
38578 80332183 83345986 82908970 82019113 78812557 76360352 78420958 78841745 67880960
38570 67880960 48770060 36586676 38726082 46505190 49986242 52279640 62274020 78556989
38562 78556989 89181218 87375215 80628605 80245327 85292134 83235837 67799399 49843720
$$ packed form
38615F9778207L882030j431413o398482m078605N700950J2412905O853394o812590
38607G9906396j6637660j6867205j0405049j203285Q150404J3350729J0698030
38600F6992360K413147n751738j0547949j0011043j069317J3212278J8978559
38593G4216297O524353j2418206j6424119l493641O998771L786861k514078j797414
38585E4878824j940394j0748157j6312795l874515J7615593K5512642J5200985
38578H0332183L013803m37016q89857l206556k452205K060606M20787j0960785
38570F7880960j9110900j2183384K139406P779108L481052K293398R994380J6282969
38562G8556989J0624229j806003o746610l83278N046807k056297j5436438j7955679
$$ plain form
38554 49843720 44402042 50476535 52681125 43052279 31124437 28386050 32602414 35552461
38546 35552461 38523602 48668320 63325291 69974738 62923803 50589852 43623566 43335925
38538 43335925 44749065 44252003 40569135 34184807 30226532 36417477 52087566 63081280
38530 63081280 55576579 35030063 23956846 36939304 62352809 74641349 63036940
38523 63036940 41386573 28802939 29223568 35653472 45751632 60501682 71025984
38516 71025984 63277800 40029062 23423343 27071940 38201362 38910307 33599545 39357202
38508 39357202 56808511 69429674 69591153 66397315 65519416 59184639 42562032 25009827
38500 25009827 16310302 13504042 10458694 10585906 20221037 36707075 52048095 62454023
$$ packed form
38554D9843720n441678O074493K204590r628846j1927842k738387M216364K950047
38546C5552461K971141J0144718J4656971O649447p050935j2333951o966286k87641
38538D3335925J413140m97062l682868o384328l958275O190945J5670089J0993714
38530F3081280p504701k0546516j1073217J2982458K5413505J2288540j1604409
38523F3036940k1650367j2583634M20629O429904J0098160J4750050J0524302
38516G1025984p748184k3248738j6605719L648597J1129422P08945n310762N757657
38508C9357202J7451309J2621163J61479l193838q77899o334777j6622607j7552205
38500B5009827q699525k806260l045348J27212R635131J6486038J5341020J0405928
$$ plain form
38492 62454023 66786159 62676703 53274692 51311831 65010312 82859508 83283023 59845480
38484 59845480 29120386 12929002 18794447 38383453 59501683 76628830 90750177
38477 90750177 100687341 98992972 81899708 60582853 52377654 59490080 67604673 68803657
38469 68803657 71865106 82186086 87064866 75754200 62007996 66914865 85529225
38462 85529225 91884816 76706249 59470224 58474068 67545395 71520006 70161318 74450242
38454 74450242 87589244 101179663 106916847 104234840 97749648 91727132 86646981 80511700
38446 80511700 74882372 76285531 86115462 93188132 85866021 69192876 58395932 56738716
38438 56738716 54317705 49993565 57051870 80190787 102962431 108947528 102599098 97447078
$$ packed form
38492F2454023M332136m109456r402011j962861J3698481J7849196M23515k3437543
38484E9845480l0725094j6191384N865445J9589006K1118230J7127147J4121347
38477I0750177R937164j694369j7093264k1316855q205199P112426Q114593J198984
38469F8803657L061449J0320980M878780j1310666j3746204M906869J8614360
38462H5529225O355591j5178567j7236025r96156R071327L974611j358688M288924
38454G4450242J3139002J3590419N737184k682007o485192o022516n080151o135281
38446H0511700n629328J403159R829931P072670p322111j6673145j0796944j657216
38438E6738716k421011m324140P058305K3138917K2771644N985097o348430n152020
$$ plain form
38430 97447078 95494538 91976198 90320314 96302115 103983933 103511885 98507473 99692249
38422 99692249 103817925 95897912 73718005 54800424 54395079 67764733 78622698 76555494
38414 76555494 63499692 51097104 53268553 73228943 96739894 106211209 101091547
38407 101091547 94799310 92915316 87843570 76620630 69016694 72175652 80377236 87478493
38399 87478493 97560437 114375068 130767897 138317073 138503306 135100518 125178888 108446676
38391 108446676 95821124 95423288 98151795 91853142 82573934 84473246 93992814 94654738
38383 94654738 86373125 87147277 100765086 105786736 88535537 67319368 66318386 79962920
38375 79962920 84600360 76836293 75801093 87807387 93406096 78804241 60818775 64697341
$$ packed form
38430I7447078j952540l518340j655884N981801P681818m72048n004412J184776
38422I9692249M125676p920013k2179907j8917581m05345J3369654J0857965k067204
38414G6555494j3055802j2402588K171449J9960390K3510951R471315n119662
38407A01091547o292237j883994n071746j1222940p603936L158958Q201584P101257
38399H7478493J0081944J6814631J6392829P549176J86233l402788r921630j6732212
38391A08446676j2625552l97836K728507o298653r279208J899312R519568O61924
38383I4654738q281613P74152J3617809N021650j7251199k1216169j000982J3644534
38375G9962920M637440p764067j035200J2006294N598709j4601855j7985466L878566
$$ plain form
38367 64697341 88120578 104883668 100688907 88438339 85738639 92362994 98225860 102617922
38359 102617922 112431072 125134165 126930866 110736045 86686203 70136548 66035641
38352 66035641 70075413 78363397 88160918 93788950 91673219 88432127 94629807 109207463
38344 109207463 118582740 114268027 104222927 102683428 114363472 132244078 145159291
38337 145159291 143960528 127277718 106900110 100632788 112187908 124036639 119127399
38330 119127399 103960776 98252649 105694291 110446694 103629502 96905305 102967378 116407126
38322 116407126 124335879 125271392 125194160 123325095 116488054 112179605 120446061 133984861
38314 133984861 134283295 120936615 116302049 131548565 145289103 132623954 103671339
$$ packed form
38367F4697341K3423237J6763090m194761j2250568k699700O624355N862866M392062
38359A02617922R813150J2703093J796701j6194821k4049842j6549655m100907
38352F6035641M039772Q287984R797521N628032k115731l241092O197680J4577656
38344A09207463R375277m314713j0045100j539499J1680044J7880606J2915213
38337A45159291j198763j6682810k0377608o267322J1555120J1848731m909240
38330A19127399j5166623n708127P441642M752403o817192o724197O062073J3439748
38322A16407126P928753R35513p7232j869065o837041m308449Q266456J3538800
38314A33984861K98434j3346680m634566J5246516J3740538j2665149k8952615
$$ plain form
38307 103671339 91632862 106469861 123418208 121455138 111204112 112740871 123242554
38300 123242554 124740481 113910909 104597243 104582058 108379075 112780036 121168135 129105961
38292 129105961 123901178 106262729 96134460 105969379 121893997 124309369 115095695
38285 115095695 109178586 109510687 108646551 108029560 115571945 127235550 131192204 129553300
38277 129553300 135218104 145771930 143143340 124678669 111413949 115453656 121564211
38270 121564211 115344326 107982167 113438992 119977712 109457849 91805385 92610491 113398622
38262 113398622 131856883 138794940 146577863 158585692 158868200 141572596 126233648
38255 126233648 129988257 143271647 147498843 141724612 137064400 136926793 137547892 138644349
$$ packed form
38307A03671339j2038477J4836999J6948347j963070j0251026J536759J0501683
38300A23242554J497927j0829572r313666j5185L797017M400961Q388099P937826
38292A29105961n204783j7638449j0128269R834919J5924618K415372r213674
38285A15095695n917109L32101q64136o16991P542385J1663605L956654j638904
38277A29553300N664804J0553826k628590j8464671j3264720M039707O110555
38270A21564211o219885p362159N456825O538720j0519863j7652464Q05106K0788131
38262A13398622J8458261O938057P782923J2007829K82508j7295604j5338948
38255A26233648L754609J3283390M227196n774231m660212j37607O21099J096457
$$ plain form
38247 138644349 139505762 132220625 112512807 91870236 86539533 98258283 115667002
38240 115667002 129776363 138172504 139420967 134595310 130960882 134144414 139467707 139281663
38232 139281663 134582417 130986440 128862981 127293157 131670339 145217595 157781601 156716206
38224 156716206 146380351 143266202 152660149 163100894 164029386 156524520 146112434 137352366
38216 137352366 136577457 147405277 161412443 165219807 158914713 155038187 157076442 153471661
38208 153471661 138368616 123906337 122678829 129286711 130045881 123113086 118279869 121385454
38200 121385454 127832343 129156160 120398379 104196801 91804895 95487722 114969127
38193 114969127 134994340 140327376 130448790 118108068 117716820 134797320 159517793
$$ packed form
38247A38644349Q61413p285137j9707818k0642571n330703J1718750J7408719
38240A15667002J4109361Q396141J248463m825657l634428L183532N323293j86044
38232A39281663m699246l595977k123459j569824M377182J3547256J2564006j065395
38224A56716206j0335855l114149R393947J0440745R28492p504866j0412086q760068
38216A37352366p74909J0827820J4007166L807364o305094l876526K038255l604781
38208A53471661j5103045j4462279j227508O607882P59170o932795m833217L105585
38200A21385454O446889J323817q757781j6201578j2391906L682827J9481405
38193A14969127K0025213N333036r878586j2340722l91248J7080500K4720473
$$ plain form
38186 159517793 170857468 157424661 135317514 132484901 151651881 163825067 146796368
38179 146796368 115216915 99664525 108222390 124801400 136670742 145276067 153151731
38172 153151731 157363389 157197185 155714876 152667180 146121183 140480110 142294360 148864478
38164 148864478 151961701 152379771 159149040 173622739 186110085 190462177 190786219 190214669
38156 190214669 183426890 165712312 142082327 122737500 114672448 119858568 135621155
38149 135621155 154608720 169649539 179731656 186717695 188396477 182438837 174710147
38142 174710147 172790184 171784529 159079636 135236989 117405995 117497245 128718161 139297775
38134 139297775 147861426 157690700 166543281 171841454 177723844 187081566 193101530 188500080
$$ packed form
38186A59517793J1339675j3432807k2107147k832613J9166980J2173186j7028699
38179A46796368l1579453j5552390Q557865J6579010J1869342Q605325P875664
38172A53151731M211658j66204j482309l047696o545997n641073J814250O570118
38164A48864478L097223M18070O769269J4473699J2487346M352092L24042n71550
38156A90214669o787779j7714578k3629985j9344827q065052N186120J5762587
38149A35621155J8987565J5040819J0082117O986039J678782n957640p728690
38142A74710147j919963j005655j2704893k3842647j7830994R1250J1220916J0579614
38134A39297775Q563651R829274Q852581N298173N882390R357722O019964m601450
$$ plain form
38126 188500080 178065983 172410301 172879935 171832342 165859669 160772636 164001263 177167897
38118 177167897 194552757 205387574 201531326 187031076 175511794 174038053 175779687
38111 175779687 173635729 172720475 180733943 193556678 201923486 207045763 216279564 225699528
38103 225699528 221369582 200075159 176958296 168363864 175599576 188740080 198153845
38096 198153845 198703880 190755033 182407836 184764796 199519103 215119524 219301422 211806309
38088 211806309 201392083 194734893 193134099 196844465 206394023 219595516 231712108
38081 231712108 239904905 245024555 248083714 247629082 243028934 238527030 239469189 243575941
38073 243575941 241372996 229695507 219964825 224962448 239564358 245043609 233864476
$$ packed form
38126A88500080j0434097n655682M69634j047593n972673n087033L228627J3166634
38118A77167897J7384860J0834817l856248j4500250j1519282j473741J741634
38111A75779687k143958r15254Q013468J2822735Q366808N122277R233801R419964
38103B25699528m329946k1294423k3116863q594432P235712J3140504R413765
38096A98153845N50035p948847q347197K356960J4754307J5600421M181898p495113
38088B11806309j0414226o657190j600794L710366R549558J3201493J2116592
38081B31712108Q192797N119650L059159m54632m600148m501904R42159M106752
38073B43575941k202945j1677489r730682M997623J4601910N479251j1179133
$$ plain form
38066 233864476 219182634 215302053 219773960 222583487 222973837 226152127 230618784 231127280
38058 231127280 229634006 231173504 232300843 226243227 217312753 216786442 224658415 228782704
38050 228782704 223684081 217415943 216751249 217723312 215398033 212473813 213165071 217190825
38042 217190825 223361249 230465617 232661787 224897493 215534449 220769010 241781460 260640469
38034 260640469 264940850 262124330 261144366 256207678 242462842 233453201 244112357 265130298
38026 265130298 273871690 266387472 259450815 262189137 264972347 259395605 251849270 250417283
38018 250417283 251755290 249335621 245389030 246637481 253839310 261363803 263513237 258812155
38010 258812155 252300943 253730212 266910599 280968099 281000822 268447930 260345975 265335637
$$ packed form
38066B33864476j4681842l880581M471907K809527L90350L178290M466657N08496
38058B31127280j493274J539498J127339o057616q930474n26311P871973M124289
38050B28782704n098623o268138o64694R72063k325279k924220O91258M025754
38042B17190825O170424P104368K196170p764294r363044N234561K1012450J8859009
38034B60640469M300381k816520r79964m936688j3744836r009641J0659156K1017941
38026B65130298Q741392p484218o936657K738322K783210n576742p546335j431987
38018B50417283J338007k419669l946591J248451P201829P524493K149434m701082
38010B58812155o511212J429269J3180387J4057500L2723j2552892q101955M989662
$$ plain form
38002 265335637 272313543 269406841 262490535 263990852 272039751 274617211 270266391 269978090
37994 269978090 277713295 282662182 276148076 265548588 262952859 266833485 265415301 255990314
37986 255990314 250052728 256421989 268049258 272255226 268840084 269427947 280099546 293141649
37978 293141649 297739116 291544227 278504788 262256959 246947751 238883614 240440161
37971 240440161 245578079 247507107 247848366 252102685 259242754 263148348 262285589 260492762
37963 260492762 259779546 260031984 264121970 274197403 283511298 282046340 271443500 264279912
37955 264279912 266098692 268267147 262519153 252852148 247920916 250538943 259963424 275096805
37947 275096805 288746867 288421358 271971887 254579372 250597580 255737379 257544123 255661251
$$ packed form
38002B65335637O977906k906702o916306J500317Q048899K577460m350820k88301
37994B69978090P735205M948887o514106j0599488k595729L880626j418184r424987
37986B55990314n937586O369261J1627269M205968l415142N87863J0671599J3042103
37978B93141649M597467o194889j3039439j6247829j5309208q064137J556547
37971B40440161N137918J929028L41259M254319P140069L905594q62759j792827
37963B60492762p13216K52438M089986J0075433R313895j464958j0602840p163588
37955B64279912J818780K168455n747994r667005m931232K618027R424481J5133381
37947B75096805J3650062l25509j6449471j7392515l981792N139799J806744j882872
$$ plain form
37939 255661251 258122280 263415112 262641580 257616817 259672987 268460628 268963523 255983358
37931 255983358 246398124 256660570 279430915 294668367 295929600 292387617 289538455
37924 289538455 282833683 271456149 265239768 271652739 283718152 288087473 281643001 273866096
37916 273866096 273525925 278085306 277856944 267826806 253040775 243279660 244703546 256724927
37908 256724927 273970863 288733558 293449619 285435835 270464848 258246129 252133266
37901 252133266 245899474 233322498 218294401 210946997 214446950 220643315 220668437 216102287
37893 216102287 216090914 224877981 235939958 239418386 233235889 224994724 223008690 226800344
37885 226800344 227870473 220155453 207870558 200520945 200885751 202185262 198864955 195310597
$$ packed form
37939B55661251K461029N292832p73532n024763K056170Q787641N02895j2980165
37931B55983358r585234J0262446K2770345J5237452J261233l541983k849162
37924B89538455o704772j1377534o216381O412971J2065413M369321o444472p776905
37916B73866096l40171M559381k28362j0030138j4786031r761115J423886J2021381
37908B56724927J7245936J4762695M716061q013784j4970987j2218719o112863
37901B52133266o233792j2576976j5028097p347404L499953O196365K5122m566150
37893B16102287j1373Q787067J1061977L478428o182497q241165j986034L791654
37885B26800344J070129p715020j2284895p349613L64806J299511l320307l554358
$$ plain form
37877 195310597 198581484 205513752 204999640 193859649 182506637 181026596 186391427 189186852
37869 189186852 187191355 184422781 180916535 173418501 164979930 163193518 167069983 165901321
37861 165901321 155722538 147896585 154454985 171781004 186811048 194143134 197701230
37854 197701230 198644574 192516446 179503888 168241599 165374074 167501240 167918624 166860525
37846 166860525 169799708 177711788 184249653 183098145 174586643 163463957 152659365 142201117
37838 142201117 133604829 131481476 138629419 151897669 165755584 178035940 188540118
37831 188540118 194103624 191093898 182887062 178237175 179993850 181401386 176798909 170113938
37823 170113938 167873211 168421190 163983754 151225965 135385895 125504178 127647776 139279724
$$ packed form
37877A95310597L270887O932268n14112j1139991j1353012j480041N364831K795425
37869A89186852j995497k768574l506246p498034q438571j786412L876465j168662
37861A65901321j0178783p825953O558400J7326019J5030044P332086L558096
37854A97701230R43344o128128j3012558j1262289k867525K127166M17384j058099
37846A66860525K939183P912080O537865j151508q511502j1122686j0804592j0458248
37838A42201117q596288k123353P147943J3268250J3857915J2280356J0504178
37831A88540118N563506l009726q206836m649887J756675J407536m602477o684971
37823A70113938k240727N47979m437436j2757789j5840070r881717K143598J1631948
$$ plain form
37815 139279724 148437790 144125796 130528020 124004968 131953993 143458438 147123287 147176009
37807 147176009 150749856 149866219 133332091 110963701 106256071 124496273 146069060
37800 146069060 154409341 153571993 153251958 153560736 152743477 154456879 157266709 150815374
37792 150815374 133872181 123197171 130850339 143896211 142219549 127841447 119850257
37785 119850257 126330877 138662680 149940121 160887451 167995241 163815558 152107603
37778 152107603 146574497 149729784 148140824 135510430 125864905 132843398 146719609 145367060
37770 145367060 123008125 96499996 84919722 92047990 108385814 122345932 127793479
37763 127793479 125698865 120574412 114134124 104098523 91303293 84116694 90214970 105722900
$$ packed form
37815A39279724R158066m311994j3597776o523052P949025J1504445L664849N2722
37807A47176009L573847q83637j6534128k2368390m707630J8240202K1572787
37800A46069060Q340281q37348l20035L08778q17259J713402K809830o451335
37792A50815374j6943193j0675010P653168J3045872j676662j4378102p991190
37785A19850257O480620J2331803J1277441J0947330P107790m179683j1707955
37778A52107603n533106L155287j588960j2630394r645525O978493J3876211j352549
37770A45367060k2358935k6508129j1580274P128268J6337824J3960118N447547
37763A27793479k094614n124453o440288j0035601j2795230p186599O098276J5507930
$$ plain form
37755 105722900 118891884 124589870 128423254 134575624 136875468 127735215 111096686 98424211
37747 98424211 93481182 90097211 86389540 91026045 108918151 128783555 135169391 128750195
37739 128750195 123712834 126843133 131320538 131676482 131188501 130324702 121900150 106009175
37731 106009175 97167378 104913969 117450710 118349229 111379455 112415319 121813591 123614671
37723 123614671 112278713 101924290 104264158 113032636 117658831 119288773 123903551 129458199
37715 129458199 130110056 127166017 126963911 131300098 136053496 136343098 129495592 117202590
37707 117202590 107082481 105755406 107773867 99770112 79924404 64136871 66391385
37700 66391385 81787373 96833359 107450494 116353604 120757226 116287278 108542972 106816793
$$ packed form
37755A05722900J3168984N697986L833384O152370K299844r140253j6638529j2672475
37747I8424211m943029l383971l707671M636505J7892106J9865404O385836o419196
37739A28750195n037361L130299M477405L55944m87981q63799q424552j5890975
37731A06009175q841797P746591J2536741Q98519o969774J035864R398272J801080
37723A23614671j1335958j0354423K339868Q768478M626195J629942M614778N554648
37715A29458199O51857k944039k02106M336187M753398K89602o847506j2293002
37707A17202590j0120109j327075K018461q003755j9845708j5787533K254514
37700F6391385J5395988J5045986J0617135Q903110M403622m469948p744306j726179
$$ plain form
37692 106816793 108347104 102764245 92163121 92086426 108936155 129769010 140965363 145508921
37684 145508921 152874447 161139458 160909611 152057531 144228121 141343120 136698448 125674627
37676 125674627 113092738 102623121 88105049 65233117 46352953 50144789 75478736
37669 75478736 98400946 101252516 93964362 96802302 111025490 120615027 118271474 113245010
37661 113245010 112744278 111476567 104350061 95575754 88325614 77978048 64070145 57218321
37653 57218321 63813237 74174109 77620365 80019846 92799666 112002810 123281850
37646 123281850 122563429 116328559 105238270 84835746 62150306 53914419 64151284
37639 64151284 78131660 83818962 86342116 94912431 107115413 114304028 113962829 109016141
$$ packed form
37692A06816793J530311n582859j0601124p6695J6849729K0832855J1196353M543558
37684A45508921P365526Q265011k29847q852080p829410k885001m644672j1023821
37676A25674627j2581889j0469617j4518072k2871932j8880164L791836K5333947
37669G5478736K2922210K851570p288154K837940J4223188R589537k343553n026464
37661A13245010n00732j267711p126506q774307p250140j0347566j3907903o851824
37653E7218321O594916J0360872L446256K399481J2779820J9203144J1279040
37646A23281850p18421o234870j1090289k0402524k2685440q235887J0236865
37639F4151284J3980376N687302K523154Q570315J2202982P188615l41199m946688
$$ plain form
37631 109016141 101325631 92493842 86064033 83790326 84140873 87549920 97046667 110077449
37623 110077449 116367868 109174256 94284945 83897541 84958412 95081517 105150837
37616 105150837 105182872 93912675 83394868 86854951 101339585 111061301 108725399 102897867
37608 102897867 102123141 103947171 103963949 103034478 99417905 87077992 70495364 67891572
37600 67891572 87622445 112190873 119120087 108779347 97450802 91078526 82797186
37593 82797186 72065885 68726312 77273774 90395228 99429600 101163256 95139070 84564360
37585 84564360 78592193 83378151 92634907 97251593 100599814 111325234 124283860 124985732
37577 124985732 113033409 104039377 105040424 104846135 95045134 84679910 84230132 87746222
$$ packed form
37631A09016141p690510q831789o429809k273707L50547L409047R496747J3030782
37623A10077449O290419p193612j4889311j0387404J060871J0123105J0069320
37616A05150837L2035j1270197j0517807L460083J4484634R721716k335902n827532
37608A02897867p74726J824030J6778r29471l616573j2339913j6582628k603792
37600F7891572J9730873K4568428O929214j0340740j1328545o372276q281340
37593H2797186j0731301l339573Q547462J3121454R034372J733656o024186j0574710
37585H4564360n972167M785958R256756M616686L348221J0725420J2958626P01872
37577A24985732j1952323q994032J001047j94289r801001j0365224m49778L516090
$$ plain form
37569 87746222 82840415 70532331 64448942 74531640 98263843 123348657 134607223
37562 134607223 125202538 106326297 98396541 106917210 114974164 106381405 87779486 78419169
37554 78419169 84531235 94578234 96627548 90460109 83076930 79884055 81194996 83264716
37546 83264716 82839498 81990926 85292479 91243156 92475284 86856697 81171533 80438977
37538 80438977 82257147 86363655 98662031 116850806 122868109 103358025 71168440
37531 71168440 52076652 53759313 62182830 66434919 70842529 80183420 88181288 87794286
37523 87794286 82587617 80224713 81002618 79115642 71529958 61550782 55883013 58934685
37515 58934685 66783344 68508865 59597384 51774798 59899246 79313151 88500827 78234546
$$ packed form
37569H7746222m905807j2308084o083389J0082698K3732203K5084814J1258566
37562A34607223r404685j8876241p929756Q520669Q056954q592759j8601919r360317
37554G8419169O112066J0046999K049314o167439p383179l192875J310941K069720
37546H3264716m25218q48572L301553N950677J232128n618587n685164p32556
37538H0438977J818170M106508J2298376J8188775O017303j9510084l2189585
37531G1168440j9091788J682661Q423517M252089M407610R340891P997868l87002
37523H7794286n206669k362904P77905j886976p585684r979176n667769L051672
37515E8934685P848659J725521q911481p822586Q124448J9413905R187676j0266281
$$ plain form
37507 78234546 65621560 70361162 86713097 91621401 76540914 58345357 57225764
37500 57225764 73640217 91737651 99307274 97886670 95073578 93586672 91342033 89010075
37492 89010075 91257968 98892375 104967051 102972375 95355641 88637356 83046033 74174748
37484 74174748 63834082 60969231 69865522 84133207 94966585 99493227 98313171 91158399
37476 91158399 79696839 70317957 69354322 77673286 92279955 109509594 123600660 126177352
37468 126177352 112244932 86209640 59801669 44382696 44281276 54021341 62204933
37461 62204933 62702048 62124873 70801781 86661113 96186859 93178171 87187106 88640286
37453 88640286 94463402 95259926 88857261 78487300 64799154 50133442 45150011 58283375
$$ packed form
37507G8234546j2612986M739602J6351935M908304j5080487j8195557j119593
37500E7225764J6414453J8097434P569623j420604k813092j486906k244639k331958
37492H9010075K247893P634407O074676j994676p616734o718285n591323q871285
37484G4174748j0340666k864851Q896291J4267685J0833378M526642j180056p154772
37476I1158399j1461560r378882r63635Q318964J4606669J7229639J4091066K576692
37468A26177352j3932420k6035292k6407971j5418973j01420R740065Q183592
37461F2204933M97115n77175Q676908J5859332R525746l008688n991065J453180
37453H8640286N823116P96524o402665j0369961j3688146j4665712m983431J3133364
$$ plain form
37445 58283375 79909693 89226368 78956216 63604247 60309001 69890159 80923710
37438 80923710 85448698 84447658 81145630 74973490 63610319 49480065 42036318 50409397
37430 50409397 72655205 95842893 109188387 113136876 112600566 107395124 95836298 82703147
37422 82703147 74883859 71829774 68705821 66276981 68083653 70022939 64185763 52768387
37414 52768387 46024815 45293795 41626672 34759408 38188625 56947828 74282689 73503793
37406 73503793 62892002 63099776 75794930 82581431 74703518 66031825 70287687 79711951
37398 79711951 77747559 64578578 56612157 62443253 72136742 74272602 73275995 80791890
37390 80791890 95420642 103050088 97819054 90743595 91799133 93860708 84701476 67685834
$$ packed form
37445E8283375K1626318R316675j0270152j5351969l295246R581158J1033551
37438H0923710M524988j001040l302028o172140j1363171j4130254p443747Q373079
37430E0409397K2245808K3187688J3345494L948489n36310n205442j1558826j3133151
37422H2703147p819288l054085l123953k428840J806672J939286n837176j1417376
37414E2768387o743572p31020l667123o867264L429217J8759203J7334861p78896
37406G3503793j0611791K07774J2695154O786501p877913q671693M255862R424264
37398G9711951j964392j3168981p966421N831096R693489K135860r96607P515895
37390H0791890J4628752P629446n231034p075459J055538K061575r159232j7015642
$$ plain form
37382 67685834 57084407 55867852 52951949 43597792 37572341 41729396 47986550 47215737
37374 47215737 44049307 47269990 53925055 54876004 50598482 49361263 52512784 53109760
37366 53109760 49057424 48062769 57872196 77524225 98341789 109206165 103410886 85920913
37358 85920913 70869332 66079555 64439389 57537222 51411307 57363327 71502007 77725072
37350 77725072 70824084 62718116 63319928 68271574 70272301 71029267 75734742 84456366
37342 84456366 93965463 99671214 92248434 63759221 23887644 -987265 4998290 28531197
37334 28531197 45069974 47957144 48471084 53099647 55219568 49028025 39127100 32590407
37326 32590407 30129675 29885109 34421119 48077415 68008733 81767663 77521721 58424575
$$ packed form
37382F7685834j0601427j216555k915903r354157o025451M157055O257154p70813
37374D7215737l166430L220683O655065R50949m277522j237219L151521N96976
37366E3109760m052336r94655R809427J9652029K0817564J0864376n795279j7489973
37358H5920913j5051581m789777j640166o902167o125915N952020J4138680O223065
37350G7725072o900988q105968O01812M951646K000727P56966M705475Q721624
37342H4456366R509097N705751p422780k8489213l9871577k4874909N985555K3532907
37334B8531197J6538777K887170N13940M628563K119921o191543r900925o536693
37326C2590407k460732k44566M536010J3656296J9931318J3758930m245942j9097146
$$ plain form
37318 58424575 43483129 48244334 65732937 74780865 68346749 62787839 73364768 91018245
37310 91018245 93864001 75283708 49448984 32543130 28967603 33775797 38213918 33543032
37302 33543032 19257308 8112220 14382992 36179486 56805539 63879331 59738663
37295 59738663 53304939 50194307 51695185 55384051 55451113 49713804 46533003 56273570
37287 56273570 75226272 87438473 84461950 74053283 66947906 64777398 64429028 64125314
37279 64125314 60014677 46311359 25531881 10798657 11304007 22046676 33468660
37272 33468660 43673664 54680088 64137065 68353733 67450632 61205957 47377829 31367343
37264 31367343 28398939 45238484 66620264 71748849 59390956 44953427 37531313
$$ packed form
37318E8424575j4941446M761205J7488603R047928o434116n558910J0576929J7653477
37310I1018245K845756j8580293k5834724j6905854l575527M808194M438121m670886
37302C3543032j4285724j1145088O270772K1796494K0626053P073792m140668
37295E9738663o433724l110632J500878L688866O7062n737309l180801R740567
37287E6273570J8952702J2212201k976523j0408667p105377k170508l48370l03714
37279F4125314m110637j3703318k0779478j4733224N05350J0742669J1421984
37272C3468660J0205004J1006424R456977M216668r03101o244675j3828128j6010486
37264C1367343k968404J6839545K1381780N128585j2357893j4437529p422114
$$ plain form
37257 37531313 33508507 30322813 31761114 38175828 43846501 46736689 50859441 56972991
37249 56972991 60189972 58186500 52790516 43395788 29675168 21285588 31454386 56872000
37241 56872000 76360399 75556012 62504404 53239938 52974199 58354880 66812154 74113221
37233 74113221 72402893 61524409 54516022 61018681 72383014 74791777 70105397 69606516
37225 69606516 72081214 64885850 46778142 33645480 37077752 49831128 58324895 59148409
37217 59148409 56328357 50871356 41829473 33178336 31532343 37883234 46229768 49717444
37209 49717444 45633136 36197689 27207005 24659357 30352408 40733365 49974717 53022224
37201 53022224 47091652 34028812 21524374 18031222 24694244 34567072 40490661 41297906
$$ packed form
37257C7531313m022806l185694J438301O414714N670673K890188M122752O113550
37249E6972991L216981k003472n395984r394728j3720620q389580J0168798K5417614
37241E6872000J9488399q04387j3051608r264466k65739N380681Q457274P301067
37233G4113221j710328j0878484p008387O502659J1364333K408763m686380m98881
37225F9606516K474698p195364j8107708j3132662L432272J2753376Q493767Q23514
37217E9148409k820052n457001r041883q651137j645993O350891Q346534L487676
37209D9717444m084308r435447q990684k547648N693051J0380957R241352L047507
37201E3022224n930572j3062840j2504438l493152O663022R872828N923589Q07245
$$ plain form
37193 41297906 40069478 39524608 40266994 41401241 42250116 44438813 50289015 56654996
37185 56654996 54047778 37797855 17847030 9989208 17884560 31262844 41338300
37178 41338300 48221584 51691674 46474827 32848221 22314560 24365202 34265169 41802144
37170 41802144 45722080 50446512 53956353 49796772 38701453 28274927 22200684 18795456
37162 18795456 19252262 27361049 40127856 48218354 48501581 48115984 52686284 57756989
37154 57756989 56501414 50285094 46149791 46826251 47945945 44651265 38603054 37392474
37146 37392474 45220183 53652422 46996733 22221918 -1357049 -1550760 19510522 38124453
37138 38124453 38878880 29696453 24302042 23120514 19562649 14391139 12859751 14697176
$$ packed form
37193D1297906j228428n44870P42386J134247Q48875K188697N850202O365981
37185E6654996k607218j6249923j9950825p857822P895352J3378284J0075456
37178D1338300O883284L470090n216847j3626606j0533661K050642R899967P536975
37170D1802144L919936M724432L509841m159581j1095319j0426526o074243l405228
37162A8795456M56806Q108787J2766807Q090498K83227l85597M570300N070705
37154E7756989j255575o216320m135303O76460J119694l294680o048211j210580
37146C7392474P827709Q432239o655689k4774815k3578967j93711K1061282J8613931
37138C8124453P54427r182427n394411j181528l557865n171510j531388J837425
$$ plain form
37130 14697176 17927248 26866491 43784945 56023258 45865603 15042020 -12876061
37123 -12876061 -18939736 -7709297 5575087 16284360 28446753 37708200 30880292
37116 30880292 6070068 -17023729 -15842470 8855068 33099787 36266865 21298270
37109 21298270 7033637 7118551 20328762 35324831 38567260 22990080 -2155660 -13298637
37101 -13298637 5214659 41270144 66637753 67500128 52776407 34124254 14274167
37094 14274167 -1294760 -58748 18571593 34502188 31535203 19750853 18399664
37087 18399664 26410644 27738400 19111019 12544523 12772124 11797995 6969658 6390417
37079 6390417 13118987 20312725 26026873 36995688 52730715 61692499 60072204 59199741
$$ packed form
37130A4697176L230072Q939243J6918454J2238313j0157655l0823583k7918081
37123a2876061o063675J1230439J3284384J0709273J2162393R261447o827908
37116C0880292k4810224k3093797J181259K4697538K4244719L167078j4968595
37109B1298270j4264633Q4914J3210211J4996069L242429j5577180k5145740j1142977
37101a3298637J8513296L6055485K5367609Q62375j4723721j8652153j9850087
37094A4274167j5568927J236012J8630341J5930595k966985j1784350j351189
37087A8399664Q010980J327756q627381o566496K27601r74129m828337n79241
37079F390417O728570P193738N714148J0968815J5735027Q961784j620295q72463
$$ plain form
37071 59199741 65697698 68559671 56789021 38009657 27849640 29933225 36856104 42504969
37063 42504969 43558464 37469550 29046920 30116612 42013266 48181096 37006254 22358235
37055 22358235 25136347 41379008 47612856 35605630 22763273 25251516 37184477
37048 37184477 42742106 37013799 27972651 25545141 33590160 46781658 52900743 44320238
37040 44320238 28540670 20461053 23279340 25313018 18056610 8824713 10627745 25436234
37032 25436234 42467991 49761266 44359531 33677549 28480089 32236595 37381382 34785876
37024 34785876 25279122 17240136 14464155 12754964 8592551 4933266 6574825 13631866
37016 13631866 20701761 20674628 11276502 377715 851313 15895662 34011735 43396370
$$ packed form
37071E9199741O497957K861973j1770650j8779364j0160017K083585O922879N648865
37063D2504969J053495o088914q422630J069692J1896654O167830j1174842j4648019
37055B2358235K778112J6242661O233848j2007226j2842357K488243J1932961
37048C7184477N557629n728307r041148k427510Q045019J3191498O119085q580505
37040D4320238j5779568q079617K818287K033678p256408r231897J803032J4808489
37032B5436234J7031757P293275n401735j0681982n197460L756506N144787k595506
37024C4785876r506754q038986k775981j709191m162413l659285J641559P057041
37016A3631866P069895k7133r398126j0898787M73598J5044349J8116073R384635
$$ plain form
37008 43396370 44847638 43662686 37636701 24918740 16141791 22688452 36754116 40269369
37000 40269369 32271691 29123531 36441997 40437995 32130087 21215984 17745065 17195569
36992 17195569 13639103 11981789 16058604 19205657 18478626 23742846 39216247 50323627
36984 50323627 44912632 34351120 34806524 38979409 28801158 9246926 5132922 24593782
36976 24593782 47404107 52996649 42234734 27494763 17380722 16023146 22934720
36969 22934720 28468417 22541516 11956848 14977893 33965804 49153386 47330287 40622892
36961 40622892 44786461 53301256 49835818 36716301 31417659 38348234 43947304 41966602
36953 41966602 44392926 58120072 66548283 50690674 21206881 10581314 31183207
$$ packed form
37008D3396370J451268j184952o025985j2717961q776949O546661J4065664L515253
37000D0269369p997678l148160P318466L995998q307908j0914103l470919n49496
36992A7195569l556466j657314M076815L147053p27031N264220J5473401J1107380
36984E0323627n410995j0561512M55404M172885j0178251j9554232m114004J9460860
36976B4593782K2810325N592542j0761915j4739971j0114041j357576O911574
36969B2934720N533697n926901j0584668L021045J8987911J5187582j823099o707395
36961D0622892M163569Q514795l465438j3119517n298642O930575N599070j980702
36953D1966602K426324J3727146Q428211j5857609k9483793j0625567K0601893
$$ plain form
36946 31183207 57211626 57421498 34500229 18633144 27736185 49477492 62804159
36939 62804159 62034960 54369130 46817566 44645690 52308684 64553402 64340759 43015835
36931 43015835 18415292 18602437 47136783 76891520 81416469 62251136 40650812
36924 40650812 31002511 29771257 26453863 17699655 8901174 4955502 3338127 -1189074
36916 -1189074 -7280968 -8617601 -5575292 -7126626 -16428536 -22328660 -13105301 6821617
36908 6821617 22282799 25135271 18540354 8341773 -155986 -732140 7909327 17438341
36900 17438341 20689495 23341216 33833036 46466494 49226507 45601853 51172828 67507144
36892 67507144 77567856 71846535 61684922 58650221 56769430 46670884 34216458
$$ packed form
36946C1183207K6028419K09872k2921269j5867085R103041K1741307J3326667
36939F2804159p69199p665830p551564k171876P662994J2244718k12643k1324924
36931D3015835k4600543J87145K8534346K9754737M524949j9165333k1600324
36924D0650812r648301j231254l317394q754208q798481l945672j617375m527201
36916a189074o091894j336633L042309j551334r301910n900124R223359J9926918
36908F821617J5461182K852472o594917j0198581q497759n76154Q641467R529014
36900A7438341L251154K651721J0491820J2633458K760013l624654N570975J6334316
36892F7507144J0060712n721321j0161613l034701j880791j0098546j2454426
$$ plain form
36885 34216458 31151534 35738389 36153235 28168995 17983659 10963449 7650058 8256251
36877 8256251 11743486 12163541 4968970 -2967857 2393833 25567626 53815896 68798925
36869 68798925 64256015 50712305 43045133 44774869 46913975 42269641 35633809 35973935
36861 35973935 43589127 51344128 54528967 52324796 44162991 33684293 31282365 40860049
36853 40860049 48180696 36805033 13399642 1185976 8516813 21009536 26043215
36846 26043215 26309135 25377860 19667408 11759141 12629133 21721333 23219092 12172854
36838 12172854 5437208 14349944 25284199 22152619 10547228 2980794 -2794361 -12121304
36830 -12121304 -16405838 -9051829 -4307646 -16971217 -34684837 -34645082 -19090063 -9711750
$$ packed form
36885C4216458l064924M586855M14846p984240j0185336p020210l313391O06193
36877H256251L487235M20055p194571p936827N361690K3173793K8248270J4983029
36869F8798925m542910j3543710p667172J729736K139106m644334o635832L40126
36861C5973935P615192P755001L184839k204171q161805j0478698k401928R577684
36853D0860049P320647j1375663k3405391j2213666P330837J2492723N033679
36846B6043215K65920r31275n710452p908267Q69992R092200J497759j1046238
36838A2172854o735646Q912736J0934255l131580j1605391p566434n775155r326943
36830a2121304m284534P354009M744183j2663571j7713620L9755J5555019R378313
$$ plain form
36822 -9711750 -13530082 -18907595 -20439972 -22673629 -21587216 -7195838 14856784 26246310
36814 26246310 21355698 10773016 1793279 -4424521 -818526 16332765 29502991 18164707
36806 18164707 -6370944 -13295573 215988 6424528 -3887083 -6251900 11190844
36799 11190844 22446508 6185705 -17003598 -16747212 1172823 9992887 6033711 7527789
36791 7527789 19057948 25531793 19283178 10702735 11019638 20286421 32089365 38288232
36783 38288232 31962268 16442188 7213288 14745707 30462883 38821595 36375389 29170775
36775 29170775 19499586 7195870 -2247259 -2315242 6336126 20089412 37324521 52110383
36767 52110383 53992770 43640405 36753736 41243573 43632082 31424026 14667748 8426480
$$ packed form
36822i711750l818332n377513j532377k233657J086413J4391378K2052622J1389526
36814B6246310m890612j0582682q979737o217800L605995J7151291J3170226j1338284
36806A8164707k4535651o924629J3511561O208540j0311611k364817J7442744
36799A1190844J1255664j6260803k3189303K56386J7920035Q820064l959176J494078
36791G527789J1530159O473845o248615q580443L16903R266783J1802944O198867
36783C8288232o325964j5520080r228900P532419J5717176Q358712k446206p204614
36775B9170775r671189j2303716r443129o7983Q651368J3753286J7235109J4785862
36767E2110383J882387j0352365o886669M489837K388509j2208056j6756278o241268
$$ plain form
36759 8426480 7808277 1044810 -4879522 4057250 20215533 23306492 13375001 8747098
36751 8747098 13282413 12572299 3780842 1746412 10035154 12381111 2171955 -3853598
36743 -3853598 6385286 20123979 21801168 16360456 14617524 11946739 -158437 -13833256
36735 -13833256 -15207827 -6764836 -1635281 -1626182 1732481 8170691 8549121 3522334 5466843
36726 5466843 17993159 27684299 22947180 10513857 5028251 9432054 14701632 15361989
36718 15361989 16077019 22448660 32424372 39445209 39258120 30780576 15026723 -2214402
36710 -2214402 -10790597 -6176631 2976290 4897602 1266670 4423944 17254300 27233091
36702 27233091 25356803 20118826 24178642 35422007 41223119 35968451 24836446 14325082
$$ packed form
36759H426480o18203o763467n924332Q936772J6158283L090959r931491m627903
36751H747098M535315p10114q791457k034430Q288742K345957j0209156o025553
36743c853598J0238884J3738693J677189n440712j742932k670785j2105176j3674819
36735a3833256j374571Q442991N129555R099L358663O438210L78430n026787J944509
36726E466843J2526316R691140m737119j2433323n485606M403803N269578O60357
36718A5361989P15030O371641R975712P020837j87089q477544j5753853j7241125
36710b214402q576195M613966R152921J921312l630932L157274J2830356R978791
36702B7233091j876288n237977M059816J1243365N801112n254668j1132005j0511364
$$ plain form
36694 14325082 7656526 5823675 5481317 110916 -9724770 -13550588 -6296864 1752855
36686 1752855 700979 -2529834 2582295 9468879 5328422 -3436920 1718571 20309738
36678 20309738 30968334 23711432 12576412 9746154 7777667 -1932983 -10844251 -7019616
36670 -7019616 5652828 14974859 17528795 17073207 14523235 9990205 7169958 6322154
36662 6322154 643209 -11099690 -16475397 -4772456 15688925 26433037 21045503 9570810
36654 9570810 4540697 10714134 24834996 37399748 37511196 23455030 6923475 1601775
36646 1601775 9647076 22590552 31208227 30928757 22957144 14655366 14039133 20170263
36638 20170263 24145040 21957528 18949420 18707985 17315725 13700645 15125904 24423496
$$ packed form
36694A4325082o668556j832851l42358n370401r835686l825818P253724Q049719
36686A752855j051876l230813N112129O886584m140457q765342N155491J8591167
36678B0309738J0658596p256902j1135020k830258j968487r710650q911268L824635
36670g019616J2672444R322031K553936m55588k549972m533030k820247q47804
36662F322154n678945j1742899n375707J1702941K0461381J0744112n387534j1474693
36654I570810n030113O173437J4120862J2564752J11448j4056166j6531555n321700
36646A601775Q045301J2943476Q617675k79470p971613q301778o16233O131130
36638B0170263L974777k187512l008108k41435j392260l615080J425259R297592
$$ plain form
36630 24423496 31109984 25027610 11929426 5863728 11064837 19326649 20350035 8259039
36622 8259039 -15446864 -38353832 -43932283 -29888639 -12920331 -8077490 -11790564 -12886688
36614 -12886688 -9498922 -4366349 5377726 19631615 26233997 16724461 3682725 4985768
36606 4985768 16746000 20754694 14648709 13428297 21018293 22238469 8638900 -6332414
36598 -6332414 -6457447 7240575 23647407 36157941 41685939 36167064 20977688 6677820
36590 6677820 2222812 5734707 11540632 19806462 32567477 45533709 51112638 47413927
36582 47413927 39626738 34073781 33517709 36506122 39877458 43110884 48709321 55313178
36574 55313178 54076026 38806491 17536980 4978757 3204773 -750708 -15474945
$$ packed form
36630B4423496O686488o082374j3098184o065698N201109Q261812J023386j2090996
36622H259039k3705903k2906968n578451J4043644J6968308M842841l713074j096124
36614a2886688L387766N132573R744075J4253889O602382r509536j3041736J303043
36606D985768J1760232M008694o105985j220412P589996J220176j3599569j4971314
36598f332414j25033J3698022J6406832J2510534N527998n518875j5189376j4299868
36590F677820m455008L511895N805925Q265830J2761015J2966232N578929l698711
36582D7413927p787189n552957n56072K988413L371336L233426N598437O603857
36574E5313178j237152j5269535k1269511j2558223j773984l955481j4724237
$$ plain form
36567 -15474945 -32089941 -35591241 -23530342 -8227657 -2978314 -9081085 -15430149 -10630996
36559 -10630996 3638532 14139492 13201906 8833083 12175972 21235007 26386758 26983146
36551 26983146 30322850 36624718 38396586 35015431 34916136 41119067 46521453 46309745
36543 46309745 43659300 40413384 34119225 27854922 30340030 40885501 46089063 37822396
36535 37822396 23668298 13561453 7825300 5489936 11566284 25680921 34776696 29806426
36527 29806426 21290672 25056044 38553724 44788559 36250820 21904655 11319741 3939640
36519 3939640 -3361792 -6638668 2550885 27017277 57350584 76133878 72773418 54924428
36511 54924428 39514394 31928863 23242410 10190276 4569476 14619593 29199808
$$ packed form
36567a5474945j6614996l501300J2060899J5302685N249343o102771o349064M799153
36559a0630996J4269528J0500960r37586m368823L342889R059035N151751N96388
36551B6983146L339704O301868J771868l381155r9295O202931N402386k11708
36543D6309745k650445l245916o294159o264303K485108J0545471N203562q266667
36535C7822396j4154098j0106845n736153k335364O076348J4114637R095775m970270
36527B9806426q515754L765372J3497680O234835q537739j4346165j0584914p380101
36519C939640p301432l276876R189553K4466392L0333307J8783294l360460j7848990
36511E4924428j5410034p585531q686453j3052134n620800J0050117J4580215
$$ plain form
36504 29199808 32676266 26425181 22240854 22270726 20967443 21364595 31912598 48551361
36496 48551361 56432635 50464553 39350103 28397211 14512019 1054637 3131
36489 3131 12186025 21459592 18397468 14896973 22444114 29719334 19875707 1139661
36481 1139661 -1342270 17299869 33533842 29466482 16833009 16714612 29208165 37654752
36473 37654752 35450707 33305941 40918106 53785148 60422333 54411502 37942631 20563798
36465 20563798 14532062 23076581 33047589 29145025 16225036 14476627 28645065 37803172
36457 37803172 25604123 5712764 1412067 11622485 17382960 14829615 17720568 27747884
36449 27747884 27529956 10313154 -5649042 -4711518 2571305 -788963 -9538632 -6695348
$$ packed form
36504B9199808L476458o251085m184327K9872j303283L97152J0548003J6638763
36496D8551361P881274n968082j1114450j0952892j3885192j3457382j051506
36489C131J2182894R273567l062124l500495P547141P275220r843627j8736046
36481A139661k481931J8642139J6233973m067360j2633473j18397J2493553Q446587
36473C7654752k204045k144766P612165J2867042O637185o010831j6468871j7378833
36465B0563798o031736Q544519R971008l902564j2919989j748409J4168438R158107
36457C7803172j2199049j9891359m300697J0210418N760475k553345K890953J0027316
36449B7747884k17928j7216802j5962196R37524P282823l360268q749669K843284
$$ plain form
36441 -6695348 6003079 9233030 -3587043 -15929230 -12972579 -2766437 -3876357 -19532249
36433 -19532249 -33782437 -32501513 -20821965 -15387393 -22433488 -30994842 -29865470 -22540360
36425 -22540360 -17512436 -11592807 3356230 20879244 24636338 14697273 11367961 25921391
36417 25921391 43839106 47454451 40849247 39160374 44571889 47248720 41984267 30663568
36409 30663568 15098737 -207858 -4998576 4562492 16847609 19633026 17104834 20199221
36401 20199221 28417482 35221651 42845329 54924670 61603451 50979858 30925908 20460578
36393 20460578 22674324 25752317 27868319 38474369 54326671 58038658 45844586 35061162
36385 35061162 36275002 38439817 31334146 23591028 25720609 31601211 31232596 28753958
$$ packed form
36441f695348J2698427L229951j2820073j2342187K956651J0206142j109920j5655892
36433a9532249j4250188J280924J1679548N434572p046095q561354J129372P325110
36425b2540360N027924N919629J4949037J7523014L757094r939065l329312J4553430
36417B5921391J7917715L615345o605204j688873N411515K676831n264453j1320699
36409C0663568j5564831j5306595m790718R561068J2285117K785417k528192L094387
36401B0199221Q218261O804169P623678J2079341O678781j0623593k0053950j0465330
36393B0460578K213746L077993K116002J0606050J5852302L711987j2194072j0783424
36385C5061162J213840K164815p105671p743118K129581N880602l68615k478638
$$ plain form
36377 28753958 32847956 39306652 38008096 30409705 26591352 29169998 31464460 28881645
36369 28881645 23262572 17991220 14880017 13417579 9988258 2684593 -1794264 5131441
36361 5131441 18046851 20743883 10979475 8325890 27327350 55324520 70136116 69249797
36353 69249797 65506901 61509366 47351623 22367070 1426658 -4244480 409667 5387029
36345 5387029 8606863 12174746 14007865 10497081 3721993 55792 2286105 6628523
36337 6628523 8167348 7549846 10445033 19695215 29982226 33085549 27475032 19426191
36329 19426191 15732787 19319381 30095956 43712733 50374943 42907993 27126864 16932652
36321 16932652 18373147 26365434 36796101 50644589 64222639 68174902 61262782 53199671
$$ packed form
36377B8753958M093998O458696j298556p598391l818353K578646K294462k582815
36369B8881645n619073n271352l111203j462438l429321p303665m478857O925705
36361E131441J2915410K697032r764408k653585J9001460K7997170J4811596q86319
36353F9249797l742896l997535j4157743k4984553k0940412n671138M654147M977362
36345E387029L219834L567883J833119l510784o775088l666201K230313M342418
36337F628523J538825o17502K895187R250182J0287011L103323n610517q048841
36329A9426191l693404L586594J0776575J3616777O662210p466950j5781129j0194212
36321A6932652J440495P992287J0430667J3848488J3578050L952263o912120q063111
$$ plain form
36313 53199671 48058639 38005401 21487185 13410086 24670380 43045749 48780565
36306 48780565 40112459 28600262 17830787 4502813 -5151550 -143780 14628170
36299 14628170 21431132 16610169 17452821 35791469 59145099 67425152 58233477 45444703
36291 45444703 38929228 35878459 30399263 23084285 18530450 17825296 17818763 17498206 20303925
36282 20303925 26486100 27626029 17272226 5719953 12282502 38739727 61948513
36275 61948513 61004669 42755311 30833064 36669577 51477306 60745293 55967886 36824711
36267 36824711 12186918 -4646254 -10095032 -14150235 -22031130 -21501414 -1434470 25828090
36259 25828090 37755504 31805611 24277299 22621517 18853117 10436362 7286622 13853114
$$ packed form
36313E3199671n141032j0053238j6518216q077099J1260294J8375369N734816
36306D8780565q668106j1512197j0769475j3327974r654363N007770J4771950
36299A4628170O802962m820963Q42652J8338648K3353630Q280053r191675j2788774
36291D5444703o515475l050769n479196p314978m553835p05154o533l20557K805719
36282B0303925O182175J139929j0353803j1552273O562549K6457225K3208786
36275F1948513r43844j8249358j1922247N836513J4807729R267987m777407j9143175
36267C6824711k4637793j6833172n448778m055203p880895N29716K0066944K7262560
36259B5828090J1927414n949893p528312j655782l768400q416755l149740O566492
$$ plain form
36251 13853114 21968670 26405194 30846668 33370052 23899988 4244574 -6148462 4562590
36243 4562590 23260193 30872936 26453807 20446599 15259078 6892424 -1409822 -1628083
36235 -1628083 5467228 10010995 5284508 -6602653 -18721985 -23563000 -17428072 -6406494
36227 -6406494 -3545504 -14020758 -27361772 -30422487 -23588959 -16985873 -13974734 -7053298
36219 -7053298 8864567 25190981 26292941 7932116 -13950595 -18620175 -5824980
36212 -5824980 2832165 -6702703 -21017453 -20710354 -11246307 -12974211 -26489853 -32442873
36204 -32442873 -25961936 -24234521 -32876870 -32104992 -10450619 12242551 14435158 4931978
36196 4931978 3891231 9620416 8414855 2678288 2508861 592015 -15361293 -32130471
$$ packed form
36251A3853114Q115556M436524M441474K523384r470064j9655414j0393036J0711052
36243D562590J8697603P612743m419129o007208n187521q366654q302246k18261
36235a628083P095311M543767m726487j1887161j2119332m841015O134928J1021578
36227f406494K860990j0475254j3341014l060715O833528O603086L011139O921436
36219g053298J5917865J6326414J101960j8360825k1882711m669580J2795195
36212e824980Q657145r534868j4314750L07099R464047j727904j3515642n953020
36204c2442873O480937J727415q642349P71878K1654373K2693170K192607r503180
36196D931978j040747N729185j205561n736567j69427j916846j5953308j6769178
$$ plain form
36188 -32130471 -24014970 4839965 21819481 13483872 2364982 7217657 14206497 3064655
36180 3064655 -19904858 -33376234 -30533574 -19745047 -6935799 5863924 11864646
36173 11864646 5559562 -5362893 -6512086 5518846 19943398 24451751 15255271 -1983243
36165 -1983243 -15306714 -14213872 -77542 14190682 18948715 17530323 16751933 14328311
36157 14328311 3688069 -12264266 -20337692 -10257987 14682797 38431506 42305758
36150 42305758 20172741 -12228500 -28709309 -18768512 2554662 15496083 18522240
36143 18522240 22452673 29862429 34032799 34856633 39722940 46443350 41322801 22569672
36135 22569672 12412432 31403339 66472669 80494729 55611038 14345543 -8431481
$$ packed form
36188c2130471Q115501K8854935J6979516q335609j1118890M852675O988840j1141842
36180C064655k2969513j3471376K842660J0788527J2809248J2799723O000722
36173A1864646o305084j0922455j149193J2030932J4424552M508353r196480j7238514
36165a983243j3323471J092842J4136330J4268224M758033j418392p78390k423622
36157A4328311j0640242j5952335q073426J0079705K4940784K3748709L874252
36150D2305758k2133017l2401241j6480809R940797K1323174J2941421L026157
36143A8522240L930433P409756M170370Q23834M866307O720410n120549j8753129
36135B2569672j0157240J8990907L5069330J4022060k4883691m1265495k2777024
$$ plain form
36128 -8431481 -4827608 4259046 641957 -10935989 -15735926 -10847607 -5926470 -6872132
36120 -6872132 -7915766 -1491728 9882131 16353314 14390557 12829588 21253658 34246302
36112 34246302 34836911 17189086 -2260295 -5660997 295596 -5791361 -25274991 -33674088
36104 -33674088 -17086539 4103240 3361010 -14165795 -22792792 -17126836 -16874015 -30381177
36096 -30381177 -38184833 -22634045 4945680 20455717 17756919 8955373 2619453 -3074957
36088 -3074957 -8818225 -9651662 -3609458 4290536 9252745 12052413 14966607 16327487
36080 16327487 11717309 -271148 -14208607 -20466846 -13657366 1034372 11835217
36073 11835217 11195875 1430079 -8890412 -11312640 -2465779 12656408 23939156 27600239
$$ packed form
36128h431481L603873R086654l617089j1577946m799937M888319M921137r45662
36120f872132j043634O424038J1373859O471183j962757j560969Q424070J2992644
36112C4246302N90609j7647825j9449381l400702N956593o086957j9483630q399097
36104c3674088J6587549K1189779p42230j7526805q626997N665956K52821j3507162
36096c0381177p803656J5550788K7579725J5510037k698798q801546o335920n694410
36088c074957n743268q33437O042204P899994M962209K799668K914194J360880
36080A6327487m610178j1988457j3937459o258239O809480J4691738J0800845
36073A1835217o39342r765796j0320491k422228Q846861J5122187J1282748L661083
$$ plain form
36065 27600239 31773989 44021888 56810633 55744928 40750398 26728780 22247402
36058 22247402 21034165 17819514 17851810 23591570 25589336 16526871 3251838 -5221889
36050 -5221889 -10904133 -16829710 -14750352 2886447 26422474 38970235 37462123 30850419
36042 30850419 23839812 16769295 15258624 23067765 29480204 21499699 6204901 2561944
36034 2561944 12107021 17957947 14489084 15948545 29220870 39647382 35608602 28726378
36026 28726378 33996862 43592463 38415990 18433359 4698333 12515876 34254985 49227547
36018 49227547 43944157 23509456 6734553 7313097 18631204 23016767 15573662 7681001
36010 7681001 5415605 650261 -9269521 -10525205 4882234 20714001 17971823 3430363
$$ packed form
36065B7600239M173750J2247899J2788745j065705j4994530j4021618m481378
36058B2247402j213237l214651L2296N739760J997766r062465j3275033q473727
36050e221889n682244n925577K079358J7636799K3536027J2547761j508112o611704
36042C0850419p010607p070517j510671P809141O412439p980505j5294798l642957
36034B561944R545077N850926l468863J459461J3272325J0426512m038780o882224
36026B8726378N270484R595601n176473j9982631j3735026P817543K1739109J4972562
36018D9227547n283390k0434701j6774903N78544J1318107M385563p443105p892661
36010G681001k265396m765344r919782j255684J5407439J5831767k742178j4541460
$$ plain form
36002 3430363 -2928013 -104381 -3034447 -11685715 -7698633 15377317 39559796 46444038
35994 46444038 37646345 26033334 21006222 26561618 39243577 44235291 29118261 5365575
35986 5365575 -1440891 12211971 21819612 13450289 5322136 15953474 32910971 35084141
35978 35084141 28090798 30554282 37482881 28240500 6545093 742939 20044372 38888027
35970 38888027 34963117 19030563 13312830 19553523 24682213 23759538 20103394 12233343
35962 12233343 -2461464 -15947986 -15756287 -1120447 17161426 30126479 35056936
35955 35056936 30683153 18332708 5578165 -693293 -3211256 -7982050 -11635747 -5036617
35947 -5036617 11270622 25020461 26795391 18922447 9247771 3481084 4220602 10072127
$$ packed form
36002C430363o358376K823632k930066q651268L987082K3075950K4182479O884242
35994D6444038q797693j1613011n027112N555396J2681959M991714j5117030k3752686
35986E365575o806466J3652862R607641q369323q128153J0631338J6957497K173170
35978C5084141o993343K463484O928599r242381k1695407n802154J9301433J8843655
35970C8888027l924910j5932554n717733O240693N128690r22675l656144p870051
35962A2233343j4694807j3486522J91699J4635840J8281873J2965053M930457
35955C5056936m373783j2350445j2754543o271458k517963m770794l653697O599130
35947e036617J6307239J3749839J774930p872944r674676n766687P39518N851525
$$ plain form
35939 10072127 14864475 14679097 15545380 25832038 40844310 45463320 34910898 22225055
35931 22225055 19714705 22928688 20895401 13909239 10992952 15099006 21564235 28316584
35923 28316584 36769256 43368956 41374529 33269119 31329367 40865936 50717563 46908735
35915 46908735 30266958 13457274 4628836 2370800 4911797 14021087 26682780 31470262
35907 31470262 20519853 1516196 -9262580 -5148405 5310327 11039401 10901522 11216372
35899 11216372 15317389 19355430 16881633 5417811 -10196783 -19889050 -16102643 -1424190
35891 -1424190 12969710 17677554 12620124 4770779 1898681 8589535 23080651 36056676
35883 36056676 38122637 31495141 28362981 33835820 38071735 32206618 24488904 29600115
$$ packed form
35939A0072127M792348j85378Q66283J0286658J5012272M619010j0552422j2685843
35931B2225055k510350L213983k033287o986162k916287M106054O465229O752349
35923B8316584Q452672O599700j994427q105410j939752R536569R851627l808828
35915D6908735j6641777j6809684q828438k258036K540997R109290J2661693M787482
35907C1470262j0950409j9003657j0778776M114175J0458732N729074j37879L14850
35899A1216372M101017M038041k473797j1463822j5614594r692267L786407J4678453
35891a424190J4393900M707844n057430p849345k872098O690854J4491116J2976025
35883C6056676K065961o627496l132160N472839M235915n865117p717714N111211
$$ plain form
35875 29600115 46500706 59631547 60719566 56206535 51951863 44457739 32120140 22634601
35867 22634601 21479709 23014948 21673188 23291221 34846679 49185530 51540186 38636747
35859 38636747 21517862 10973217 9067626 13689526 21728789 26905505 23237151 13132498
35851 13132498 5360660 3124192 761063 -5607033 -11177008 -9808048 -2119880 8161465
35843 8161465 20451140 34418215 45474930 49954731 51804367 56585728 60498747 54422817
35835 54422817 39829310 30589953 34053880 39702964 35259818 26076694 25453204 30462414
35827 30462414 24956466 8103361 525564 13199277 28501831 27577507 20767779 28636379
35819 28636379 43507600 38315606 11910319 -4461393 7364366 28724901 38515718
$$ packed form
35875B9600115J6900591J3130841J088019m513031m254672p494124j2337599r485539
35867B2634601j154892J535239j341760J618033J1555458J4338851K354656j2903439
35859C8636747j7118885j0544645j905591M621900Q039263N176716l668354j0104653
35851A3132498p771838k236468k363129o368096n569975J368960P688168J0281345
35843H161465J2289675J3967075J1056715M479801J849636M781361L913019o075930
35835E4422817j4593507r239357L463927N649084m443146r183124o23490N009210
35827C0462414n505948j6853105p577797J2673713J5302554r24324o809728P868600
35819B8636379J4871221n191994k6405287j6371712J1825759K1360535R790817
$$ plain form
35812 38515718 43997096 56983641 63439045 45843638 20582917 20493778 46127646 65729081
35804 65729081 63226425 54854582 52582025 42784933 16207759 -7336174 -5949935 10226573
35796 10226573 14724398 3782536 -2697831 6100063 19671815 27025949 31035193 36725170
35788 36725170 39178135 31424502 17129527 8421361 13516740 29330801 44267400 47520358
35780 47520358 38185083 25698893 19637248 20227375 21073049 18822369 16063137 15769798
35772 15769798 17061866 17038834 14893655 14217637 20822733 35091902 46769481 44237980
35764 44237980 31874690 29600685 47667530 69227216 69225811 46285328 22269066 11112749
35756 11112749 3782143 -11088679 -26890350 -30756650 -25405046 -24587927 -30580873 -30797627
$$ packed form
35812C8515718N481378J2986545O455404j7595407k5260721q9139K5633868J9601435
35804F5729081k502656q371843k272557r797092k6577174k3543933J386239J6176508
35796A0226573M497825j0941862o480367Q797894J3571752P354134M009244N689977
35788C6725170K452965p753633j4294975q708166N095379J5814061J4936599L252958
35780D7520358r335275j2486190o061645N90127Q45674k250680k759232k93339
35772A5769798J292068k3032k145179o76018O605096J4269169J1677579k531501
35764D4237980j2363290k274005J8066845K1559686j405k2940483k4016262j1156317
35756A1112749p330606j4870822j5801671l866300N351604Q17119n992946k16754
$$ plain form
35748 -30797627 -18311864 -3079860 2867536 1995925 5038994 13965595 20096782 17099047
35740 17099047 7632242 -3082698 -12671551 -18388035 -15435554 -3395260 9729669 14955701
35732 14955701 11770110 6179061 1476883 -4212367 -11902094 -17974006 -17664713 -10087793
35724 -10087793 499937 7428651 7337185 4700759 7291853 14216866 13470518 -2251085
35716 -2251085 -21500838 -25396460 -11892208 1717834 2126966 -5017771 -8090607 -6990264
35708 -6990264 -8989075 -13835516 -13228939 -3391211 9332605 15389391 10430976 -1562142
35700 -1562142 -10284484 -7280602 4336023 12285596 11020424 9427449 16552988 26004876
35692 26004876 24449356 12046369 2986516 5678671 12856814 13561302 6218770 -3018835
$$ packed form
35748c0797627J2485763J5232004N947396q71611L043069Q926601O131187k997735
35740A7099047r466805j0714940r588853n716484K952481J2040294J3124929N226032
35732A4955701l185591n591049m702178n689250p689727o071912L09293P576920
35724a0087793J0587730O928714r1466k636426K591094O925013p46348j5721603
35716b251085j9249753l895622J3504252J3610042M09132p144737l072836J100343
35708f990264j998811m846441O06577R837728J2723816O056786m958415j1993118
35700a562142q722342L003882J1616625P949573j265172j592975P125539R451888
35692B6004876j555520j2402987r059853K692155P178143P04488p342532r237605
$$ plain form
35684 -3018835 -7476050 -2930049 9201646 18950079 15998977 4564478 1925628 16632054
35676 16632054 35751690 40912740 30478199 17205962 9374542 5211126 3669096 8485756
35668 8485756 19062251 27045828 26568804 20884972 14533799 6139863 -4465146 -8273124
35660 -8273124 3453581 23069436 30220998 15244962 -8242518 -19471748 -14511513
35653 -14511513 -7615447 -10731040 -19106065 -19477687 -7818680 5114589 5111643 -10658463
35645 -10658463 -30306388 -38558486 -31761907 -20616808 -16553387 -17067268 -8463771 16363497
35637 16363497 47007354 65173220 63142975 49579269 37466068 29615550 18903187
$$ packed form
35684c018835m457215M546001J2131695R748433k951102j1434499k638850J4706426
35676A6632054J9119636N161050j0434541j3272237p831420m163416j542030M816660
35668H485756J0576495P983577m77024n683832o351173q393936j0605009l807978
35660h273124J1726705J9615855P151562j4976036k3487480j1229230M960235
35653a4511513O896066l115593q375025l71622J1659007J2933269k946j5770106
35645a0658463j9647925q252098O796579J1145099M063421n13881Q603497K4827268
35637A6363497L0643857J8165866k030245j3563706j2113201p850518j0712363
$$ [...]
##END NTUPLES=NMR SPECTRUM
##END=
