##TITLE=31Pdec_LR-662-RM1
 CH2Cl2, 124 sc
 14.3.2019
##JCAMPDX= 6.0         $$ Bruker NMR JCAMP-DX V2.0
##DATA TYPE= NMR SPECTRUM
##DATA CLASS= NTUPLES
##ORIGIN= UXNMR, Bruker Analytische Messtechnik GmbH
##OWNER= root
$$ XWIN-NMR		Version 3.5
$$ Thu Mar 14 14:56:00 2019 Russian Standard Time (UT+4h)  she@DPX200
##.OBSERVE FREQUENCY= 81.013821
##.OBSERVE NUCLEUS= ^31P
##.ACQUISITION MODE= SIMULTANEOUS
##.ACQUISITION SCHEME= undefined
##.AVERAGES= 24
##.DIGITISER RES= 17
##SPECTROMETER/DATA SYSTEM= spect
##.PULSE SEQUENCE= zgpg30
##.SOLVENT NAME= CDCl3
##.SHIFT REFERENCE= (INTERNAL, CDCl3, 0, 182.463)
##AUDIT TRAIL= $$ (NUMBER, WHEN, WHO, WHERE, WHAT)
$$ ##TITLE= Audit trail, XWIN-NMR		Version 3.5
$$ ##JCAMPDX= 5.01
$$ ##ORIGIN= Bruker BioSpin GmbH
$$ ##OWNER= she
$$ F:/spectra/data/she/nmr/P31/1/pdata/1/auditp.txt
$$ ##AUDIT TRAIL=  $$ (NUMBER, WHEN, WHO, WHERE, WHAT)
(   1,<2019-03-14 14:54:13.92 +0400>,<she>,<DPX200>,
      <created by zg, POWCHK disabled, PULCHK disabled
       configuration hash MD5:
       00 E9 B6 7A A2 85 ED C7 34 08 36 98 17 FE 4E 26
       data hash MD5: 32K
       DD 81 41 AE 2E ED B1 00 92 DF E8 2B 56 C9 49 03>)
(   2,<2019-03-14 14:54:16.87 +0400>,<she>,<DPX200>,
      <Start of raw data processing
       efp BC_mod = 2 LB = 1 FT_mod = 6 PKNL = 1 PHC0 = -1843.359 PHC1 = 135.1989 SI = 64K 
       data hash MD5: 64K
       F4 EB 66 AD 5B A4 22 D4 CB FB CC BA 82 2C D3 2C>)
(   3,<2019-03-14 14:54:37.06 +0400>,<she>,<DPX200>,
      <pk PHC0 = 9.784919 PHC1 = 0 
       data hash MD5: 64K
       97 EE 0A AB 06 05 F3 AD E2 F6 8D 01 4B BB 75 EB>)
(   4,<2019-03-14 14:54:41.04 +0400>,<she>,<DPX200>,
      <abs ABSG = 5 
       data hash MD5: 64K
       7D 42 30 C8 70 A8 25 F7 B7 D3 8A 8B 3A E4 9A AC>)
$$ ##END=
$$ 
$$ hash MD5
$$ 01 01 DA 12 F6 A3 45 A0 08 AC 21 3D 89 CE 85 55
##$RELAX= 
##$RELAX= 
##$RELAX= 
##$RELAX= 
##$RELAX= 
##$RELAX= 
##$RELAX= 
##$RELAX= 
$$ Bruker specific parameters
$$ --------------------------
##$DU= <F:/spectra>
##$EXPNO= 1
##$NAME= <P31>
##$PROCNO= 1
##$TYPE= <nmr>
##$USER= <she>
##$AMP= (0..31)
100 100 100 100 100 100 100 100 100 100 100 100 100 100 100 100 100 100 
100 100 100 100 100 100 100 100 100 100 100 100 100 100 
##$AQSEQ= 0
##$AQ_mod= 1
##$AUNM= <au_zg>
##$AUTOPOS= <>
##$BF1= 81.014009
##$BF2= 200.13
##$BF3= 200.13
##$BF4= 200.13
##$BF5= 200.13
##$BF6= 200.13
##$BF7= 200.13
##$BF8= 200.13
##$BYTORDA= 1
##$CFDGTYP= 0
##$CFRGTYP= 5
##$CHEMSTR= <none>
##$CNST= (0..31)
1 1 145 1 1 1 1 1 1 1 1 1 1 1 1 1 1 1 1 1 1 1 1 1 1 1 1 1 1 1 1 1 
##$CPDPRG= <waltz16>
##$CPDPRG1= <>
##$CPDPRG2= <waltz16>
##$CPDPRG3= <>
##$CPDPRG4= <mlev>
##$CPDPRG5= <mlev>
##$CPDPRG6= <mlev>
##$CPDPRG7= <mlev>
##$CPDPRG8= <mlev>
##$CPDPRGB= <>
##$CPDPRGT= <>
##$D= (0..31)
0 1 0 0 0 0 0 0 0 0 0 0.03 2e-05 3e-06 0 0 0 0 0 0 0 0 0 0 0 0 0 0 0 0 
0 0 
##$DATE= 1552560853
##$DBL= (0..7)
120 120 120 11 120 120 24 19 
##$DBP= (0..7)
150 150 150 150 150 150 150 150 
##$DBP07= 0
##$DBPNAM0= <>
##$DBPNAM1= <>
##$DBPNAM2= <>
$$ [...]
##$SUBNAM3= <"">
##$SUBNAM4= <"">
##$SUBNAM5= <"">
##$SUBNAM6= <"">
##$SUBNAM7= <"">
##$SUBNAM8= <"">
##$SUBNAM9= <"">
##$SW= 369.568048894756
##$SWIBOX= (0..15)
0 1 3 0 0 0 0 0 0 0 0 0 0 0 0 0 
##$SW_h= 29940.119760479
##$TD= 32768
##$TD0= 1
##$TE= 0
##$TE2= 300
##$TE3= 300
##$TEG= 300
##$TL= (0..7)
0 120 53 12 22 120 120 120 
##$TP= (0..7)
150 150 150 150 150 150 150 150 
##$TP07= 0
##$TPNAME0= <>
##$TPNAME1= <>
##$TPNAME2= <>
##$TPNAME3= <>
##$TPNAME4= <>
##$TPNAME5= <>
##$TPNAME6= <>
##$TPNAME7= <>
##$TPOAL= (0..7)
0.5 0.5 0.5 0.5 0.5 0.5 0.5 0.5 
##$TPOFFS= (0..7)
0 0 0 0 0 0 0 0 
##$TUNHIN= 0
##$TUNHOUT= 0
##$TUNXOUT= 0
##$USERA1= <user>
##$USERA2= <user>
##$USERA3= <user>
##$USERA4= <user>
##$USERA5= <user>
##$V9= 5
##$VALIST= <valist>
##$VCLIST= <CCCCCCCCCCCCCCC>
##$VD= 0
##$VDLIST= <DDDDDDDDDDDDDDD>
##$VPLIST= <PPPPPPPPPPPPPPP>
##$VTLIST= <TTTTTTTTTTTTTTT>
##$WBST= 1024
##$WBSW= 4
##$XGAIN= (0..3)
0 0 0 0 
##$XL= 0
##$YL= 0
##$YMAX_a= 18387
##$YMIN_a= -22805
##$ZGOPTNS= <>
##$ZL1= 120
##$ZL2= 120
##$ZL3= 120
##$ZL4= 120
##$ABSF1= 182.463
##$ABSF2= -187.1042
##$ABSG= 5
##$ABSL= 3
##$ALPHA= 0
##$AQORDER= 0
##$ASSFAC= 0
##$ASSFACI= 0
##$ASSFACX= 0
##$ASSWID= 0
##$AUNMP= <proc_1d>
##$AZFE= 0.1
##$AZFW= 0.5
##$BCFW= 0
##$BC_mod= 2
##$BYTORDP= 0
##$COROFFS= 0
##$CY= -3
##$DATMOD= 1
##$DC= 0
##$DFILT= <>
##$DTYPP= 0
##$F1P= 0
##$F2P= 0
##$FCOR= 1
##$FTSIZE= 65536
##$FT_mod= 6
##$GAMMA= 0
##$GB= 0
##$INTBC= 1
##$INTSCL= 5.30512e-09
##$ISEN= 30
##$LB= 1
##$LEV0= 0
##$LPBIN= 0
##$MAXI= 10000
##$MC2= 0
##$MEAN= 0
##$ME_mod= 0
##$MI= 50
##$NCOEF= 0
##$NC_proc= -7
##$NLEV= 6
##$NOISF1= 182.463
##$NOISF2= 159.3651
##$NSP= 0
##$NTH_PI= 0
##$NZP= 0
##$OFFSET= 182.463
##$PC= 4
##$PHC0= -1833.574
##$PHC1= 135.1989
##$PH_mod= 1
##$PKNL= yes
##$PPARMOD= 0
##$PSCAL= 0
##$PSIGN= 0
##$REVERSE= no
##$SF= 81.0140089999434
##$SI= 65536
##$SIGF1= 159.3651
##$SIGF2= -187.1042
##$SINO= 113.3802
##$SIOLD= 16384
##$SREGLST= <1H.CDCl3>
##$SSB= 0
##$STSI= 65536
##$STSR= 0
##$SW_p= 29940.119760479
##$SYMM= 0
##$S_DEV= 0
##$TDeff= 32768
##$TDoff= 0
##$TI= <>
##$TILT= no
##$TM1= 0
##$TM2= 0
##$TOPLEV= 0
##$USERP1= <user>
##$USERP2= <user>
##$USERP3= <user>
##$USERP4= <user>
##$USERP5= <user>
##$WDW= 1
##$XDIM= 65536
##$YMAX_p= 290700487
##$YMIN_p= -56857665
$$ End of Bruker specific parameters
$$ ---------------------------------
##NTUPLES= NMR SPECTRUM
##VAR_NAME=  FREQUENCY,     SPECTRUM/REAL,   SPECTRUM/IMAG
##SYMBOL=    X,             R,               I
##VAR_TYPE=  INDEPENDENT,   DEPENDENT,       DEPENDENT
##VAR_FORM=  AFFN,          ASDF,            ASDF
##VAR_DIM=   65536,         65536,           65536
##UNITS=     HZ,            ARBITRARY UNITS, ARBITRARY UNITS
##FACTOR=    0.456856943014862, 1,           1
##FIRST=     14782.0589164792, 0,            0
##LAST=      -15158.0608439998, 0,           0
##MIN=       -15158.0608439998, -56857665,   0
##MAX=       14782.0589164792, 290700487,    0
$$ Real data points
##PAGE= N=1
##DATA TABLE= (X++(R..R)), XYDATA
$$ [...]
49028C987312J057104j903006m379890l452272j269195m69693L28278K793634
$$ 3987312 5044416 3141410 -1238480 -4690752 -5959947 -6429640 -6101362 -3307728
49020c307728M180688J251891l277115l528263J006253M680663L708603M40628
$$ -3307728 872960 2124851 -1152264 -4680527 -3674274 1006389 4714992 5155620
49012E155620j412559j762821k354914l032157k349240m07649J023168P96852
$$ 5155620 3743061 1980240 -374674 -3406831 -5756071 -6163720 -5140552 -4343700
49004d343700k87062l73553J360676L319010K880403j16740k482563j668608O86448
$$ -4343700 -4630762 -5004315 -3643639 -324629 2555774 2439034 -43529 -1712137 -1025689
48995a025689J304683J12015l24145N69158P32724m51024r59883J15072Q04512
$$ -1025689 278994 391009 66864 636022 1368746 917722 -42161 72911 877423
48986H77423l79128k046802k420300j771456q17567R06338L219238M064344K297889
$$ 877423 498295 -1548507 -3968807 -5740263 -6557830 -5651492 -2432254 1632090 3929979
48977C929979m9961m81809M79788O39784m06815j419930k002224k598758k783600
$$ 3929979 3880018 3398209 3877997 4517781 4110966 2691036 688812 -1909946 -4693546
48968d693546j802335l17788M36715P57734J693287K660196K100496L39081n41571
$$ -4693546 -6495881 -6813669 -6376954 -5619220 -3925933 -1265737 834759 1173840 632269
48959F32269Q1462M48019p37267k434590k977499k047689k61113J640467K443051
$$ 632269 713731 1161750 424483 -2010107 -4987606 -7035295 -7296408 -5655941 -3212890
48950c212890J035788j500752k028181P00507L481555K312368j942878m158716
$$ -3212890 -2177102 -3677854 -5706035 -5005528 -1523973 788395 -1154483 -5313199
48942e313199j687509K096301K585094J43052j190536p1653O59331o73415j426311
$$ -5313199 -7000708 -4904407 -2319313 -2176261 -3366797 -3438450 -2779119 -3452534 -4878845
48933d878845R90778M437760M982890K753739J155465J170768N59801j247272
$$ -4878845 -3888067 549693 5532583 8286322 9441787 10612555 11172356 9925084
48925I925084j887877q44635j147154m035451n812338l218197J216675K948824
$$ 9925084 8037207 7192572 6045418 2009967 -3802371 -7020568 -5803893 -2855069
48917b855069K054098J866868K794344K197533k93791k035293k101518k418571
$$ -2855069 -800971 1065897 3860241 6057774 5763983 3728690 1627172 -791399
48909g91399l467226l031159n81472R20147m43087k394907k047203j0276J302103
$$ -791399 -4258625 -7289784 -7871256 -6951109 -7394196 -9789103 -11836306 -11846582 -10544479
48900a0544479J303372J019076J042385J576161K783705L497990J650232k235706
$$ -10544479 -9241107 -8222031 -7179646 -5603485 -2819780 678210 2328442 92736
48892I2736m301529k332862Q54404J673327J023058J793616L115639J585454k489597
$$ 92736 -4208793 -6541655 -5687251 -4013924 -2990866 -1197250 1918389 3503843 1014246
48883A014246m693883k888010P8127J232977J403171K373793L206248K037599
$$ 1014246 -3679637 -6567647 -6489520 -5256543 -3853372 -1479579 1726669 3764268
48875C764268l14985j217517L4570J369755P18686j656023l661906l531581j450859
$$ 3764268 3449283 2231766 2266336 3636091 4354777 2698754 -963152 -4494733 -5945592
48866e945592P81736J755696J686388J280363L88642r90028j429975J53558K075228
$$ -5945592 -5163856 -3408160 -1721772 -441409 -52767 -1042795 -2472770 -2319212 -243984
48857b43984J640468q83315k643711k461610j694734p00042J794265M755425M465806
$$ -243984 1396484 513169 -2130542 -4592152 -6286886 -6986928 -5192663 -437238 4028568
48848D028568L55758k677496j027199J976882J281273j863416k170254R89456
$$ 4028568 4384326 1706830 679631 2656513 3937786 2074370 -95884 893572
48840H93572K731582N07073k336406k084809L68569J814626R40777j281280l032734
$$ 893572 3625154 4132227 1795821 -288988 79581 1894207 2834984 1553704 -1479030
48831a479030k503814L87653K693337J524404j410563j767578O79464J654989
$$ -1479030 -3982844 -3595191 -901854 622550 -788013 -2555591 -1876127 -221138
48823b21138j89231p20486K176398L946693P55123l023174r44434M661895N192673
$$ -221138 -410369 -1130855 1045543 4992236 5747359 2724185 1779751 6441646 11634319
48814A1634319j364890p078655n233771J009073M154517K188866r63279k056646
$$ 11634319 10269429 3190774 -2042997 -1033924 3120593 5309459 4346180 2289534
48806B289534j573356j101820r49167o71401r2392O33469J077285O71919n52724
$$ 2289534 716178 -385642 -1334809 -2006210 -2098602 -1465133 -387848 284071 -268653
48797b68653j562150j233094L94351K054189K336776Q90253j121528j929587r95522
$$ -268653 -1830803 -3063897 -2669546 -615357 1721419 2611672 1490144 -439443 -1434965
48788a434965L47339O36792R6991k09988l49403j081201j784181p94210J717960
$$ -1434965 -1087626 -450834 -353843 -563831 -913234 -1994435 -3778616 -4572826 -2854866
48779b854866L019575J108789k413904m084219k691852m42968J05569p09936l96334
$$ -2854866 164709 1273498 -1140406 -5224625 -7916477 -8359445 -8253876 -8963812 -9360146
48770i360146J860987L525525K154244n00164l60896K861457M542490J650138
$$ -9360146 -7499159 -3973634 -1819390 -2319554 -2680450 181007 4723497 6373635
48762F373635k624929l455404j140851K86737m79019j113180m45251J75169L83270
$$ 6373635 3748706 293302 -847549 -560812 -1039831 -2153011 -2598262 -2423093 -2039823
48753b039823J482560K909420J960332j701560m711660m505954k120897M34255
$$ -2039823 -557263 2352157 4312489 2610929 -2100731 -6606685 -8727582 -8293327
48745h293327K285330K384636M1591k089266k9488M749457N531089Q4280m953036
$$ -8293327 -6007997 -3623361 -3581770 -5671036 -5700524 -951067 4580022 4664302 -288734
48736b88734l430095J398833K566925k9294j106336O21730J419758j36752j336946
$$ -288734 -3718829 -2319996 246929 217635 -888701 -266971 1152787 1016035 -320911
48727c20911r83931j050041j924991j211867J552601L508875L031511J614706
$$ -320911 -1304842 -2354883 -4279874 -5491741 -3939140 -430265 2601246 4215952
48719D215952K19549k083427m611422m424853r44387K439141L079884K037813
$$ 4215952 4435501 2352074 -2259348 -6684201 -7628588 -5189447 -2109563 -71750
48711g1750Q99398o64362k379688k163975K17147J618747J66542j574592p03820
$$ -71750 827648 163286 -2216402 -4380377 -4163230 -2544483 -2377941 -3952533 -4656353
48702d656353J532258K180222J119251L13575M64776R99032J662789J883012M11308
$$ -4656353 -3124095 -943873 175378 488953 953729 1952761 3615550 5498562 5909870
48693E909870k237929l096032q34557J572714Q41117j974799l470918k608136
$$ 5909870 3671941 575909 -258648 1314066 2155183 180384 -3290534 -5898670
48685e898670p21347J274875K832876K758363J175461O58722K410804L414116
$$ -5898670 -6620017 -5345142 -2512266 246097 1421558 2080280 4491084 7905200
48677G905200Q73509k629617k593265M85079K212779J130692l63304j123282k159052
$$ 7905200 8778709 6149092 3555827 4040906 6253685 7384377 7021073 5897791 3738739
48668C738739k656935m89212K729629K415517j873467n052545l836604o92006
$$ 3738739 1081804 592592 3322221 5737738 3864271 -1188274 -5024878 -5716884
48660e716884J248838K192702K391332K03747l341304l319577J493181M700241
$$ -5716884 -4468046 -2275344 115988 319735 -3021569 -6341146 -4847965 -147724
48652a47724J252498m030450l424988J589632K972409p77978k753528M10708L149170
$$ -147724 1104774 -2925676 -6350664 -4761032 -1788623 -2566601 -5320129 -4909421 -1760251
48643a760251P28121k759371j242086L625007N582186L505178J860106K623427
$$ -1760251 -1032130 -3791501 -5033587 -1408580 4173606 7678784 9538890 12162317
48635A2162317K658929j52401l069443k857170o78028p6959j938501l814014l467347
$$ 12162317 14821246 14668845 11599402 8742232 8064204 7987245 6048744 2234730 -1232617
48626a232617j214797J070436J928606J188205k01025r54701n81014J12013m9607
$$ -1232617 -2447414 -1376978 551628 1739833 1538808 584107 3093 115106 65499
48617F5499j121916j868377j264709J24007P05905j77305j338137j211106N4237
$$ 65499 -1056417 -2924794 -4189503 -4065496 -3359591 -3536896 -4875033 -6086139 -6031902
48608f031902O86929m00271k124186k509108r28224J450416K940073K419814j92744
$$ -6031902 -5344973 -5745244 -7869430 -10378538 -11306762 -9856346 -6916273 -4496459 -4689203
48599d689203l398517m437361j775738K436200M042523J895878l62357R19826
$$ -4689203 -8087720 -12525081 -14300819 -11864619 -7822096 -5926218 -6288575 -5368749
48591e368749M138809M414919N54989k918877j950254J348498J782653j397633
$$ -5368749 -1229940 3184979 3739968 821091 -1129163 219335 2001988 604355
48583F04355l407329q44890L372783M000419M16726l160840l604816j981825m20189
$$ 604355 -2802974 -3647864 -275081 3725338 4142064 981224 -2623592 -4605417 -5025606
48574e025606R83802K415463K071118j345099m989447m142248J485273O502546
$$ -5025606 -4041804 -1626341 444777 -900322 -5889769 -10032017 -8546744 -2044198
48566b044198O108720J533773k259184k602454r48571K67326M33325M54967J121198
$$ -2044198 4064522 5598295 3339111 736657 -211914 55412 488737 943704 2064902
48557B064902K115542K141190L27806k148436k847200j227306K95714k40170j366385
$$ 2064902 4180444 6321634 6649440 4501004 1653804 426498 722212 482042 -884343
48548h84343o95159Q99973N94069j418693j767573O86021K701602J482107j316080
$$ -884343 -1579502 -679529 -85460 -1504153 -3271726 -2585705 115897 1598004 281924
48539B81924k581963k265939k154999k056961m91105J821713K553371J690226
$$ 281924 -2300039 -4565978 -6720977 -8777938 -9269043 -7447330 -4893959 -3203733
48531c203733J636448K904801K776705m22973m225607n072870k785811p1859J235890
$$ -3203733 -1567285 1337516 4114221 3691248 -534359 -5607229 -8393040 -8464899 -7229009
48522g229009J451375J260703P61389K70963L57671O97102K74125p88745q88688
$$ -7229009 -5777634 -4516931 -3755542 -3484579 -3126908 -2429806 -2155681 -2944426 -3833114
48513c833114P36436K359242J676453j005601k777443j639826Q84504J484837
$$ -3833114 -3096678 -737436 939017 -66584 -2844027 -4483853 -3599349 -2114512
48505b114512p32604k678365p61252M215443O994727L843696k280502m634956
$$ -2114512 -2847116 -5525481 -6286733 -2071290 4923437 8767133 6486631 1851675
48497A851675r39676L735573L687582k25558k791808k115711j180932k013521
$$ 1851675 911999 4647572 8335154 8109596 5317788 3202077 2021145 7624
48489G624k619847j181567M97989L11240l23979Q88687K745614K269449m32870
$$ 7624 -2612223 -3793790 -3295801 -2984561 -3308540 -2419853 325761 2595210 2162340
48480B162340k372967k033943m89898J166220K433343K075814l88988k209590
$$ 2162340 -210627 -2244570 -2734468 -1568248 865095 2940909 2551921 342331
48472C42331j55335M070291N077417J224058l037181l502377j162292R17927J999106
$$ 342331 186996 4257287 9334704 10558762 7521581 4019204 2856912 3774839 5773945
48463E773945K511631J629929j031164l390314l205194r93337J079828J595324
$$ 5773945 8285576 9915505 8884341 5494027 2288833 1295496 2375324 3970648
48455C970648M9379k977995m699894k285270K342157L555374k7680k863373p59900
$$ 3970648 4020027 1042032 -3657862 -5943132 -3600975 -45601 -73281 -2936654 -3696554
48446c696554K721642K468648P4801J74689J981396J234625j562007k013102J6955
$$ -3696554 -974912 1493736 1568537 1743226 3724622 4959247 3397240 1384138 1401093
48437A401093L21107j585544j548607J107337J742589j207004k842630j0926L239592
$$ 1401093 1722200 136656 -1411951 -304614 1437975 230971 -2611659 -2622585 617007
48428F17007K488617l786K00044K271461K170677p08809l548716m656459l981047
$$ 617007 3105624 3101838 3301882 5573343 7744020 7035211 3486495 -1169964 -5151011
48419e151011j047346L612590O493702M507986n06774l853917l602719j312946
$$ -5151011 -6198357 -2585767 3907935 8415921 7909147 4055230 452511 -860435
48411h60435J463064M012887M743942K265927j766824l764643k454566o767R74531
$$ -860435 602629 4615516 9359458 11625385 9858561 6093918 3639352 3632585 4607116
48402D607116j54106k242858l259373j698602J395078K848461J345058n48168
$$ 4607116 4453010 2210152 -1049221 -2747823 -1352745 1495716 2840774 2292606
48394B292606k54096Q91430L33906j013267m95803J087382L45316k779489m286394
$$ 2292606 2038510 2929940 3263846 2250579 1754776 2842158 3187474 407985 -3878409
48385c878409k206897N22551R32205L12365J192530K647272J754066j444454l490651
$$ -3878409 -6085306 -5562755 -4630550 -4318185 -3125655 -478383 1275683 -168771 -3659422
48376c659422k251888J50986L21164j705052k455356J39239L610634M104823J608987
$$ -3659422 -5911310 -5760324 -5439160 -7144212 -9599568 -9460329 -5849695 -1744872 -135885
48367a35885k74585M11265J691831J319545j43497j324845k285128k738921r10526
$$ -135885 -410470 795 1692626 3012171 2868674 1543829 -741299 -3480220 -4390746
48358d390746L026444N028096K257251k103936l150124j466891j273300k687318
$$ -4390746 -1364302 3663794 5921045 3817109 666985 -799906 -2073206 -4760524
48350d760524j622062K418074M352179J188097l269037m006454j212883J611526
$$ -4760524 -6382586 -3964512 387667 1575764 -1693273 -5699727 -6912610 -5301084
48342e301084K629629J954849j24747k245359j698313J942314M861284L560753
$$ -5301084 -2671455 -716606 -841353 -3086712 -4785025 -2842711 2018573 5579326
48334E579326k49172k129378q89484P67736N92485r66688k351271k458848j033938
$$ 5579326 5330154 3200776 2311292 3079028 3671513 2704825 353554 -2105294 -3139232
48325c139232P46445Q38598q81231j626081N22686L294143L271886R87405j91465
$$ -3139232 -2392787 -1554189 -2435420 -4061501 -3538815 -244672 3027214 4014619 3823154
48316C823154N47738Q44126j10980k00301J215956J321610j501438m090571k709475
$$ 3823154 4370892 5215018 5104038 4903737 6119693 7441303 5939865 1849294 -860181
48307h60181J062463K266056j57667j705787J025989N014546M594852q62123n965240
$$ -860181 202282 2468338 2310671 604884 1630873 6645419 11240271 10378148 4412908
48298D412908o151124k893243o44586n76897J417K561081M645255L276468r66133
$$ 4412908 -1738216 -4631459 -5276045 -5852942 -5851525 -3290444 1354811 4631279 3665146
48289C665146m775390n730583l709211O5635L634201M817630L120107Q30009M56983
$$ 3665146 -1110244 -6840827 -10550038 -10484403 -6850202 -2032572 1087535 1917544 2374527
48280B374527J297910N01024k439268m555187l544680r01829N32774M41117M72082
$$ 2374527 3672437 4173461 1734193 -2820994 -6365674 -7267503 -6734729 -6293612 -5821530
48271e821530R29743M56461j086802j784477n45920R80352P62704n01304l46981
$$ -5821530 -4891787 -4435326 -5522128 -7306605 -7852525 -6872173 -6109469 -6610773 -6957754
48262f957754J808243L744592L477791J732967N64207N76680O66083m4774j219141
$$ -6957754 -5149511 -1404919 2072872 3805839 4370046 4946726 5612809 5568035 4348894
48253D348894k120021k333280j577258K02865K170458K837372J559336o37659
$$ 4348894 2228873 -104407 -1681665 -1478800 691658 3529030 5088366 4450707
48245D450707k143877k310544j619759q38665m72224n74864n01653P03844K832262
$$ 4450707 2306830 -3714 -1623473 -2462138 -2934362 -3509226 -4010879 -3307035 -474773
48236d74773L756734J462595k849525n041146k567941K053369L857478J335798
$$ -474773 3281961 4744556 1895031 -3146115 -5714056 -3660687 196791 1532589
48228A532589k008084k463347o05277L96685n08926j421011q37620M63805J217880
$$ 1532589 -475495 -2938842 -3544119 -3147434 -3656360 -5077371 -5914991 -5451186 -4233306
48219d233306J415927J556946J653899J695684J830947J574780K16171j536720
$$ -4233306 -2817379 -1260433 393466 2089150 3920097 5494877 5711048 4174328
48211D174328j985180j089544p41739j569207j742764k77707R47754M21567j77266
$$ 4174328 2189148 1099604 357865 -1211342 -2954106 -3231813 -2284059 -1862492 -2039758
48202b039758J028848K490385J790983L6397l7275R36370M7218k359945k780543
$$ -2039758 -1010910 1479475 3270458 3306855 3269580 4205950 4253168 1893223 -887320
48193h87320n59501P08016q61949k225105m04866K649664L027213M50123j832347
$$ -887320 -1446821 -738805 -1600754 -3825859 -4230725 -1581061 1446152 1896275 63928
48184F3928j503909N90763J952426Q41328k089050l934544k419498J090030L016925
$$ 63928 -1439981 -849218 1103208 1944536 -144514 -4079058 -6498556 -5408526 -2391601
48175b391601K124172N13421r9486l35294o61061L43J739285K510146J247382
$$ -2391601 -267429 245992 146506 -188788 -849849 -849506 889779 3399925 4647307
48166D647307l16667o26411o21747j295240j431815J58356K333595L397719L042251
$$ 4647307 4330640 3704229 3082482 1787242 355427 513783 2847378 6245097 9287348
48157I287348J143180k518347n782184m955205m26414K397624O79505j479612
$$ 9287348 10430528 7912181 2129997 -2825208 -3251622 -853998 -174493 -1654105
48149a654105m3626K019952J19793l433218k890310J382513L880052L191961K961699
$$ -1654105 -1697731 322221 442014 -2991204 -5881514 -4499001 -618949 2573012 5534711
48140E534711L842157K046647k787702n379451k966327M07745Q03785J38071J416192
$$ 5534711 9376868 11423515 8635813 3256362 290035 697780 1501565 1639636 3055828
48131C055828K938260J543940j726595l358250k525374j141249n05184o24618
$$ 3055828 5994088 7538028 5811433 2453183 -72191 -1213440 -1718624 -2343242
48123b343242j266301j534017j44289K152129K574791M47543j117260L82726L167776
$$ -2343242 -3609543 -5143560 -5287849 -3135720 -560929 -113386 -1230646 -847920 2319856
48114B319856L955819K166567n09310k421259k264637J70288K080391m4984m454008
$$ 2319856 6275675 8442242 7932932 5511673 3247036 3417324 5497715 5452731 998723
48105I98723m863379J43684L540840M7389n047531l477198L300983O468618K998890
$$ 998723 -3864656 -3720972 -180132 -132743 -5180274 -8657472 -5356489 1112129 4111019
48096D111019j342957j907466n16821K53952J179860K439222J604208j424331
$$ 4111019 2768062 860596 343775 597727 1777587 4216809 5821017 4396686
48088D396686k567569J40290K893565K082660k53596o65398j50596j374301l039352
$$ 4396686 1829117 1969407 4862972 6945632 6692036 6026638 5876042 4501741 1462389
48079A462389j915851J284733K742507J407412r8790j44394P1247n12365j180692
$$ 1462389 -453462 831271 3573778 4981190 4882400 4738006 4809253 4296888 3116196
48070C116196j203071p61574P5326J222481J657747P61445k047P98016J522428
$$ 3116196 1913125 1151551 1226877 2449358 4107105 4868550 4866503 5664519 7186947
48061G186947l66190l614645m353008k038080j85100m21923k04227J800510K533789
$$ 7186947 6820757 3206112 -1146896 -3184976 -3370076 -3791999 -3996226 -2195716 338073
48052C38073j75085k974375j719352J901056K966071P73068r86805n71667N7820
$$ 338073 162988 -2811387 -4530739 -2629683 336388 1109456 122651 -449016 -391196
48043c91196j89780J92471J646510K250765J317101O11959O73396l65888k603349
$$ -391196 -580976 -388505 1258005 3508770 4825871 5437830 6111226 5745338 3141989
48034C141989k876341J01422K634027J136613k613317m594250m228901l314833
$$ 3141989 265648 367070 3001097 4137710 1524393 -3069857 -7298758 -10613591
48026a0613591j732126J400374L896701K548868j491116l622252k091311L74508
$$ -10613591 -12345717 -10945343 -7048642 -4499774 -5990890 -9613142 -11704453 -11329945
48018a1329945J234792P35724k86706j496344j625125M29186K743851K299483
$$ -11329945 -10095153 -9359429 -9646135 -11142479 -12767604 -12338418 -9594567 -7295084
48010g295084j5570m64759J157742J111686j304741j823932J515276M502462L372885
$$ -7295084 -7310654 -7775413 -6617671 -5505985 -6810726 -8634658 -7119382 -2616920 755965
48001G55965M00117q69758j222012k156224j373838K435015M364214k32444o807223
$$ 755965 1156082 286324 -935688 -3091912 -4465750 -2030735 2333479 2101035 -4706188
47992d706188o776084l25290L792907J431127j854288o72259K576691L341653
$$ -4706188 -11482272 -11807562 -8014655 -6583528 -8437816 -9110075 -6533384 -3191731
47984c191731K126229J723489J791223O94233n19258j96729L71377o80604k029508
$$ -3191731 -1065502 657987 2449210 3143443 2624185 2427456 2798833 2118229 88721
47975H8721j466652o8854k56703j184932j10706K410898K745753k44518l374257
$$ 88721 -1377931 -1446785 -1703488 -2888420 -2999126 -588228 2157525 1913007 -1461250
47966a461250l687611k022833q78011q47176o16880O33316K059276K200577Q19402
$$ -1461250 -5148861 -7171694 -8049705 -8896881 -9513761 -8880445 -6821169 -4620592 -3801190
47957c801190m91896j04808J253418J200790p31920k018345q19219J100571R88320
$$ -3801190 -4293086 -4397894 -3144476 -1943686 -2675606 -4693951 -5513170 -4412599 -3424279
47948c424279r81465k632985l151477k893503j197452K337804N199183M276155
$$ -3424279 -4405744 -7038729 -10190206 -13083709 -14281161 -11943357 -6744174 -2468019
47940b468019P54486r97431K47082J297736M61025L50991K666089M239222J698797
$$ -2468019 -1713533 -2710964 -2463882 -1166146 -705121 -354130 2311959 6551181 8249978
47931H249978k856574m630113k690147j46820Q62502P69351O1589j221588j813569
$$ 8249978 5393404 763291 -1926856 -2073676 -1211174 -441823 -380234 -1601822 -3415391
47922c415391l44594J922769K453980J313663O13932N21024n03210j628193k54508
$$ -3415391 -3759985 -1837216 616764 1930427 2544359 3065383 2562173 933980 679472
47913F79472K609946K392610j770901m493665j784959K929066M081109J621605
$$ 679472 3289418 5682028 3911127 -582538 -2367497 561569 4642678 6264283
47905F264283q21047k214086l538977l422106q5473L665841L334341K47154J74030
$$ 6264283 5443236 3229150 -309827 -3731933 -3817406 -151565 3182776 3429930 3603960
47896C603960L876150N209270N93456n310696o512968l617994j120593m56790
$$ 3603960 7480110 12689380 13282836 7972140 1459172 -2158822 -3279415 -3736205
47888c736205J23947J200474J634373J086349J71124p67615j026659N58484L178331
$$ -3736205 -3612258 -2411784 -777411 308938 480062 -287553 -1314212 -755728 2422603
47879B422603L776939J391211p67221p8048J372358M14090k232453l979091m523870
$$ 2422603 6199542 7590753 6823532 6745484 8117842 8531932 6299479 2320388 -2203482
47870b203482m182351j251832M103096O423812J644551m985158m819113J455546
$$ -2203482 -6385833 -7637665 -3534569 2889243 4533794 -451364 -5270477 -3814931
47862c814931M860176J922866j255786n21911o3957l011602m224252P34629O142848
$$ -3814931 1045245 2968111 1712325 1190414 1126457 -1885145 -6109397 -5374768 768080
47853G68080M039816k744756m473251O71614M631119K418271j467488j764421
$$ 768080 4807896 2063140 -2410111 -1738497 2892622 5310893 3843405 2078984
47845B078984l13641j237315l547787l414325p68757R52638L45429m97618J93016
$$ 2078984 1765343 528028 -3019759 -6434084 -7202841 -6250203 -5904774 -6402392 -6209376
47836f209376J572282K229670K411448L091297L824655K783452q42482n129005
$$ -6209376 -4637094 -2407424 4024 3095321 6919976 9703428 8860946 3731941
47828C731941o938370n209536j834842J003884L025354M501394M337255J480935
$$ 3731941 -3206429 -8415965 -10250807 -9246923 -6221569 -1720175 2617080 4098015
47820D098015k573704m866498m357121k423873l57552J550817K704491K475916
$$ 4098015 1524311 -3342187 -7699308 -10123181 -10480733 -8929916 -6225425 -3749509
47812c749509J918793K602957L411430J550286k343518l638058l75583K823443
$$ -3749509 -1830716 772241 4183671 5733957 3390439 -247619 -623202 2200241
47804B200241R48101l734563m563799j1905M341720L835140L89177j569458j224424
$$ 2200241 3148342 -586221 -5150020 -5161925 -820205 3014935 3404112 1834654 610230
47795F10230o96241p82833n82364j08445k97098q35871m57867P90805J773632
$$ 610230 -86011 -868844 -1451208 -1559653 -1856751 -2692622 -3150489 -2359684 -586052
47786e86052K510867L800998M631390K781574j278391l863217k869319o94555
$$ -586052 1924815 5725813 10357203 13138777 11860386 7997169 5127850 4433295
47778D433295n18877j803420j866678k95982R94240J163008J091731J012111J69628
$$ 4433295 3914418 2110998 244320 -51662 942578 2105586 3197317 4209428 4379056
47769D379056j069802j205750k9153J051494J386822J687614J970109J175886
$$ 4379056 3309254 2103504 2074351 3125845 4512667 6200281 8170390 9346276
47761I346276n97423j713548j574601j414420j735472j262727M86855J897964
$$ 9346276 8748853 7035305 5460704 4046284 2310812 1048085 1534940 3432904
47753C432904J817044J163196N71089j085388l875002m979307k350458J650402
$$ 3432904 5249948 6413144 6984233 5898845 2023843 -2955464 -5305922 -3655520
47745c655520L169977K099816J448764K377166K921307J511570q81031k415188
$$ -3655520 -485543 1614273 3063037 5440203 8361510 9873080 8992049 6576861
47737F576861k353763j302100q00064k142351m303402m185917o72222L024171
$$ 6576861 4223098 2920998 2120934 -21417 -4324819 -8510736 -9182958 -6158787
47729f158787L336155J138422k70107l87997r85494j510570L53990L582246M098339
$$ -6158787 -2822632 -1684210 -1954317 -2342314 -3327808 -4838378 -4484388 -902142 3196197
47720C196197J244516o14062J164518L329167J950330j698266l585053k609292
$$ 3196197 4440713 3826651 4991169 8320336 10270666 8572400 4987347 2378055
47712B378055p50225M55211P07284j13651j154070k77215K929187N328080L932992
$$ 2378055 1627830 2083041 2790325 2676674 1522604 1245389 4174576 9502656 13435648
47703A3435648L7911k749958l045695j759525M79980K839752K942541k12698l149828
$$ 13435648 13473559 10723601 7677906 5918381 6398361 9238113 12180654 11967956 8818128
47694H818128j788839K264628L617905J051649j173055n45751K59715r71884j835467
$$ 8818128 7029289 9293917 12911822 13963471 12790416 12244665 12504380 11532496 9697029
47685I697029l5315J719356j90863l922620m499291j267123J411488P99987q83133
$$ 9697029 9661714 11381070 11190207 7267587 2768296 1501173 2912661 3712648 2829515
47676B829515o21069J210355K351763K031035J078224J42937n69059o11736K53520
$$ 2829515 2208446 3418801 5770564 7801599 8879823 9022760 8453701 7841965 8095485
47667H095485J261604J303718L15372n98253m07123P63159J706773J207117p29718
$$ 8095485 9357089 10660807 10976179 10377926 9970803 10733962 12440735 13647852 12918134
47658A2918134k653526k987137j643559o0883L93409k13984n81644M73459K656845
$$ 12918134 10264608 7277471 5633912 5573029 5966438 5752454 5170810 5644269 8301114
47649H301114L964528K368335j596041m486468l376830N36242L091137K125626
$$ 8301114 12265642 14633977 13037936 8551468 5174638 5710880 8802017 10927643
47641A0927643j63860m89129J297096K499678J263338j492057l574369l737884
$$ 10927643 10763783 10274654 11571750 14071428 15334766 13842709 10268340 6530456
47633F530456k308459m67227Q49825J678067K494533K813499J223891k317800
$$ 6530456 4221997 3754770 4604595 6282662 8777195 11590694 12814585 10496785
47625A0496785n198835m754652j761736M55827L97989j10597P24784J941211J758641
$$ 10496785 5297950 543298 -1218438 -762611 -364622 -475219 249565 2190776 3949417
47616C949417N35801r4416l401m01778j299023j233013J56447J073115o3614k359006
$$ 3949417 4485218 4390802 4387401 3985623 2686600 1453587 1610034 2683149 2619535 260529
47606B60529l489429k311084L46759K888073M050328L191641O55942j857104k231742
$$ 260529 -3228900 -5539984 -5193225 -2305152 1745176 4936817 5592759 3735655 1503913
47597A503913j14653K172318J888603p99646k771917j835708M18934R47978l67569
$$ 1503913 1389260 3561578 5450181 4650535 1878618 42910 461844 1409822 1042253
47588A042253p58312R60870K383825J200534j128144j444998N38947K080152J393264
$$ 1042253 283941 1244811 3628636 4829170 3701026 2256028 2794975 4875127 6268391
47579F268391m21220j581158j731905j279796l56903O19427O64309m10174j202049
$$ 6268391 5847171 4266013 2534108 1254312 897409 1516836 2181145 1770971 568922
47570E68922l35521J596902K583066J529713n19470j517348n47016J209936J772482
$$ 568922 233401 1830303 4413369 5943082 5423612 3906264 3359248 4569184 6341666
47561F341666O77491n50897o36431l79668j192347k531372k460093o51093R26974
$$ 6341666 7019157 6468260 5831829 5452161 4259814 1728442 -731651 -1382744 -455770
47552d55770P46268l42208n51682O43050K353007L269987K337147m25180l186099
$$ -455770 290498 -51710 -603392 39658 2392665 5662652 7999799 7574619 4388520
47543D388520l517299j040196J998844L227553K303087M21576j022618j044797
$$ 4388520 871221 -168975 1829869 5057422 7360509 7782085 6759467 5714670
47535E714670J94092J017718K15085o76759N55988K425839R66886l588616n536539
$$ 5714670 5908762 6926480 7141565 6464806 7020794 9446633 10413519 6824903 1288364
47526A288364j741726L022747K789261q56827j893357N61997J807323j96633k375232
$$ 1288364 -453362 2569385 5358646 4501819 2608462 3170459 4977782 4781149 2405917
47517B405917k687821k623796k356737M11812M556943M698369k49875l578069
$$ 2405917 -281904 -2905700 -5262437 -4850625 -293682 4404687 4154812 576743
47509E76743n52652L669777J988011l210546m041429K36362K877424J106703n66619
$$ 576743 24091 3693868 5681879 2471333 -1570096 -1333734 1543690 2650393 2083774
47500B083774M41210M78943k464696l921188o01518L014844J415093k933511l468198
$$ 2083774 2524984 3003927 539231 -3381957 -3983475 -968631 446462 -2487049 -5955247
47491e955247L27654K925892J615241o19667j129859j157356k156238k801807
$$ -5955247 -5627593 -2701701 -1086460 -1706127 -2835986 -3993342 -6149580 -8951387
47483h951387j483439J072243L119901L749668K664246K23768j710432j107113
$$ -8951387 -10434826 -9362583 -6242682 -2493014 171232 395000 -1315432 -2422545
47475b422545J491114L440038L348405J884271m73346l590698n557635l916891
$$ -2422545 -931431 2508607 5857012 7741283 7267937 3677239 -1880396 -5797287
47467e797287J60771K404940J407254N05447J988801L230344J364742j580356
$$ -5797287 -5636516 -3231576 -1824322 -1318875 669926 3900270 5265012 3684656
47459C684656j900045r5374M48592q76851j525554l72114R07418Q98437j7672
$$ 3684656 1784611 1689237 2137829 1260978 -264576 -636690 270728 1169165 1151493
47450A151493j081974j667257p90017J473970K730454J005928j985993l093753
$$ 1151493 69519 -1597738 -2387755 -913785 1816669 2822597 836604 -2257149
47442b257149k336223j958781j755039M57704L721697L966660L47996k764289
$$ -2257149 -4593372 -6552153 -8307192 -7849488 -4127791 -161131 186865 -2577424
47434b577424k119761k3367J89635l58979J326098M403241N039472K116432j327555
$$ -2577424 -4697185 -4720552 -4530917 -4889896 -3563798 839443 5878915 7995347 6667792
47425F667792k450977j764839j321039j658816j681331p73757J15021o5347m77543
$$ 6667792 4216815 2451976 1130937 -527879 -2209210 -2982967 -2867946 -2933293 -3410836
47416c410836P44380L120074L161101r87163n713869n704588r13692L490066M064126
$$ -3410836 -2666456 453618 3614719 2627556 -3086313 -8790901 -9704593 -6214527 -2150401
47407b150401K408728J087363J42223r27293j296863q27446q91463j482790o51152
$$ -2150401 258327 1345690 1487913 560620 -736243 -1563689 -2455152 -3937942 -4589094
47398d589094J548739K203893O36586J89616K202563K750428p52850m160824k840053
$$ -4589094 -3040355 -836462 -199876 -10260 2192303 4942731 4189881 29057 -2810996
47389b810996O41736J106274k56292J373368M894991M510120K4106k262976j39043
$$ -2810996 -2169260 -1062986 -1319278 54090 4949081 9459201 9483307 7220331 7081288
47380G081288R27078k538144n937696m325130l17957O84759j106335j389344J129121
$$ 7081288 8008366 5470222 -467474 -4792604 -5110561 -4425802 -5532137 -6921481 -5792360
47371e792360L763398M227316K382706q20056l282556k506101R51974K887176
$$ -5792360 -2028962 2198354 4581060 3761004 478448 -2027653 -1075679 1811497
47363A811497Q87416k140484k657846j671708j627885j311659J270385L399691
$$ 1811497 2698913 558429 -2099417 -3771125 -5399010 -6710669 -5440284 -2040593
47355b040593R90621l665533l840790J467360N370974K960778j959457k978412
$$ -2040593 -1049972 -4715505 -8556295 -7088935 -1717961 1242817 -716640 -3695052
47347c695052K60489L152852L070012J428971K77578N7415L19925M39452j58192
$$ -3695052 -3434563 -281711 2788301 4217272 4494850 4552265 4872190 5311642 5153450
47338E153450j167623j473063r93475j179346k482938k942007r93321J796555
$$ 5153450 3985827 2512764 1519289 339943 -2142995 -5085002 -6078323 -4281768
47330d281768K858206K158031J313543M39539j252727k551801j351083J358997
$$ -4281768 -1423562 734469 2048012 2487551 1234824 -1316977 -2668060 -1309063
47322a309063K096019J71176j106963J32203J196565n20803k897951k382166L45595
$$ -1309063 786956 958132 -148831 -16628 1179937 659134 -2238817 -4620983 -4275388
47313d275388J815345J441339J588221K510416J646587j391386l251441j879968
$$ -4275388 -2460043 -1018704 569517 3079933 4726520 3335134 83693 -1796275
47305a796275L15627M43668o23151m62588P47519J099117M54347L68113J326513
$$ -1796275 -1480648 -1036980 -1660131 -2122719 -1375200 -276083 178264 546377 1872890
47296A872890K236401K087974N79751j966367l952453l220978m5735K305241J890156
$$ 1872890 4109291 6197265 6777016 4810649 858196 -2362782 -2408517 -103276 1786880
47287A786880R12429J762598K617470N76534k736993l230870j012146p2981j403469
$$ 1786880 2699309 4461907 7079377 7655911 4918918 1688048 675902 602921 -800548
47278h00548j646728L61893R74455j977900m830391l414707O39575K659411J632801
$$ -800548 -2447276 -2085383 -1110928 -3088828 -7919219 -11333926 -10694351 -8034940 -6402139
47269f402139L90583M93685N86680m46049j577536j298004M96938K490904L001905
$$ -6402139 -6011556 -5517871 -4931191 -5377240 -6954776 -8252780 -7755842 -5264938 -2263033
47260b263033J480432n00631p29801O69128J273497Q8059q07090L12306J846638
$$ -2263033 -782601 -1283232 -2013033 -1343905 -70408 17651 -789439 -477133 1369505
47251A369505J385882n06488j448531j026118q59856j407182j153526P59785K866018
$$ 1369505 2755387 2248899 800368 -225750 -1085606 -2492788 -3646314 -2886529 -20511
47242b0511K929591M29634k684516l572329j346162J618444K204556L75488j013727
$$ -20511 2909080 3338714 654198 -2918131 -4264293 -2645849 -441293 -65805 -1079532
47233a079532k63731J359694K181582K002218P53405j853867m152844l109296
$$ -1079532 -1343263 16431 2198013 4200231 4953636 3099769 -1053075 -4162371
47225d162371J112274M221581L562544J622119J302850J279588m66880j974149
$$ -4162371 -3050097 1171484 4734028 6356147 7658997 8938585 8471705 6497556
47217F497556o92710J221640J36852k561399k645423l16306M38722r62841j136591
$$ 6497556 5804846 7026486 7163338 4601939 1956516 1640210 2078932 1116091 -20500
47208b0500N61241Q27512j144427j912679j83199O64526j138446k198586J53099
$$ -20500 540741 1368253 223826 -1688853 -1872052 -1207526 -2345972 -4544558 -4391459
47199d391459L033985K758959O22110M2324R85271J150098L49985n4814k73867
$$ -4391459 -1357474 1401485 2023595 2065919 3051190 4201288 4551273 4496459 4222592
47190D222592j163012j669864m27754J293211J160121o79656k126144k111385
$$ 4222592 3059580 1389716 961962 2255173 3415294 2735638 609494 -1501891
47182a501891q69081J288705L139490K291685j428013m035928k100343K006908
$$ -1501891 -2370972 -1082267 2057223 4348908 2920895 -1115033 -3215376 -1208468
47174a208468L150451O86135j287928n19104Q05990O23685J15256P07438J231443
$$ -1208468 1941983 2628118 1340190 821086 1627076 2250761 2366017 3073455 4304898
47165D304898K18280j309162j604367j192449j813546l136077k711183N10390
$$ 4304898 4523178 3214016 1609649 417200 -1396346 -4532423 -7243606 -6733216
47157f733216M086273M509217J403273j742208j667090O36518J520065p169j011081
$$ -6733216 -2646943 1862274 3265547 1523339 -143751 492767 2012832 2005663 994582
47148I94582M59350J977418N61616k323922k889061q44594O61508N25710J017526
$$ 994582 1453932 3431350 3992966 1669044 -1220017 -2064611 -1403103 -877393 140133
47139A40133K954833L587552J157184j783937k151775q32860n15507j008375n3017
$$ 140133 3094966 6682518 7839702 6055765 3903990 3071130 2555623 1547248 1494231
47130A494231K259759L276235J838422m20792k086411l391812l938727j967069
$$ 1494231 3753990 7030225 8868647 8447855 6361444 2969632 -969095 -2936164
47122b936164K338888N162460L239927j427488l584446j105824K882622M333178
$$ -2936164 -597276 4565184 7805111 6377623 2793177 1687353 4569975 8903153
47114H903153K509426p05283l580011n220932n006071l123015r93146K75310J283730
$$ 8903153 11412579 10707296 7127285 1906353 -3099718 -6222733 -7215879 -6940569 -5656839
47105e656839K829536L739131K186560r69882k368000l85487K532099K916882
$$ -5656839 -2827303 911828 3098388 2128506 -239494 -624981 1907118 4824000
47097D824000M42997k181228k680273j294261K89404R73851R94225J088681J251927
$$ 4824000 5266997 3085769 405496 -888765 -599361 374490 1368715 2457396 3709323
47088C709323O74223p80159j715981r60651K66619k54519k030030j780123J772232
$$ 3709323 4383546 3603387 1887406 926755 1193374 938855 -1091175 -2871298 -1099066
47079a099066N130545M128572m89039m009714l759377j719394r30628j556471
$$ -1099066 4031479 8160051 7671012 3661298 -98079 -1817473 -2748101 -4304572
47071d304572j578232O3259K320108L442952K669882P68943o71515p28657m9076
$$ -4304572 -5882804 -5819545 -3499437 -56485 2613397 3382340 2710825 1982168 1933092
47062A933092R9700m13797n33586J73936O44047j71906j672766k300034j423661
$$ 1933092 2032792 1618995 1085409 1259345 1903392 1731486 58720 -2241314 -3664975
47053c664975K63617J892152K999854L118772J956889L03209l76408Q9261N8878
$$ -3664975 -3401358 -1509206 1490648 4609420 6566309 6869518 6493110 6582371 6641249
47044F641249j478840k982343k424391n31587J28347q95862j316358P2905J465473
$$ 6641249 5162409 2180066 -244325 -775912 -647565 -1543427 -2859785 -2786880 -1321407
47035a321407J089812j73759q27712j143165j519516p68291J372123K227823q394
$$ -1321407 -231595 -405354 -1233066 -2376231 -3895747 -4664038 -3291915 -1064092 -1072486
47026a072486k387036j083869K313377L040462P94180j86332J313539J691726
$$ -1072486 -3459522 -4543391 -2230014 810448 1604628 1418296 2731835 4423561
47018D423561m54366j478557O07120K157360K06446k242297j595088J11276n08181
$$ 4423561 3969195 2490638 3097758 5255118 5461564 3219267 1624179 1735455 1227274
47009A227274j481959R25036M547691L767690j463063n150731l760712J10232
$$ 1227274 -254685 670351 5218042 8985732 7522669 2371938 -1388774 -1278542
47001a278542K755117L118547J205510k407598m754481k754839J788902L767296
$$ -1278542 1476575 4595122 5800632 3393034 -1361447 -4116286 -2327384 1439912
46993A439912K029845M45248R10856P35364j131329r45202L249221O639544L860511
$$ 1439912 3469757 3915005 4825861 5561225 4429896 3484694 6733915 13373459 17233970
46984A7233970k929882o775871m868379p20554J431795Q04515q79068j672161
$$ 17233970 14304088 7528217 2659838 1939284 3371079 4175594 3296526 1624365
46976A624365q11649N20073M56387n92447Q907K790677M337851K034606j612040
$$ 1624365 812716 1332789 1789176 1196729 1205636 3996313 8334164 10368770 8756730
46967H756730k287750J97690K377204K327241J352540J159882J983040K994011
$$ 8756730 6468980 6666670 9043874 11371115 12723655 13883537 15866577 18860588
46959A8860588K571328o66672m985312n579316n41151N013039M695622m89682
$$ 18860588 21431916 20765244 15779932 10200616 9659465 14672504 19368126 18878444
46951A8878444l685372j855239J000789Q58750j041280j704946r79349j75730
$$ 18878444 15193072 13337833 14338622 15197372 14156092 12451146 11471797 11296067
46943A1296067O52173J559404J459348K69543j14991R39871J173118p25951k374349
$$ 11296067 11948240 13507644 14966992 15236535 15121544 16061415 17234533 16508582 14134233
46934A4134233j509016J55203J47769k58782J167718K474760J55711m143535n039229
$$ 14134233 12625217 12780420 12928189 12669407 13837125 16311885 16467596 12324061 7284832
46925G284832j769952L68410j547167l446056r34763L789940N528290L417585
$$ 7284832 5514880 5883290 4336123 890067 -44696 3745244 9273534 12691119
46917A2691119N71609j349846k875303l431293j798476N25629N84414j154968
$$ 12691119 13262728 11912882 9037579 5606286 3807810 4333439 4917853 3762885
46909C762885j033405J976853M383493L365141M41993j694907k777241l213262
$$ 3762885 2729480 4706333 9089826 12454967 12896960 11202053 8424812 5211550
46901E211550j837823J552337L745443J785536k181183l303600p85310J241586
$$ 5211550 3373727 4926064 8671507 10457043 8275860 4972260 4186950 5428536
46893E428536q6037k589615k784237q25218L58017m24402j117283N41893L843069
$$ 5428536 5342499 2752884 -31353 -856571 -498554 -922956 -2040239 -1498346 2344723
46884B344723N683262M008422L8683l189341l948231k801880j013691O37327J477592
$$ 2344723 8027985 12036407 12075090 8885749 4937518 2135638 1121947 1759274 3236866
46875C236866J044119R0472r999O13398M91431l91614k36292J161966J362100
$$ 3236866 4280985 4371457 4361458 4974856 5466287 5074673 4838381 6000347 7362447
46866G362447n88367j794276P5150K616229K312515J33034m88672M14331K0775
$$ 7362447 6774080 4979804 5054954 7671183 9983698 10116732 9628060 10042391 10063166
46857A0063166j595920j413002Q83496K010849N83682j019191j323051j823443
$$ 10063166 8467246 7054244 7937740 9948589 10532271 9513080 8190029 6366586
46849F366586k937698k377784L40757J960665O42596p35735O10267K648369J916431
$$ 6366586 3428888 1051104 1391861 3352526 3995122 3259387 3869654 6518023 8434454
46840H434454j097981l240282l174424j667373N52461K501972K536748P71979
$$ 8434454 7336473 4096191 921767 -745606 -193145 2308827 4845575 5617554
46832E617554k11911O27012P70430j271308k535092k64346L015664L259108J169960
$$ 5617554 5405643 6032655 6803085 5531777 2996685 2732339 5748003 9007111 10177071
46823A0177071J60142L13064n38316j492177L3755K521849J762135j986154l846526
$$ 10177071 10337213 10650277 10111961 8619784 8653539 11175388 12937523 10951369 7104843
46814G104843j961372J10439j78755p24597N55081K076375K023411J484892J638175
$$ 7104843 5143471 5253910 5075155 4350558 4905639 6982014 9005425 10490317 12128492
46805A2128492J182612q55764k584799j949098K58087J936795K117388O85776
$$ 12128492 13311104 12455340 9870541 7921443 8179530 10116325 12233713 12919489
46797A2919489j684055k386560Q73523N370423N004033j133739o167820m625593
$$ 12919489 11235434 8848874 9722397 15092820 20096853 18963114 12795294 8169701
46789H169701J3758J271894o40218p60508J561059K174205R9312n89516J882022
$$ 8169701 8183459 9455353 8815135 8054627 9615686 11789891 11889203 11299687 13181709
46780A3181709L456431P13544l490632m226787j387652J139573J395910R09842
$$ 13181709 16638140 17351684 13861052 9634265 8246613 9386186 10782096 11691938
46772A1691938R73858O82911o60067j653424q02858Q96113J082327n98432j845555
$$ 11691938 12665796 13348707 12688640 11035216 10232358 11128471 12210798 11612366 9766811
46763I766811q58172J256846K322730K204232K252679K237844L99691k929375
$$ 9766811 8908639 10165485 12488215 14692447 16945126 19182970 19582661 16653286
46755A6653286m461841k425864K81482o2704k454927k594379N18693K770101P10965
$$ 16653286 12191445 9765581 10047063 9984359 7529432 4935053 5453746 8223847 8934812
46746H934812l537903n073671k380639J323951K380045N93823j347162j247607
$$ 8934812 5396909 323238 -2057401 -733450 1646595 2240418 893256 -354351
46738c54351M33272J558647J046618J71702P47711K416465K847495R12945j526363
$$ -354351 78921 1637568 2684186 2855888 3603599 6020064 8867559 9780504 8254141
46729H254141j953475m88044M95820k66749j461727j374559j35281J003510J520194
$$ 8254141 6300666 5812622 6308442 6041693 4579966 3205407 3070126 4073636 5593830
46720E593830J630169J232407K35639m78647L7509R39083K26201k358842m578651
$$ 5593830 7223999 8456406 8692045 8213398 8250907 9189990 9416191 7057349 2478698
46711B478698m555854k980068j504873l35695J162875K569148K926396K587687
$$ 2478698 -2077156 -5057224 -6562097 -6897792 -5734917 -3165769 -239373 2348314
46703B348314K695158K989490J975005m53641k210413j572421N94453J927296
$$ 2348314 5043472 8032962 10007967 9554326 7343913 5771492 6365945 8293241
46695H293241J188158p52738k032185j507065K40601J383358O39420j399781k987384
$$ 8293241 9481399 8728661 6696476 5189411 5430012 6813370 7452790 6053009 3065625
46686C065625k962449j372990J017857K956440K945140N79521k342089l217353
$$ 3065625 103176 -1269814 -251957 2704483 5649623 6229144 3887055 669702
46678F69702j477933P58826J125074n16624k190060j953039J54158K138011K253222
$$ 669702 -808231 -49405 1075669 559045 -1631015 -3584054 -3429896 -1291885 961337
46669I61337J108533P46968J603913J912132P15752m64435k97791M0138p41733
$$ 961337 2069870 2816838 4420751 6332883 7048635 6584200 6286409 6326547 5584814
46660E584814j244498K38351K031884J248644j119215j135761J877928L856604
$$ 5584814 4340316 4578667 6610551 7859195 6739980 5604219 7482147 11338751
46652A1338751J735752k554935n247708n111093l086567m7089L049553M428326
$$ 11338751 13074503 10519568 5271860 160767 -2925800 -2972889 76664 4504990
46644D504990K912170m90811l291092l366664l81377L428704M503514J825781
$$ 4504990 7417160 6926349 3635257 268593 -112784 3315920 7819434 9645215
46636I645215j226149j185337N10336J13556k027567k264639m53182l92175k620709
$$ 9645215 8419066 7233729 7744065 7857621 5830054 3565415 3112233 2720058 99349
46627I9349k765620P33658L160892J148429j727583j229450P38135O86624K46040
$$ 99349 -2666271 -1932613 1228279 2376708 649125 -580325 157810 844434 1090474
46618A090474K189848L621331K97328m681822m153336J920855N919969L745162
$$ 1090474 3280322 6901653 7198981 2517159 -1636177 284678 6204647 9949809
46610I949809k73341j205132r5428j14698j160350j517459j333608j407713j018968
$$ 9949809 9676468 8471336 8375908 8261210 7100860 5583401 4249793 2842080 1823112
46601A823112N17410J968147J825318M69687o19234o58065J10251P25780O3249
$$ 1823112 2340522 4308669 6133987 6603674 5984440 5326375 5436626 6162406 6225655
46592F225655j630165k269338p11219J010312O18208m77294N44961K731575K562428
$$ 6225655 4595490 2326152 1614933 2625245 3243453 2766159 3311120 6042695 8605123
46583H605123K7256j048545P16883K189149J133653o18394j129153j404542k327830
$$ 8605123 8632379 7583834 8300717 10489866 11623519 11005125 9875972 8471430 6143600
46574F143600k263903k70000J452981Q99923o18940j019902n45739j55585N59509
$$ 6143600 3879697 3609697 5062678 5962601 5343661 4323759 3778020 3622435 4181944
46565D181944J639425J574330J46975k16491J667082L270683K421053R74089J333833
$$ 4181944 5821369 7395699 7542674 7326183 8993265 12263948 14685001 15659090 16992923
46556A6992923K062847O51484j632280j726028N2937Q94285L22458M1197j14325
$$ 16992923 19055770 19707254 18074974 16348946 16401883 17296168 17618626 17659823 17545498
46547A7545498j701187l449400k039215K221931M583854K165086k174521l925330
$$ 17545498 15844311 12394911 10355696 12577627 17161481 19326567 17152046 13226716
46539A3226716k257950M33597K097138K241798J169591j88050n62391K28431R10882
$$ 13226716 10968766 11402363 13499501 15741299 16910890 16722840 16160449 16388880 17299762
46530A7299762O92395M73854J017380J109347o41357k777785k081521J724426
$$ 17299762 17992157 18466011 19483391 20592738 19951381 17173596 15092075 16816501
46522A6816501M456832K432216k289002m115032j182080K489353L002036J630324
$$ 16816501 21273333 23705549 21416547 17301515 16119435 18608788 21610824 23241148
46514B3241148J555686K359256J526493k89870j07128J779314J891940j80022
$$ 23241148 24796834 27156090 28682583 28392713 28285585 30064899 31956839 31776817
46506C1776817o42269J777062K912251k37051m346207m746322j908391Q66904
$$ 31776817 31134548 32911610 35823861 35586810 31240603 26494281 24585890 25452794
46498B5452794K848385M589203M271855N16418l189699k224796K170043M719563
$$ 25452794 28301179 32890382 37162237 37678655 34488956 32264160 34434203 39153766
46490C9153766L990570L117161L264951K265466J48548N8211K275492L034562
$$ 39153766 43144336 46261497 49526448 51791914 51940462 51998673 54274165 57308727
46482E7308727J379615J586515N668293Q714427N997862N91258j033180J893195
$$ 57308727 58688342 60274857 65943150 74657577 80655439 81246697 80213517 82106712
46474H2106712M752331N026951M401535M250162L863508L384107M424514O972826
$$ 82106712 86859043 91885994 96287529 100537691 104401199 107785306 112209820 119182646
46466A19182646Q851878Q950927Q322808P788971P337700Q091017J1357557J4935448
$$ 119182646 128034524 136985451 145308259 153097230 160434930 168525947 179883504 194818952
46458A94818952J4305419R409663O402369R531133J4487227J4028784Q068163
$$ 194818952 209124371 218534034 224936403 234467536 248954763 262983547 271051710
46451B71051710L222101L158080M705968M224086K582425J613711J42406l144309
$$ 271051710 274273811 277431891 282137859 286361945 288944370 290558081 290700487 287556178
46443B87556178o373145p725655r064373j2231725j4426646j2300539q651874
$$ 287556178 281183033 273457378 264393005 252161280 237734634 225434095 216782221
46436B16782221r035198j2574163j2921890q967281p263579j1162689j4613778
$$ 216782221 207747023 195172860 182250970 173283689 166020110 154857421 140243643
46429A40243643j1571133n724732m475618p321310p617590l936180k069704n334979
$$ 140243643 128672510 122947778 118472160 111150850 103533260 99597080 97527376 92192397
46421I2192397r468013r225295n212399j616642n46981j077226j699293j732571
$$ 92192397 82724384 73499089 68286690 66670048 66123067 65045841 63346548 61613977
46413F1613977j521915k169156m010575n415211m685269k739869j810394j968978
$$ 61613977 60092062 57922906 53912331 48497120 43811851 41071982 39261588 37292610
46405C7292610j529674m77226m29752j277954j249858o59073j960497n124148
$$ 37292610 35762936 35285710 34855958 33578004 32328146 31669073 29708576 24584428
46397B4584428o568201m331027j094833n1015n66685k84088Q05574J013126J79768
$$ 24584428 18016227 13685200 12590367 12539352 11972667 11688579 12494153 13507279 13687047
46388A3687047j81635O68390J745281J522981n48567l055359l310983n01539K290333
$$ 13687047 13505412 14173802 15919083 17442064 16893497 13838138 10527155 10025616 12315949
46379A2315949J581058j274608j647885J183932K483673o29368m272564l217716
$$ 12315949 13897007 12622399 10974514 12158446 14642119 14012751 9740187 6522471
46371F522471J694157N006817L748087n2188k815003k726999l81714J786892J380574
$$ 6522471 8216628 13223445 16971532 16919344 14104341 11377342 10995628 12782520 14163094
46362A4163094j232558l128943k763145j826596j933953j892463k19985J979537
$$ 14163094 12930536 9801593 7038448 5211852 3277899 1385436 1165451 3144988
46354C144988K991877L177528L271805K253797l96958k561278k556836k104493
$$ 3144988 6136865 9314393 12586198 14839995 14443037 11881759 9324923 7220430
46346G220430k995912l254984o00449K506663K085083o26574r43238J433868J939721
$$ 7220430 4224518 969534 369085 2875748 4960831 4334257 3391019 4824887 6764608
46337F764608j098034l651317k436756M90261J620761O62784p49382j807457k062054
$$ 6764608 5666574 2015257 -421499 68762 1689523 2352307 1602925 -204532 -2266586
46328b266586j008258K66036k13931j657914p62603K837407M915319K689313q94915
$$ -2266586 -3274844 -3008808 -3222739 -4880653 -5643256 -2805849 2109470 4798783 3903868
46319C903868j769068n43141k57094q83255j21756J832644K405162J009000k86131
$$ 3903868 2134800 1591659 1334565 451310 329554 2162198 4567360 5576360 5290229
46310E290229m30977n52233j111725q32459P36647J968581J505043O6620r95006
$$ 5290229 4859252 4307019 3195294 2362835 3099482 5068063 6573106 6639726 5644720
46301E644720j410626j361120n64139Q63233J690652R94179l11198n68025K56186
$$ 5644720 4234094 2872974 2308835 3172068 4862720 5856899 5545701 4977676 5233862
46292E233862N03132o95235j973034j478422O50554K555542L023045K337481Q70633
$$ 5233862 5736994 5041759 3068725 1590303 2240857 4796399 7819444 10156925 11027558
46283A1027558j487386l899416m411730k591573p97639j013684j827159q88719
$$ 11027558 9540172 5640756 1229026 -1362547 -2160186 -3173870 -5001029 -5889748
46275e889748R11077Q66471o41475m70375J777281K608520L34402j919198j091197
$$ -5889748 -4978671 -4112200 -4753675 -5224050 -3446769 -838249 -503847 -2423045 -3514242
46266c514242J289419K175411J589769R52809m25409l263446m842725k131577
$$ -3514242 -2224823 -49412 1540357 2493166 2067757 -1195689 -6038414 -8169991
46258h169991K758085M733557K800170M84134n42525k134419m292160l674307
$$ -8169991 -5411906 -678349 2121821 2605955 2063430 -70989 -4363149 -8037456
46250h037456K37557K579906K92904k352353r584N047501N913587J270887k928563
$$ -8037456 -7799899 -5219993 -4927089 -7279442 -7289026 -2241525 3672062 4942949 2014386
46241B014386k160384J256512K767195J510260m07745j456595j204870M38826
$$ 2014386 -145998 1110514 3877709 5387969 4980224 3523629 2318759 2757585
46233B757585K339070K286306L4985j486471q1846K206883J934781p02532k454891
$$ 2757585 5096655 7382961 7417946 5931475 5849629 8056512 9991293 9288761 6833870
46224F833870j900776q01590p20998j168577j481692j888199k019996q81231Q60312
$$ 6833870 4933094 4131504 3410506 2241929 760237 -1127962 -3147958 -4029189 -3168877
46215c168877J101636j24138j12150J897539K641831k8936k813489j550619J891434
$$ -3168877 -2067241 -2191379 -2303529 -405990 2235841 2206905 -606584 -2157203 -265769
46206b65769K061572j451545l092492o998L394542K193250j722093k882122k32597
$$ -265769 1795803 344258 -2748234 -2755232 639310 2832560 1110467 -1771655 -2004252
46197b004252K269973J901960J8280j249243j582748j130174L87599K104843K086681
$$ -2004252 265721 2167681 2185961 936718 -646030 -1776204 -1388605 716238 2802919
46188B802919L01128p76278q4472j61647l063163o043715m662579N03370L897430
$$ 2802919 3104047 2327769 2243297 2081650 -981513 -7025228 -11687807 -11184437 -7287007
46179g287007K424069m37114J56358L572924M923075K004622j975825k944870
$$ -7287007 -4862938 -5300052 -5143694 -1570770 3352305 5356927 3381102 436232
46171D36232r11837P87005m1616k040310k262703P8689K353555J625253j146666
$$ 436232 -475605 311400 269784 -1770526 -4033229 -3954540 -1600985 24268 -1122398
46162a122398j705000J652664M796274K925469k261411m305030r88090K565868
$$ -1122398 -2827398 -1174734 3621540 6547009 4285598 -19432 -1007522 1558346
46154A558346J426692k372049l567078j219405J228059J633901R62595K57969
$$ 1558346 2985038 612989 -2954089 -4173494 -2945435 -1311534 -348939 -90970
46146i0970m79013o45495L92700J212493M2901j624922p10693K123567K862056
$$ -90970 -569983 -1215478 -822778 389715 432616 -1192306 -1902999 220568 3082624
46137C082624N13795j245165k69003O83685p65843k192310p34179J645182J481636
$$ 3082624 3596419 2351254 2082251 2765936 2000093 -192217 -926396 718786 2200422
46128B200422l00364m67881M89152m74158k680258k053789J790267L878188J085427
$$ 2200422 1900058 1432177 1921329 1447171 -1233087 -3286876 -1496609 2381579 3467006
46119C467006l121438l664809n16530K408593K911820K158164J668185J241967
$$ 3467006 345568 -3319241 -3835771 -1427178 1484642 3642806 5310991 6552958
46111F552958P678j899118l117064k352366j57628R96291l78148k176222j027633
$$ 6552958 6560636 4661518 1544454 -807912 -965540 30751 -347397 -2523619 -3551252
46102c551252K596225M223877J474010k324760k717445j64602J366871M33669
$$ -3551252 -955027 3268850 4742860 2418100 -299345 -463947 902924 1336593
46094A336593p00403n66669n73427j647808j948340K4471K224846J659517q26586
$$ 1336593 636190 69521 -503906 -2151714 -4100054 -4075583 -1850737 -191220 -1017806
46085a017806j241090J839591M800303L616814p27508l504844k324349K87068
$$ -1017806 -2258896 -419305 4380998 7997812 7270304 3765460 1441111 1728179
46077A728179Q81227l71265p68099M82312J258675J56601j047562L0613K538762
$$ 1728179 2609406 2238141 1470042 1952354 3211029 3367630 2320068 2350681 4889443
46068D889443L026376k2416l832386m398053j199960K198846K295387n13744k815932
$$ 4889443 7915819 7893403 4061017 -337036 -1536996 661850 2957237 2443493 -372439
46059c72439k347661k28229J068293Q31708L36268N94577J097321Q28382l79219
$$ -372439 -2720100 -2948329 -1880036 -1048328 -712060 -117483 979838 1808220 1429001
46050A429001j748347k235375j256157O34411J848760J372439K09012J36745R75574
$$ 1429001 -319346 -2554721 -3810878 -3176467 -1327707 44732 253744 390489 1366063
46041A366063O38517j464798k798964j008077K349232L460094J303786j087040
$$ 1366063 2004580 539782 -2259182 -3267259 -918027 2542067 3845853 2758813
46033B758813q36737J133283J766512K4949j989328j817463M37904K284103J685906
$$ 2758813 1922076 3055359 4821871 4846820 2857492 1040029 1477933 3762036 5447942
46024E447942n39653j587412q4981K123958K432408R00566l20734n25492j140620
$$ 5447942 4908289 3320877 3235896 5359854 7792262 8692828 8372094 7846602 6705982
46015F705982k536840k764510q90565P81903J08066j195614k29602K016193J974605
$$ 6705982 4169142 1404632 514067 1295970 1404036 208422 -21180 1995013 3969618
46006C969618m23083j129363J510765L602794J446545k708202l934476j642825
$$ 3969618 3546535 2417172 3927937 7530731 8977276 6269074 2334598 691773
45998F91773L09180l83317j962827k217834j384251m88020O62870K306334L165437
$$ 691773 1000953 617636 -1345191 -3563025 -4947276 -5435296 -4772426 -2466092 699345
45989F99345J720792j485952l858188l109831M16489L618867L396039K22354j869052
$$ 699345 2420137 934185 -2924003 -6033834 -5617345 -1998478 1397561 1619915 -249137
45980b49137r8827L191035L420540n0585l124640k513974M58755K435252K109697
$$ -249137 -347964 2843071 6263611 6213026 3088386 574412 1033167 3468419 5578116
45971E578116M60355j233256k074138j570451l37434K33021l0381L62723K039728
$$ 5578116 6038471 4805215 2731077 1160626 823192 1056213 1025832 1388555 3428283
45962C428283L246575K198608k52509j767980j453917l08590N22323O85262L14063
$$ 3428283 6674858 8873466 8620957 6852977 5399060 5090470 5612793 6298055 6612118
45953F612118k58776q09471j537139k361876k117656k5444K122729J582557j166355
$$ 6612118 6353342 5543871 4006732 1644856 -472800 -498244 1624485 3207042 2040687
45944B040687k636782j530223m47681r79016q74040J352635K819688R89565j370166
$$ 2040687 -596095 -2126318 -2573999 -3553015 -4427055 -3074420 -254732 734833 -635333
45935f35333n27298J655522Q59319j972225k099062P39879J906498l2922j148493
$$ -635333 -1162631 492891 1352210 -620015 -2719077 -1979198 -72700 -105622 -1254115
45926a254115N97337K012113Q07193n17972K39916J143136N99348P85831K754814
$$ -1254115 -656778 1355335 2162528 1644556 1884472 3027608 3626956 4412787 7167601
45917G167601K823997j402981n498892m235982L4325J119544j131159j399028
$$ 7167601 9991598 8588617 3089725 -1146257 -1111932 7612 -1123547 -2522575
45909b522575J470951K427921j041024m368281k870390J410650L249698J487155
$$ -2522575 -1051624 1376297 335273 -4033008 -6903398 -5492748 -2243050 -755895
45901g55895p72237j424601j529908k554174l778074l056726N33438N003353O639360
$$ -755895 -1528132 -2952733 -4482641 -7036815 -10814889 -13871615 -13338177 -8334824 -1695464
45892a695464L646480j419926l866252j732008K311593L954286J412893l140933
$$ -1695464 1951016 531090 -3335162 -5067170 -2755577 1198709 2611602 -529331
45884e29331n448351k899729K519118N575612L382225j059072k567120k57960
$$ -529331 -5977682 -8877411 -6358293 -782681 2599544 1540472 -1026648 -1284608
45876a284608K008165J274095j265128l095260l585284l081340j274099J605391
$$ -1284608 723557 1997652 732524 -2362736 -5948020 -9029360 -10303459 -8698068
45868h698068L639371L283171J555860M70451J81735m98738j398253r12238J184867
$$ -8698068 -5058697 -1775526 -219666 250785 432520 -66218 -1464471 -2376709 -1191842
45859a191842K685530J617515j078592k616690j701698K40646J221530J003673
$$ -1191842 1493688 3111203 2032611 -584079 -2285777 -2045131 -823601 180072
45851A80072O05813M26445J77797J93250R95669J520944l3508k871087l549221
$$ 180072 785885 1212330 1390127 1583377 2579046 4099990 4066482 1195395 -2353826
45842b353826q11589J956890J451842o54961p87133M81008k42210k685260k772390
$$ -2353826 -3165415 -1208525 243317 -411644 -1198777 -717769 -959979 -3645239 -6417629
45833f417629N28238L131304K215318J35921l60826m61979j591290j435825J958232
$$ -6417629 -5889391 -2758087 -542769 -406848 -767674 -1229653 -2820943 -4256768 -2298536
45824b298536N226756L952067p4496j325842O58730Q10953k654143m873173k068686
$$ -2298536 2928220 6880287 6805791 5479949 6138679 6949632 4295489 -577684 -2646370
45815b646370K314833K850031P6864j009846J384750L877857L296050O20439j160707
$$ -2646370 -331537 2518494 2595358 1585512 2970262 6848119 10144169 10764608 9603901
45806I603901q36712L55001N20377j072090l135144l217803l93357K955120L346457
$$ 9603901 8767189 9122190 9642567 8570477 5435333 2217530 1824173 4779293 8125750
45797H125750M34393k393323k285516m11066j444j938965l903895l572320j081805
$$ 8125750 8560143 6166820 3881304 3470238 3468794 1529829 -2374066 -5946386 -7028191
45788g028191J822066L650210L721967K200771M01103j9163Q86718J108951m22052
$$ -7028191 -5206125 -1555915 2166052 4366823 4767926 4748763 5635481 6744432 6322380
45779F322380j828764q54341J418801J682839q87969l417622l337268j354607
$$ 6322380 4493616 3639275 5058076 6740915 5852946 2435324 -901944 -2256551
45771b256551N69580J981416L003650K545959j65438l260169l878051j932719
$$ -2256551 -1686971 294445 3298095 5844054 5678616 2418447 -1459604 -3392323
45763c392323j14003m5912m46670L59224J884187K481631J735105O37822q8875
$$ -3392323 -3506326 -3552238 -3998908 -3639684 -1755497 726134 2461239 3099061 3010186
45754C010186p67077j782739k530258j854652M17878K800827L516387K453472
$$ 3010186 2243109 460370 -2069888 -3924540 -3506662 -705835 2810552 5264024
45746E264024J099699M91287J47674o39593j500746j649465j000639O6697J241754
$$ 5264024 6363723 6855010 7002684 6363091 4862345 3212880 2212241 2278938 3520692
45737C520692J957179J558293N20242K79760R76176Q31833j023393k778788k621064
$$ 3520692 5477871 7036164 7556406 7836166 8812342 9644175 8620782 5841994 3220930
45728C220930j451030q53959j67416J702402L182877K175301J42972K01100J779034
$$ 3220930 1769900 915941 748525 2450927 5633804 7809105 7952077 8153177 9932211
45719I932211J443462j038031k074083l60691J093354M22996k85977L79945L99138
$$ 9932211 11375673 10337642 8263559 7902868 8996222 9419218 9133241 9513186 9912324
45710I912324j176406j517658Q11467K296168Q5980k847574k747755j469556k494245
$$ 9912324 8735918 7218260 8029727 10325895 10411875 7564301 4816546 3346990 852745
45701H52745l976043k071658J390437J586995n66746J25363L493529L741862l55183
$$ 852745 -3123298 -5194956 -3804519 -2217524 -2784270 -2658907 834622 4576484 4221301
45692D221301k930429q62292J429033L36746q61500J238235L586477K272455m19927
$$ 4221301 1290872 428580 1857613 2194359 1332859 2571094 6157571 8430026 8010099
45683H010099m06426Q52055n10652l441218l914044j928202o90564n80084L78211
$$ 8010099 7603673 8455728 7945076 4503858 589814 -1338388 -2028952 -2609036 -2230825
45674b230825J487697N60384j022707k42238J443590L9499l331784l260561R88765
$$ -2230825 -743128 -182744 -1205451 -1447689 -4099 35400 -3296384 -6556945 -5568180
45665e568180L974763K871591J183455J490909J088399j702026l015730k3844
$$ -5568180 -1593417 1278174 2461629 3952538 5040937 3338911 323181 299337
45657B99337K984184P56334m225205n151798q90972L179428L422313J628899K88035
$$ 299337 3283521 4039855 -185350 -5337148 -6228120 -3048692 373621 2002520 2290555
45648B290555r50563k694238l362650j423931J909487L912629L371074J444302
$$ 2290555 1339992 -1354246 -4716896 -6140827 -4231340 -318711 3052363 4496665
45640D496665l723m57828j107096k917257m680353m198984j398245J542849L451905
$$ 4496665 4492942 4035114 2928018 10761 -4669592 -8868576 -10266821 -8723972 -5272067
45631e272067N138129O315086M672204N7048l365217k200045J153130K012960
$$ -5272067 -133938 6181148 10853352 10910400 7545183 5345138 6498268 8511228
45623H511228J81571p33957L55598P73525q14646k186361j446524K30874J050803
$$ 8511228 8692799 7958842 8314440 9087965 8273319 6086958 4640434 4871308 5922111
45614E922111J066627Q41000q1032j900237l432032l451235j990658K28002K280525
$$ 5922111 6988738 7829738 7748706 5848469 2416437 -1034798 -3025456 -2797454 -516929
45605e16929K772122R43399j538474j859542K55939K102898J939427J191255J513142
$$ -516929 2255193 3198592 1660118 -199424 56515 2159413 4098840 5290095 6803237
45596F803237J753237j71867l589133n366245l748243m49145J442666R17111k03976
$$ 6803237 8556474 8384607 4795474 -570771 -4319014 -4768159 -3325493 -2408382 -2612358
45587b612358J8336R83138Q11242j10959P34735L397456L915253n6998m566345
$$ -2612358 -2594022 -1610884 -799642 -910601 -175866 3221590 7136843 7079845 2513500
45578B513500m165902J26192K284256K47552j624258N7224K807911K926606R14761
$$ 2513500 -1652402 -1526210 758046 1005598 -618660 -561436 2246475 5173081 6087842
45569F087842n81025j019054j221280r59278j12306o4263j299236j674591K53073
$$ 6087842 5506817 4487763 3266483 2307205 2194899 2130636 831400 -843191 -590118
45560e90118K214099J437137q80685j393847M09815K083564K189466J574604J230193
$$ -590118 1623981 3061118 2180433 786586 1196401 3279965 5469431 7044035 8274228
45551H274228J262268J523725J404172j46956k671156l641479j822735M50704
$$ 8274228 9536496 11060221 12464393 12317437 9646281 6004802 4182067 4632771
45543D632771O66536o1110N37831J447736K8096l085605m605980l534722j781273
$$ 4632771 5299307 5238197 5776028 7223764 7251860 4166255 -439725 -3974447 -5755720
45534e755720k56378J819629L788250L693013J997382J428082K409690K267309
$$ -5755720 -6012098 -4192469 -404219 3288794 5286176 6714258 9123948 11391257
45526A1391257j08947k358443k586578j820970j238582l32556O40781j22314k330555
$$ 11391257 11282310 8923867 6337289 4516319 3277737 2945181 3585962 3463648 1133093
45517A133093k567685N85537L504034K600651k10218o31445J416019K189121J73184
$$ 1133093 -1434592 -849055 2654979 5255630 5045412 4413967 5829986 8019107 8192291
45508H192291k038245k033201o43531O7117l48574r16772r40462n62798j85616
$$ 8192291 6154046 4120845 3477314 3544431 3195857 2279085 1338623 775825 590209
45499E90209J44595P58931J677699K121515J436891L95783M12337J360076J573675
$$ 590209 734804 1493735 3171434 5292949 6729840 7125623 7537960 8898036 10471711
45490A0471711L10126j352893k415723k895060k395005p1429K953999L618755
$$ 10471711 10781837 9428944 7013221 4118161 1723156 1651727 4605726 8224481
45482H224481J000180j849764k005794m13893N32362P27606R35094N9737k463086
$$ 8224481 9224661 7374897 5369103 4955210 5487572 6215178 7150272 7210009 4746923
45473D746923l437930L18236N714282N933431n0863n270637m039394O49141K046155
$$ 4746923 1308993 1627229 7341511 13274942 13224079 7953442 3914048 4563189 6609344
45464F609344j002357l499610j860094J709820K880668P01580j878989j901942
$$ 6609344 5606987 2107377 247283 1957103 4837771 5539351 3660362 1758420
45456A758420M26478K460998K297384M81686j449902k915212l738155k799691
$$ 1758420 2184898 4645896 6943280 7424966 5975064 3059852 -678303 -3477994
45448c477994N90724M161644M108733M2346l679460l198049l3394J350141l58872
$$ -3477994 -2887270 1274374 5383107 5425453 1745993 -1452056 -1485450 -135309 -494181
45439d94181k211091j653456L39726J471757J333728J080940J269287J524954
$$ -494181 -2705272 -4358728 -4019002 -2547245 -1213517 -132577 1136710 2661664
45431B661664J653154J679705J161649k09244j468930j277913j44338k02301k017602
$$ 2661664 4314818 5994523 7156172 6946928 5477998 4200085 4055747 3853446 1835844
45422A835844l094496j066037K562076L855378J553733j303114j564447N089L58041
$$ 1835844 -1258652 -2324689 237387 4092765 5646498 4343384 2778937 2784026 3142067
45413C142067j340904k839112k219050k58426J273822K063163K585301K036759
$$ 3142067 1801163 -1037949 -3256999 -3515425 -2241603 -178440 2406861 4443620
45405D443620q53029m678271n338106r55067M554151N396025J120333k868161
$$ 4443620 3590591 -1087680 -6425786 -7380853 -2826702 2569323 3689656 821495
45397H21495k565941k086J093667J016451K123454L500695K213506q83894j544126
$$ 821495 -1744446 -1746532 -652865 363586 2487040 5987735 8201241 7317347 5773221
45388E773221R97069K303959k85919l359118k935031n20254K067j385319j882193
$$ 5773221 6770290 9074249 8788330 5429212 2494181 1973927 1975994 590675 -1291518
45379a291518j127269r45129r86772Q18505L669418M079718J211836j789391k619950
$$ -1291518 -2418787 -3363916 -4350688 -3532183 137235 4216953 5428789 3639398 1019448
45370A019448k342615j988196m24033K358213L202743K4912m120786m381072m09476
$$ 1019448 -1323167 -3311363 -3735396 -1377183 1825560 1850472 -2270314 -6651386 -7060862
45361g060862L473264L943539J990613M82588N91828J415080J761314J263552
$$ -7060862 -3587598 355941 2346554 2829142 3420970 4836050 6597364 7860916
45353G860916J86966j058450k048803k307048j560201j99296Q72326J176083J102146
$$ 7860916 8047882 6989432 4940629 2633581 1073380 874084 1746410 2922493 4024639
45344D024639J093111R53228M70876n4050o64649k101470m061557m232673j054960
$$ 4024639 5117750 6070978 6541854 6487804 5823155 3721685 -339872 -4572545 -5627505
45335e627505L223246M616875K433613j25397n54516L04287P70383P87418O08975
$$ -5627505 -2404259 2212616 4646229 4520832 3966316 4270603 5040986 5828404 6437379
45326F437379n50344k729328l942512k669999k92425Q12739N02919L90895J071091
$$ 6437379 5887035 3157707 -784805 -3454804 -3747229 -2934490 -2431571 -2040676 -969585
45317i69585J699059J742382J410928P04614m32224j285638j114084n12491p10717
$$ -969585 729474 2471856 3882784 4587398 4155174 2869536 1755452 1242961 532244
45308E32244j610984j780370n16396J088102J427311K09626j094324n26475K198431
$$ 532244 -1078740 -2859110 -3375506 -2287404 -860093 -650467 -1744791 -2271266 -72835
45299g2835M701163M051529L63078k808177k491050L17538K341618K033360M79830
$$ -72835 4628328 8679857 9042935 6234758 3743708 4061246 6402864 8436224 8916054
45290H916054q07011j200165m53288J180138K131369O08960k724762m538442k521787
$$ 8916054 8109043 6908878 6455590 7635728 9767097 10376057 7651295 3112853 591066
45281E91066J377611K792234J39602l248941l159801Q7808J984367j50801l498997
$$ 591066 1968677 4760911 4900513 1651572 -1508229 -1420421 563946 413145 -3085852
45272c085852l581402k12625K712466K584421N56092j205626j934602j490009
$$ -3085852 -6667254 -6879879 -4167413 -1582992 -1026900 -2232526 -4167128 -5657137
45264e657137M5802J091937m04762l414409l946846l56984L980697N177598L540622
$$ -5657137 -5611335 -4519398 -4924160 -8338569 -12285415 -12642399 -8661702 -3484104 56518
45255E6518J598984l4963j934850l015942j744031R35861K751123L227113L158720
$$ 56518 1655502 1620539 -314311 -3330253 -5074284 -4138423 -1387300 1839813 4998533
45246D998533K258397J30415j638178j363315j70923j9702p6889J481295L214127
$$ 4998533 7256930 7387345 5749167 4385852 4214929 4195227 4118338 5599633 8813760
45237H813760K023410j510117l530676k586260r15508m9647O87390J076786j08618
$$ 8813760 10837170 9327053 5796377 3210117 2294609 2244962 2932352 4009138 3900520
45228C900520j526851l01008K383471J826305k355304m376246j063072K824575
$$ 3900520 2373669 2072661 4456132 6282437 3927133 -449113 -1512185 1312390
45220A312390K041328j106187j253974J194010J622882o93845k120520j368746
$$ 1312390 3353718 2247531 993557 2187567 3810449 3116604 996084 -372662
45212c72662q85835j348043j78989L071946M458640J105740m146659n978841k686225
$$ -372662 -1258497 -2606540 -2785529 286417 4745057 5850797 1704138 -4274703 -6960928
45203f960928K651208N720632M476788L39011l019949k938499m17031J327668
$$ -6960928 -4309720 1410912 5887700 6226711 3206762 268263 -148768 1178900
45195A178900R96248L93215J140845K116177J433375l95816j090797K7753J016450
$$ 1178900 2175148 2568363 3709208 5825385 7258760 6862944 5772147 5799900 6816350
45186F816350R3988j813994k381138j138122K6430j89081o42093J23507J291733
$$ 6816350 6910338 5096344 2715206 1577084 1603514 1414433 772340 895847 2187580
45177B187580J130572K8528j00272R01648J216073J94762q24881j177639j595056
$$ 2187580 3318152 3346680 3246408 4148056 5364129 5558891 4734010 3556371 1961315
45168A961315j718339m8172K521987K556973o90234l253478k067133O41408J449012
$$ 1961315 242976 194804 2716791 5273764 4583530 1330052 -737081 -95673 1353339
45159A353339R19981J052568P08316j772662l866485k096063J615129K420705
$$ 1353339 2273320 3325888 4034204 2261542 -1604943 -3701006 -2085877 334828
45151C34828M57382K39116K258946J835264k237465m478863j323773K698443J820163
$$ 334828 792210 1031326 3290272 5125536 2888071 -1590792 -2914565 -216122 1604041
45142A604041k133328k910722P11184L854113L037527J40099j569288j764037
$$ 1604041 -529287 -3440009 -2728825 1125288 4162815 4302914 2733626 969589
45134I69589k041922k748418k535438n79020J817913K370851N89273j356964j336108
$$ 969589 -1072333 -3820751 -6356189 -6935209 -5117296 -2746445 -2157172 -3514136 -4850244
45125d850244q04N79555J83410J40463L02376q09216k669535k732054o16895Q23847
$$ -4850244 -4851048 -4271493 -4088083 -3947620 -3645244 -4454460 -7123995 -9856049 -10472944 -9649097
45115i649097R0559l35021J947087N125133N649873L021856k89875k282393k562668
$$ -9649097 -9558538 -9893559 -7946472 -2821339 2828534 5850390 5560515 3278122 715454
45106G15454j310319O76564J660604N08648j875560l626681l553164j232714K780184
$$ 715454 -594865 81699 1742303 2250951 375391 -3251290 -6804454 -8037168 -5256984
45097e256984O077139N879923K570645l96343j194891j654657l296841m506516
$$ -5256984 820155 6700078 9270723 8874380 7679489 6024832 2727991 -1778525
45089a778525l722933k309487j700826p87466J008955J422232l58888n71559L362565
$$ -1778525 -5501458 -7810945 -9511771 -10299237 -9290282 -7868050 -8226938 -8798497 -5435932
45080e435932P076014M858672j185131l786896j147857J540492J028408j48080
$$ -5435932 1640082 6498754 5313623 1526727 378870 1919362 2947770 2799690
45072B799690K10190K70577j238042k108539j016830l28308j811995l401101k823953
$$ 2799690 3009880 3280457 2042415 -66124 -1082954 -1411262 -3223257 -6624358 -9448311
45063i448311r52830Q24112K915418M684618L186371j913338n528054l174208
$$ -9448311 -10401141 -9577029 -6661611 -1976993 1209378 -703960 -6232014 -9406222
45055i406222K616269N680152M115175J098414o68358j433394j868050j559359
$$ -9406222 -6789953 -1109801 3005374 4103788 3435430 2002036 133986 -1425373
45047a425373m49725M67890L68837n57215j261673l99071K092263L601814J203522
$$ -1425373 -1875098 -1407208 -1038371 -1595586 -2857259 -3256330 -1164067 2437747 3641269
45038C641269l641564n428339j467777M161930N829595L132008j78865j754765
$$ 3641269 -295 -5428634 -6896411 -2734481 3095114 6227122 6048257 4293492
45030D293492j948189j320332k38315J44259n57792n90036J008720J723376q54450
$$ 4293492 2345303 1024971 786656 930915 373123 -216913 791807 2515183 1660733
45021A660733m278249m060852l58815K318446J794980M43261M22289P86989L49132
$$ 1660733 -2617516 -6678368 -7037183 -4718737 -2923757 -2480496 -2058207 -1271218 -922086
45012i22086j29442L1368N3033m11695m17522L28719R06028J094227J437636J135221
$$ -922086 -1051528 -1020160 -967127 -1378822 -1796344 -1467625 -561597 532630 1970266 3105487
45002C105487j179705m038222l857964j92966K973393K679951O26112m05894o19888
$$ 3105487 1925782 -2112440 -5970404 -6163370 -3189977 -510026 116086 -289808 -909696
44993i09696j299056j603915k69400J380593J071527q86420k149587j559979J77744
$$ -909696 -2208752 -3812667 -4082067 -2701474 -1629947 -2516367 -4665954 -6225933 -6048189
44984f048189K062410L168790K470228J38857j909669k396868k396120k949382
$$ -6048189 -3985779 -816989 1653239 1792096 -117573 -2514441 -4910561 -7859943
44976g859943k587423K64985L641941L880748Q14272j787750j292412Q29680J825313
$$ -7859943 -10447366 -10182381 -6540440 -2659692 -1845420 -3633170 -4925582 -4095902 -2270589
44967b270589J214129L43062J0548n6950k02268m78992r22155j327768r18353
$$ -2270589 -1056460 -713398 -702850 -759800 -962068 -1441060 -2363215 -3690983 -4609336
44958d609336R88006L646847M735916K501354j615204l627842j558094J523399
$$ -4609336 -3621330 25517 4761433 7262787 5647583 2019741 461647 1985046
44950A985046J108023k410072l918771r07259K658020K041167j432716k728407
$$ 1985046 3093069 682997 -3235774 -4143033 -1485013 556154 -876562 -3604969
44942c604969o43280J121210J91491j274396p20685R13807J456859J142005J512333
$$ -3604969 -4248249 -3127039 -2935548 -4209944 -4930629 -4016822 -2559963 -1417958 94375
44933I4375K260606J790156K67071l90622L27540O57351l16514o64913J470948
$$ 94375 2354981 4145137 4412208 4021586 4349126 5006477 4689963 4025050 5495998
44924E495998M155688L428519r80317m329629k917613N89767P27026k817543m494829
$$ 5495998 9651686 13080205 12099888 7770259 4852646 5442413 6169439 3351896 -1142933
44915a142933r07739L983665M067016q03555m916702l972308N36814M052843L734691
$$ -1142933 -2050672 1932993 6000009 5196454 279752 -3692556 -3155742 897101 4631792
44906D631792K15575l581257m797412k938456j81972J180093J170073J127394
$$ 4631792 4847367 1266110 -3531302 -6469758 -6651730 -5471637 -4301564 -3174170
44898c174170J178464L90227r78805j342257j41048J263657J525320R29100N87654
$$ -3174170 -1995706 -1605479 -2584284 -3926541 -4067589 -2803932 -1278612 -349512 238142
44889B38142Q99808J253914Q36779l70746j329664j175577p08260j389449k575458
$$ 238142 1137950 2391864 3228643 2857897 1528233 352656 -355604 -1745053 -4320511
44880d320511j760489J382086L540571K208949o86196j973755j637429j007884
$$ -4320511 -6081000 -4698914 -1158343 1050606 364410 -1609345 -3246774 -4254658
44872d254658P20255L853343M524397n14535o661425n792940J844724P056266
$$ -4254658 -3534403 318940 4843337 4328802 -2332623 -8125563 -6280839 775427
44864G75427M632480k56922j597025j219495k978433m603188k171835J730555
$$ 775427 5407907 5150985 3553960 2334465 -643968 -5247156 -7418991 -5688436
44856e688436J756158j003559r39806K350668L534454O48894k047808j376959
$$ -5688436 -3932278 -4935837 -5875643 -3524975 9479 658373 -1389435 -2766394
44848b766394N30670R66170N28573L34051l10686j401744j095796J013169K645958
$$ -2766394 -2235724 -1269554 -740981 -406930 -717616 -2119360 -3215156 -2201987 443971
44839D43971K389040J460269P78491m42923k010155k103436o00420L98882M93481
$$ 443971 2833011 4293280 5071771 4628848 2618693 515257 -85163 313719 807200
44830H07200J551397L122697J876507k304267m467629j885915J291571M35181
$$ 807200 2358597 5481294 7357801 5053534 585905 -1300010 -8439 426742
44822D26742k611971l330451j689020o69948n55526K46059R94122L11956Q4879
$$ 426742 -2185229 -5515680 -7204700 -7874648 -8430174 -8184115 -7189993 -6878037 -6793158
44813f793158K478271M870378L311648m10661j161105J004667J159555j696192
$$ -6793158 -4314887 555491 3867139 3456478 2295373 3300040 4459595 2763403
44805B763403k927182m51784J911911J370459L60593J022361J035806j469481
$$ 2763403 -163779 -615563 1296348 2666807 3027400 4049761 5085567 3616086
44797C616086l615337k377413L15232R72636j25787n99512r0210O58966K015886
$$ 3616086 749 -2376664 -2061432 -1088796 -1214583 -1814095 -1904305 -1245339 770547
44788G70547L461963K363138j710703m397360k184107K099749L529465K102724
$$ 770547 4232510 6595648 4884945 487585 -1696522 403227 3932692 6035416
44780F035416R69977K93410j723588l545965j983198J529518K026285j454144
$$ 6035416 7005393 7298803 5575215 2029250 46052 1575570 3601855 2147711
44772B147711m552522m248755k059652m4056J647128K385638Q40508j698960k048811
$$ 2147711 -2404811 -6653566 -8713218 -8757274 -7110146 -4724508 -3884000 -5582960 -7631771
44763g631771k74255J85296j450961j936746j67166M71893j573885k390071J139097
$$ -7631771 -7906026 -7720730 -9171691 -11108437 -11275603 -10803710 -12377595 -14767666 -13628569
44754a3628569N646668O034110K701448j25124p27091m18766K38138J544803K195186
$$ -13628569 -7981901 -1947791 753657 628533 -98558 -517324 -279186 1265617 3460803
44745C460803N17751k354028l555306k194595L85774L009924M854788M435168
$$ 3460803 3978554 1624526 -1930780 -4125375 -3739601 -729677 4125111 8560279
44737H560279J246491k275166l041975j184325M30820P908j660247k822348k367600
$$ 8560279 9806770 7531604 4489629 3305304 3736124 3744032 2083785 -738563 -3106163
44728c106163n68506P14346j36688j775183j273851R30451Q84866k319972l930217
$$ -3106163 -3674669 -2960323 -3097011 -4872194 -6146045 -5215594 -4330728 -6650700 -10580917
44719a0580917n98712L911003M330685J664020L17468N20987n11375k106488j239946
$$ -10580917 -11179629 -7268626 -2937941 -1273921 -956453 -435466 -946841 -3053329 -4293275
44710d293275J135210J294111l51768J3791K173692J845487j466306l336210k201941
$$ -4293275 -3158065 -1863954 -2215722 -2201931 -28239 1817248 350942 -2985268 -5187209
44701e187209j534228k647709k242645N90475J889499M26526P79789M695114O278102
$$ -5187209 -6721437 -9369146 -11611791 -11021316 -9131817 -8705291 -7925502 -3230388 3047714
44692C047714J350083m445099l597865J846622M049993J294689j292688j061664
$$ 3047714 4397797 -47302 -3645167 -1798545 2251448 3546137 2253449 1191785
44684A191785n12959r48006j49134K448204L608487J244156k176024l026396j011514
$$ 1191785 678826 -269180 -418314 2029890 5638377 6882533 4706509 1680113 668599
44675F68599J106487R71326r00280j815612m19917R67898m09239k633299j193028
$$ 668599 1775086 2746412 1846132 30520 -389397 578501 169262 -2464037 -3657065
44666c657065L204134M249171j85537l787461j522782K232252J269712k024681
$$ -3657065 -452931 3796240 3610703 -176758 -1699540 532712 1802424 -222257
44658b22257j575668J143212Q408l871526l229889K475353N245283J501785k463656
$$ -222257 -1797925 -654713 -646305 -4517831 -7747720 -5272367 -27084 1474701 -988955
44649i88955j448198P20355r16294l744035k753145Q41295K254706P73636p97345
$$ -988955 -2437153 -1716798 -2633092 -6377127 -9130272 -8288977 -6034271 -5260635 -6057980
44640f057980j575003k348402j954501J196095N065566N635294K231829j771605
$$ -6057980 -7632983 -9981385 -11935886 -10739791 -5674225 -38931 2192898 421293
44632D21293l099328j294916J720716L006779Q78157k542923k814310J114251
$$ 421293 -2678035 -3972951 -2252235 754544 1632701 -910222 -3724532 -2610281
44624b610281M799181L878884m47744l723261l823721j812161O93162K273067
$$ -2610281 2188900 6067784 5620040 1896779 -1926942 -3739103 -3045941 -772874
44616g72874J561681r63168k475319j424688L776n41523j497199R7424L464065
$$ -772874 788807 -174361 -2649680 -4074368 -4070592 -4612115 -6109314 -6011890 -2547825
44607b547825M750716K212578j968419m614615m170838j069088K511915L900196
$$ -2547825 2202891 4415469 2447050 -2167565 -6338403 -7407491 -4895576 -995380
44599i95380K581979P44996K8549n21123j760686k109134l20502J566311J017168
$$ -995380 1586599 2331595 2360144 1839021 78335 -2030799 -2351301 -784990 232178
44590B32178r26678j411073k13401O47924N81969O18752Q34529N08483R6993M05576
$$ 232178 -694500 -2105573 -2318974 -1671050 -1089081 -470329 364200 872683 969676 1375252
44580A375252O74206k6085o83402j98234J86146p88656j369287M57622K786301
$$ 1375252 2049458 2023373 1339971 1141737 1327883 539227 -830060 -372438 2413863
44571B413863K270069m77794k042834j688303j361285j178871L14882J884848
$$ 2413863 4683932 4206138 2163304 475001 -886284 -2065155 -1750273 134575
44563A34575O86208k244730k609037M48905L107234L072537K041185J006362j498384
$$ 134575 820783 -1423947 -4032984 -3584079 -476845 2595692 4636877 5643239 4144855
44554D144855m744816m827280r76853K023168Q13327j573670j056358J338503
$$ 4144855 -599961 -5427241 -6404094 -4380926 -3567599 -5141269 -6197627 -4859124
44546d859124K412548K150233K017809J134936j412631k978677o54631L523326
$$ -4859124 -2446576 -296343 1721466 2856402 1443771 -1534906 -2189537 1333789
44538A333789M845138K186156j576202l956623m119928j444915L045250N130907
$$ 1333789 6178927 8365083 6788881 2832258 -1287670 -2732585 312665 5443572
44530E443572J789955l496143m371455l91237K519498R27293j678019j068876
$$ 5443572 7233527 3737384 -634071 -1025308 1494190 2421483 743464 -325412
44522c25412J523660K359255J089342J58769K48741k6502o18298K29632K298791
$$ -325412 1198248 3557503 4646845 4805614 5054355 5027853 4409555 4639187 6937978
44513F937978K537231m73300l426097k273851J692790K941014o21065m308293
$$ 6937978 9475209 9001909 5575812 3301961 4994751 7935765 7314700 3006407
44505C006407l132602J033409K308453n86947k959557j579902R57137J024918
$$ 3006407 -126195 907214 3215667 2628720 -330837 -1910739 -953602 71316
44497G1316o47927j087065J67389J411054K020481K435156K144730L56490k105237
$$ 71316 -576611 -1663676 -1496287 -85233 1935248 4370404 6515134 6871624 4766387
44488D766387l679214m024338l406337j458341J498626L353049K682445J058180
$$ 4766387 1087173 -2937165 -6343502 -7801843 -6303217 -2950168 -267723 790457
44480G90457O50260R70842M51351l30529L6887O54500j63267j273187k61990K000079
$$ 790457 1440717 2411559 2862910 2532381 2569268 3223768 3060501 1787314 1525324 3525403
44470C525403K193511j57802k006807j711235r73631j180000j288169l88490O96830
$$ 3525403 5718914 5561112 3554305 1843070 869439 -310561 -1598730 -1987220 -1290390
44461a290390J314446J645269R64379j472312l350825j224368L338243M168857
$$ -1290390 24056 1669325 2633704 1161392 -2189433 -3413801 -75558 4093299
44453D093299o54832n013490l278637J584203L169862J525856J854986M903342
$$ 4093299 3438467 -1575023 -4853660 -3269457 -99595 1426261 3281247 8184589
44445H184589N294398L77683m972558n095632j101988J646689J134199J19536
$$ 8184589 13478987 13856670 8884112 3788480 2686492 4333181 5467380 5586916
44437E586916Q53563J824736O26491k171896l729554k717189p29452K58149L62051
$$ 5586916 6440479 8265215 8891706 6719810 2990256 273067 -456385 -198236 163815
44428A63815P18835J061904J77575j498478j819262m7150J783851J663766K20689
$$ 163815 882650 1944554 2122129 623651 -1195611 -1242761 541090 2204856 2425545
44419B425545p23026q01960p78156p65328n43163o79623j456623j532827J71959
$$ 2425545 1702519 900559 122403 -642925 -1186088 -1865711 -3322334 -4855161 -4683202
44410d683202J942681J187001j334312k076090L7669J919034J134237m36139P3996
$$ -4683202 -2740521 -1553520 -2887832 -4963922 -4926253 -3007219 -1872982 -2309121 -2235125
44401b235125J822953J824358j62487j553443j310448j066018j426555m65290
$$ -2235125 -412172 1412186 1249699 -303744 -1614192 -2680210 -4106765 -4572055
44393d572055K508584M479186K618088j137754k486010r72424m33937k773776
$$ -4572055 -2063471 2415715 5033803 3896049 1410039 437615 3678 -2770098
44385b770098m599592k067949L164218N735455L629381N44002N64589K807033
$$ -2770098 -7369690 -9437639 -6273421 -537966 3091415 3635417 4200006 7007039
44377G007039L178019L08337k634497k437681j87771M59921j573369l506775k812465
$$ 7007039 10185058 10493395 7858898 5421217 5233446 5693367 4119998 613223 -2199242
44368b199242n65186N35259p8650q61080r05736n56948K09863J702126K851338
$$ -2199242 -2764428 -2229169 -2307819 -3168899 -4074635 -4631583 -4421720 -2719594 131744
44359A31744K034881q4636r50539K5716N73630m39174r58296N08749J809684M32350
$$ 131744 2166625 2081989 1131450 1157166 1730796 1291622 333326 842075 2651759 3084109
44349C084109k224430k840285r44937J257890K552241L052059K026472r66488
$$ 3084109 859679 -1980606 -2925543 -1667653 884588 3936647 5963119 4996631
44341D996631l348835j876345K093708L581112R85479j745017j348008J39273
$$ 4996631 1647796 -228549 1865159 5446271 6431750 4686733 3338725 3477998
44333C477998o12670k709215k676288J94502L155916L834884K400047L75498q79545
$$ 3477998 2865328 156113 -2520175 -2325673 830243 4665127 7065174 7440672 6561127
44324F561127q40566k99598o94123j971440k112933q8254J859758Q23463k464589
$$ 6561127 5720561 5420963 4726840 2755400 642467 554213 2413971 3237434 772845
44315G72845m129701k188831Q83749J597719j2214r85205l5821O67798p37996
$$ 772845 -3356856 -5545687 -4661938 -3064219 -3076433 -4061638 -4097459 -3429661 -4167657
44306d167657k306802j031735J902583K206066p07892k102970P66003L772216
$$ -4167657 -6474459 -7506194 -5603611 -3397545 -4105437 -6208407 -5442404 -1670188
44298a670188K156103j718284k037449J246426K938074J352929l5688R8802j009082
$$ -1670188 485915 -1232369 -3269818 -2023392 914682 2267611 2231923 2330725 1321643
44289A321643l278273k056403L452221O679902L171159k188871k812641k35144
$$ 1321643 -1956630 -4013033 -560812 6119090 9290249 7101378 4288737 4053593
44281D053593K9102j641734o08470K878544L689361M68486k367156j789756K61548
$$ 4053593 4082695 2440961 1832491 4711035 8400396 8868882 6501726 4711970 4973518
44272D973518J278212J334690Q95145m18280k029595k778729l188772m006968
$$ 4973518 6251730 7586420 8481565 8063285 6033690 3254961 66189 -3940779
44264c940779l243275J026639N601892N131052K26204k895050j583494J59110
$$ -3940779 -7184054 -6157415 -555523 4575529 4801733 1906683 323189 482299
44256D82299p88112j977728q28326P15232M27044M7634J389148K156066j01616
$$ 482299 -305813 -2283541 -3111867 -2396635 -1969591 -1921957 -532809 1623257 1521641
44247A521641l021717k764649L2011J748194J367854O04260r2831j641585l150853
$$ 1521641 -1500076 -4264725 -4232714 -2484520 -1116666 -512406 -605237 -2246822 -5397675
44238e397675k309354R76440M026534M570011K614404m29172k711710k653751
$$ -5397675 -7707029 -6730589 -2704055 1865956 4480360 4051188 1339478 -1314273
44230a314273m33714J747982K199735J646979J466813J438734P40938l16282j196879
$$ -1314273 -1747987 -5 2199730 3846709 5313522 6752256 7493194 7176912 5980033
44221E980033k186238k816302j196877K778710N439870L479880j212295l902279
$$ 5980033 3793795 977493 -219384 2559326 7999196 11479076 10266781 6364502
44213F364502l247551j991557j975768j958194q07833K98645J52614k44948P07791
$$ 6364502 3116951 1125394 -850374 -2808568 -3616401 -3317756 -3165142 -3410090 -2702299
44204b702299K555826L117965J218147j643942k675861r87834J071327P61485
$$ -2702299 -146473 2971492 4189639 2545697 -130164 -1117998 -46671 714814
44196G14814j224954j646617L99274J996276R37291q93840p08913Q68939J319654
$$ 714814 -510140 -2156757 -1757483 238793 1176084 282244 -426669 442270 1761924
44187A761924L73440k89845m03098j177219k461160k580066j046470P45393J613531
$$ 1761924 2135364 1845519 1442421 265202 -2195958 -4776024 -5822494 -5077101 -3463570
44178c463570J638880J216680N87490J72370K08160M19979P68861J455717J527287
$$ -3463570 -1824690 -608010 -20520 151850 360010 779989 1548850 3004567 4531854
44169D531854n69536l833410m576979j446339J950108K023531K65367O8296R61833
$$ 4531854 3962318 128908 -4448071 -5894410 -3944302 -1920771 -1655404 -1587108 -625275
44160f25275K17758j547200j130883J544659K980428J441810j070802k364078
$$ -625275 -407517 -1954717 -3085600 -1540941 1439487 2881297 1810495 -553583
44152e53583k245748j226920l3727N9012p89344m0333K898741L716822p06409
$$ -553583 -2799331 -4026251 -4059978 -4000966 -4790310 -4830643 -1931902 1784920 1078511
44143A078511n640577m317630J181601K533104j627778l736416k8532L688142
$$ 1078511 -4562066 -8879696 -7698095 -5164991 -6792769 -10529185 -10557717 -6869575
44135f869575K494959J99146J469479L379266J282360k529184k939816n33885
$$ -6869575 -4374616 -4175470 -2705991 673275 1955635 -573549 -3513365 -4047250
44127d047250P00115P71261K196622L852802K845055M78061J34511R22294l78933
$$ -4047250 -3347135 -2575874 -379252 3473550 6318605 6796666 6931177 7853471 7474538
44118G474538k510508j394856K104677K628880j174513m535566l792651n19293
$$ 7474538 4964030 3569174 5673851 8302731 7128218 2592652 -1199999 -1719292
44110a719292K448041M183436L869977N80463l717260n055530k735361j28744
$$ -1719292 728749 4912185 8782162 9362625 5645365 589835 -2145526 -2274270
44102b274270N88261O84640J127453P78424m53235o70056L76151N03865o40181
$$ -2274270 -1686009 -1001369 126084 904508 451273 -218783 157368 661233 21052
44093B1052m61426J753162K812229O02935k445908l244769k208358j195556l34645
$$ 21052 -440374 1312788 4125017 4727952 2282044 -962725 -3171083 -4366639 -4701284
44084d701284O09900N45547o56782p64052J286664K905910J686068n39137m96433
$$ -4701284 -4091384 -3545837 -4202619 -4966671 -3680007 -774097 911971 372834 -123599
44075a23599J505339K476489J345410l26429j326026j743424j509234m20865O16113
$$ -123599 1381740 3858229 5203639 4877210 3551184 1807760 298526 -122339 493774
44066D93774L30141j079346k237593k317103j381560J95799J532959J424590m6165
$$ 493774 823915 -255431 -2493024 -4810127 -6191687 -5995888 -4462929 -3038339 -3084504
44057c084504j008729p9266J799830K823008K558714J706373P49551r3378n53757
$$ -3084504 -4093233 -4172499 -2372669 450339 3009053 4715426 5464977 5371599 4817842
44048D817842p15607p59080j33676J437918K251872M09427k556813l092403j237549
$$ 4817842 4102235 3343155 3209479 4647397 6899269 7308696 4751883 1659480 421931
44039D21931q03400k574061k181271K301663N515863K283356l867607n372282
$$ 421931 -381469 -2955530 -5136801 -2835138 2680725 4964081 1096474 -4275808
44031d275808j385780K190086K110372R49086R01299M71656j343834k584747j871845
$$ -4275808 -5661588 -3471502 -1361130 -412044 489255 960911 -382923 -2967670 -4839515
44022d839515m99604N66637K179949M048731L839642R81033j762672k208485j390654
$$ -4839515 -5339119 -4772482 -2592533 1456198 5295840 6276873 4514201 2305716 915062
44013I15062p95645M5535J492227K191177J442071O14974M86332j72488j588437
$$ 915062 119417 164952 1657179 3848356 5290427 5905401 6391733 6219245 4630808
44004D630808j566959N97697J743186n78012l554027k743817J262754L507234
$$ 4630808 3063849 3661546 5404732 4826720 1272693 -1471124 -208370 3298864
43996C298864J475882k012290k983447q93255J570931J727591m86923k389562
$$ 3298864 4774746 2762456 -220991 -1114246 456685 2184276 1697353 -692209
43988f92209j285788K130461M052069K058726j877625l993352k985037k79497
$$ -692209 -1977997 152464 4204533 6263259 4385634 392282 -2592755 -2872252
43980b872252K469309M219146L964783J540720j335174k504024j667803j99960
$$ -2872252 -402943 3816203 7780986 9321706 7986532 5482508 3814705 3614745
43972C614745O47155L15988j185031k707811k463284m77645Q64542K88385j68795
$$ 3614745 4261900 4577888 3392857 685046 -1778238 -2255883 -1391341 -1102956 -1271751
43963a271751J416385L159131K140549o02259j525934k59532J44306j348831k148719
$$ -1271751 144634 3303765 5444314 4842055 3316121 3056589 3200895 1852064 -296655
43954b96655p68756O87452M24108k2040J138908K597973K209462M77089q70679
$$ -296655 -1065411 -377959 46149 24109 1163017 3760990 5970452 6447541 5576862
43945E576862k083611m198000n685028l625654J485809M929671L122993j799494
$$ 5576862 3493251 -704749 -6389777 -10015431 -8529622 -3599951 -476958 -2276452
43937b276452m363498k138877J765778K893035Q18268r98061k26670J520336J635620
$$ -2276452 -6639950 -8778827 -7013049 -4120014 -3301746 -4299807 -4526477 -3006141 -1370521
43928a370521K64087o73732o71513m42254L91463K443724L881393K033117j937051
$$ -1370521 -1106434 -1780166 -2451679 -2893933 -2502470 -58746 3822647 5855764 3918713
43919C918713l470744q75522K185498K123290P4869j129116j446272j952034j428082
$$ 3918713 447969 -427553 1757945 3881235 3956104 2826988 1380716 -571318 -1999400
43910a999400J419455M103002K995092r49727l243150k437642j498499k131538
$$ -1999400 -579945 3523057 6518149 5568422 2325272 -112370 -1610869 -3742407
43902c742407j998130P41469L681348L500604P17298j388279j186329Q8331O34107
$$ -3742407 -5740537 -4999068 -1317720 2182884 2900182 1511903 325574 413905 1048012
43893A048012j14574j408529j720602K5450K866508M150176K252545j650322m840184
$$ 1048012 933438 -475091 -2195693 -2170243 696265 4846441 7098986 5448664 608480
43884F08480n202193k231019K397760N093047L429625l68629j502729Q81480K300975
$$ 608480 -4593713 -6824732 -4426972 666075 4095700 3727071 2224342 3105822 5406797
43875E406797j56802l024267j812360J806578K673275J32438j767820j344114
$$ 5406797 5249995 2225728 413368 2219946 4893221 5025659 3257839 1913725
43867A913725j112493k080346j672790Q60632J973900m14192k896699j745193
$$ 1913725 801232 -1279114 -2951904 -2091272 -117372 -531564 -3428263 -5173456
43859e173456J332943K323791R52844l18184r35737j709820j576692O58213K811143
$$ -5173456 -3840513 -1516722 -563878 -882062 -1817799 -3527619 -5104311 -4446098 -1634955
43850a634955K120925L59230J232720L610984K973971n47100j814482O30293J970637
$$ -1634955 485970 845200 2077920 5688904 8662875 8115775 6301293 6931586 8902223
43841H902223n27294k878658j619320K36228p97643j958277N86772L995392K902835
$$ 8902223 8374929 5496271 3876951 4113179 3315536 1357259 1944031 5939423 8842258
43832H842258j456020l197752j189452M07071P4157L29594J229157k31544l189157
$$ 8842258 7386238 4188486 2999034 3406105 3480262 3809856 5039013 4807469 1618312
$$ [...]
##END NTUPLES=NMR SPECTRUM
##END=
