##TITLE=31Pdec_LR-661-RM1
 CH2Cl2, 124 sc
 13.3.2019
##JCAMPDX= 6.0         $$ Bruker NMR JCAMP-DX V2.0
##DATA TYPE= NMR SPECTRUM
##DATA CLASS= NTUPLES
##ORIGIN= UXNMR, Bruker Analytische Messtechnik GmbH
##OWNER= root
$$ XWIN-NMR		Version 3.5
$$ Wed Mar 13 16:39:54 2019 Russian Standard Time (UT+4h)  she@DPX200
##.OBSERVE FREQUENCY= 81.013821
##.OBSERVE NUCLEUS= ^31P
##.ACQUISITION MODE= SIMULTANEOUS
##.ACQUISITION SCHEME= undefined
##.AVERAGES= 24
##.DIGITISER RES= 17
##SPECTROMETER/DATA SYSTEM= spect
##.PULSE SEQUENCE= zgpg30
##.SOLVENT NAME= D2O
##.SHIFT REFERENCE= (INTERNAL, D2O, 0, 182.463)
##AUDIT TRAIL= $$ (NUMBER, WHEN, WHO, WHERE, WHAT)
$$ ##TITLE= Audit trail, XWIN-NMR		Version 3.5
$$ ##JCAMPDX= 5.01
$$ ##ORIGIN= Bruker BioSpin GmbH
$$ ##OWNER= she
$$ F:/spectra/data/she/nmr/P31/1/pdata/1/auditp.txt
$$ ##AUDIT TRAIL=  $$ (NUMBER, WHEN, WHO, WHERE, WHAT)
(   1,<2019-03-13 16:38:45.51 +0400>,<she>,<DPX200>,
      <created by zg, POWCHK disabled, PULCHK disabled
       configuration hash MD5:
       00 E9 B6 7A A2 85 ED C7 34 08 36 98 17 FE 4E 26
       data hash MD5: 32K
       7E AC 52 4B AA AA C7 99 FD 52 21 FB 77 C9 E9 CE>)
(   2,<2019-03-13 16:39:01.17 +0400>,<she>,<DPX200>,
      <Start of raw data processing
       efp BC_mod = 2 LB = 1 FT_mod = 6 PKNL = 1 PHC0 = -1801.675 PHC1 = 56.79897 SI = 64K 
       data hash MD5: 64K
       C8 4E 85 46 27 68 8D 7F 9C 55 68 2D 84 0A 81 BB>)
(   3,<2019-03-13 16:39:12.93 +0400>,<she>,<DPX200>,
      <pk PHC0 = -11.24453 PHC1 = 0 
       data hash MD5: 64K
       38 11 E1 EF D2 7C 48 EA 1B FC FB 23 33 19 87 6A>)
(   4,<2019-03-13 16:39:15.23 +0400>,<she>,<DPX200>,
      <abs ABSG = 5 
       data hash MD5: 64K
       CB FD C8 CD 4C FC F8 50 DD F6 2A 29 DA 3D 90 03>)
$$ ##END=
$$ 
$$ hash MD5
$$ 0B 39 BE D3 57 A0 D2 5D 66 21 D3 9D EC 7B C8 0F
##$RELAX= 
##$RELAX= 
##$RELAX= 
##$RELAX= 
##$RELAX= 
##$RELAX= 
##$RELAX= 
##$RELAX= 
$$ Bruker specific parameters
$$ --------------------------
##$DU= <F:/spectra>
##$EXPNO= 1
##$NAME= <P31>
##$PROCNO= 1
##$TYPE= <nmr>
##$USER= <she>
##$AMP= (0..31)
100 100 100 100 100 100 100 100 100 100 100 100 100 100 100 100 100 100 
100 100 100 100 100 100 100 100 100 100 100 100 100 100 
##$AQSEQ= 0
##$AQ_mod= 1
##$AUNM= <au_zg>
##$AUTOPOS= <>
##$BF1= 81.014009
##$BF2= 200.13
##$BF3= 200.13
##$BF4= 200.13
##$BF5= 200.13
##$BF6= 200.13
##$BF7= 200.13
##$BF8= 200.13
##$BYTORDA= 1
##$CFDGTYP= 0
##$CFRGTYP= 5
##$CHEMSTR= <none>
##$CNST= (0..31)
1 1 145 1 1 1 1 1 1 1 1 1 1 1 1 1 1 1 1 1 1 1 1 1 1 1 1 1 1 1 1 1 
##$CPDPRG= <waltz16>
##$CPDPRG1= <>
##$CPDPRG2= <waltz16>
##$CPDPRG3= <>
##$CPDPRG4= <mlev>
##$CPDPRG5= <mlev>
##$CPDPRG6= <mlev>
##$CPDPRG7= <mlev>
##$CPDPRG8= <mlev>
##$CPDPRGB= <>
##$CPDPRGT= <>
##$D= (0..31)
0 1 0 0 0 0 0 0 0 0 0 0.03 2e-05 3e-06 0 0 0 0 0 0 0 0 0 0 0 0 0 0 0 0 
0 0 
##$DATE= 1552480724
##$DBL= (0..7)
120 120 120 11 120 120 24 19 
##$DBP= (0..7)
150 150 150 150 150 150 150 150 
##$DBP07= 0
##$DBPNAM0= <>
##$DBPNAM1= <>
##$DBPNAM2= <>
$$ [...]
##$SUBNAM3= <"">
##$SUBNAM4= <"">
##$SUBNAM5= <"">
##$SUBNAM6= <"">
##$SUBNAM7= <"">
##$SUBNAM8= <"">
##$SUBNAM9= <"">
##$SW= 369.568048894756
##$SWIBOX= (0..15)
0 1 3 0 0 0 0 0 0 0 0 0 0 0 0 0 
##$SW_h= 29940.119760479
##$TD= 32768
##$TD0= 1
##$TE= 0
##$TE2= 300
##$TE3= 300
##$TEG= 300
##$TL= (0..7)
0 120 53 12 22 120 120 120 
##$TP= (0..7)
150 150 150 150 150 150 150 150 
##$TP07= 0
##$TPNAME0= <>
##$TPNAME1= <>
##$TPNAME2= <>
##$TPNAME3= <>
##$TPNAME4= <>
##$TPNAME5= <>
##$TPNAME6= <>
##$TPNAME7= <>
##$TPOAL= (0..7)
0.5 0.5 0.5 0.5 0.5 0.5 0.5 0.5 
##$TPOFFS= (0..7)
0 0 0 0 0 0 0 0 
##$TUNHIN= 0
##$TUNHOUT= 0
##$TUNXOUT= 0
##$USERA1= <user>
##$USERA2= <user>
##$USERA3= <user>
##$USERA4= <user>
##$USERA5= <user>
##$V9= 5
##$VALIST= <valist>
##$VCLIST= <CCCCCCCCCCCCCCC>
##$VD= 0
##$VDLIST= <DDDDDDDDDDDDDDD>
##$VPLIST= <PPPPPPPPPPPPPPP>
##$VTLIST= <TTTTTTTTTTTTTTT>
##$WBST= 1024
##$WBSW= 4
##$XGAIN= (0..3)
0 0 0 0 
##$XL= 0
##$YL= 0
##$YMAX_a= 25022
##$YMIN_a= -30041
##$ZGOPTNS= <>
##$ZL1= 120
##$ZL2= 120
##$ZL3= 120
##$ZL4= 120
##$ABSF1= 182.463
##$ABSF2= -187.1042
##$ABSG= 5
##$ABSL= 3
##$ALPHA= 0
##$AQORDER= 0
##$ASSFAC= 0
##$ASSFACI= 0
##$ASSFACX= 0
##$ASSWID= 0
##$AUNMP= <proc_1d>
##$AZFE= 0.1
##$AZFW= 0.5
##$BCFW= 0
##$BC_mod= 2
##$BYTORDP= 0
##$COROFFS= 0
##$CY= -3
##$DATMOD= 1
##$DC= 0
##$DFILT= <>
##$DTYPP= 0
##$F1P= 0
##$F2P= 0
##$FCOR= 1
##$FTSIZE= 65536
##$FT_mod= 6
##$GAMMA= 0
##$GB= 0
##$INTBC= 1
##$INTSCL= 5.30512e-09
##$ISEN= 30
##$LB= 1
##$LEV0= 0
##$LPBIN= 0
##$MAXI= 10000
##$MC2= 0
##$MEAN= 0
##$ME_mod= 0
##$MI= 50
##$NCOEF= 0
##$NC_proc= -7
##$NLEV= 6
##$NOISF1= 182.463
##$NOISF2= 159.3651
##$NSP= 0
##$NTH_PI= 0
##$NZP= 0
##$OFFSET= 182.463
##$PC= 4
##$PHC0= -1812.92
##$PHC1= 56.79897
##$PH_mod= 1
##$PKNL= yes
##$PPARMOD= 0
##$PSCAL= 0
##$PSIGN= 0
##$REVERSE= no
##$SF= 81.0140089999434
##$SI= 65536
##$SIGF1= 159.3651
##$SIGF2= -187.1042
##$SINO= 113.3802
##$SIOLD= 16384
##$SREGLST= <1H.CDCl3>
##$SSB= 0
##$STSI= 65536
##$STSR= 0
##$SW_p= 29940.119760479
##$SYMM= 0
##$S_DEV= 0
##$TDeff= 32768
##$TDoff= 0
##$TI= <>
##$TILT= no
##$TM1= 0
##$TM2= 0
##$TOPLEV= 0
##$USERP1= <user>
##$USERP2= <user>
##$USERP3= <user>
##$USERP4= <user>
##$USERP5= <user>
##$WDW= 1
##$XDIM= 65536
##$YMAX_p= 469819323
##$YMIN_p= -42142612
$$ End of Bruker specific parameters
$$ ---------------------------------
##NTUPLES= NMR SPECTRUM
##VAR_NAME=  FREQUENCY,     SPECTRUM/REAL,   SPECTRUM/IMAG
##SYMBOL=    X,             R,               I
##VAR_TYPE=  INDEPENDENT,   DEPENDENT,       DEPENDENT
##VAR_FORM=  AFFN,          ASDF,            ASDF
##VAR_DIM=   65536,         65536,           65536
##UNITS=     HZ,            ARBITRARY UNITS, ARBITRARY UNITS
##FACTOR=    0.456856943014862, 1,           1
##FIRST=     14782.0589164792, 0,            0
##LAST=      -15158.0608439998, 0,           0
##MIN=       -15158.0608439998, -42142612,   0
##MAX=       14782.0589164792, 469819323,    0
$$ Real data points
##PAGE= N=1
##DATA TABLE= (X++(R..R)), XYDATA
$$ [...]
46002d872946N81705J545493K274355J875703K63530q66536q6911R86446k10728
45993A490111k527566k321005M08189J725495O00491P15346L350923M163448N71441
45984H176873l056933k306461k922r29532l285816k055495J831665K810611k0395
45975A161595j701433M07553L220685L472248J645170n01330k005288j750825
45967C948375M49747J614903j222750n493136n624266j483147J245934K70176
45959f294164J13588L651132O320831L436202j553941k104948J120954J595615
45951F285269k410666n127773k456870J889353K408772k43538j410285K5813R31773
45942a08152n2762n40134O57690R17662j488521l507689j547519K677170M410757
$$ plain form
46002 -4872946 -4291241 -2745748 -471393 1404310 1667840 801304 714393 1700839 1490111
45993 1490111 -1037455 -3358460 -2950271 -1224776 -624285 91061 3441984 7605432 8176873
45984 8176873 5119940 2813479 2810557 1881025 -1404791 -3460286 -1628621 1181990 1161595
45975 1161595 -539838 -132285 3088400 6560648 8205818 7704488 5699200 3948375
45967 3948375 4398122 6013025 4790275 -702861 -6327127 -7810274 -6564340 -6294164
45959 -6294164 -6180576 -2529444 3791387 7227589 5673648 3568700 4689654 6285269
45951 6285269 3874603 -1253170 -3710040 -1820687 588085 344547 -1065738 -1039925 -108152
45942 -108152 -160914 -701048 -43358 874304 -614217 -4121906 -5669425 -2992255 1418502
45933A418502K627320N03020j51037n67317j113778l11994J298101Q20065j771921
45924B750961k372067R01790M081761L113323k27371j656584p37000j50965q27330
45915D876518j564181j974381k367341j889376J49362K156561K162194P06674
45907B256030n34715j487556k559937k507193k31961K648854L598279K232473
45899C414274l48732l240296m687210k240779L133941O017958L105011j901836
45891C252331l664517k572429k392105l371463k843082o79749J053799K325295
45883h891920M049573M499891K008187n22429N27354K792713J349806k484936
45875C328239k778581J059086L265963J231648j182501j203199j110375k473490
$$ plain form
45933 1418502 4045822 4548842 4397805 3830488 2716710 2404716 3702817 4522882 2750961
45924 2750961 378894 1280684 5362445 8475768 8248397 6591813 5854813 5703848 4876518
45915 4876518 3312337 1337956 -1029385 -2918761 -2769399 -612838 1549356 2256030
45907 2256030 1721315 233759 -2326178 -4833371 -5065332 -2416478 1181801 3414274
45899 3414274 3065542 -174754 -4861964 -7102743 -3968802 2049156 5154167 3252331
45891 3252331 -412186 -2984615 -5376720 -8748183 -11591265 -12271014 -11217215 -8891920
45883 -8891920 -4842347 -342456 1665731 1143302 1670656 4463369 5813175 3328239
45875 3328239 549658 1608744 4874707 6106355 4923854 3720655 2610280 136790
45867A36790k751354m06116J967942K261283J819598J647464M66326j396751j130946
45858B614236J370548K324185K40153j621576j158854o37458j543192j525655
45850F2387N99159J938222Q04789o8434J067846J383229j020569k925297j496501
45841C44831N86162p0943j822224j599070m38386p19991j345007l41349Q37626
45832d568351J37496q97238n1792J339644J228407P93830J419027J180643j152505
45823e70839k300631K36639K720386Q48011k430393j392228K757498L893923J168409
45814D930775k41935J661397K859231O41139k397283l284278k573274j744097
45806a48325r13935m33529j067476j661688j20820K666673L366952J178211j189144
$$ plain form
45867 136790 -2614564 -3020680 -1052738 1208545 3028143 4675607 5141933 3745182 2614236
45858 2614236 3984784 6308969 6549122 4927546 3768692 3131234 1588042 62387
45850 62387 661546 2599768 3404557 3336123 4403969 5787198 4766629 1841332 344831
45841 344831 930993 860050 -962174 -2561244 -2999630 -3719621 -5064628 -5405977 -4568351
45832 -4568351 -4430855 -5328093 -5379885 -4040241 -2811834 -2018004 -598977 581666 -570839
45823 -570839 -2871470 -2634831 85555 933566 -1496827 -2889055 -131557 3762366 4930775
45814 4930775 4688840 6350237 9209468 9850607 7453324 4169046 1595772 -148325
45806 -148325 -1062260 -1495789 -2563265 -4224953 -4345773 -1679100 1687852 2866063 1676919
45797A676919j939293k044636k127618j123253R37534J999329J027785n16856
45789b110089j100760q94084p03640j008610j985680k768245j535600J577379
45781a0529329L137614Q14090k498377k497147J07328J229435L06510O34095L096246
45772f199535M605309L409681J404897K17660q61621j994789j704311K00708J953953
45763A031952K758392L073381J934767j917577n988170n777865j476728J765308
45755d596540J421553N51121J557202K156681K23260k004873j801919k03837P46319
45746a951033J452965K369911J671106j245271l134314j455663J281191J487996
45738D76888K11690P86829K886952L282633J250690q98958j941328k567445k571723
$$ plain form
45797 1676919 -262374 -2307010 -4434628 -5557881 -4620347 -2621018 -1593233 -2110089
45789 -2110089 -3210849 -4104933 -4808573 -5817183 -7802863 -10571108 -12106708 -10529329
45781 -10529329 -7391715 -6577625 -9076002 -11573149 -11465821 -10236386 -9929876 -9295781 -6199535
45772 -6199535 -1594226 1815455 3220352 3438012 2576391 581602 -1122709 -922001 1031952
45763 1031952 3790344 6863725 8798492 6880915 892745 -4885120 -6361848 -4596540
45755 -4596540 -3174987 -2623866 -1066664 1090017 1313277 -691596 -2493515 -2697352 -1951033
45746 -1951033 -498068 1871843 3542949 2297678 -836636 -2292299 -1011108 476888
45738 476888 688578 1475407 4362359 7644992 8895682 7996724 6055396 3487951 916228
45729I16228r65573J004296M48990k761585m957004l162825J213267M179473L466796
45720f17937L76425j958025j786614l73651r4346j055090j049628O53662J568334
45711d336870l63737l154360l189684l02369K165713K187091J439502K202146
45703c352568L791339L488736L10718l375390m265395j671049J879032L597070
45695D02493L215037K278407J638100R81717K71175j07651n20776j618474k592229
45686C947799j830839K81789J214588k72425k303182k469229p49626J097562J752592
45677F69029J063856l18153j344372j529968j684594k522201k862011j123467
45669i651881J596367K461471J142835L24901J314213K114760J026487p75594
$$ plain form
45729 916228 -49345 954951 1403941 -1357644 -6314648 -9477473 -8264206 -4084733 -617937
45720 -617937 -241512 -2199537 -3986151 -4359802 -4454148 -5509238 -6558866 -5905204 -4336870
45711 -4336870 -4700607 -7854967 -11044651 -11347020 -9181307 -6994216 -5554714 -3352568
45703 -3352568 438771 3927507 4238225 862835 -3402560 -5073609 -3194577 402493
45695 402493 3617530 5895937 7534037 8515754 8786929 8679278 8158502 6540028 3947799
45686 3947799 2116960 2398749 3613337 3340912 1037730 -1431499 -2181125 -1083563 669029
45677 669029 1732885 1414732 70360 -1459608 -3144202 -5666403 -8528414 -9651881
45669 -9651881 -8055514 -5594043 -4451208 -4126307 -2812094 -697334 329153 -446441
45661d46441j763708k307074k649996j526014J043489K332601Q70301o92734M16331
45652d723245K447199J784765j367565l351659k168048P39142L067203L404575
45644a67633J247981k122176l594511j599975J328845J905587Q48148J200848
45636i52886K845110K460791r51952m102500l879036r95321J808611K872005K020569
45627A125391L3854j274216k80388K140249L086474J297180j097210j422129J72361
45618C781566J229789J47583j996395k580317l18081K790934L065137n00811m389722
45609A229683m520621j286050J304390J056639k20774j68064R52950J547626J205692
45600A101471N68027j676l39625q1299M95380J05426j811566l627808l139342
$$ plain form
45661 -446441 -2210149 -4517223 -7167219 -8693233 -7649744 -5317143 -4446842 -5139576 -4723245
45652 -4723245 -2276046 -491281 -1858846 -5210505 -7378553 -6639411 -3572208 -167633
45644 -167633 1080348 -1041828 -4636339 -6236314 -4907469 -3001882 -2153734 -952886
45636 -952886 1892224 4353015 3401063 -701437 -4580473 -5575794 -3767183 -895178 1125391
45627 1125391 1159245 -114971 -395359 1744890 4831364 6128544 5031334 3609205 3781566
45618 3781566 5011355 5158938 3162543 582226 264145 3055079 6120216 5619405 1229683
45609 1229683 -3290938 -4576988 -3272598 -2215959 -2436733 -2604797 -1651847 -104221 1101471
45600 1101471 1669498 1667822 1328197 1246898 1742278 1847704 36138 -3591670 -6731012
45591f731012m08000K241717L110324K821364K723577K719326J741638j45031
45583H073903j487508j502713j210135j833967k970364l211685j915229M78927
45575e578771L074676M470504L175995l40125k944351k169531M09182J289943
45567A387522j40670j518961j647108j444177q72043J248669L730479L448193
45559D191904O72674k22990K469116M514770K214913j769213k828692j231865
45551H010617k90223o56786j079144k205972m499256m640454N6484N171529L743510
45542C610305k977145o169234j857975L924604M619256J615869k01006j48265
45534B416409n24153j401816j260283n33676n33751m85102Q82539K231359J459907
$$ plain form
45591 -6731012 -7139012 -4897295 -1786971 1034393 3757970 6477296 8218934 8073903
45583 8073903 6586395 5083682 3873547 2039580 -930784 -4142469 -6057698 -5578771
45575 -5578771 -2504095 1966409 5142404 4802279 1857928 -311603 97579 1387522
45567 1387522 1246852 -272109 -1919217 -3363394 -4235437 -2986768 743711 4191904
45559 4191904 4864578 4641588 7110704 11625474 13840387 12071174 9242482 8010617
45551 8010617 7720394 7063608 5984464 3778492 -720764 -5361218 -5304734 -133205 3610305
45542 3610305 633160 -5536074 -7394049 -3469445 1149811 2765680 2564674 2416409
45534 2416409 1892256 490440 -769843 -1303519 -1837270 -2322372 -1439833 791526 2251433
45525B251433m62455p61514P25036J454648K36288j386262j906446j626820j273041
45516b749133p50601J31873R73509J272141R30010L13825K20307J095207J750938
45507C188076J83310l184979m689804j951654K040637K298053j099742k706525
45499e922628O30786N084206N087168R09710k219017j540891K63496q827j596364
45490F87639k101025j709904k115994k623584r11607K302693K966443n10206m068601
45481h084146k981083J839171N101399L724845k55970k911059k367098L39308
45473e594633K527122K020378m77607j490629J158185M944249N383579J822235
45465A0292879j993723l247750l145522l690926m044642k225524J086486K890496
$$ plain form
45525 2251433 1788978 1027464 1752500 3207148 3443436 2057174 150728 -1476092 -2749133
45516 -2749133 -3499734 -3367861 -2394352 -1122211 -192201 121624 341931 1437138 3188076
45507 3188076 3371386 186407 -4503397 -6455051 -4414414 -2116361 -3216103 -5922628
45499 -5922628 -5291842 -207636 4879532 5789242 3570225 2029334 2292830 2284003 687639
45490 687639 -1413386 -3123290 -5239284 -7862868 -8774475 -6471782 -3505339 -4015545 -8084146
45481 -8084146 -11065229 -9226058 -4124659 -399814 -655784 -3566843 -5933941 -5594633
45473 -5594633 -3067511 -1047133 -1524740 -3015369 -1857184 3087065 8470644 10292879
45465 10292879 8299156 5051406 1905884 -1785042 -5829684 -8055208 -6968722 -4078226
45457d078226J836956M3417L03958K400943L225806P77243k771705l216095L85343
45448a092360M062749L568009n47398l933494l728200j218894M55132j98066j883847
45439d516369k083911N7043K252724J638452r88520j760803M53958J906811j16100
45430c156715k524637j322007J563839J398951j292296j781623M21272Q27803
45422e865413j535816j795941K099346M870600K148101k278618k634110k16981
45414e208832k28990k529918k278703J287530L262466R40109k304841k761499
45406i822678j410807o80644J62623K960021O111804N778972J364655l077161
45398A386785l685613j138033J075939J425688J476941K488211L057059J324419
$$ plain form
45457 -4078226 -2241270 -2197853 -1893895 507048 3732854 4510097 1738392 -1477703 -1092360
45448 -1092360 2970389 6538398 5991000 2057506 -1670694 -2889588 -2434456 -2632522 -4516369
45439 -4516369 -6600280 -6543237 -4290513 -2652061 -3640581 -5401384 -4947426 -3040615 -3156715
45430 -3156715 -5681352 -7003359 -5439520 -4040569 -5332865 -7114488 -6693216 -5865413
45422 -5865413 -7401229 -9197170 -7097824 -2227224 -79123 -2357741 -4991851 -5208832
45414 -5208832 -5437822 -7967740 -10246443 -8958913 -5696447 -4756338 -7061179 -9822678
45406 -9822678 -11233485 -11914129 -11751506 -8791485 -2679681 3099291 4463946 1386785
45398 1386785 -2298828 -3436861 -2360922 -935234 541707 3029918 6086977 7411396
45390G411396j931135m111661l975738k350968k70242J733147K801141K262010
45382A567950J039632P48985J357678J492045Q24591O8330j063635l239762m927223
45373b131409l549541K62865K740754K162754P89397N42656K62817j002534j472253
45364a394494J38999J831685J448264N479p68486j597689l286160l665354o45317
45355g933073L386261M088727J220861j332167j106016N80760J643131J644217
45347B192701R47693j17428q27513n71783R491k44521j239123j718223q57174
45338b425880J050278K871253L076315J089486j329321j793418q78004j504711
45330A55998l854419m171224n51566L448303L848121J906924J347798K452399
$$ plain form
45390 7411396 5480261 1368600 -2607138 -4958106 -5228348 -3495201 -694060 1567950
45382 1567950 2607582 3356567 4714245 6206290 7030881 7099211 6035576 2795814 -2131409
45373 -2131409 -5680950 -5418085 -2677331 -514577 274820 817476 1080293 77759 -1394494
45364 -1394494 -1255495 576190 2024454 2029933 1261447 -336242 -3622402 -7287756 -7933073
45355 -7933073 -4546812 -458085 762776 -569391 -1675407 -1094647 548484 2192701
45347 2192701 3140394 3022966 2195453 1623670 1633161 1388640 149517 -1568706 -2425880
45338 -2425880 -1375602 1495651 4571966 5661452 4332131 2538713 1660709 155998
45330 155998 -3698421 -7869645 -8421211 -4972908 -1124787 782137 2129935 4582334
45322D582334K688856J283942n18230k094359k934862j487971J844971K846062
45314F210743j040687n502563m669804O3407K190037N4595j531789K28251K213559
45305a784251J332508j034743k515854l131274l136998j409093J921216M417760
45297e340729M571024L279436J280322j595041l928492l317458n01335R90034
45289d562239L81485O39873K581492K695399q32441m317033l847505p60282J259282
45280f761969J412892J059776N80367O8296P02554K447670K598257m82778m137736
45271b512671m670376k089892Q42682K515262L023539K564170J626084J331762
45263B630560J699360J191291m86158j289486j44190J177230J263392J282262
$$ plain form
45322 4582334 7271190 8555132 8036902 5942543 3007681 1519710 3364681 6210743
45314 6210743 5170056 -332507 -5002311 -4938904 -2748867 -2694272 -4226061 -3997810 -1784251
45305 -1784251 -451743 -1486486 -4002340 -7133614 -10270612 -11679705 -9758489 -5340729
45297 -5340729 -769705 2509731 3790053 2195012 -1733480 -5050938 -5552273 -4562239
45289 -4562239 -4180754 -3540881 -959389 1736010 903569 -3413464 -7260969 -8021251 -6761969
45280 -6761969 -5349077 -4289301 -3708934 -3640638 -2938084 -490414 2107843 1625065 -2512671
45271 -2512671 -7183047 -9272939 -8430257 -5914995 -2891456 -327286 1298798 2630560
45263 2630560 4329920 5521211 5035053 3745567 3601377 4778607 6041999 7324261
45255G324261J885495J089126k011378m516349l911968k073686j648032j437477
45247e300008N62165K371151J095625j412671j216862Q76059O60379k026433k897745
45238g288340n16222J439091L58699j642727j885169p69682N37975K323430M234560
45229c208385M318536K260791O29987Q15081O39001j586086l434921j887475J589614
45220A36143K894384J087306r94168j502716j663614k561114k791084r04401J754583
45211d544681K689563J793712J160230J526220J107881j190189l352999k854380
45203c664643m87861P11142o9055n95603M87629J605977J221050M03420O77624
45194B89680J251264N24202j023369j625421r66600j20326M75709J080613J381056
$$ plain form
45255 7324261 9209756 10298882 8287504 3771155 -140813 -2214499 -3862531 -5300008
45247 -5300008 -4737843 -2366692 -1271067 -2683738 -3900600 -3024541 -2364162 -4390595 -7288340
45238 -7288340 -7804562 -6365471 -6006772 -7649499 -9534668 -10304350 -9766375 -7442945 -3208385
45229 -3208385 1110151 3370942 4000929 4816010 5455011 3868925 434004 -1453471 136143
45220 136143 3030527 4117833 3123665 1620949 -42665 -2603779 -5394863 -6299264 -4544681
45211 -4544681 -1855118 -61406 1098824 2625044 3732925 2542736 -810263 -3664643
45203 -3664643 -4152504 -3441362 -3510417 -4106020 -3618391 -2012414 -791364 -387944 289680
45194 289680 1540944 2065146 1041777 -583644 -1550244 -1670570 -1194861 -114248 1266808
45185A266808J019582P44805J193467J221623n01606k766355k920709n84619J780635
45176D53631K106008P03281j081373k427368k938243k491488j633275j120583
45168h429410r48523n73781K78921J822831M294869O614841O201483K103036k627956
45159H736311m060523k337608r77646j555534k030386p66234P83269P25791k86246
45150a768806m79022J90280L81741k81099p73839l26463O04688J172926J354656
45141G5062J860662K696419K360500l87878l945280m861219k394706j39239j191005
45132e926684l410278k366601J915782M592952K665808j167924k509694n96657
45124f803296J970495K996014K350633R27370l39164p17572j30515O01998N73401
$$ plain form
45185 1266808 2286390 3031195 4224662 5446285 4944679 2178324 -742385 -1327004 453631
45176 453631 2559639 3262920 2181547 -245821 -3184064 -5675552 -7308827 -8429410
45168 -8429410 -9377933 -9951714 -9672793 -7849962 -3555093 3059748 9261231 11364267 8736311
45159 8736311 4675788 2338180 1360534 -195000 -2225386 -2991620 -2208351 -1482560 -1768806
45150 -1768806 -2247828 -2057548 -1675807 -1956906 -2730745 -3057208 -2452520 -1279594 75062
45141 75062 1935724 4632143 6992643 6604765 2659485 -2201734 -4596440 -4735679 -5926684
45132 -5926684 -9336962 -11703563 -9787781 -5194829 -2529021 -3696945 -6206639 -6803296
45124 -6803296 -4832801 -1836787 513846 1441216 1102052 384480 253965 855963 1429364
45115A429364j54608o54710l31213K25259l2477q68985n45338J633052L284776
45106C985120J491246k723203n032302l542454r72592J25324Q98969K603500K995175
45097a71217Q3225l232027k851201n5824M80837j745186k643625n13994J706369
45088h942643J864643J394266J443559P85201o63009m76154J937139L413797J875925
45079B632724k71892j52345J184673J127357k50150j114130j123805j191389j411083
45070e70040j260943o60496M88744K260523L313114J765168j495922k989722j440957
45061e90531L98521K32277n94996l58883j17284r56113j094178J053473L360188
45052A332474K901384M97802q64388n50564j32857j48979k5267r5530r18259j566441
$$ plain form
45115 1429364 1274756 620046 288833 514092 481615 -387370 -932708 700344 3985120
45106 3985120 5476366 2753163 -2279139 -5821593 -6794185 -6668861 -5769892 -3166392 -171217
45097 -171217 -87992 -3320019 -6171220 -6227044 -5746207 -7491393 -10135018 -10649012 -8942643
45088 -8942643 -7078000 -5683734 -4240175 -3454974 -4117983 -4594137 -2656998 756799 2632724
45079 2632724 2360832 2208487 3393160 4520517 4270367 3156237 2032432 841043 -570040
45070 -570040 -1830983 -2491479 -2002735 257788 3570902 5336070 3840148 850426 -590531
45061 -590531 -192010 40267 -554729 -913612 -1030896 -1987009 -3081187 -2027714 1332474
45052 1332474 4233858 4731660 3867272 3316708 3183851 3034872 3009605 2914075 1995816 429375
45042D29375j024563k19610n20847j534538k327971l067377l434022j742323J860121
45033a1581755L872827K193836j42216M72649K425797J884336n58604j132084
45025b565214N38629J177996k51148j145542P3974J955117K867896K365835Q315
45016E025858l589363n194304k467746J603783K154919l04036j005192J030373
45008b745708J690972q36904l052327k126563J83351J551663K353561K872697
45000a09258J698970q56012j901026o81930o1043j236648j395446R90959L082329
44991d69105K693367J880481K341368J816040j160135l346800k026602j07130
44983A621484j170965l071476j773246J496031K576093J435234J156399J737021
$$ plain form
45042 429375 -595188 -814798 -1335645 -2870183 -5198154 -8265531 -11699553 -13441876 -11581755
45033 -11581755 -7708928 -5515092 -5657308 -5184659 -2758862 -874526 -1433130 -2565214
45025 -2565214 -2026585 -848589 -1099737 -2245279 -2171305 -216188 2651708 5017543 5025858
45016 5025858 1436495 -3757809 -6225555 -4621772 -2466853 -2770889 -3776081 -2745708
45008 -2745708 -1054736 -1891640 -4943967 -7070530 -6887179 -5335516 -2981955 -109258
45000 -109258 1589712 733700 -1167326 -1849256 -1910299 -3146947 -4542393 -3551434 -469105
44991 -469105 2224262 4104743 6446111 8262151 7102016 3755216 1728614 1621484
44983 1621484 450519 -2620957 -4394203 -2898172 -322079 1113155 2269554 4006575
44975D006575P39233j150038j010601O01513M33880j408221j682499o0050N92767
44966A062559q604P22351K339107J257573k246135l071541N23957L525317J806792
44957E911376k026223l740118l571126l370243k091448J225727L464728J474082
44949b723245k254588k805197q9532J785627J241526N58364Q65006N08187r04349
44940c818201r93877J290394L252633K148747q14159k206890q90259J066102J562782
44931E97272R47476P90526J169877N92568j102738j461720J194112M201998L249461
44922A0178832j409966m718664l693831j062564k11204j39258J435502L046506
44914C425353J780860j298135k490872j245684k90791n16956j53032R40317O95836
$$ plain form
44975 4006575 4745808 3595770 2585169 3186682 3620562 2212341 529842 469792 1062559
44966 1062559 1053955 1776306 4115413 5372986 3126851 55310 579267 4104584 5911376
44957 5911376 3885153 145035 -3426091 -6796334 -8887782 -7662055 -4197327 -2723245
44949 -2723245 -4977833 -7783030 -7872562 -6086935 -4845409 -4287045 -3422039 -2913852 -3818201
44940 -3818201 -4812078 -3521684 -269051 1879696 1065537 -1141353 -2031612 -965510 597272
44931 597272 1544748 2335274 3505151 4097719 2994981 1533261 2727373 6929371 10178832
44922 10178832 8768866 4050202 356371 -706193 -917397 -1056655 378847 3425353
44914 3425353 5206213 3908078 1417206 171522 -119269 -636225 -789257 151060 846896
44905H46896p58272n81645J593320K284993p9858k099574p27752J870254J927539
44896D275901l26616k001510k143880j605609l00405J790668K446768l8043k888560
44887g91286j800062K253920L362261j152754o519189o409955n59417N634321
44879e982161P517767N104532J425512j004284j770092j748278j568622j076730
44871H97644q8881R33987J303483P44464o44809k372479l171678j778103J097955
44862c078417K761700J714769k27106m80701O60306Q26288o50729j891281j300668
44853a665839N93346K202345K279197M44771k130491k934047q17065J854231J825597
44844A652045n48692j882892q35121K31603o57680k143981k062892o11526O74652
$$ plain form
44905 846896 88624 -493021 1100299 3385292 3305434 1205860 478108 2348362 4275901
44896 4275901 3949285 1947775 -196105 -1801714 -2102119 -311451 2135317 2097274 -791286
44887 -791286 -2591348 -337428 3024833 1872079 -4647110 -11057065 -11616482 -5982161
44879 -5982161 1535606 6640138 8065650 7061366 5291274 3542996 1974374 897644
44871 897644 808763 1742750 3046233 3790697 3145888 773409 -2398269 -4176372 -3078417
44862 -3078417 -316717 1398052 1170946 690245 1350551 2176839 1526110 -365171 -1665839
44853 -1665839 -1072493 1129852 3409049 3853820 1723329 -1210718 -2027783 -173552 1652045
44844 1652045 1103353 -779539 -1614660 -1383057 -2040737 -4184718 -6247610 -6859136 -6184484
44835f184484J310864J565391J227483K93779k26574L85840J335510J450556N95677
44826A754042q42527k602428l803297l050171m60376J773315K055959J317737
44818c857746J124173J366969J206615P74087L26285p77395k391307k368700O20478
44809c976541M099669M212940P82296k398807k324188J92683K368996K473818
44801E430866O40144j762560k978536k133883j39409J209582J033818j87175j554139
44792d41292k414280k457962j829877q82878L98698K039210L165446K881102K208283
44783B666450L068310M696238L758977m75219l998176l509764j245295j111550
44775C849971k463942j895205N21956J588005P60184N43206J107503k06690l038248
$$ plain form
44835 -6184484 -4873620 -3308229 -2080746 -1786967 -2013541 -1627701 -292191 1158365 1754042
44826 1754042 911515 -1690913 -5494210 -8544381 -9004757 -7231442 -5175483 -3857746
44818 -3857746 -2733573 -1366604 -159989 614098 940383 162988 -2228319 -4597019 -3976541
44809 -3976541 123128 4336068 5118364 2719557 395369 588052 2957048 5430866
44801 5430866 6071010 4308450 1329914 -803969 -943378 266204 1300022 1112847 -441292
44792 -441292 -2855572 -5313534 -7143411 -8026289 -7627591 -5588381 -2422935 458167 2666450
44783 2666450 5734760 10430998 14189975 13714756 9716580 6206816 4961521 3849971
44775 3849971 1386029 -509176 12780 1600785 2360969 2904175 4011678 3804988 766740
44766G66740l001530J243284M719645L149127p10776j596171M33861J077519j101145
44757D980554l093308k568742q27584j19111o84245j240682p68573O52542J816739
44748a852410J373428l21208j060990M00060K361555K438229Q16020m98101p50579
44739B906004o30498m8819J708919L586135L101363r4194l075678l210187j284606
44730B958439J76595L93720N29304J124059J113580l46180k263473k740302j151676
44721b05934J115273K113098J291122r5836m33044N60189J623074J328921m33156
44712F863707k333284k885340j796148l4326J249113J580647J070763R4951o16668
44703C193415j65143J521033L060024K692693J51980k879370m283358l387392
$$ plain form
44766 766740 -2234790 -991506 3728139 6877266 6166490 4570319 5004180 6081699 4980554
44757 4980554 1887246 -681496 -1509080 -1628191 -2312436 -3553118 -4321691 -3669149 -1852410
44748 -1852410 -478982 -800190 -1861180 -1461120 900435 3338664 4154684 3656583 2906004
44739 2906004 2275506 2226687 3935606 7521741 10623104 10528910 7453232 4243045 2958439
44730 2958439 3135034 3528754 4058058 5182117 6295697 5949517 3686044 945742 -205934
44721 -205934 909339 3022437 4313559 4217723 3784679 4344868 5967942 7296863 6863707
44712 6863707 4530423 1645083 -151065 -185391 1063722 2644369 3715132 3810083 3193415
44703 3193415 3028272 4549305 7609329 10302022 10454002 7574632 3291274 -96118
44695i6118j463896m24945q09341j203536j88658J432613J534846j50641j392789
44686b762465o61034P72564J117006O97776N89599K80496r43457j555679M10959
44677b054235L709169M893344K870870k27790k590860m187231m586070k707594
44669d880397L56546J531771K31629l41582J788129L892542K576999r63964k678315
44660A513358j252704R57109J923352K052608K109245J399533q25933l260896
44652D615672l211486J74842L896424L696677o29908m126586k685641J312566
44644C042560K326603l35285j885884L04620K943203K362427k78380j943296k362959
44635D173609k596911j922638K61739J694338J38810k537795k679007q7697K203423
$$ plain form
44695 -96118 -1560014 -1984959 -2794300 -3997836 -4186494 -2753881 -1219035 -1369676 -2762465
44686 -2762465 -3423499 -2650935 -1533929 -836153 -246554 33942 -909515 -2465194 -2054235
44677 -2054235 1654934 6548278 9419148 9191358 6600498 2413267 -2172803 -4880397
44669 -4880397 -4523851 -2992080 -2760451 -3102033 -1313904 2578638 5155637 4191673 1513358
44660 1513358 260654 1217763 3141115 5193723 7302968 8702501 7876568 4615672
44652 4615672 1404186 1579028 5475452 9172129 8542221 4415635 1729994 3042560
44644 3042560 5369163 5033878 3147994 3452614 6395817 8758244 8479864 6536568 4173609
44635 4173609 1576698 -345940 -84201 1610137 1748947 -788848 -3467855 -3555552 -1352129
44626a352129K334995Q11720j531023l665112l610103p44069K130387K207442
44618c417892R81810J596444L138325J951054j849273l881910k048888P85751
44610b744579J749462J559719J605776J124559n42276j763687r93772P34092J597172
44601B326466J513482J242891O11124o85360j750586j530175m94023k30477j645280
44592f41938l743981l899800k18264N283031P356213L607311j565319k308111
44584C869142O69124J745297n13789j510611R63680K421559q91730n253697m927299
44575c428324r11713J182383L9256k62517K252884M210085K463909j198479l059271
44566A288213k312818o42762R97143K662152L547467K388251k21686j898325j483630
$$ plain form
44626 -1352129 982866 1794586 263563 -3401549 -7011652 -7755721 -5625334 -3417892
44618 -3417892 -2436082 -839638 2298687 4249741 2400468 -1481442 -3530330 -2744579
44610 -2744579 -995117 564602 2170378 3294937 2752661 988974 -4798 729294 2326466
44601 2326466 3839948 5082839 5693963 5008603 3258017 1727842 1233819 1003342 -641938
44592 -641938 -4385919 -8285719 -8503983 -3220952 4135261 7742572 6177253 3869142
44584 3869142 4538266 6283563 5769774 4259163 5222843 7644402 6752672 1498975 -3428324
44575 -3428324 -4340037 -3157654 -3118398 -3380915 -1128031 3082054 5545963 4347484 1288213
44566 1288213 -1024605 -1667367 -670224 1991928 5539395 7927646 7705960 5807635 4324005
44557D324005m85607n67795j005753k98086P09126j63499k341724k421477O20235
44548a630575K999644J208646k760699m240162k259428K90399J696098K736890
44540a959187L318159J875342j193822l036477k306614o43186N69773J792558
44532a583454K840848K174313o3127j495526j346246j565024k747402k563469
44524f349087j36360J778158J417802J049586K375032K685053m45855l890224
44516a515895l162651L90509J675043j77986j079304J008227L190748K618185
44508B946876L45621j168146j395427j059282k98854J003849K278614K630692
44500E283943J704516J30365o82069o4415K99968j902153n490335o025801j955719
$$ plain form
44557 4324005 3838398 3270603 2264850 1966764 2675890 2512391 170667 -2250810 -1630575
44548 -1630575 1369069 2577715 -182984 -4423146 -6682574 -6392175 -4696077 -1959187
44540 -1959187 1358972 3234314 2040492 -995985 -3302599 -3945785 -3376012 -1583454
44532 -1583454 1257394 3431707 3368580 1873054 526808 -1038216 -3785618 -6349087
44524 -6349087 -6485447 -4707289 -3289487 -2239901 135131 2820184 2374329 -1515895
44516 -1515895 -4678546 -4288037 -2612994 -2790980 -3870284 -2862057 328691 2946876
44508 2946876 3292497 2124351 728924 -330358 -629212 374637 2653251 5283943
44500 5283943 6988459 7118824 6436755 6372340 6672308 4770155 -720180 -6745981 -8701700
44491h701700K383190K664193N80594K33804J242366M54361j283609n1822L694141
44482A215518M636433P93817l147753k829982r937J246496L80004n30299n06875
44473A247422K10001J461285K244900P29601k609806m169626j917759J242566
44465a561416J424281q44633k065031j113382J9077Q9817J19887R24822J607576
44456a399002J160018k5831q45109p39005L0019P46228P90004J47306p18050j439127
44446b292549j669416p31068J477319L317955K803397M60407r80127l14714P00851
44437B772055N31696J98825Q12172Q73234j509294m899542n578573k104496K946718
44428e957205N711354M367193K64645l109845k962997j26922J627179K38608j960238
$$ plain form
44491 -8701700 -6318510 -3654317 -3073723 -2839919 -1597553 -1143192 -2426801 -2478623 1215518
44482 1215518 5851951 6645768 3498015 668033 658096 1904592 2284596 1754297 1247422
44473 1247422 1457423 2918708 5163608 5893209 3283403 -886223 -2803982 -1561416
44465 -1561416 -137135 -981768 -3046799 -4160181 -4141104 -4051287 -3931400 -3006578 -1399002
44456 -1399002 -238984 -264815 -1109924 -1848929 -1818910 -1072682 -282678 -135372 -853422 -2292549
44446 -2292549 -3961965 -4693033 -3215714 102241 2905638 3366045 2385918 2071204 2772055
44437 2772055 3303751 3502576 4314748 5187982 3678688 -1220854 -6799427 -8903923 -5957205
44428 -5957205 -245851 4121342 4385987 1276142 -1686855 -1813777 -186598 52010 -1908228
44419a908228j665136Q29215K662356K716794K095540J072883j128833l412719
44411A261872l039868J20922K456595J370358j143727j620724Q1590J394647J140350
44402B022015N08672M24620K49834o72422j851527k381165j729377J60952K394484
44393h73914L019514R94056j776161k205232j34953J341363L45070j249768j071052
44384a611077K57122R86740J492637K645938K589656q65640n208411n172872m81030
44375e366937K990095J732660l09467J387901M134213K345356k866889m696087
44367f49155r05207K995946K298807n21636q35096R49850J136835q71725k034111
44358A564508n79338J872040K948634J854474q20000l527181m107113j694958
$$ plain form
44419 -1908228 -3573364 -2744149 -81793 2635001 4730541 5803424 4674591 1261872
44411 1261872 -1777996 -1657074 799521 2169879 1026152 -594572 -512982 881665 2022015
44402 2022015 2530687 2955307 3205141 2532719 681192 -1699973 -3429350 -3268398 -873914
44393 -873914 2145600 3139656 1363495 -841737 -976690 364673 709743 -540025 -1611077
44384 -1611077 -1353955 -367215 1125422 3771360 6361016 5495376 286965 -4885907 -5366937
44375 -5366937 -2376842 -644182 -953649 434252 4568465 6913821 4046932 -649155
44367 -649155 -1554362 1441584 3740391 3218755 2383659 3333509 4470344 3598619 1564508
44358 1564508 985170 2857210 5805844 7660318 6840318 3313137 -793976 -2488934
44350b488934J593335K629243J097308l07777K76882J681885K010805J360368
44342G853115R18820O14031n79730k442751l361286k632003j481740j112590r20391
44333c144525K44512J912161K566508J960022J151017K73183j655025m020922
44325g13069l960888j75128M188985M783242J460407j833014k305255j144468
44317C00812p20457j103181o10050J274589K815123J934310j122262l470777k689021
44308c390914n0139R33442n22183j431331j72367N29150j468906k976940j64789
44299h714977M271015M437293P75729m37800K280903K843515j848775n726795
44291b119892k957189K307294K239277k480367m202970k50363M007182M088068
$$ plain form
44350 -2488934 -895599 1733644 2830952 2523175 2800057 4481942 6492747 7853115
44342 7853115 8771935 9385966 8806236 6363485 3002199 370196 -1111544 -2224134 -3144525
44333 -3144525 -2900013 -987852 1578656 3538678 4689695 4962878 3307853 -713069
44325 -713069 -4673957 -4849085 -660100 4123142 5583549 3750535 1445280 300812
44317 300812 -419645 -1522826 -2132876 -858287 1956836 3891146 2768884 -701893 -3390914
44308 -3390914 -3441053 -2507611 -3029794 -4461125 -4633492 -4104342 -5573248 -8550188 -8714977
44299 -8714977 -4443962 -6669 769060 331260 2612163 5455678 3606903 -2119892
44291 -2119892 -5077081 -2769787 -530510 -3010877 -7213847 -7464210 -3457028 631040
44283F31040J864894P02466O15235M41818M81331N38188j131420m409050n755550
44274f021048k721520K137613M396058L225600J375456Q73512J126284Q70080
44266E262035L5727n64011l27484N76362J336489J263734M60264o25102j977619
44257E440395l466551l906822k184770O31088K014132J261688L39527P37925J337020
44248B203632O82083k96175K50629J903741K347901O44663j687849k916099k762903
44239C69623j601342K86627J905850J642603m53035j682010J42327L181697L453125
44230G245465K83792k577647k184669k02796L22942l51005j39448M29553q58719
44221A967468l083302k637439P32049K567319K60862k831993k581693j24315P78315
$$ plain form
44283 631040 2495934 3198400 3813635 4255453 4736784 5274972 4143552 -265498 -6021048
44274 -6021048 -8742568 -6604955 -2208897 1016703 2392159 3265671 4391955 5262035
44266 5262035 5297762 4733751 4406267 4982629 6319118 7582852 8043116 7418014 5440395
44257 5440395 1973844 -1932978 -4117748 -3486660 -1472528 -210840 128687 866612 2203632
44248 2203632 2885715 2589540 2840169 4743910 7091811 7736474 6048625 3132526 369623
44239 369623 -1231719 -945092 960758 2603361 2150326 468316 610643 3792340 7245465
44230 7245465 7529257 4951610 2766941 2564145 2887087 2536082 2396634 2826187 1967468
44221 1967468 -1115834 -3753273 -3021224 -453905 -193043 -3025036 -5606729 -5731044 -4952729
44212d952729r0274M6726J665295K365567J252055K27833O03223J351273J209795
44203C678764K36286r38302j513561n40336J469807J859693o74234k995101j349735
44194g66719K515828L276391L3167k324283p78818J670249J756794J201561K591126
44185I175296L707815Q22424m241832n447846j076544L318052K051899l368859
44177D940405o323922l332880K029156L935099J402432j277694q98037O16902
44169A091461J16223j378309n84662K045020K585961J10108j523595J74187K416903
44160E053297J819660m07972r69388M21146J612742J686617R90791p37396l194599
44151F274898m049218j890260P59754P65100o41224r5191J716193Q33551k900447
$$ plain form
44212 -4952729 -5043003 -4996277 -3330982 -965415 286640 514473 1117696 2468969 3678764
44203 3678764 3915050 2976748 1463187 922851 2392658 4252351 3578117 583016 -766719
44194 -766719 1749109 5025500 5058667 2734384 1955566 3625815 5382609 6584170 9175296
44185 9175296 12883111 13705535 9463703 4015857 2939313 6257365 8309264 4940405
44177 4940405 -1383517 -4716397 -2687241 1247858 2650290 1372596 474559 1091461
44169 1091461 1207684 -170625 -755287 1289733 3875694 3985802 2462207 2636394 5053297
44160 5053297 6872957 6464985 5495597 5916743 7529485 9216102 10206893 9469497 6274898
44151 6274898 2225680 335420 1095174 1860274 1219050 1123859 2840052 3673603 773156
44142G73156m507610j214875L184942L946768J972473J445042L076877L515090
44134A2191863Q81502k422575l117264j070991J122686J367314j54103j817475
44126F980957k227730j084748Q58942K244748J921519Q1947j427746q31645J240944
44117G757188K148254N89315j549510j783832l76120N67486N49116R84647K136633
44108A1023177K210390L49052j592689j683455o97194n78812j405802j872559
44100E752108j923552k529618l079896j625730J601105L362435J609057j402183
44092A763726k150498n76502N76566J54327m55302m13754m48199m50431P91805
44083a208262K488463J742414j645325l420593o17367L624099M296948J471337
$$ plain form
44142 773156 -3734454 -4949329 -1764387 2182381 4154854 5599896 8676773 12191863
44134 12191863 13073365 10650790 7533526 6462535 7585221 8952535 8798432 6980957
44126 6980957 4753227 3668479 4527421 6772169 8693688 8775635 7347889 6516244 7757188
44117 7757188 9905442 10494757 8945247 7161415 6785295 7352781 7901897 8886544 11023177
44108 11023177 13233567 13582619 11989930 10306475 9609281 9030469 7624667 5752108
44100 5752108 3828556 1298938 -1780958 -3406688 -1805583 1556852 3165909 1763726
44092 1763726 -386772 -963274 -386708 -232381 -687683 -1101437 -1549636 -2000067 -1208262
44083 -1208262 1280201 3022615 1377290 -2043303 -2660670 963429 5260377 6731714
44075F731714p30479m97296M43431R61929J562309J654122P6470j643563q15656
44066G742981J472432J416412j142734k296543p50508L95117j63187K43737K170575
44057I088282K004971q87701j433460K315153M034185j177078p684505p276514
44049a016667j659788J248255L8321k71375J120087O6258k909116k096220K824189
44040b656056M880529J192030k252145q51569J468515M2792k655589k416453o43536
44031c891482m68734n45470J268042K413950J47410k164833L7005M134370L865985
44022D796243n81190l051764j237587Q40042M25074l88174Q0727J12957j056943
44013f0615r71981J273082K191098r34911n106812n235961r35102L327971M038173
$$ plain form
44075 6731714 6001235 5503939 5947370 6909299 8471608 10125730 10202200 8558637 7742981
44066 7742981 9215413 10631825 9489091 7192548 6442040 6837157 6673970 6917707 9088282
44057 9088282 11093253 10205552 8772092 11087245 15121430 13944352 6259847 -1016667
44049 -1016667 -2676455 -1428200 -1389879 -1661254 -541167 -474909 -3384025 -5480245 -2656056
44040 -2656056 2224473 3416503 1164358 312789 1781304 1824096 -831493 -3247946 -3891482
44031 -3891482 -4360216 -4905686 -3637644 -1223694 -1076284 -3241117 -3204112 930258 4796243
44022 4796243 4215053 1163289 -74298 765744 1190818 802644 883371 996328 -60615
44013 -60615 -1032596 240486 2431584 1496673 -3610139 -8846100 -9781202 -6453231 -2415058
44004b415058K142721Q13247J428549K454711J877397P0094o33215N93588J509674
43995G841708k8548k698973l517896k097102o82143l43246K28074J807748K917891
43986C427513J931307o50881k730917k469290L37011L581660M056022R48225k432301
43977E998349k424762Q1811J059669o67894j998212o48444J486231J547195k09231
43968D224712j389539q10543Q08994K274706K643372J469002n87936k090084k314332
43959D228352j638881m48094J010358J752795R12651l27915K56259K515038L639056
43950A1899619J948981j118462l408684m147882l071304k19212K400469J917392
43942F200917j161719k752156r21515J309132R65468n00969o45060l94033j292236
$$ plain form
44004 -2415058 -272337 540910 1969459 4424170 6301567 6371661 5738446 6332034 7841708
43995 7841708 7813160 5114187 1596291 -500811 -1182954 -1526200 -1298126 509622 3427513
43986 3427513 5358820 4707939 1977022 -492268 -155257 3426403 7482425 8430650 5998349
43977 5998349 3573587 3655398 4715067 4047173 2048961 1400517 2886748 4433943 4224712
43968 4224712 2835173 2024630 2833624 5108330 7751702 9220704 8632768 6542684 4228352
43959 4228352 2589471 2141377 3151735 4904530 5817181 5489266 5745525 8260563 11899619
43950 11899619 13848600 12730138 9321454 5173572 2102268 1883056 4283525 6200917
43942 6200917 5039198 2287042 1365527 2674659 3640127 3139158 2494098 2100065 807829
43933H07829j521046P95828K856168R59112k752236l006894J13802J526743m9258
43924b69952j72182L044988N106294K474466j702729k932621j941466j717784
43916A889014j772961j06658J829608J087329j472779k388435j064099J75543
43908a823438O16009J441469K046831N81484j777223j672997O80536J252163j027165
43899C17669k092108K74610K051301n64317m214153l098321J713938L626093P06094
43890a279194j454378J390736N642710N466609J179368k090778k040795j148558
43882E665720j601060k356039j959694j007587m48959R1301Q78270J067402N87489
43873I16843R33407K356235K427743k17513k647041j279181K470803L767623J159489
$$ plain form
43933 807829 -713217 82611 2938779 3897891 1145655 -1861239 -1747437 -220694 -269952
43924 -269952 -442134 2602854 7709148 10183614 8480885 5548264 3606798 1889014
43916 1889014 116053 9395 1839003 2926332 1453553 -934882 -1998981 -1823438
43908 -1823438 -1207429 234040 2280871 2862355 1085132 -587865 92671 1344834 317669
43899 317669 -1774439 -1499829 551472 -12845 -4226998 -7325319 -5611381 -1985288 -1279194
43890 -1279194 -2733572 -1342836 4299874 9766483 10945851 8855073 6814278 5665720
43882 5665720 4064660 1708621 -251073 -1258660 -1707619 -1616318 -738048 329354 916843
43873 916843 1850250 4206485 6634228 6416715 3769674 2490493 4961296 8728919 9888408
43864I888408j879715k489589j778831j613895j605176j016640n70605l40583
43856a406626J222748L844595L974438j68343m655440m598293r13349J577988
43848a122282J323187Q93516J381760P48597j669211l310543k418256m61064Q43385
43839c790911J799107K664188K410136J143791Q10889J742014J499333p60117
43831G518430j878461N35008L658348L255422m0019k002031j218320m03175j610173
43822G815029l649452m645356m188786k319861R52881M183393M892167K727044
43814E767059M17335K44375J076281M77894j376742j923752j56426J635216J028763
43805G190003r25406j043247J266743K734877P02969k973309m403914k678331
$$ plain form
43864 9888408 8008693 5519104 3740273 2126378 521202 -495438 -1066043 -1406626
43856 -1406626 -183878 3660717 7635155 7466812 2811372 -1786921 -2700270 -1122282
43848 -1122282 200905 1094421 2476181 3224778 1555567 -1754976 -4173232 -4634296 -3790911
43839 -3790911 -1991804 672384 3082520 4226311 5037200 6779214 8278547 7518430
43831 7518430 5639969 6174977 9833325 13088747 13048728 11046697 9828377 9425202 7815029
43822 7815029 4165577 -479779 -4668565 -6988426 -6035545 -1852152 3040015 5767059
43814 5767059 6184394 6428769 7505050 7982944 6606202 4682450 4526024 6161240 7190003
43805 7190003 6264597 5221350 6488093 9222970 9925939 6952630 2548716 -129615
43797a29615P8657K564290M884372N736512L144964j225075k707196k91591J452883
43788A3508201n43208l092986k391775k46261j64750q37275R28308L466157K728145
43779A3354556j62007n17568J432885P31015l178535m722235j457350J770875
43771G251636R05780j257518q55441O89688N25687j03178J025746K390544J944492
43762A2517436J495851K865712L120115o75242m906789m087031l1637O68849k531643
43753H435621l286063R71852M776823L488874J35891k70639J569012J538000j097883
43744A6261488l357413l227664j326383R77365K515617K314379O27235q73937
43736A3910687j246583j291054j382701l94880J661330K362428N82111p94674
$$ plain form
43797 -129615 -50958 2513332 7397704 13134216 16279180 15054105 12346909 12055318 13508201
43788 13508201 12964993 9872007 7480232 7233971 7069221 6231946 7160254 10626411 13354556
43779 13354556 13192549 12674981 14107866 14838881 11660346 6938111 5480761 7251636
43771 7251636 8157416 6899898 6044457 6734145 7259832 7156654 8182400 10572944 12517436
43762 12517436 14013287 16878999 19999114 19323872 14417083 10330052 10298415 10967264 8435621
43753 8435621 5149558 6121410 10898233 14387107 14522998 14252359 15821371 17359371 16261488
43744 16261488 12904075 9676411 8350028 9327393 11843010 14157389 14784624 13910687
43736 13910687 12664104 11373050 9990349 9595469 11256799 13619227 14201338 13406664
43728A3406664J078395M051240L729855J24208k500246k256043j864636l254099
43720A2515338l988492j465512K329335L366374J187325j036346j211575k27713
43712A1468734O17383J284485J560660M99025j462348j855934N18035K996216
43704A5626256J960006k112793m678741k593186K183145N127927M051381M02463
43696A9966458l179992n051281m723528k560916J62951J913863K246421J988816
43688A0762792J782215J212722m3780j081987q80219n6732r4926q61987n57804
43679A0180294J299375K549267J342238r93224j843209j003147k26784J72204
43671A1477014J369534K708357J683312j714688l871113k607455m09155k01781
$$ plain form
43728 13406664 14485059 18536299 22266154 22390362 19890116 17634073 15769437 12515338
43720 12515338 8526846 7061334 9390669 12757043 13944368 12908022 11696447 11468734
43712 11468734 12086117 13370602 14931262 15430287 13967939 12112005 12630040 15626256
43704 15626256 17586262 15473469 10794728 8201542 10384687 15512614 19563995 19966458
43696 19966458 16786466 11735185 7011657 4450741 4613692 6527555 8773976 10762792
43688 10762792 12545007 13757729 13713949 12631962 11751743 11695011 11600085 10738098 10180294
43679 10180294 11479669 14028936 15371174 14377950 12534741 11531594 11304810 11477014
43671 11477014 12846548 15554905 17238217 15523529 11652416 9044961 8635806 8434025
43663H434025p99758J89698J504637M89695j534729j005752J536956J959068m31797
43654A0342043j629289Q7194J134370j076879l613540l115178j353237j590190
43646h14706k518814n65704L573274N459714L468930O61795k50219l61066j907838
43637F745366m525127n597134l470272M82481L102219K993152K283005L427782
43629E441472M926152L175158j214046l026196p7582K999300J693234j580889
43621A2336603j873865L38448Q06698j029760j893705r91636q69786j971178j616509
43612C235310Q20353K365112J182158j078745k559377l048285j886056J903104
43604I33574O283173O966803L043550j478643k986802j908060j91513J224187
$$ plain form
43663 8434025 7634267 7823965 9328602 9818297 8283568 7277816 8814772 10773840 10342043
43654 10342043 8712754 8799948 9934318 8857439 5243899 2128721 775484 -814706
43646 -814706 -3333520 -3899224 -325950 5133764 8602694 9264489 9014270 8653204 6745366
43637 6745366 2220239 -3376895 -6847167 -6364686 -3262467 -269315 2013690 5441472
43629 5441472 10367624 13542782 12328736 9302540 9224958 12224258 13917492 12336603
43621 12336603 10462738 10801186 11607884 10578124 8684419 7692783 6822997 4851819 3235310
43612 3235310 4055663 6420775 7602933 6524188 3964811 916526 -969530 933574
43604 933574 7216747 14183550 17227100 15748457 12761655 10853595 10662082 11886269
43596A1886269J363719o24659k993857k715274l45081L98814j061484j026915
43588D881532J697319L189464J278387k91131J621721L729523J813369j940971
43580A5979213k513869n9635J188297Q3451p45905k66267o5237m25624J85801
43571A3360225J714925K314874J485978K71933j180863l072040l675769j166877
43563A0052386K643287L873239J800395o35645j387489j164871q11246o9673O75087
43554A4975470K51967j215763k255408k080855q46843J307919L308862K726469
43546A6171818p04137k810988j57535L956376L562120o87756k106942J605408
43538A8828364M675659K219558k599203l887556j242706J401640K113329J987363
$$ plain form
43596 11886269 13249988 12625329 9631472 6916198 6571117 6969931 5908447 4881532
43588 4881532 6578851 9768315 11046702 10755571 12377292 16106815 17920184 15979213
43580 15979213 13465344 13405709 14594006 14677457 13931552 13665285 13600048 13174424 13360225
43571 13360225 15075150 17390024 18876002 19147935 17967072 14895032 11219263 10052386
43563 10052386 12695673 16568912 18369307 17733662 16346173 15181302 14370056 14300383 14975470
43554 14975470 15227437 14011674 11756266 9675411 8828568 10136487 13445349 16171818
43546 16171818 15467681 12656693 12499158 16455534 20017654 19329898 17222956 18828364
43538 18828364 23504023 25723581 23124378 19236822 17994116 19395756 21509085 23496448
43530B3496448J685410P58934m06331q61537p34834n29711K71435J970491L178372
43521B8828677K669890J658175K011701L039358K370320l45625k742317k739134
43513C4751045n93094J999091L383095K589114m8427k661398l300897j893650
43505C4224879r9415P22403O85611O02742Q48623J217842J436605J531281J733567
43496D2904138K028839J906617Q34798j002280k642719k950173j241717K098599
43488D1936102N223464N859809L706212J216893R02667K398012L482737L395616
43480F8121512L329928L805059L561984J623671j045849k605054k090741J19521
43472G4820031K599004L621034K762519J720945K405897M499417O197365O799710
$$ plain form
43530 23496448 25181858 25940792 25534461 24672924 23938090 23408379 23679814 25650305 28828677
43521 28828677 31498567 33156742 35168443 38207801 40578121 40232496 37490179 34751045
43513 34751045 34157951 36157042 39540137 42129251 42080824 39419426 36118529 34224879
43505 34224879 34125464 34847867 35533478 36136220 36984843 38202685 39639290 41170571 42904138
43496 42904138 44932977 46839594 47674392 46672112 44029393 41079220 39837503 41936102
43488 41936102 47159566 53019375 56725587 57942480 58845147 61243159 64725896 68121512
43480 68121512 71451440 75256499 78818483 80442154 79396305 76791251 74700510 74820031
43472 74820031 77419035 81040069 83802588 85523533 87929430 92428847 98626212 105425922
43464A05425922O839673O288997M905801L933906M774953O095942N268963K897683
43456A46431840K514196N009625P041727O505994N866356P599092R694367R010645
43448A99673842O593617N980054P826675R798799J0718713J1315022J1483663
43441B63390385J0347214R024531R963674J2889489J4384328J2657680J0353697
43434C43010998J1065499J4564635J6992207J5180016R952703N408966M979928
43427D21154952P747731R209476O692314L118796L317266O953004Q167747L458037
43419D69819323k937426m308343n75121J496623k611459r411713j2645048j1525613
43411D27301223j0467346j1905493j3501674j3067725j2317494j3441025j4903731
$$ plain form
43464 105425922 112265595 118554592 123460393 127394299 132169252 138265194 143534157 146431840
43456 146431840 148946036 153955661 160997388 167503382 173369738 180968830 190663197 199673842
43448 199673842 206267459 212247513 220074188 229872987 240591700 251906722 263390385
43441 263390385 273737599 282762130 292725804 305615293 319999621 332657301 343010998
43434 343010998 354076497 368641132 385633339 400813355 410766058 416175024 421154952
43427 421154952 428902683 438112159 444804473 447923269 451240535 458193539 466361286 469819323
43419 469819323 466881897 462573554 461998433 463495056 460883597 451471884 438826836 427301223
43411 427301223 416833877 404928384 391426710 378358985 366041491 352600466 337696735
43404C37696735j3923987j1442923j1089074j3721735j6199213j5752534j3021866
43397B42545403j0503337j0105435j2120438j4427159j3243564p464640j761883
43390A72918947j893715o980822j0391818q776959n740070n175246n798609n098899
43382A23062809m396266n931575p920982o871791l155485l99517l03148j373141
43374I2710904k165844k870428l899362n014190n577869m552244j491634J468965
43366F8608298Q74798l169089n977649m323458p46947P88722N20349P03967P05140
43357E7984131j341236m027027m433325l020574k374947k324225q07371J428208
43349D1083634J673095J03704p74197q14178j654474k290072n34516J625162R5313
$$ plain form
43404 337696735 323772748 312329825 301240751 287519016 271319803 255567269 242545403
43397 242545403 232042066 221936631 209816193 195389034 182145470 174680830 172918947
43390 172918947 171025232 164044410 153652592 144875633 139135563 133960317 128161708 123062809
43382 123062809 118666543 112734968 104813986 97942195 94786710 94387193 94084045 92710904
43374 92710904 90545060 87674632 83775270 78761080 73183211 68630967 67139333 68608298
43366 68608298 69483096 66314007 60336358 56012900 55265953 56054675 56575024 57278991 57984131
43357 57984131 56642895 52615868 48182543 45161969 42787022 40462797 39655426 41083634
43349 41083634 42756729 42860433 42086236 41272058 39617584 37327512 36792996 38418158 38513471
43340C8513471l745245l951019L72775K918290p3656m131095l949926j015746
43332B4937849K13132p05939j311679r10668j38024J356086L230979L048803j94390
43323B9526149l587110m274933l261436k435582r45584K060665M119646K834099
43315B4035914J08207q72386n36623q50628q50069J091012K550304q8383m991631
43306A9595717o283461k181946K767816M050978J859202j107710k881084k506004
43298A3313508k48187J651018R81821j259934k089446q49799M09397P38543J332439
43289A3979360K455339K439297N49904j723786k921170k916346j757096L37637
43281A0443139J731516Q80364p33109j33795K388502L279028J031079j895621
$$ plain form
43340 38513471 34768226 30817207 31189982 34108272 34034616 29903521 25953595 24937849
43332 24937849 25150981 24445042 23133363 22222695 22084671 23440757 26671736 29720539 29526149
43323 29526149 25939039 21664106 18402670 15967088 15021504 17082169 21201815 24035914
43315 24035914 24144121 23271735 22735112 21884484 21034415 22125427 24675731 24587348 19595717
43306 19595717 13312256 11130310 13898126 17949104 19808306 18700596 15819512 13313508
43298 13313508 13065321 14716339 15698160 14438226 12348780 11498981 11908378 12646921 13979360
43289 13979360 16434699 18873996 19423900 17700114 14778944 11862598 10105502 10443139
43281 10443139 12174655 13055019 12321910 12188115 14576617 17855645 18886724 16991103
43273A6991103l296249l715199l451869j047958K966984M484242J196825l102486
43265A1025393l071492J109880M494835L932893P23948k474029m271044m188967
43257G281417k357303l3578J311204J646527J860983J892728R03901q42269j823253
43248I840357j178307K65366J012291L16680j185444j815488m80322J605860K005370
43239A0386363N78098K20739K597590M883002L228070j559387m680033l529802
43231A2124640m79703R64176K44160j022162j790791k016054j545503r3270J968638
43222H354131L473805L068609K98676l201013m346116k027698O71871J5666k784182
43213C523749k635418J879290N572838L716643j013630k428464K14753J757503
$$ plain form
43273 16991103 13694854 9979655 6527786 5479828 8446812 12931054 14127879 11025393
43265 11025393 7953901 9063781 13558616 17491509 18215457 15741428 11470384 7281417
43257 7281417 4924114 4890536 6201740 7848267 9709250 11601978 12505879 11663610 9840357
43248 9840357 8662050 8927416 9939707 10256387 9070943 7255455 6775133 8380993 10386363
43239 10386363 10964461 11185200 13782790 18665792 21893862 20334475 15654442 12124640
43231 12124640 11644937 12609113 12853273 11831111 10040320 8024266 6478763 6385493 8354131
43222 8354131 11827936 14896545 15195221 11994208 7648092 5620394 6292265 6307931 3523749
43213 3523749 888331 2767621 8340459 12057102 11043472 8615008 8829761 10587264
43205A0587264o34701l568434l181790o86316O13888Q00886K122541L874398K671096
43196A2598832j883008n349559l964429K92853K355371O56347j376077m88023
43188B842307K012767K478624K31554j626070q36507R16573J034993L01217J407734
43179H763192L824789L566415q46754n216166m782328m81463K700836K336287
43171I864808L75281j057056k127390k953688k178495L55348K060569J052697
43163E392074o35062Q5752K355990K261162j203752m030653k479116J633756L218294
43154F598445O56046k304966j873283Q99409K248457J113517j77965j50512r0665
43145F918483r89917j430899k25611J188474J177736O91696J006029O27425k147771
$$ plain form
43205 10587264 9952563 6384129 3202339 2516023 3129911 3930797 6053338 9927736 12598832
43196 12598832 10715824 5366265 1401836 1694689 4050060 4706407 3330330 2842307
43188 2842307 4855074 7333698 7565252 5939182 5102675 6019248 7054241 7355458 8763192
43179 8763192 12587981 16154396 15307642 10091476 5309148 4827685 7528521 9864808
43171 9864808 10240089 9183033 7055643 4101955 1923460 2278808 4339377 5392074
43163 5392074 4757012 4842764 7198754 9459916 8256164 4225511 1746395 3380151 6598445
43154 6598445 7254491 4949525 3076242 3975651 6224108 7337625 7159660 7009148 6918483
43145 6918483 5928566 4497667 4272056 5460530 6638266 7329962 8335991 8963416 6815645
43136F815645m993761l969603K97456L077139K407838J189416J582331J828612
43128H235073M32685p42424j05121O24977j47484p78466J99018P53636j030168
43119G441726k969684k349753q14444j319559k518352j165161J522670J344223
43111h28334j665586k849703n0271L687658N165788M396906K258379q38206l001429
43102F275202j882516J125972J763476q17802k786049j925497o76543j049566
43094B6677j164426N16321J831500R00912m46621m82691r91495l231109m199198
43085g240130j194954L075765M427993L344045K564581J519491j385520l507799
43077A603472j386187K170234J317627l003519l733636J037040M773224K759724
$$ plain form
43136 6815645 1821884 -2147719 -1850263 1226876 3634714 4824130 6406461 8235073
43128 8235073 8667758 7925334 7820213 8445190 8297706 7519240 7718258 8471894 7441726
43119 7441726 4472042 2122289 1307845 -11714 -2530066 -3695227 -2172557 -828334
43111 -828334 -2493920 -5343623 -5393894 -1706236 3459552 7856458 10114837 9276631 6275202
43102 6275202 4392686 5518658 7282134 6464332 3678283 1752786 1076243 26677
43094 26677 -1137749 -621428 1210072 2110984 1664363 1181672 190177 -3040932 -7240130
43085 -7240130 -8435084 -5359319 -931326 2412719 4977300 6496791 5111271 1603472
43077 1603472 217285 2387519 3705146 701627 -3032009 -1994969 2778255 5537979
43069E537979j134031j566499K95227N44136m53246j13520P18334l21232j821385
43060A685763o58506J934792J716118j413725k674478L54409M094606M163058
43052I202037Q85081k211822k977228j950287p90588q09072j878728k068588K94784
43043b304411L799850M973696K722185k38311j225890p29776m94599p13928r46551
43034D842265j783569l205503k931139O03978M534406M190433m18788l933484
43026A898599k526561J230931K220231m36859k874325k045452O60764J975173
43018A02501J198225M78625J044503J148626r42195l311067k444102J105087K499630
43009H79833l16932k808956m53020L755007L470560q73821k462950R46551L323563
$$ plain form
43069 5537979 4403948 2837449 3132676 3676812 3223566 3110046 3828380 3507148 1685763
43060 1685763 1027257 2962049 4678167 3264442 589964 944373 5038979 9202037
43052 9202037 10087118 7875296 4898068 2947781 2157193 1348121 -530607 -2599195 -2304411
43043 -2304411 1495439 6469135 9191320 8953009 7727119 6997343 6502744 5788816 4842265
43034 4842265 3058696 -146807 -3077946 -2473968 2060438 6250871 5832083 1898599
43026 1898599 -627962 602969 2823200 2386341 -487984 -2533436 -1872672 102501
43018 102501 1300726 1779351 2823854 3972480 3030285 -280782 -2724884 -1619797 879833
43009 879833 562901 -2246055 -2699075 1055932 4526492 3652671 1189721 2136272 5459835
43000E459835L28511l432528j944218K483433L213381k99682k804529k194320
42992H09883j362877j607134q29083J008460R09236j163572j224750J630150K774442
42983I44755k47303k918038p17515L625324M598685K073725j00163r57977k386353
42974C915140l824073k569954Q82176K742459J639226K44276M41447P33108k83394
42965C920411j234987o01048M33266k39056k356713l372322j390606K566385N027573
42956B752903L264434j322571m011127k141679J626329L164002K276614J513098
42948G122003J131404p40910l348572l270804j55428J751568j15086k473852j195657
42939a295334K386807L695637J629707p53789j607857k431418m080453m084899
$$ plain form
43000 5459835 5788346 2355818 411600 2895033 6108414 5808732 3004203 809883
42992 809883 -552994 -2160128 -2989211 -1980751 -1071515 -2235087 -3459837 -1829687 944755
42983 944755 697452 -2220586 -2938101 687223 5285908 7359633 7259470 6301493 3915140
42974 3915140 91067 -2478887 -1596711 1145748 2784974 3029250 3470697 4203805 3920411
42965 3920411 2685424 2084376 2517642 2278586 -78127 -3450449 -4841055 -2274670 2752903
42956 2752903 6017337 4694766 683639 -1458040 168289 3332291 5608905 7122003
42948 7122003 8253407 7512497 4163925 893121 737693 2489261 2374175 -99677 -1295334
42939 -1295334 1091473 4787110 6416817 5663028 4055171 1623753 -2456700 -6541599
42931f541599k90432M698357N732857J774756k295524j839569J578447K803563
42923E620856M86550j613659r84963j6651j251659k647410j203113J322511R37476
42914F49938j713005k033600J106762L641982K826293P30524l12008j140888k360410
42905A395588j904466Q01742K085411o80075m120258l519093l5176J449213N9257
42896d467857n97589Q77569J719656M70909l03710J426520L652076L665395K009985
42887H452954O63924l40967j737110k245515k00358K755240K820368o86476l924842
42878E557218l581079j065223K08000n5671N48671K331418K654470O37807p70064
42869F465547M31344J553522l50400k783026j227212K961895L679552n32250m045258
$$ plain form
42931 -6541599 -6832031 -2133674 3599183 5373939 3078415 1238846 2817293 5620856
42923 5620856 6107406 4493747 3508784 3492133 2240474 -406936 -1610049 -287538 649938
42914 649938 -1063067 -3096667 -1989905 1652077 4478370 5208894 4896886 3755998 1395588
42905 1395588 -508878 292864 2378275 1698200 -2422058 -5941151 -5976327 -4527114 -4467857
42896 -4467857 -5065446 -4187877 -2468221 -1997312 -2301022 -874502 2777574 6442969 8452954
42887 8452954 9116878 8775911 7038801 4793286 4592928 7348168 10168536 9482060 5557218
42878 5557218 1976139 910916 1118916 1063245 1611916 3943334 6597804 7235611 6465547
42869 6465547 6896891 8450413 8100013 5316987 4089775 7051670 10731222 10198972 6153714
42860F153714l008939q81857j615619k660610k7775L725267L048145j266895l024386
42851D41045l17972K124212R09602j605702k396204j931954j097446J207099M545784
42842A878464N246400J654141k214402j828786J627539L662406K885263J325381
42834A4236406J0582j830299l813150m198071k734621j047925j63469J57485o2224
42825E54714q36318q83477R89971L228722K873571r9167k342217j734425N1947
42816A803321O88434N51060J179444K168592J874692L69761n56474k73599j83397
42807G621834j141450j706887k85453K000334K421616N58122q37042K30654J954277
42798A0816005J436356p83025j573508l09884M8117k038087l694360j964865J171154
$$ plain form
42860 6153714 3144775 2262918 647299 -2013311 -2041086 1684181 4732326 3465431 441045
42851 441045 123073 2247285 3156887 1551185 -845019 -2776973 -3874419 -2667320 1878464
42842 1878464 7124864 8779005 6564603 4735817 6363356 10025762 12911025 14236406
42834 14236406 14246988 12416689 8603539 4405468 1670847 622922 459453 616938 554714
42825 554714 -281604 -1165081 -175110 3053612 5927183 5828016 3485799 1751374 1803321
42816 1803321 2491755 3042815 4222259 6390851 8265543 8635304 8078830 7805231 7621834
42807 7621834 6480384 4773497 4488044 6488378 8909994 9468116 8631074 8861728 10816005
42798 10816005 12252361 11469336 9895828 9585944 9634061 7595974 3901614 1936749 3107903
42789C107903J349915j629076l220322l95739M323786O185011L647786p07273
42781A2661991l502892l617920k419233j720070j630978p29376J434919L033569
42773C510010K267682O4847j192204r84795o92817p20286o4513J055588P89907
42764D033419j193442k487022j242230J180463K277552J502159o5815j521604
42756B483480k090183q77945J529607K585135Q34165j668705j957058j52495J191503
42747A877504Q49835j90739r37944j186075n43236J045937K114396J299009j36428
42738D192259J51436J765760K084448N94045m39811q2643n3278q45876k13223
42729G153117K422048L556007P17554k810748k280137J284890K416745p89835
$$ plain form
42789 3107903 4457818 2828742 -391580 -787319 3536467 9721478 13369264 12661991
42781 12661991 9159099 5541179 3121946 1401876 -229102 -958478 476441 3510010
42773 3510010 5777692 5842539 4650335 3665540 2972723 2252437 2187924 3243512 4033419
42764 4033419 2839977 352955 -889275 291188 2568740 4070899 4005084 2483480
42756 2483480 393297 -484648 1044959 3630094 4464259 2795554 838496 686001 1877504
42747 1877504 2727339 2536600 1598656 412581 -130655 915282 3029678 4328687 4192259
42738 4192259 4343695 6109455 8193903 8787948 8348137 8265494 8212216 7366340 7153117
42729 7153117 9575165 13131172 13848726 11037978 8757841 10042731 12459476 11669641
42721A1669641m200461l805800q08082R55280J51682j277415j114916P34430K268806
42712D573165J436301j198785k344996l3965K884824J852104k753303n230926
42704h15581k093718K932599L785129j13292l777319l432975n10900J228787L11590
42695b485680j512135j752541J17658K159766K168165M02896o83203J96123J414379
42686B5428J057483j76079m63858m5665m79021j261001p1388L145266N039964
42677F771129L152883o63484k789751k349614j322330j147951j343359j271801
42669i64278j245198j299966m53614J689455L486208K833565J34883j642822n36162
42660B002071J788206K197069L18315j167573o21334L05636k85830j248378l89715
$$ plain form
42721 11669641 7469180 3663380 2855298 3810578 3962260 2684845 1569929 2304359 4573165
42712 4573165 6009466 4810681 2465685 2431720 5316544 7168648 4415345 -815581
42704 -815581 -2909299 23300 3808429 3695137 -82182 -3515157 -4026057 -2797270 -2485680
42695 -2485680 -3997815 -5750356 -5632698 -3472932 -1304767 -901871 -1585074 -1388951 25428
42686 25428 1082911 906832 442974 397309 -81712 -1342713 -1414101 1731165 6771129
42677 6771129 9924012 9260528 6470777 4121163 2798833 1650882 307523 -964278
42669 -964278 -2209476 -3509442 -3963056 -2273601 1212607 4046172 4181055 2538233 2002071
42660 2002071 3790277 5987346 6305661 5138088 4516754 4822390 4536560 3288182 2898467
42651B898467J517198J617552m73462k017826j458094l77877j27667M93379K301435
42642D373105L158946J045248k157315k890579q04270J372789J964351J500523
42634G562798M12144j340808k575921j924787n67522p53965j557198R8712L578928
42625B932381M167441L76250k874533j496124J431421Q71915j942741j965182
42617A500828J018922K371128P70078L9002J678694J748480j950840m888756k311710
42608b4174K980554M289181L65343l678617l910741j568505N60374J703473K030993
42599B747881J228803k57418o70030Q45816K754707K908594R23018j740188l180370
42590E560813k396597k69156Q51132k10024j477585k40742K717725L629755R69720
$$ plain form
42651 2898467 4415665 6033217 5559755 3541929 2083835 1705958 1578291 2071670 4373105
42642 4373105 7532051 8577299 6419984 3529405 2725135 4097924 6062275 7562798
42634 7562798 7974942 6634134 4058213 2133426 1565904 811939 -745259 -646547 2932381
42625 2932381 7099822 7476072 4601539 3105415 4536836 5408751 3466010 1500828
42617 1500828 2519750 4890878 5660956 5699958 7378652 9127132 7176292 2287536 -24174
42608 -24174 2956380 7245561 7610904 3932287 21546 -1546959 -986585 716888 2747881
42599 2747881 3976684 3719266 3049236 3895052 6649759 9558353 10481371 8741183 5560813
42590 5560813 3164216 2895060 3746192 3536168 2058583 1817841 4535566 8165321 9135041
42581I135041k276693k774078j096103j14362q53508j988480k337178j771011
42573d076372k32981K228970M553182N247235L932669J447393j180301k977184
42565H942611l015371j471784j12519l09630j094751p25128L59669J35454j586355
42556A122196k589633j650661l86586n66050j330787p62526Q94600J490115J62173
42547c617159j387605j157159P15146K289784J979788n8205k237508k802002j059713
42538g334633K074537M619187M887677K633816r17986l940983m885435l090199
42530e954019O00631L781716M122967J807353m18781n40266K13572m35967j900173
42521A277033j357468J568219L459446J726582j656151k943343j455983N36236
$$ plain form
42581 9135041 6858348 4084270 2988167 2873805 2020297 31817 -2305361 -4076372
42573 -4076372 -4309353 -2080383 2472799 7720034 11652703 13100096 11919795 8942611
42565 8942611 5927240 4455456 4342937 4033307 2938556 2213428 2573097 2708551 1122196
42556 1122196 -1467437 -3118098 -3504684 -4070734 -5401521 -6164047 -5269447 -3779332 -3617159
42547 -3617159 -5004764 -6161923 -5446777 -3156993 -1177205 -1235410 -3472918 -6274920 -7334633
42538 -7334633 -5260096 -640909 4246768 6880584 5962598 2021615 -2863820 -5954019
42530 -5954019 -5353388 -1571672 2551295 4358648 3939867 3399601 3613173 3177206 1277033
42521 1277033 -80435 1487784 4947230 6673812 5017661 2074318 618335 1154571
42513A154571J418552J264500K13027j528047k519041j517258J99508N05412J7206
42504g91570Q91068K237170P83484l022242m055431r10M309503L610273j24303
42495C837042j289347N01920P35206j726834k692945m2945K373240Q86787k206699
42486C75425k544002l70788O10739p00827j828459j120028M13176J692773K864097
42477f07894L447935K011682j204526l525920l022311q34465Q36798J540574K020050
42468F61923K157790J195054n80002j818068j650412l96969R30137J193694j23577
42459A569570j912820j944359N38929L385491L869480J855139o23035k187936
42451D550459k818329k300247k40316K236687L038033K006517J254240J728614
$$ plain form
42513 1154571 2573123 3837623 4050650 2522603 3562 -1513696 -1314188 -808776 -791570
42504 -791570 99498 2336668 3120152 97910 -3957521 -3958431 351072 3961345 3837042
42495 3837042 2547695 3049615 3784821 2057987 -634958 -677903 1695337 2582124 375425
42486 375425 -2168577 -2539365 -1928626 -2629453 -4457912 -5577940 -5164764 -3471991 -607894
42477 -607894 2840041 4851723 3647197 121277 -2901034 -3735499 -2898701 -1358127 661923
42468 661923 2819713 4014767 3434765 1616697 -33715 -430684 499453 1693147 1569570
42459 1569570 -343250 -2287609 -1748680 1636811 5506291 7361430 6738395 4550459
42451 4550459 1732130 -568117 -808433 1428254 4466287 6472804 7727044 9455658
42443I455658J560070p48305l458923l988016k692833j808336j491189K04893
42435b966981L343708M962346L110080o7766j068624L30081J111167o19310l114462
42426E020239l379544q69011K201862L653117L238108J729253n03012l018465
42418H072547m322777l017562l4711J739742P29422j481573k287762j134778M50472
42409a286980J160240J121945J114827J506661J953795J683519L01665j393457
42401F162215j983309j242288o08036j164013j950596j252133R99370L100378
42393B061588L487405J962237n45843k609557l088828k033407m86668R17402K293348
42384A957677L120945K124871l98388j828336n60047J287365O54336k012237l500111
$$ plain form
42443 9455658 11015728 10267423 6808500 2820484 127651 -1680685 -3171874 -2966981
42435 -2966981 376727 5339073 8449153 8381387 7312763 7642844 8754011 8134701 5020239
42426 5020239 1640695 771684 2973546 6626663 9864771 11594024 11091012 8072547
42418 8072547 3749770 732208 697497 2437239 3166661 1685088 -602674 -1737452 -1286980
42409 -1286980 -126740 995205 2110032 3616693 5570488 7254007 7555672 6162215
42401 6162215 4178906 2936618 2328582 1164569 -786027 -2038160 -1038790 2061588
42393 2061588 5548993 7511230 6965387 4355830 1267002 -766405 -1253073 -335671 1957677
42384 1957677 5078622 7203493 6805105 4976769 4416722 5704087 6358423 4346186 846075
42375H46075k331962J2746J991800L409245L849841K404930l63495k366715k628333
42366D824132k203762k033135j743641j046563m75713k30118N8601J96028j52700
42357b806871j7742J616458L190571K061090j092184k584829j249163j01161j012879
42348a996710j452143Q97387L544998K741578n54408j996058l8195K578774L107615
42339F832838J605111n71082k564391l781003l561006j815057N70555K006952
42331a277083R91133k236393m660151l039611J682070M667762L225642L02085
42323c44546N9680K198957L256901J836731l70848j752580k208087j979451j346456
42314f49699j038458j146506m32249J583940L061641K295684L81150o63139q98225
$$ plain form
42375 846075 -1485887 -1473141 518659 3927904 7777745 10182675 9819180 7452465 4824132
42366 4824132 2620370 587235 -1156406 -2202969 -2678682 -2908800 -2850199 -2654171 -2806871
42357 -2806871 -2824613 -1208155 1982416 4043506 2951322 366493 -882670 -983831 -1996710
42348 -1996710 -3448853 -2551466 993532 3735110 3180702 1184644 1146449 3725223 6832838
42339 6832838 8437949 7866867 5302476 1521473 -2039533 -3854590 -3284035 -1277083
42331 -1277083 -285950 -2522343 -7182494 -10222105 -8540035 -3872273 -646631 -344546
42323 -344546 -284866 1914091 5170992 7007723 6636875 4884295 2676208 696757 -649699
42314 -649699 -1688157 -2834663 -3266912 -1682972 1378669 3674353 4055503 3392364 2494139
42305B494139j235427r23842Q48200K374103J676612O4431O2365R61438J51350
42296F473369j995134k558189r30497P42488J707973L041031L945772K060404
42288A2487217j911222m134994l213063j790985j535460p34203J485708K703385
42280C356383J283303o12680o15503J94492k89137j614526j976467r79043P01598
42271e51580K458463L116633J432945j394155k229496m24800R79336n4430j694060
42262A638856j854449j490822k012266k417467j535113l52552L63894J867318
42254e792601M216285M447246J212633j799164r20660J668538J464748j132740
42246C364285j819097O14761K875546K395194N0550k198753l089849j844909P55822
$$ plain form
42305 2494139 1258712 334870 1183070 3557173 5233785 5298216 5360581 6322019 6473369
42296 6473369 4478235 1920046 989549 1732037 3440010 6481041 10426813 12487217
42288 12487217 10575995 6441001 3227938 1436953 -98507 -832710 652998 3356383
42280 3356383 4639686 4027006 3411503 3605995 3316858 1702332 -274135 -1253178 -551580
42271 -551580 1906883 5023516 6456461 5062306 2832810 2408010 3387346 3332916 1638856
42262 1638856 -215593 -1706415 -3718681 -6136148 -7671261 -8023813 -7659919 -5792601
42254 -5792601 -1576316 2870930 4083563 2284399 1363739 3032277 4497025 3364285
42246 3364285 1545188 2159949 5035495 7430689 7481239 5282486 2192637 347728 1103550
42237A103550J755281m38672k870507j824850J336792K213764M02922k71183J419391
42228B826488K075880l66424l186018l321853j560772j71021M96657Q69250L59214
42219a978599j000312j385682J06012J446761N63555j314552j398535O54333K552415
42210a754604K586018J236733k35760j347862k211504k582502j728636M58952
42202e579165K466670K331062L10235r66549j52961N89849j008827l193536k376656
42193g579878J259352L679359K634377K04591q72725l83808P45950K063800K577553
42184D328571R31803j867784k531430q2851K097483R57143j765144k338994n08861
42175g80064P94390J60377r32311j269083j587758k386583k238805J68474L297148
$$ plain form
42237 1103550 2858831 2420159 -450348 -2275198 -938406 1275358 1678280 1407097 2826488
42228 2826488 4902368 4535944 1349926 -1971927 -3532699 -3703720 -3207063 -2337813 -1978599
42219 -1978599 -2978911 -4364593 -4258581 -2811820 -2248265 -3562817 -4961352 -4307019 -1754604
42210 -1754604 831414 2068147 1832387 484525 -1726979 -4309481 -6038117 -5579165
42202 -5579165 -3112495 -781433 -471198 -1437747 -1590708 -1000859 -2009686 -5203222 -7579878
42193 -7579878 -6320526 -2641167 -6790 197801 -674924 -1058732 -312782 1751018 4328571
42184 4328571 5260374 3392590 861160 778309 2875792 3832935 2067791 -271203 -780064
42175 -780064 14326 174703 -757608 -2026691 -3614449 -6001032 -8239837 -8071363 -4774215
42166d774215L784590O00947k951933k723034J074824L996973L302370J375688
42158C686210J360378J916722m0025l008791k310167K080944M437358J737313
42150I859942j806964j673348J17985n76272k458698j284390K118317K489270
42142F785842j276399l873037j358518L425972N363608L344991l43783l753515
42134H315161n494039l766801J269136N501295M744951K42282k818611k215764
42126E777610q41035j343398k232872j323413L2217o34356k233476j687423P00349
42117c785797J516246l4257q86773L69166J066215l63147j064238J053810K675846
42108E47071K36612l233266k068793K798029M676992J086514l050060l200593
$$ plain form
42166 -4774215 -989625 -388678 -3340611 -6063645 -4988821 -991848 2310522 3686210
42158 3686210 5046588 6963310 6923285 3914494 1604327 3685271 8122629 9859942
42150 9859942 8052978 6379630 6497615 5921343 3462645 2178255 4296572 6785842
42142 6785842 5509443 1636406 277888 3703860 9067468 12412459 12068676 8315161
42134 8315161 2821122 -945679 323457 5824752 10569703 10811985 7993374 5777610
42126 5777610 4936575 3593177 1360305 36892 69109 -565247 -2798723 -4486146 -3785797
42117 -3785797 -2269551 -2303808 -3190581 -2821415 -1755200 -2118347 -3182585 -2128775 547071
42108 547071 783683 -2449583 -4518376 -1720347 2956645 4043159 993099 -2207494
42100b207494p17370J279407K446060L145632K289614J26037o30259P77181J308950
42091G817758n37114j675127j11852O60207k429266n532277l083653K999628N535795
42082C644099K368735j579182k394493j497240j001411j35626J660215K290712
42074C355809K53149k431216k741250l25217K724440M195879L067139J12268k292493
42065E918508k490255j679598k025690l165290k993400j406714k27999L70419
42057g700019J823371L339044K181403j090796j853015J881157N652435M499419
42049H732999j45711l005803k374745j107187j125566r45163P00482J998584P14581
42040C442471j923475k228930R94554M202170L149658j451581m356765k441150
$$ plain form
42100 -2207494 -2924864 -1645457 800603 3946235 6235849 6361886 5731627 6508808 7817758
42091 7817758 7280644 5605517 5493665 6153872 3724606 -1807671 -4891324 -1891696 3644099
42082 3644099 6012834 4433652 2039159 541919 -459492 -595118 1065097 3355809
42074 3355809 3608958 1177742 -1563508 -1888725 835715 5031594 8098733 8211001 5918508
42065 5918508 3428253 1748655 -277035 -3442325 -6435725 -7842439 -8070438 -7700019
42057 -7700019 -5876648 -2537604 -356201 -1446997 -3300012 -1418855 4233580 8732999
42049 8732999 8587288 5581485 3206740 2099553 973987 28824 729306 2727890 3442471
42040 3442471 1518996 -709934 284620 4486790 7636448 6184867 1828102 -613048
42032f13048J260744J897579p42106k841951k389928j077052p00945r82377j238771
42023g427855j244094j45482K440924M090440J858167k633406m318074j761238
42015i140618J148937J812693K284190L851382L642076L08412j946118R0238K470061
42006D521253L37734l375619k540399J460439J701667k392087l722944N22555
41998c487401L869427J085106l334650k510480K132277L768858Q44905j498090
41990H69952L2577K431429J638895j624060l358258j732729R77896J658864K49899
41981A144465o43643J20615L45192j735223l642986j840481K149160L108852P5845
41972i18204j881143K79720K620045P95048k711748k761984J36916J298330j70259
$$ plain form
42032 -613048 647696 2545275 1803169 -1038782 -3428710 -4505762 -5206707 -6189084 -7427855
42023 -7427855 -8671949 -8817431 -6376507 -2286067 -427900 -3061306 -7379380 -9140618
42015 -9140618 -7991681 -6178988 -3894798 -43416 3598660 3907072 1960954 2051192 4521253
42006 4521253 4858987 1483368 -1057031 403408 2105075 -287012 -4009956 -3487401
41998 -3487401 382026 1467132 -1867518 -4377998 -2245721 1523137 2368042 869952
41990 869952 902529 3333958 4972853 3348793 -9465 -1742194 -764298 894566 1144465
41981 1144465 500822 621437 966629 -768594 -4411580 -6252061 -4102901 -994049 -918204
41972 -918204 -2799347 -2519627 100418 895466 -1816282 -4578266 -4441350 -3143020 -3313279
41963c313279p03596R72666K118805J444812J031851J745642J631829L06682J91692
41954E427104J587513J316016j416380k701399n27233J249264l98036j805452
41946B731397J062562M533708K432573l183999m382890J67010L213022P79880
41938G353263j907216J52366L321461J766423k730776l911788j156697K00764
41930C087800k151353m365140l089090r5382J628836K262952K986027K585192
41922B849842l94681l838068l927832n58232K170138J564933j26647N54011K914889
41913A208353L138466J54692k471776j544833J291259K116670J88408j727759
41905B353480j723451o89317J26099Q13566J405551J152670J80910j68991L49373
$$ plain form
41963 -3313279 -4016875 -3044209 -925404 519408 1551259 3296901 4928730 5235412 5427104
41954 5427104 7014617 8330633 6914253 4212854 3685621 4934885 4536849 2731397
41946 2731397 3793959 8327667 10760240 7576241 3193351 3360361 6573383 7353263
41938 7353263 5446047 5598413 8919874 10686297 7955521 4043733 2887036 3087800
41930 3087800 936447 -3428693 -6517783 -6613165 -4984329 -2721377 264650 2849842
41922 2849842 2455161 -1382907 -5310739 -5868971 -3698833 -2133900 -2260547 -1706536 1208353
41913 1208353 4346819 4501511 2029735 484902 1776161 3892831 4081239 2353480
41905 2353480 630029 -59288 66811 880377 2285928 3438598 3619508 3450517 3799890
41896C799890K61416q93439j404322l44872O02788J09000k59476J164309K742666
41887E777960J786524j133929l094793l120618k608320k089669p42104R45331
41879d279618J124311l01078j219506o55400q4866n31982p15458N76889K139357
41870c947351J970241J23678j448321j370258k12604M45715q3393p07823P2139
41861e157977J806563K219072M27594j364179q40747J072658J759352O98912n35847
41852H5401j134604j414254j113892m5807K32929j547176l180983j353688K856165
41843f615909M661540K342822m99294o15111P16473R09709L6790o23642j099242
41834g85864j470496o04684J533465K510044P12459j813739k009662K20756K486488
$$ plain form
41896 3799890 4061306 3167867 1763545 1418673 2021461 2130461 1870985 3035294 5777960
41887 5777960 7564484 6430555 3335762 215144 -2393176 -4482845 -5224949 -4279618
41879 -4279618 -3155307 -3456385 -4675891 -5331291 -5416157 -5948139 -6663597 -6086708 -3947351
41870 -3947351 -1977110 -1853432 -3301753 -4672011 -4884615 -4438900 -4522293 -5230116 -5157977
41861 -5157977 -3351414 -1132342 -704748 -2068927 -2909674 -1837016 -77664 621248 85401
41852 85401 -1049203 -2463457 -3577349 -3623156 -3390227 -4937403 -8118386 -9472074 -6615909
41843 -6615909 -1954369 388453 -110841 -725952 -9479 900230 937020 313378 -785864
41834 -785864 -2256360 -2861044 -1327579 1182465 1894924 81185 -1928477 -1707721 778767
41825G78767K888082J083020j942402l898350k849172R8339J855792J682888J479598
41816A176562J257058j231600m743044l870659K368315O554611K764964l881022
41808C95185m149256J844085N571890L145977m57263q29437k64394j874138l692121
41799c09472k455107Q48980K899628K773899J723258L73371j156754j954456j479438
41790A263909q97295j395354k088804j167403J444383L692640L456195P20962
41782E029233j994339j870751P61641K195040j640l348224l677432q38100J697179
41773b047393K065951J421128N12036j206974k706688j646626J454121L088035
41765I33590K104903J365668K419031K670289M33046j210602O81121L326914K072558
$$ plain form
41825 778767 3666849 4749869 2807467 -1090883 -3940055 -3841716 -1985924 -303036 1176562
41816 1176562 2433620 1202020 -3541024 -7411683 -5043368 1511243 4276207 395185
41808 395185 -3754071 -1909986 3661904 6807881 6350618 5521181 5256787 3382649 -309472
41799 -309472 -2764579 -1915599 984029 3757928 5481186 5854557 4697803 2743347 1263909
41790 1263909 366614 -1028740 -3117544 -4284947 -2840564 852076 4308271 5029233
41782 5029233 3034894 1164143 1925784 4120824 4119184 770960 -2906472 -3744572 -2047393
41773 -2047393 18558 1439686 1951722 744748 -1961940 -3608566 -2154445 933590
41765 933590 3038493 4404161 6823192 9493481 9926527 8715925 9397046 12723960 14796518
41756A4796518k126649l904571j590355N50051r45311l618508k861726J481132
41748A780581M837208L699771l07905k873853k390645j301173j892803k753101
41740a201920j245565J782994K654294J84482k544848k537542l99872J651549
41732a656428K797921L062683K053480K25070n20359M34785Q18568j197885l720082
41723B297753l799370k065067j622492k929738l057820m76715K381195K689493
41715f582761J208316P84489K018255K598437J039861q31309m06540J731209K387935
41706C947892M24976j396475m98057J589216J616215m46683j705521r75469q4111
41697B471983m35337j148789j181174p49198l7378J112818J789013Q36841n76097
$$ plain form
41756 14796518 12669869 8765298 7174943 7724994 6779683 3161175 299449 1780581
41748 1780581 6617789 10317560 10009655 7135802 4745157 3443984 1551181 -1201920
41740 -1201920 -2447485 -664491 1989803 2174285 -370563 -2908105 -3307977 -1656428
41732 -1656428 1141493 4204176 6257656 6482726 5962367 6397152 7215720 6017835 2297753
41723 2297753 -1501617 -3566684 -5189176 -8118914 -11176734 -11653449 -9272254 -6582761
41715 -6582761 -5374445 -4589956 -2571701 26736 1066597 235288 -171252 1559957 3947892
41706 3947892 4372868 2976393 2478336 4067552 5683767 5237084 3531563 2556094 2471983
41697 2471983 2036646 887857 -293317 -1042515 -1079893 32925 1821938 2658779 2082682
41688B082682j40048J505346J304061r61198j971348o62570k10844k042494k541065
41679c637478Q22404M248602K971351j264600k914861o96274J794784K103467
41671C427395J064429j73790j170366r07365P93544J364850j279390m485960l825800
41662e192453L10000L214918K655451R34975J33378l89914j070058p34898P21494
41653E82893J597451J295031R28729M17847j597377m042498l323514J272125N221835
41644B352522M110944p72298m243169l229553O28967L468663L132722R12873m60100
41635E901571n41445j456571l648686l992241p13014K490990J349507j984632
41627b594521j999742J308749K675427O08460m49879J572902K624727Q1021k082606
$$ plain form
41688 2082682 1942634 3447980 4752041 3790843 1819495 1156925 946081 -1096413 -3637478
41679 -3637478 -2815074 1433528 4404879 3140279 225418 -470856 1323928 3427395
41671 3427395 4491824 4318034 3147668 2240303 3033847 4398697 3119307 -1366653 -5192453
41662 -5192453 -4882453 -1667535 987916 1922891 2056269 1666355 596297 -138601 582893
41653 582893 2180344 3475375 4404104 4821951 3224574 -817924 -4141438 -2869313 2352522
41644 2352522 6463466 5691168 1447999 -1781554 -1152587 2316076 5448798 6361671 5901571
41635 5901571 5360126 3903555 254869 -3737372 -4450386 -1959396 -609889 -2594521
41627 -2594521 -4594263 -3285514 -610087 -1627 -451506 1121396 3746123 3827144 1744538
41618A744538k5459L096466K250277j209515k084120J18208Q29332k075384n282661
41609b638318n002641j450369K300599L646427K290355K93584J72228J959817
41601A571682L012576J635855o19280j509538j114457o59260j61244P78175J404979
41592D339488R90036J75320n16150j833149l774408m398657k643933l52725O02212
41583g411966J064531K183982K703190J536704O79894K010126L181549Q07248
41575F755258l535575m815190j704347J776388K032504j67907k089547k380008
41567d128424j267221K71340R22346K93543k70041L51950J050583M07647n15890
41558b884167N6284J107098L30400j422691q37998K482578M825082L512759L83289
$$ plain form
41618 1744538 1719079 4815545 7065822 5856307 3772187 3890395 4719727 2644343 -2638318
41609 -2638318 -7640959 -9091328 -6790729 -3144302 -853947 -560363 -388135 1571682
41601 1571682 4584258 6220113 5600833 4091295 2976838 2317578 2156334 2934509 4339488
41592 4339488 5329524 5504844 4988694 3155545 -618863 -5017520 -7661453 -8014178 -7411966
41583 -7411966 -6347435 -4163453 -1460263 76441 756335 2766461 5948010 6755258
41575 6755258 3219683 -1595507 -3299854 -1523466 509038 341131 -1748416 -4128424
41567 -4128424 -5395645 -5124305 -4201959 -3908416 -4178457 -3826507 -2775924 -2368277 -2884167
41558 -2884167 -2827883 -1720785 -1390385 -2813076 -3651074 -1168496 3656586 7169345 7552634
41549G552634j143440l03119R60324P50122q58482j923779p28622J643174K004468
41540G953280m64341k377320r95919J220342K78424k857704l674875j119998J356495
41531f81616J657337J374508J759619J777099J174947J352555J958630O79227
41523A1052306k150156k822763n5466K383809J207968j645078k369126n14074
41515E087420J630921K421619J432582j079516l416378l376675j388516j86331
41507A125126l52646M22764K356807K101113j437407m093079k439234J069102
41499a247454K450097J969180J697594J035107q05777j334392J026023K399629
41491G190007j042057n632347m838854M21955L278777J953579J506242L763841
$$ plain form
41549 7552634 6409194 6106075 7066399 7816521 6958039 5034260 4305638 5948812 7953280
41540 7953280 7488939 5111619 4115700 5336042 5614466 2756762 -918113 -2038111 -681616
41531 -681616 975721 2350229 4109848 5886947 7061894 8414449 10373079 11052306
41523 11052306 8902150 6079387 6023921 8407730 9615698 7970620 5601494 5087420
41515 5087420 6718341 9139960 10572542 9493026 6076648 2699973 1311457 1125126
41507 1125126 772480 1195244 3552051 5653164 4215757 122678 -2316556 -1247454
41499 -1247454 1202643 3171823 4869417 5904524 5098747 3764355 4790378 7190007
41491 7190007 6147950 515603 -4323251 -3901296 -622519 1331060 2837302 6601143
41483F601143L615393j628798o295808m521930R02425L238910J643275N76074
41475D130684J559059J522776p38025j866354M41157K959648J189965l720718
41467E478192n809257k303575K304474K243796j647932l547302j383387O74525
41459c990466l86195j529812N48781L188541K349595J31578J379924M660459L838325
41450A0190730j472595m511689j976681J186900O20590n89919J540495M249823
41442I237654K794489j230859k602365r00706j22300j374447j867386o94272j44540
41433C095268r53628j084418L6866M02597n25147o80888M96290O76690j015315
41424D48315j842509J84938K768941K679760M34215r64663m25553N57017P00159
$$ plain form
41483 6601143 10216536 8587738 2291930 -2230000 -1327575 1911335 3554610 4130684
41475 4130684 5689743 7212519 6474494 4608140 5049297 8008945 9198910 5478192
41467 5478192 -331065 -2634640 -330166 1913630 265698 -3281604 -4664991 -3990466
41459 -3990466 -4376661 -5906473 -5357692 -2169151 180444 312022 1691946 6352405 10190730
41450 10190730 8718135 4206446 2229765 3416665 4037255 3447336 4987831 9237654
41442 9237654 12032143 10801284 8198919 7298213 7175913 5801466 3934080 3239808 3095268
41433 3095268 2141640 1057222 1094088 1496685 971538 290650 786940 1463630 448315
41424 448315 -1394194 -1209256 1559685 4239445 4673660 3708997 3283444 3840461 4540620
41415D540620K28182k23143l40931J7424N79676O19119K4378k44570K68261L17230
41405E786246j281351l253581k980776j38785K405004K127801J07757n11606J254765
41396C515474L097999K713632O74235r91733j755609k362412k530907j380674
41388I80005r7420j201029m152247m737088r43628L291140L327918O58416L98018
41379b475915L089988L893747M74339l093852k490689N67499J382619q29313k589128
41370b070705j612657N87421J578339J029461J61187l39717r11217j980422k757905
41361f316215j672145J507926M520147M795919K570648K89445q68086j703272
41353C124367k163408p92192J840990K340122n62086k980721j033986K985881
$$ plain form
41415 4540620 4768802 4545659 4204728 4222152 4801828 5420947 5445325 5200755 5469016 5786246
41405 5786246 4504895 1251314 -1729462 -1868247 536757 2664558 2772315 2260709 3515474
41396 3515474 6613473 9327105 10001340 9009607 7253998 4891586 2360679 980005
41388 980005 882585 -318444 -4470691 -9207779 -10151407 -6860267 -3532349 -2873933 -2475915
41379 -2475915 614073 4507820 4982159 1888307 -602382 -34883 1347736 518423 -2070705
41370 -2070705 -3683362 -3095941 -1517602 -488141 -326954 -666671 -1577888 -3558310 -6316215
41361 -6316215 -7988360 -6480434 -1960287 2835632 5406280 5695725 4827639 3124367
41353 3124367 960959 168767 2009757 4349879 3787793 807072 -226914 2758967
41345B758967L510416j99015l075384j697887J236483J415167j188200l173986
41337d13439k622927p81874M72138R13728J430610K205041K160082M37329j890273
41328A910415k533484q19163J260898J629702N46820o74706j858106l040272k854405
41319f432301m60993J941003J634124j80721p892J989628J817332j642712m089478
41310e432010k167237J462061K502235J316505J034840J691435O76710j961478
41302h76939l020844j141382J361984K390504K627766L072226K758490P08127
41294G879932j683564k102807l20298J630492J887443N11236r88669j420024j229465
41285D164276j882221l631444m557797k782608Q56277L607503M025696L024226
$$ plain form
41345 2758967 6269383 6070368 2994984 1297097 2533580 3948747 2760547 -413439
41337 -413439 -3036366 -3818240 -3346102 -2432374 -1001764 1203277 3363359 3800688 1910415
41328 1910415 -623069 -1442232 -181334 1448368 1995188 1320482 -537624 -3577896 -6432301
41319 -6432301 -6893294 -4952291 -3318167 -3498888 -3506780 -1517152 300180 -1342532 -5432010
41310 -5432010 -7599247 -6137186 -3634951 -2318446 -1283606 407829 1084539 -876939
41302 -876939 -3897783 -5039165 -3677181 -1286677 1341089 4413315 7171805 7879932
41294 7879932 6196368 4093561 3773263 5403755 7291198 7802434 6813765 5393741 4164276
41285 4164276 2282055 -1349389 -5907186 -8689794 -7833517 -4226014 -200318 2823908
41277B823908J889407Q80317n477n29618r94388k021064k927378j922725J049993
41268a757025L122917J684747k097751m511137l670997j196798M50656Q22780
41260g152608J056576J638945J757615Q04152m14905n43692O09006J877850K176866
41251A809805J430690Q7222j308549j796887n60248J424399J687951m36991k219900
41242A17492j241864N79393l15894k998208k607799K017242N480435L318180j167513
41233C181464j791500J039676J155477l290134o329854l019706K979892M674943
41225a399742J570359o93335O13605J863301l46925l635011l501490K61091L841639
41216a426508M569276L038912R51835n77037q91144k36591k07638j771045l162695
$$ plain form
41277 2823908 4713315 5593632 5588155 5058537 4064149 2043085 -884293 -2807018 -1757025
41268 -1757025 1365892 3050639 952888 -3558249 -7229246 -8426044 -7975388 -7152608
41260 -7152608 -6096032 -4457087 -2699472 -1895320 -2310225 -2853917 -2244911 -367061 1809805
41251 1809805 3240495 3327717 2019168 222281 -337967 1086432 2774383 2337392 117492
41242 117492 -1124372 -544979 -860873 -3859081 -6466880 -4449638 1030797 4348977 3181464
41233 3181464 1389964 2429640 3585117 294983 -6034871 -9054577 -6074685 -1399742
41225 -1399742 170617 -522718 90887 1954188 1607263 -2027748 -5529238 -5268147 -1426508
41216 -1426508 3142768 6181680 7133515 6556478 5665334 5428743 5221105 3450060 287365
41207B87365j991073Q04576J770374m6670j733262r55990R71669J682270Q69870
41198A659129n77019k052051k352725j09274L019009K710128j704341m438704
41190c845848o68141N789638P035227J838601l477763m502481l450404l395245
41182d676416l229175j078206J384440J551415L10800N45255K524054L589032
41174I21199K015128q01934k176041j261031q2943j102019l520680l494708N24834
41165h978195M565018M094316N67691r71333L27333Q43555k67825L34971L093681
41156C609212L467400k29244k978098j081479J545114J65474k699923k093286
41148b94830O12877P10662j134450o95482J212202n8902l692648l466042J795517
$$ plain form
41207 287365 -1703708 -899132 871242 824572 -908690 -1864680 -893011 789259 1659129
41198 1659129 1082110 -969941 -3322666 -3431940 -412931 2297197 592856 -3845848
41190 -3845848 -4513989 1275649 8310876 10149477 6671714 2169233 -1281171 -4676416
41182 -4676416 -7905591 -8983797 -7599357 -6047942 -5737142 -5191887 -2667833 921199
41174 921199 2936327 2134393 -41648 -1302679 -1385622 -2487641 -6008321 -9503029 -8978195
41165 -8978195 -4413177 -318861 248830 -722503 -395170 448385 180560 515531 3609212
41156 3609212 7076612 6847368 3869270 2787791 4332905 4498379 1798456 -294830
41148 -294830 318047 1028709 -105741 -801223 410979 352077 -3340571 -6806613 -5011096
41139e011096N431209L041749j286039k093947j83391O95497J39066k6589L05871
41130A012330M27230R03707J636126N82051k558232m167838j522729K672733L932932
41121B918310K020891r1669j310241k653892l714360k762014m7593K129358K518515
41112i92695J647609J8599j875872k334928q3685L033063L711702J696306M6069
41103D866168M69987R70013p09193l289119l402628r7666L602488L968727Q09212
41094G187989k278640k193188n2191N96000j198891k600138j224498J585369K853911
41085B675723J565054j059421l201892l186759m72435K709673K798873l68106
41077A460710k629975j330874P31260J78875j037751R20129M437620M128076m74493
$$ plain form
41139 -5011096 420113 3461862 2175823 81876 -101515 593982 733048 706459 1012330
41130 1012330 1439560 2343267 3979393 4561444 2003212 -2164626 -3687355 -1014622 2918310
41121 2918310 4939201 4847532 3537291 883399 -2830961 -5592975 -5640568 -3511210 -992695
41112 -992695 654914 673513 -1202359 -3537287 -3620972 -587909 3123793 4820099 4866168
41103 4866168 5336155 6306168 5596975 2307856 -1094772 -1192438 2410050 6378777 7187989
41094 7187989 4909349 2716161 2663970 3259970 2061079 -539059 -1763557 -178188 2675723
41085 2675723 4240777 3181356 -20536 -3207295 -3679730 -970057 1828816 1460710
41077 1460710 -1169265 -2500139 -1768879 -1590004 -2627755 -1707626 2729994 6858070 6383577
41068F383577l598278j813544J257278J182205p72566p71202J220667K128116
41060E216253R57246n03334j364332k578248m116586m108561j676785J346637
41052f827710K661031K257271J831626K110300J995914M99780j510919k348573
41044F68720j781225j019425m85469O86368K273843K119982o35398l155960k185036
41035c513600J297520L336181K268796l9771j691089k257585j053027K257327
41027F04752M877784K967192k139897m158626n78086L182245J677090k584825
41019C847629l620967j103323O35220N75020J563595L484995K565498j368509
41011F579158l233266q18053J079238j562009m872081k896832K748158M948811
$$ plain form
41068 6383577 2785299 971755 2229033 3411238 2638672 1867470 3088137 5216253
41060 5216253 6173499 5670165 4305833 1727585 -2389001 -6497562 -8174347 -6827710
41052 -6827710 -4166679 -1909408 -77782 2032518 4028432 4528212 3017293 668720
41044 668720 -1112505 -2131930 -2617399 -1931031 342812 2462794 1827396 -1328564 -3513600
41035 -3513600 -2216080 1120101 3388897 3349126 1658037 -599548 -1652575 604752
41027 604752 5482536 8449728 6309831 2151205 1573119 4755364 6432454 3847629
41019 3847629 226662 -876661 -241441 333579 1897174 5382169 7947667 6579158
41011 6579158 3345892 2527839 3607077 2045068 -2827013 -5723845 -2975687 1973124
41003A973124J484934k484304k652050r36501p99622j603202p13396J664162L273374
40994g93481L881347M998867N926754L652945k198996p100953o496825j521518
40986C48140K460015K393617J59417j386059k082905k714905k145042Q65859M191428
40977B089565M129809Q02733j492102l49428J420383M64561j886185k040223M7690
40968C186803J065957k92199j675372j125452L13194R91099J060598J174741R00986
40959E600355o7630p76559n75610m72659j456795k544617j946902M58529K854484
40950A072596L195310Q24294k643538l969840j506366K001343K128584j135857
40942c3474l021052r93580J515289R98507l16243J193375L488108J907504k296911
$$ plain form
41003 1973124 3458058 973754 -1678296 -2614797 -3414419 -5017621 -5731017 -4066855 -793481
40994 -793481 3087866 8086733 14013487 17666432 15467436 8366483 1869658 348140
40986 348140 2808155 5201772 5361189 3975130 1892225 -822680 -2967722 -2101863 2089565
40977 2089565 6219374 7022107 5530005 5180577 6600960 7065521 5179336 3139113 3186803
40968 3186803 4252760 3960561 2285189 1159737 1472931 2464030 3524628 4699369 5600355
40959 5600355 5532725 4756166 4180556 3707897 2251102 -293515 -2240417 -1781888 1072596
40950 1072596 4267906 5092200 2448662 -1521178 -3027544 -1026201 1102383 -33474
40942 -33474 -3054526 -4048106 -2532817 -1534310 -1850553 -657178 2830930 4738434 2441523
40933B441523k976520J126956M055342J868604j786962k378030j341545j922751
40925i13383k575440k7660L799231L848020n6434k710439j317858J091291J206446
40916B343774Q6302N9518L39929j176544l564734l554484l60778K687888K244332
40907h94797p48853k199836m397L300522L689760N83627k610764k646089K03494
40898a327333L058243L432206J045921k049208k823078j76927L107884L011399
40890G279107n84974l414171k420767M29774J529909N86002j57552N3930P8710
40881C379968l31877r1750R38164J402902M41690j229059k292566j951342m30728
40872a64598R33004R20022K78120Q80472K417669K238100k51352j859975m42359
$$ plain form
40933 2441523 -534997 591959 4647301 6515905 4728943 2350913 1009368 -913383
40925 -913383 -3488823 -3516483 282748 4130768 4074334 1363895 46037 1137328 2343774
40916 2343774 2430076 2489594 2829523 1652979 -1911755 -5466239 -5827017 -3139129 -894797
40907 -894797 -1643650 -3843486 -3847883 -547361 3142399 3726026 1115262 -1530827 -1327333
40898 -1327333 1730910 5163116 6209037 4159829 1336751 1159824 4267708 7279107
40890 7279107 6694133 3279962 859195 1288969 2818878 3404880 3247328 3301258 3379968
40881 3379968 3048091 2956341 3894505 5297407 5739097 4510038 2217472 266130 -164598
40872 -164598 768406 1688428 1966548 2847020 5264689 7502789 7251437 5391462 4949103
40863D949103J483168R13440p27685o46826M4938j188339k765406j433163J259056
40854A888286J091407r90380q3565L311409K798308k936937o331602k253976L641654
40845A34604L526740j036852k916534j015934n12417l152701m760483k835347
40837a2568924j98024O42426J397964L651906M867903K281375j883536k864758
40829d673668L3883K674526J987351l30185j127942l41423O8625J77441J780459
$$ plain form
40863 4949103 6432271 7345711 6618026 5971200 6016138 4827799 2062393 629230 1888286
40854 1888286 2979693 1989313 1905748 5217157 8015465 5078528 -1253074 -3507050 134604
40845 134604 3661344 2624492 -292042 -1307976 -1820393 -4973094 -9733577 -12568924
40837 -12568924 -12766948 -12124522 -10726558 -7074652 -2206749 74626 -1808910 -4673668
40829 -4673668 -4639785 -1965259 22092 -308093 -1436035 -1777458 -1708833 -1531392 249067
$$ [...]
##END NTUPLES=NMR SPECTRUM
##END=
