##TITLE=31Pdec_LR-661-CK2
 CDCl3, 24 sc
 14.3.2019
##JCAMPDX= 6.0         $$ Bruker NMR JCAMP-DX V2.0
##DATA TYPE= NMR SPECTRUM
##DATA CLASS= NTUPLES
##ORIGIN= UXNMR, Bruker Analytische Messtechnik GmbH
##OWNER= root
$$ XWIN-NMR		Version 3.5
$$ Thu Mar 14 14:34:54 2019 Russian Standard Time (UT+4h)  she@DPX200
##.OBSERVE FREQUENCY= 81.013821
##.OBSERVE NUCLEUS= ^31P
##.ACQUISITION MODE= SIMULTANEOUS
##.ACQUISITION SCHEME= undefined
##.AVERAGES= 24
##.DIGITISER RES= 17
##SPECTROMETER/DATA SYSTEM= spect
##.PULSE SEQUENCE= zgpg30
##.SOLVENT NAME= CDCl3
##.SHIFT REFERENCE= (INTERNAL, CDCl3, 0, 182.463)
##AUDIT TRAIL= $$ (NUMBER, WHEN, WHO, WHERE, WHAT)
$$ ##TITLE= Audit trail, XWIN-NMR		Version 3.5
$$ ##JCAMPDX= 5.01
$$ ##ORIGIN= Bruker BioSpin GmbH
$$ ##OWNER= she
$$ F:/spectra/data/she/nmr/P31/1/pdata/1/auditp.txt
$$ ##AUDIT TRAIL=  $$ (NUMBER, WHEN, WHO, WHERE, WHAT)
(   1,<2019-03-14 14:33:47.04 +0400>,<she>,<DPX200>,
      <created by zg, POWCHK disabled, PULCHK disabled
       configuration hash MD5:
       00 E9 B6 7A A2 85 ED C7 34 08 36 98 17 FE 4E 26
       data hash MD5: 32K
       F1 4B D2 0F CD 5B 3D D2 81 03 8F D3 88 2A EF 37>)
(   2,<2019-03-14 14:33:55.40 +0400>,<she>,<DPX200>,
      <Start of raw data processing
       efp BC_mod = 2 LB = 1 FT_mod = 6 PKNL = 1 PHC0 = -1856.741 PHC1 = 184.3989 SI = 64K 
       data hash MD5: 64K
       C9 E5 E5 6F 7B B7 65 6F 06 E0 BA 69 4A 3F 54 83>)
(   3,<2019-03-14 14:34:23.85 +0400>,<she>,<DPX200>,
      <pk PHC0 = 21.66366 PHC1 = -49.2 
       data hash MD5: 64K
       A6 AA FF 8A 7A 47 FB 60 8B 23 12 E5 90 00 F8 36>)
(   4,<2019-03-14 14:34:27.43 +0400>,<she>,<DPX200>,
      <abs ABSG = 5 
       data hash MD5: 64K
       A3 25 6B C1 BE E4 6B D4 7F BF 4F 51 E5 BD 18 DD>)
$$ ##END=
$$ 
$$ hash MD5
$$ 62 69 3F 4C 3B 9D DE 5B 04 DE D5 07 46 68 3E 71
##$RELAX= 
##$RELAX= 
##$RELAX= 
##$RELAX= 
##$RELAX= 
##$RELAX= 
##$RELAX= 
##$RELAX= 
$$ Bruker specific parameters
$$ --------------------------
##$DU= <F:/spectra>
##$EXPNO= 1
##$NAME= <P31>
##$PROCNO= 1
##$TYPE= <nmr>
##$USER= <she>
##$AMP= (0..31)
100 100 100 100 100 100 100 100 100 100 100 100 100 100 100 100 100 100 
100 100 100 100 100 100 100 100 100 100 100 100 100 100 
##$AQSEQ= 0
##$AQ_mod= 1
##$AUNM= <au_zg>
##$AUTOPOS= <>
##$BF1= 81.014009
##$BF2= 200.13
##$BF3= 200.13
##$BF4= 200.13
##$BF5= 200.13
##$BF6= 200.13
##$BF7= 200.13
##$BF8= 200.13
##$BYTORDA= 1
##$CFDGTYP= 0
##$CFRGTYP= 5
##$CHEMSTR= <none>
##$CNST= (0..31)
1 1 145 1 1 1 1 1 1 1 1 1 1 1 1 1 1 1 1 1 1 1 1 1 1 1 1 1 1 1 1 1 
##$CPDPRG= <waltz16>
##$CPDPRG1= <>
##$CPDPRG2= <waltz16>
##$CPDPRG3= <>
##$CPDPRG4= <mlev>
##$CPDPRG5= <mlev>
##$CPDPRG6= <mlev>
##$CPDPRG7= <mlev>
##$CPDPRG8= <mlev>
##$CPDPRGB= <>
##$CPDPRGT= <>
##$D= (0..31)
0 1 0 0 0 0 0 0 0 0 0 0.03 2e-05 3e-06 0 0 0 0 0 0 0 0 0 0 0 0 0 0 0 0 
0 0 
##$DATE= 1552559626
##$DBL= (0..7)
120 120 120 11 120 120 24 19 
##$DBP= (0..7)
150 150 150 150 150 150 150 150 
##$DBP07= 0
##$DBPNAM0= <>
##$DBPNAM1= <>
##$DBPNAM2= <>
$$ [...]
##$SUBNAM3= <"">
##$SUBNAM4= <"">
##$SUBNAM5= <"">
##$SUBNAM6= <"">
##$SUBNAM7= <"">
##$SUBNAM8= <"">
##$SUBNAM9= <"">
##$SW= 369.568048894756
##$SWIBOX= (0..15)
0 1 3 0 0 0 0 0 0 0 0 0 0 0 0 0 
##$SW_h= 29940.119760479
##$TD= 32768
##$TD0= 1
##$TE= 0
##$TE2= 300
##$TE3= 300
##$TEG= 300
##$TL= (0..7)
0 120 53 12 22 120 120 120 
##$TP= (0..7)
150 150 150 150 150 150 150 150 
##$TP07= 0
##$TPNAME0= <>
##$TPNAME1= <>
##$TPNAME2= <>
##$TPNAME3= <>
##$TPNAME4= <>
##$TPNAME5= <>
##$TPNAME6= <>
##$TPNAME7= <>
##$TPOAL= (0..7)
0.5 0.5 0.5 0.5 0.5 0.5 0.5 0.5 
##$TPOFFS= (0..7)
0 0 0 0 0 0 0 0 
##$TUNHIN= 0
##$TUNHOUT= 0
##$TUNXOUT= 0
##$USERA1= <user>
##$USERA2= <user>
##$USERA3= <user>
##$USERA4= <user>
##$USERA5= <user>
##$V9= 5
##$VALIST= <valist>
##$VCLIST= <CCCCCCCCCCCCCCC>
##$VD= 0
##$VDLIST= <DDDDDDDDDDDDDDD>
##$VPLIST= <PPPPPPPPPPPPPPP>
##$VTLIST= <TTTTTTTTTTTTTTT>
##$WBST= 1024
##$WBSW= 4
##$XGAIN= (0..3)
0 0 0 0 
##$XL= 0
##$YL= 0
##$YMAX_a= 8136
##$YMIN_a= -13518
##$ZGOPTNS= <>
##$ZL1= 120
##$ZL2= 120
##$ZL3= 120
##$ZL4= 120
##$ABSF1= 182.463
##$ABSF2= -187.1042
##$ABSG= 5
##$ABSL= 3
##$ALPHA= 0
##$AQORDER= 0
##$ASSFAC= 0
##$ASSFACI= 0
##$ASSFACX= 0
##$ASSWID= 0
##$AUNMP= <proc_1d>
##$AZFE= 0.1
##$AZFW= 0.5
##$BCFW= 0
##$BC_mod= 2
##$BYTORDP= 0
##$COROFFS= 0
##$CY= -3
##$DATMOD= 1
##$DC= 0
##$DFILT= <>
##$DTYPP= 0
##$F1P= 0
##$F2P= 0
##$FCOR= 1
##$FTSIZE= 65536
##$FT_mod= 6
##$GAMMA= 0
##$GB= 0
##$INTBC= 1
##$INTSCL= 5.30512e-09
##$ISEN= 30
##$LB= 1
##$LEV0= 0
##$LPBIN= 0
##$MAXI= 10000
##$MC2= 0
##$MEAN= 0
##$ME_mod= 0
##$MI= 50
##$NCOEF= 0
##$NC_proc= -5
##$NLEV= 6
##$NOISF1= 182.463
##$NOISF2= 159.3651
##$NSP= 0
##$NTH_PI= 0
##$NZP= 0
##$OFFSET= 182.463
##$PC= 4
##$PHC0= -1835.077
##$PHC1= 135.1989
##$PH_mod= 1
##$PKNL= yes
##$PPARMOD= 0
##$PSCAL= 0
##$PSIGN= 0
##$REVERSE= no
##$SF= 81.0140089999434
##$SI= 65536
##$SIGF1= 159.3651
##$SIGF2= -187.1042
##$SINO= 113.3802
##$SIOLD= 16384
##$SREGLST= <1H.CDCl3>
##$SSB= 0
##$STSI= 65536
##$STSR= 0
##$SW_p= 29940.119760479
##$SYMM= 0
##$S_DEV= 0
##$TDeff= 32768
##$TDoff= 0
##$TI= <>
##$TILT= no
##$TM1= 0
##$TM2= 0
##$TOPLEV= 0
##$USERP1= <user>
##$USERP2= <user>
##$USERP3= <user>
##$USERP4= <user>
##$USERP5= <user>
##$WDW= 1
##$XDIM= 65536
##$YMAX_p= 299924593
##$YMIN_p= -9588495
$$ End of Bruker specific parameters
$$ ---------------------------------
##NTUPLES= NMR SPECTRUM
##VAR_NAME=  FREQUENCY,     SPECTRUM/REAL,   SPECTRUM/IMAG
##SYMBOL=    X,             R,               I
##VAR_TYPE=  INDEPENDENT,   DEPENDENT,       DEPENDENT
##VAR_FORM=  AFFN,          ASDF,            ASDF
##VAR_DIM=   65536,         65536,           65536
##UNITS=     HZ,            ARBITRARY UNITS, ARBITRARY UNITS
##FACTOR=    0.456856943014862, 1,           1
##FIRST=     14782.0589164792, 0,            0
##LAST=      -15158.0608439998, 0,           0
##MIN=       -15158.0608439998, -9588495,    0
##MAX=       14782.0589164792, 299924593,    0
$$ Real data points
##PAGE= N=1
##DATA TABLE= (X++(R..R)), XYDATA
$$ [...]
$$ plain form
42746 -1183755 -730447 -251238 129916 276047 152048 115849 576628 1374573 1921141 1929802
42736 1929802 1662827 1509056 1615111 1870000 2026539 1929299 1747628 1777662 1935633 1821751
42726 1821751 1429410 1279165 1550425 1635633 1037318 220207 -29654 286200 565983 614068
42716 614068 748503 1059436 1279660 1388636 1693151 2208734 2523004 2440644 2298789 2423787
42706 2423787 2627927 2503186 2025388 1642152 1769493 2272632 2526745 2118457 1435378
42697 1435378 1281107 1864773 2543601 2736852 2716186 3198942 4415561 5803027 6381333
42688 6381333 5360748 2842500 104385 -1344691 -1273781 -775329 -625494 -421613 242943
42679 242943 774127 604568 352841 830583 1531561 1359029 419437 -212593 -225481 -217244
$$ packed form
42746a183755M53308M79209L81154J46131j23999l6199M60779P97945N46568Q661
42736A929802k66975j53771J06055K54889J56539r7240j81671L0034J57971j13882
42726A821751l92341j50245K71260Q5208n98315q17111k49861L15854K79783M8085
42716F14068J34435L10933K20224J08976L04515N15583L14270q2360j41855J24998
42706B423787K04140j24741m77798l83236J27341N03139K54113m08288o83079
42697A435378j54271N83666O78828J93251k0666M82756J216619J387466N78306
42688F381333j020585k518248k738115j449076P0910M98452J49835K03881O64556
42679B42943N31184j69559k51727M77742P00978j72532r39592o32030j2888Q237
$$ plain form
42669 -217244 -297714 6482 463433 269014 -348271 -199980 810368 1286824 613376 67060
42659 67060 748414 1828771 2022051 1575840 1460191 1587288 1308342 897599 975542 999910
42649 999910 -29010 -1621982 -2203850 -1504068 -999813 -1665722 -2661311 -2780596 -2054524
42640 -2054524 -1264380 -766367 -478134 -370541 -374522 -290378 -202347 -460987 -929423 -902731
42630 -902731 -202485 341387 83344 -390054 -127274 758239 1332354 1201265 797127 462119
42620 462119 103108 -190153 6327 692319 1136168 722027 -244956 -888454 -665482 289180
42610 289180 1439932 2225291 2404490 2304641 2538030 3230338 3737594 3418638 2472832 1623495
42600 1623495 1149652 767995 438391 605317 1346546 1866236 1398285 303809 -348055
$$ packed form
42669b17244q0470L04196M56951j94419o17285J48291J010348M76456o73448n46316
42659F7060O81354J080357J93280m46211j15649J27097k78946m10743P7943K4368
42649I99910j028920j592972n81868O99782N04255o65909r95589j19285P26072
42640b054524P90144M98013K88233J07593l981Q4144Q8031k58640m68436K6692
42630i02731P00246N43872k58043m73398K62780Q85513N74115j31089m04138l35008
42620D62119l59011k93261J96480O85992M43849m14141r66983o43498K22972R54662
42610B89180J150752P85359J79199r9849K33389O92308N07256l18956r45806q49337
42600A623495m73843l81657l29604J66926P41229N19690m67951j094476o51864
$$ plain form
42591 -348055 -192847 49477 -300067 -930033 -1005894 -225527 925091 1771259 2013522 1807814
42581 1807814 1553597 1606626 2035826 2597166 2954523 2933915 2641526 2402575 2457957 2595764
42571 2595764 2291886 1455389 744254 684249 749503 54113 -1131130 -1506672 -634855 292828
42561 292828 183309 -345066 1516 1166127 1875486 1539976 893718 689900 769237 705946
42551 705946 560610 583306 744523 926355 1144622 1310738 1180561 769281 430468 340125
42541 340125 307242 251544 395348 757626 926290 622514 96764 -290170 -475681 -446097
42531 -446097 -52560 583131 911449 612202 76152 -133129 30831 297676 609377 1026101
42521 1026101 1393042 1508809 1383165 1009299 231662 -778888 -1321902 -936285 -33768
$$ packed form
42591c48055J55208K42324l49544o29966p5861P80367J150618Q46168K42263k05708
42581A807814k54217N3029M29200N61340L57357k0608k92389k38951N5382J37807
42571B595764l03878q36497p11135o0005O5254o95390j185243l75542Q71817R27683
42561B92828j09519n28375L46582J164611P09359l35510o46258k03818P9337o3291
42551G05946j45336K2696J61217J81832K18267J66116j30177m11280l38813r0343
42541C40125l2883n5698J43804L62278J68664l03776n25750l86934j85511K9584
42531d46097L93537O35691L28318k99247n36050k09281J63960K66845L11701M16724
42521A026101L66941J15767j25644l73866p77637j010550n43014L85617R02517
$$ plain form
42512 -33768 722334 1263400 1750286 1833248 1139900 227112 68080 631598 925067 541002
42502 541002 185966 404416 739724 663206 512118 836090 1416623 1633358 1366906 883749
42492 883749 219414 -607032 -1065505 -614142 352022 807384 435048 15547 320144 1194756
42482 1194756 1980493 2318505 2187244 1563895 527825 -479825 -924873 -720472 -281089
42473 -281089 -61959 -183360 -422233 -425271 -32720 459366 498327 -72106 -713947 -799737
42463 -799737 -343752 218849 803365 1658696 2567529 2761689 1982494 1051768 859897 1224921
42453 1224921 1394872 1314411 1529554 1958077 1759747 694280 -274142 -249045 383319 618573
42443 618573 204997 -322416 -606054 -722434 -649603 -186133 595245 1360774 1969726 2421766
$$ packed form
42512c3768P56102N41066M86886Q2962o93348r12788j59032N63518K93469l84065
42502E41002l55036K18450L35308p6518j51088L23972N80533K16735k66452m83157
42492H83749o64335q26446m58473M51363R66164M55362l72336m19501L04597Q74612
42482A194756P85737L38012j31261o23349j036070j007650m45048K04401M39383
42473b81089K19130j21401k38873l038L92551M92086L8961n70433o41841q5790
42463g99737M55985N62601N84516Q55331R08833J94160p79195r30726j91871L65024
42453A224921J69951q0461K15143M28523j98330j065467r68422K5097O32364K35254
42443F18573m13576n27413k83638j16380P2831M63470P81378P65529O08952M52040
$$ plain form
42433 2421766 2429042 1652649 424714 -356164 -232701 361182 787008 877735 794207 704838
42423 704838 826485 1322865 1885475 1819200 861595 -393287 -1158230 -1247237 -977851 -633970
42413 -633970 -357505 -307220 -562051 -973024 -1301491 -1359994 -964943 -93415 785028 976517
42403 976517 418316 -176036 -342283 -526704 -1231056 -1980358 -1874024 -927454 -92554 47060
42393 47060 -97302 60858 424606 449027 -131589 -1031637 -1630170 -1383305 -326238 744451
42383 744451 911781 119997 -723452 -756630 -58783 580168 581962 120700 -147289 211159
42373 211159 947748 1409663 1300652 982283 879925 874297 620049 210604 -269 -121004
42363 -121004 -629695 -1472615 -1878938 -1344550 -294543 556671 1041565 1329453 1293465 646555
$$ packed form
42433B421766P276p76393j227935p80878J23463N93883M25826R0727q3528q9369
42423G04838J21647M96380N62610o6275r57605j254882p64943q9007K69386L43881
42413f33970K76465N0285k54831m10973l28467n8503L95051Q71528Q78443J91489
42403I76517n58201n94352j66247j84421p04352p49302J06334R46570Q34900J39614
42393D7060j44362J58160L63748K4421n80616r00048n98533K46865J057067J070689
42383G44451J67330p91784q43449l3178O97847O38951J794m61262k67989L58448
42373B11159P36589M61915j09011l18369j02358n628k54248m09445k10873j20735
42363a21004n08691q42920m06323N34388J050007Q51214M84894K87888l5988o46910
$$ plain form
42353 646555 -465960 -1490304 -2004928 -1879781 -1067238 273848 1501810 1891704 1464159
42344 1464159 1006512 1104442 1540489 1845306 1976034 2034605 1705308 642226 -677118
42335 -677118 -1215808 -715410 -135308 -310710 -690958 -102054 1504567 2879296 3081158
42326 3081158 2480216 1911884 1561120 1161741 731427 494445 427173 436492 669293 1089493
42316 1089493 1131085 502387 10911 646192 1962342 2445279 1639573 800749 989984
42307 989984 1599817 1570252 1181649 1502941 2515778 3010804 2356967 1344756 1005904
42298 1005904 1387647 1861613 2011932 1757920 1071004 122560 -516785 -331461 523539
42289 523539 1418119 2038284 2639950 3453730 4174307 4277110 3681730 2848837 2255014 1997642
$$ packed form
42353F46555j112515j024344n14624J25147Q12543J341086J227962L89894m27545
42344A464159m57647R7930M36047L04817J30728N8571l29297j063082j319344
42335f77118n38690N00398N80102j75402l80248N88904J606621J374729K01862
42326C081158o00942n68332l50764l99379m30314k36982o7272R319K32801M20200
42316A089493M1592o28698m91476O35281J316150M82937q05706q38824J89235
42307I89984O09833k9565l88603L21292J012837M95026o53837j012211l38852
42298A005904L81743M73966J50319k54012o86916r48444o39345J85324Q55000
42289E23539Q94580O20165O01666Q13780P20577J02803n95380q32893n93823k57372
$$ plain form
42279 1997642 1955006 2102160 2486742 2988497 3290938 3130266 2534728 1839871 1442061 1407767
42269 1407767 1342783 881620 324999 403155 1226183 1942979 1849447 1374376 1321058 1507231
42259 1507231 1084183 100458 -342464 226304 832894 512146 -275313 -465160 26705
42250 26705 483371 735234 1287030 2193781 2800437 2794365 2715484 3069426 3529466 3441137
42240 3441137 2721378 1829201 1082870 449398 -9611 127705 1192820 2788478 3933056
42231 3933056 4078509 3779432 3962538 4670991 5130214 5073552 5176542 5807240 6197036 5595715
42221 5595715 4575272 4194626 4308096 3866139 2749970 2059133 2356534 2776982 2404476
42212 2404476 1621974 1396770 1847033 2228035 1973374 1154907 161506 -572357 -688354
$$ packed form
42279A997642m2636J47154L84582N01755L02441j60672n95538o94857l97810l4294
42269A407767o4984m61163n56621P8156Q23028P16796r3532m75071n3318J86173
42259A507231m23048r83725m42922N68768O06590l20748p87459j89847M91865
42250B6705M56666K51863N51796R06751O06656o072p8881L53942M60040q8329
42240C441137p19759q92177p46331o33472m59009J37316J065115J595658J144578
42231C933056J45453k99077J83106P08453M59223n6662J02990O30698L89796o01321
42221E595715j020443l80646J13470m41957j116169o90837K97401M20448l72506
42212B404476p82502k25204M50263L81002k54661q18467r93401p33863j15997
$$ plain form
42203 -688354 -184767 485051 829717 731291 357043 -63683 -251863 -8361 490318 833664
42193 833664 916260 930456 755932 -11745 -1157385 -1682100 -1087852 -252148 -336486 -1240323
42183 -1240323 -1885465 -1737457 -1215437 -712510 -92939 672325 1115097 884747 286752
42174 286752 -142135 -288311 -388612 -526202 -514381 -228776 164021 368321 282981 93490
42164 93490 510 -74578 -355563 -783228 -930469 -430228 656929 1903313 2724953 2609054
42154 2609054 1573419 467907 289519 973763 1393261 845688 -77187 -558122 -796774
42145 -796774 -1413347 -2151515 -2187212 -1499061 -903877 -741930 -519059 6115 359152 287343
42135 287343 248289 496101 505678 -79231 -637607 -467097 59579 98962 -247192 -57634
$$ packed form
42203f88354N03587O69818L44666r8426l74248m20726j88180K43502M98679L43346
42193H33664Q2596J4196j74524p67677j145640n24715N94248Q35704q4338r03837
42183a240323o45142J48008N22020N02927O19571P65264M42772k30350n97995
42174B86752m28887j46176j00301j37590J1821K85605L92797K04300q5340j89491
42164I3490r2980p5088k80985m27665j47241N00241J087157J246384Q21640j15899
42154B609054j035635j105512j78388O84244M19498n47573r22875m80935k38652
42145g96774o16573p38168l5697O88151N95184J61947K22871N25174L53037p1809
42135B87343l9054K47812R577n84909n58376J70510N26676L9383l46154J89558
$$ plain form
42125 -57634 949848 1987332 2364699 2264241 2015981 1370533 140151 -946932 -898639
42116 -898639 132455 917279 809400 561970 1026155 1729976 1578466 573133 -191630
42107 -191630 -196168 -74245 -277617 -289632 206091 400129 -420729 -1486431 -1545960 -757173
42097 -757173 -306786 -427215 -185424 730692 1425870 1330839 1045257 1139463 1292903 1283224
42087 1283224 1706954 2816537 3569544 2904606 1348417 346743 444271 1028026 1441574
42078 1441574 1429743 859993 -21273 -316625 591652 2030032 2836872 2926804 3064598 3318998
42068 3318998 2971185 2010914 1462409 1853116 2434230 2424426 2103062 2082930 2289568 2322357
42058 2322357 2206787 2137734 1979735 1641287 1504838 1858151 2253922 2052230 1329983 677002
$$ packed form
42125e7634J007482J037484L77367j00458k48260o45448j230382j087083M8293
42116h98639J031094P84824j07879k47430M64185P03821j51510j005333p64763
42107a91630m538J21923k03372j2015M95723J94038q20858j065702n9529P88787
42097g57173M50387j20429K41791R16116O95178r5031k85582R4206J53440r679
42087A283224M23730J109583P53007o64938j556189j001674R7528N83755M13548
42078A441574j1831n69750q81266k95352R08277J438380Q06840Q9932J37794K54400
42068C318998l47813r60271n48505L90707N81114r804l21364k0132K06638L2789
42058B322357j15570o9053j57999l38448j36449L53313L95771k01692p22247o52981
$$ plain form
42048 677002 332029 112966 17616 249473 673997 835440 621070 450044 638264 924230
42038 924230 844055 382890 45094 316145 1181942 2238373 3209005 4143770 4993573 5292138
42028 5292138 4676160 3567327 2778651 2446710 2000611 1314304 1088991 1648619 2109873
42019 2109873 1514110 297158 -248248 252846 900749 919375 561675 405406 465866 429493
42009 429493 318586 464102 987245 1615853 1963832 1843441 1358320 801084 481793 628365
41999 628365 1304455 2187566 2509933 1698734 237952 -637094 -467207 -260802 -1095315
41990 -1095315 -2503695 -3049379 -2242613 -1004524 -279344 -54941 107895 348644 561648
41981 561648 598278 258857 -400663 -779117 -424308 56911 -307883 -1237739 -1422294 -614262
$$ packed form
42048F77002l44973k19063r5350K31857M24524J61443k14370j71026J88220K85966
42038I24230q0175m61165l37796K71051Q65797J056431R70632R34765Q49803K98565
42028E292138o15978j108833p88676l31941m46099o86307k25313N59628M61254
42019B109873n95763j216952n45406N01094O47903J8626l57700j56269O0460l6373
42009D29493j10907J45516N23143O28608L47979j20391m85121n57236l19291J46572
41999F28365O76090Q83111L22367q11199j460782q75046J69887K06405q34513
41990a095315j408380n45684Q06766J238089P25180K24403J62836K40749K13004
41981E61648L6630l39421o59520l78454L54809M81219l64794r29856j84555Q08032
$$ plain form
41971 -614262 -159877 -797530 -1294985 -415919 880839 738842 -752797 -1662797 -975364
41962 -975364 324276 1078484 1418670 1886284 2279967 2166108 1792500 1718381 1933602 1955044
41952 1955044 1582323 1105775 847678 755138 434372 -407869 -1432876 -1745695 -834425
41943 -834425 708714 1825916 2199115 2285519 2315701 2018951 1406365 1022392 1115519 1223384
41933 1223384 965145 691995 917197 1521114 1941225 1862809 1416544 954645 840088 1171079
41923 1171079 1572308 1572661 1232981 977458 821951 387269 -261769 -549065 -356963 -240736
41913 -240736 -344948 1416 1067109 1951788 1775087 929332 352127 182889 23766
41904 23766 -18045 443204 1160300 1548673 1665268 1985116 2400507 2350957 1811752 1271033
$$ packed form
41971f14262M54385o37653m97455Q79066J296758j41997j491639r10000O87433
41962i75364J299640P54208L40186M67614L93683j13859l73608p4119K15221K1442
41952A955044l72721m76548k58097r2540l20766q42241j025007l12819R11270
41943h34425J543139J117202L73199Q6404L0182k96750o12586l83973R3127J07865
41933A223384k58239k73150K25202O03917M20111p8416m46265m61899j14557L30991
41923A171079M01229L53l39680k55523j55507m34682o49038k87296J92102J16227
41913b40736j04212L46364J065693Q84679j76701q45755n77205j69238j59123
41904B3766m1811M61249P17096L88373J16595L19848M15391m9550n39205n40719
$$ plain form
41894 1271033 841724 284416 -195291 -122306 312650 472099 467923 1123000 2559497 3806710
41884 3806710 4122579 3838593 3571522 3434975 3407336 3684841 4215850 4549895 4551585 4641326
41874 4641326 4987450 5130415 4773720 4257438 3845553 3260648 2411742 1877889 2055014
41865 2055014 2391402 2101482 1216163 404475 161328 604763 1593860 2584269 2858279
41856 2858279 2383870 1984457 2221982 2631928 2508263 1865598 1144257 604163 546051 1395920
41846 1395920 2860302 3691871 3110504 1842714 952180 375696 -378708 -847316 -283725
41837 -283725 756742 982589 362798 150098 880710 1701405 1877528 1690774 1503979
41828 1503979 1110735 463714 21883 -93208 -354842 -803239 -692802 312769 1447798
$$ packed form
41894A271033m29309n57308m79707P2985M34956J59449m176O55077J436497J247213
41884C806710L15869k83986k67071j36547k7639K77505N31009L34045J690Q9741
41874D641326L46124J42965l56695n16282m11885n84905q48906n33853J77125
41865B055014L36388k89920q85319q11688k43147M43435R89097R90409K74010
41856B858279m74409l99413K37525M09946j23665o42665p21341n40094n8112Q49869
41846A395920J464382Q31569n81367j267790q90534n76484p54404m68608N63591
41837b83725J040467K25847o19791k12700P30612Q20695J76123j86754j86795
41828A503979l93244o47021m41831j15091k61634m48397J10437J005571J135029
$$ plain form
41819 1447798 1907230 1844626 1785891 1803331 1827421 2040625 2354548 2191340 1426832 886906
41809 886906 1202570 1765721 1573942 625560 -258772 -582477 -438434 -14621 480183 732983
41799 732983 781954 1174439 2080490 2743114 2520790 1943341 1843152 1932497 1374478 490311
41789 490311 601922 2059164 3594418 4016820 3605605 3343107 3527361 3704844 3454860
41780 3454860 2739112 1833806 1285095 1595854 2631373 3620841 3991030 3895052 3721983
41771 3721983 3479397 2974077 2288860 1731365 1493985 1600013 1965198 2279569 2072647
41762 2072647 1202988 142774 -485934 -561141 -442026 -416048 -408781 -223544 130276 437404
41752 437404 575979 747859 1261797 1991000 2246988 1496752 132384 -828636 -836989 -264978
$$ packed form
41819A447798M59432o2604n8735J7440K4090K13204L13923j63208p64508n39926
41809H86906L15664N63151j91779r48382q84332l23705J44043M23813M94804K52800
41799G32983M8971L92485R06051O62624k22324n77449j00189Q9345n58019q84167
41789D90311J11611J457242J535254M22402m11215k62498J84254J77483k49984
41780C454860p15748r05306n48711L10759J035519R89468L70189r5978j73069
41771C721983k42586n05320o85217n57495k37380J06028L65185L14371k06922
41762B072647q69659j060214o28708p5207J19115K5978P267J85237L53820L07128
41752D37404J38575J71880N13938P29203K55988p50236j364368r61020q353N72011
$$ plain form
41742 -264978 273138 631654 986355 1381969 1756666 2169106 2670265 3094644 3260052 3263222
41732 3263222 3315754 3365994 3137865 2531075 1791598 1267866 1093427 1084088 912262 493596
41722 493596 232422 666111 1734260 2631413 2614924 1791324 856584 226399 -239783 -737779
41712 -737779 -1147881 -1262426 -1091307 -789100 -471874 -248585 -269377 -547745 -797876 -644004
41702 -644004 -61585 478288 426445 -240415 -921608 -1021152 -622646 -321301 -360463 -274163
41692 -274163 352939 1059987 946589 -86923 -1061775 -1101802 -469449 -56675 -156223 -264642
41682 -264642 -11569 303002 280527 56457 -7321 29559 -202863 -729197 -1140639 -1221946
41672 -1221946 -1246359 -1434029 -1458946 -869202 138793 765490 508350 -251040 -723620 -629253
$$ packed form
41742b64978N38116L58516L54701L95614L74697M12440N01159M24379J65408L170
41732C263222N2532N0240k28129o06790p39477n23732j74439r339j71826m18666
41722D93596k61174M33689J068149Q97153j6489q23600r34740o30185m66182m97996
41712g37779m10102j14545J71119L02207L17226K23289k0792k78368k50131J53872
41702f44004N82419N39873n1843o66860o81193r9544L98506L01345l9162Q6300
41692b74163O27102P07048j13398j033512r74852m0027O32353M12774r9548j08419
41682b64642K53073L14571k2475k24070o3778L6880k32422n26334m11442q1307
41672a221946k4413j87670k4917N89744J007995O26697k57140p59390m72580R4367
$$ plain form
41662 -629253 -428536 -634157 -1073056 -1028467 -149008 972000 1345421 674655 -356964
41653 -356964 -927414 -893430 -593180 -176066 449807 1144010 1499291 1370583 1074262 926448
41643 926448 891489 838930 837772 970431 1109422 1127197 1103168 1064613 786124 228772 -39674
41632 -39674 588679 1775444 2365731 1710240 438718 -350747 -305246 130624 549029 934813
41622 934813 1282104 1405684 1286940 1208668 1307149 1274525 793169 77569 -350723 -367567
41612 -367567 -388038 -725592 -1097794 -996861 -415122 78589 21609 -412991 -706892 -626194
41602 -626194 -297980 234981 1112656 2167877 2739834 2347548 1328856 419373 -121556
41593 -121556 -500441 -681867 -364357 304267 731372 837436 1258715 2177239 2724700 2239134
$$ packed form
41662f29253K00717k05621m38899M4589Q79459J121008L73421o70766j031619
41653c56964n70450L3984L00250M17114O25873O94203L55281j28708k96321j47814
41643I26448l4959n2559j158J32659J38991J7775k4029l8555k78489n57352k68446
41632c9674O28353J186765N90287o55491j271522p89465M5501M35870M18405L85784
41622I34813L47291J23580j18744p8272R8481l2624m81356p15600m28292j6844
41612c67567k0471l37554l72202J00933N81739M93711n6980m34600k93901Q0698
41602f26194L28214N32961Q77675J055221N71957l92286j018692r09483n40929
41593a21556l78885j81426L17510O68624M27105J06064M21279R18524N47461m85566
$$ plain form
41583 2239134 1443694 1449410 2060868 2160649 1531502 1094843 1292466 1431360 976117 435202
41573 435202 438292 782222 934901 755187 225181 -759870 -1780116 -1857055 -706057 673918
41563 673918 1321688 1467868 1643577 1547550 861928 385070 980467 1909754 1696182 415147
41553 415147 -377776 -531 576037 543544 398306 741731 1185383 1152610 812556 544785
41543 544785 256500 -188717 -569573 -808636 -1152260 -1455880 -1128786 -226415 342234 239587
41533 239587 313447 1071412 1594457 963611 -132632 -389042 199325 636101 623439 670014
41523 670014 797490 442082 -368060 -861063 -665929 -217761 44578 85826 -117828 -572681
41513 -572681 -858929 -504708 217638 597439 538338 544354 741736 768144 600922 592682 652488
$$ packed form
41583B239134p95440N716O11458R9781o29147m36659J97623J38894m55243n40915
41573D35202L090L43930J52679j79714n30006r85051j020246p6939J150998J379975
41563F73918O47770J46180J75709r6027o85622m76858N95397R29287k13572j281035
41553D15147p92923L77245N76568l2493j45238L43425M43652l2773l40054k67771
41543E44785k88285m45217l80856k39063l43624l03620L27094R02371N68649j02647
41533B39587P3860P57965N23045o30846j096243k56410N88367M36776j2662M6575
41523F70014J27476l55408q10142m93003J95134M48168K62339M1248k03654m54853
41513e72681k86248L54221P22346L79801n9101O016J97382K6408j67222q240N9806
$$ plain form
41502 652488 314878 -293081 -500070 -246680 -230423 -682000 -955091 -605821 76921 914972
41492 914972 2179979 3666796 4493872 4450160 4574729 5643319 6905185 7133738 6236000
41483 6236000 5009877 3925339 2978338 2226794 1648295 901187 -30040 -420796 199025
41474 199025 1109689 1273705 697137 72774 -466378 -1224500 -1906797 -1816372 -1000507 -213823
41464 -213823 229026 627997 953440 728668 -14540 -585245 -638554 -500626 -323220 185630
41454 185630 900384 1042975 264236 -779814 -1398720 -1734541 -2163337 -2489622 -2355582
41445 -2355582 -1939312 -1603375 -1242283 -617172 -29555 12855 -347732 -420215 90547 747737
41435 747737 1039037 949122 775576 701463 709310 735816 760271 768231 680445 381357 -87604
$$ packed form
41502F52488l37610o07959k06989K53390J6257m51577k73091L49270O82742Q38051
41492I14972J265007J486817Q27076m3712J24569J068590J261866K28553q97738
41483F236000j226123j084538r47001p51544n78499p47108r31227l90756O19821
41474A99025R10664J64016n76568o24363n39152p58122o82297R0425Q15865P86684
41464b13823M42849L98971L25443k24772p43208n70705n3309J37928J77406N08850
41454A85630P14754J42591p78739j044050o18906l35821m28796l26285J34040
41445b355582M16270L35937L61092O25111N87617M2410l60587p2483N10762O57190
41435G47737K91300q9915j73546p4113P847K6506K4455P960q7786k99088m68961
$$ plain form
41424 -87604 -417707 -323355 41347 205754 -3464 -239610 -160227 85816 82493 -348196
41414 -348196 -1028293 -1588322 -1584692 -744828 602984 1549820 1422144 526847 -193730 -214533
41404 -214533 114585 148778 -276415 -749396 -823138 -525545 -300081 -441492 -686721 -535797
41394 -535797 38181 461360 262593 -338347 -776823 -906540 -1092940 -1552041 -1913269 -1641939
41384 -1641939 -780685 -29171 7896 -486297 -784856 -499860 45516 376030 460532 550036
41374 550036 746884 1048891 1509319 1928439 1697900 555201 -712753 -1045632 -518213
41365 -518213 -170962 -386969 -369541 459929 1469121 1779329 1452820 1045541 636889 90426
41355 90426 -241172 61207 682208 990876 993935 1117713 1339697 1389527 1571227 2413883
$$ packed form
41424h7604l30103R4352L64702J64407k09218k36146P9383K46043l323m30689
41414c48196o80097n60029L630Q39864J347812R46836j27676q95297p20577k0803
41404b14533L29118L4193m25193m72981p3742K97593K25464j41411k45229J50924
41394e35797N73978M23179j98767o00940m38476j29717j86400m59101l61228K71330
41384a641939Q61254P51514L7067m94193k98559K84996N45376L30514Q4502Q9504
41374E50036J96848L02007M60428M19120k30539j142699j267954l32879N27419
41365e18213L47251k16007J7428Q29470J009192L10208l26509m07279m08652n46463
41355I0426l31598L02379O21001L08668L059J23778K21984M9830J81700Q42656
$$ plain form
41345 2413883 3587750 4174335 4098321 4307746 5295220 6360070 6709807 6487422 6252917
41336 6252917 6116449 5848788 5300660 4324369 2823663 1231945 346469 298367 307419 -104531
41326 -104531 -346991 191467 979349 1031550 341172 -191835 -17366 613781 1275915 1745918
41316 1745918 1855268 1596805 1331929 1383877 1555392 1529681 1471979 1599429 1463790 531313
41306 531313 -668745 -975280 -274903 240159 -196002 -862534 -742930 2178 432278
41297 432278 163037 -380151 -715611 -723231 -530593 -435379 -703472 -1082519 -889547 -21311
41287 -21311 600265 256566 -311085 212170 1734047 2689757 2131756 928045 430598
41278 430598 757734 1073318 992829 869054 911584 827839 405197 -145698 -576350 -881955
$$ packed form
41345B413883J173867N86585p6014K09425R87474J064850L49737k22385k34505
41336F252917j36468k67661n48128r76291j500706j591718q85476m8102R052m11950
41326a04531k42460N38458P87882N2201o90378n33007J74469O31147O62134M70003
41316A745918J09350k58463k64876N1948J71515k5711n7702J27450j35639r32477
41306E31313j200058l06535P00377N15062m36161o66532J19604P45108M30100
41297D32278k69241n43188l35460p620J92638R5214k68093l79047J92972Q68236
41287b1311O21576l43699n67651N23255J521877R55710n58001j203711m97447
41278D30598L27136L15584q0489j23775M2530q3745m22642n50895m30652l05605
$$ plain form
41268 -881955 -1052228 -928902 -479111 113910 764194 1520089 2123148 1987081 984492
41259 984492 -112160 -475853 -289351 -404228 -1027724 -1391141 -886986 14506 338837
41250 338837 -221506 -1051503 -1370953 -1011393 -541612 -719048 -1634763 -2376468 -1896239 -323464
41240 -323464 1061831 1417804 1324339 1671309 2157695 1819893 794332 419990 1342433
41231 1342433 2498146 2546861 1576332 648948 168373 -385757 -1231137 -1702276 -1198463
41222 -1198463 -139035 476824 241156 -297944 -404206 316 384288 348583 50198
41213 50198 -193372 -434325 -880949 -1291410 -1115038 -381848 78374 -300800 -922046 -712748
41203 -712748 476136 1682390 1965765 1237396 13470 -1085405 -1514392 -1095266 -407389
$$ packed form
41268h81955j70273J23326M49791N93021O50284P55895O03059j36067j002589
41259I84492j096652l63693J86502j14877o23496l63417N04155R01492L24331
41250C38837n60343q29997l19450L59560M69781j77436r15715p41705M80229J572775
41240c23464J385295L55973r3465L46970M86386l37802j025561l74342R22443
41231A342433J155713M8715r70529r27384m80575n54130q45380m71139N03813
41222a198463J059428O15859k35668n39100j06262M04522L83972l5705k98385
41213E0198k43570k40953m46624m10461J76372P33190M60222l79174o21246K09298
41203g12748J188884J206254K83375p28369j223926j098875m28987M19126O87877
$$ plain form
41194 -407389 -402743 -1276353 -2104666 -1978942 -1136270 -513660 -492631 -657452 -621674 -448595
41184 -448595 -231388 133631 574674 746560 549038 330501 325019 293528 35193 -147049
41174 -147049 85201 495086 617161 474263 418120 445038 292637 136971 486933 1277454
41164 1277454 1746350 1459768 851455 447927 197359 -4452 216340 1033706 1695322
41155 1695322 1293218 37207 -994179 -1237613 -1043090 -796719 -485790 -205297 -258102
41146 -258102 -512653 -411360 77463 236898 -290392 -879692 -901755 -652697 -693055 -874077
41136 -874077 -798680 -768666 -1344870 -2205093 -2389810 -1678571 -859006 -497560 -245808 357993
41126 357993 1112969 1600680 1853441 2079589 2090316 1523497 487744 -430799 -772795 -560162
$$ packed form
41194d07389M646q73610q28313J25724Q42672O22610K1029j64821L5778J73079
41184d48595K17207L65019M41043J71886j97522k18537n482l1491k58335j82242
41174a47049K32250M09885J22075j42898n6143K6918j52401j55666L49962P90521
41164A277454M68896k86582o08313m03528k50568k01811K20792Q17366O61616
41155A695322m02104j256011j031386k43434J94523K46371L10929K80493n2805
41146b58102k54551J01293M88823J59435n27290n89300k2063K49058m0358j81022
41136h74077P5397L0014n76204q60223j84717P11239Q19565L61446K51752O03801
41126C57993P54976M87711K52761K26148J0727n66819j035753r18543l41996K12633
$$ plain form
41116 -560162 -109528 270715 422564 390725 388209 603559 982226 1222392 1033161 447802
41106 447802 -129329 -292538 -83587 66140 -106973 -396801 -470947 -238218 292450 1146899
41096 1146899 2038337 2263978 1500079 462183 144852 546217 840336 726887 747000
41087 747000 1135139 1300330 875393 453071 655448 1133213 1210384 995801 1049395 1329718
41077 1329718 1346387 1141547 1217618 1519068 1355304 487075 -458277 -880870 -869718 -743164
41067 -743164 -582850 -539748 -960284 -1749010 -2147993 -1700233 -1007176 -927958 -1361224 -1501187
41057 -1501187 -1097322 -706084 -703860 -811028 -795661 -949180 -1447600 -1784486 -1414451 -654274
41047 -654274 -341959 -705523 -1132516 -1095984 -777588 -582458 -483695 -185816 323440 732659
$$ packed form
41116e60162M50634L80243J51849l1839k516K15350L78667K40166j89231n85359
41106D47802n77131j63209K08951J49727j73113k89828p4146K32729N30668Q54449
41096A146899Q91438K25641p63899j037896l17331M01365K94119j13449K0113
41087G47000L88139J65191m24937m22322K02377M77765P7171k14583N3594K80323
41077A329718J6669k04840P6071L01450j63764q68229r45352m22593J1152J26554
41067g43164J60314M3102m20536p88726l98983M47760O93057P9218m33266j39963
41057a501187M03865L91238K224j07168J5367j53519m98420l36886L70035P60177
41047f54274L12315l63564m26993L6532L18396J95130R8763K97879N09256M09219
$$ plain form
41037 732659 804554 553032 111268 -344379 -609941 -609769 -479615 -310979 73420 834917
41027 834917 1702478 2161260 2050928 1677835 1324674 980967 625058 423622 488124 701527
41017 701527 933686 1168568 1288957 1064233 573618 322567 626175 1126212 1255520 952540
41007 952540 521734 -9193 -869498 -1928861 -2644121 -2751057 -2548804 -2287639 -1716633
40998 -1716633 -614864 538224 931351 407754 -355532 -730834 -808485 -987543 -1264082
40989 -1264082 -1322144 -1137573 -985108 -834150 -285775 642787 1165903 637818 -481865
40980 -481865 -1107031 -816143 -130776 376518 601418 506056 -80954 -991030 -1627622 -1686770
40970 -1686770 -1481265 -1267805 -833581 -145583 215163 -142677 -702492 -794450 -613282 -730110
$$ packed form
41037G32659P1895k51522m41764m55647k65562J72J30154J68636L84399P61497
41027H34917Q67561M58782j10332l73093l53161l43707l55909k01436O4502K13403
41017G01527K32159K34882J20389k24724m90615k51051L03608N00037J29308l02980
41007I52540m30806n30927q60305j059363p15260j06936K02253K61165N71006
40998a716633J101769J153088L93127n23597p63286l75302p7651j79058k76539
40989a264082n8062J84571J52465J50958N48375R28562N23116n28085j119683
40980d81865o25166K90888O85367N07294K24900r5362n87010r10076o36592n9148
40970a686770K05505K13460M34224O87998L60746l57840n59815r1958J81168j16828
$$ plain form
40960 -730110 -1006433 -912575 -659529 -971482 -1768797 -2125844 -1708710 -1273910 -1429778 -1819502
40950 -1819502 -1955795 -1989275 -2069584 -1728982 -657406 470753 737662 209304 -270714
40941 -270714 -248480 32753 295138 556258 856111 1135260 1315021 1169472 386367 -817428
40931 -817428 -1502350 -1053955 -157694 -3599 -680154 -1158345 -837926 -238381 18371 67450
40921 67450 263731 491898 530272 593318 958846 1373585 1325739 732298 -1719 -441060
40911 -441060 -372678 176896 912980 1472362 1846421 2319791 2834446 2893223 2409911 2089854
40901 2089854 2409361 2721406 2138376 946695 241580 339482 557944 573312 868626 1520433
40891 1520433 1671702 895537 166229 563065 1653367 2154160 1752537 1199481 849565
$$ packed form
40960g30110k76323R3858K53046l11953p97315l57047M17134M34800j55868l89724
40950a819502j36293l3480q0309L40602J071576J128159K66909n28358m80018
40941b70714K2234K81233K62385K61120K99853K79149J79761j45549p83105j203795
40931h17428o84922M48395Q96261J54095o76555m78191L20419N99545K56752M9079
40921F7450J96281K28167L8374O3046L65528M14739m7846n93441p34017m39341
40911d41060O8382N49574P36084N59382L74059M73370N14655N8777m83312l20057
40901B089854L19507L12045n83030j191681p05115R7902K18462J5368K95314O51807
40891A520433J51269p76165p29308L96836J090302N00793m01623n53056l49916
$$ plain form
40882 849565 286013 -538385 -930965 -614985 -327926 -716187 -1333490 -1341109 -683375 32877
40872 32877 434743 572193 501898 251215 25895 -22446 -91056 -389664 -711076 -762679
40862 -762679 -703706 -855803 -1068192 -939974 -560225 -402772 -493653 -347835 122939 302218
40852 302218 -171058 -642807 -165132 1233214 2452832 2495520 1441234 207474 -448707
40843 -448707 -524577 -445206 -443949 -535023 -919117 -1842345 -2877083 -2964620 -1711941 -212018
40833 -212018 139708 -591804 -1083598 -624623 92884 179353 -332391 -932661 -1428684 -1763258
40823 -1763258 -1642576 -959525 -187835 196834 356130 648564 915805 807063 535004
40814 535004 642433 1150281 1575507 1739911 1909729 2069288 1712895 634337 -559538
$$ packed form
40882H49565n63552q24398l92580L15980K87059l88261o17303p619O57734P16252
40872C2877M01866J37450p0295k50683k25320m8341o8610k98608l21412n1603
40862g62679N8973j52097k12389J28218L79749J57453r0881J45818M70774J79279
40852C02218m73276m71749M77675J398346J219618M2688j054286j233760o56181
40843d48707p5870P9371J257r1074l84094r23228j034738q7537J252679J499923
40833b12018L51726p31512m91794M58975P17507Q6469n11744o00270m96023l34574
40823a763258J20682O83051P71690L84669J59296K92434K67241j08742k72059
40814E35004J07429N07848M25226J64404J69818J59559l56393j078558j193875
$$ plain form
40805 -559538 -1081742 -832588 -334469 -893 217681 523653 880305 1037681 883223 661648
40795 661648 730617 1056783 1109068 456205 -579731 -1135392 -782585 -84958 46619 -543390
40785 -543390 -1115777 -1082117 -825970 -1100601 -1807226 -1980523 -1125110 34226 529712 373915
40775 373915 233843 281164 127988 -278921 -530380 -542091 -690755 -1047374 -1226069 -1157393
40765 -1157393 -1224311 -1399163 -1104283 -299023 184009 -84902 -399135 -147479 76598 -482519
40755 -482519 -1288764 -1192712 -138003 856917 1126338 771383 -71414 -1286902 -2243034
40746 -2243034 -2298907 -1868321 -1950124 -2553077 -2651181 -1838969 -906593 -449046 -7090 859979
40736 859979 1588299 1404779 474582 -349338 -450245 268096 1447119 2253366 1938304
$$ packed form
40805e59538n22204K49154M98119L33576K18574L05972L56652J57376j54458k21575
40795F61648O8969L26166N2285o52863j035936n55661L52807O97627J31577n90009
40785e43390n72387L3660K56147k74631p06625j73297Q55413J159336M95486j55797
40775C73915j40072M7321j53176m06909k51459j1711j48664l56619j78695O8676
40765a157393o6918j74852K94880Q05260M83032k68911l14233K51656K24077n59117
40755d82519q06245R6052J054709R94920K69421l54955q42797j215488r56132
40746b243034n5873M30586q1803o02953r8104Q12212R32376M57547M41956Q67069
40736H59979P28320j83520r30197q23920j00907P18341J179023Q06247l15062
$$ plain form
40727 1938304 828172 85938 102932 -7577 -747122 -1106662 -142271 1169978 1079332
40718 1079332 -322296 -1154011 -495462 374013 1896 -1195509 -1795661 -1438933 -955470
40709 -955470 -793847 -421177 582124 1675568 2038881 1629403 1103003 912583 898191
40700 898191 666939 -9004 -1142541 -2462320 -3306296 -3006982 -1642846 -142648 578897
40691 578897 359723 -438126 -1421742 -2106569 -1900183 -798296 211469 167930 -585430
40682 -585430 -860683 -267993 427578 637470 715936 1076231 1372708 1101610 421526 -160292
40672 -160292 -445230 -399084 160495 1141860 1832780 1645715 1007206 871447 1405797 1727026
40662 1727026 1042371 -348983 -1365477 -1274757 -408928 226058 47705 -503290 -612501
$$ packed form
40727A938304j110132p42234J6994j10509p39545l59540R64391J312249r0646
40718A079332j401628q31715O58549Q69475l72117j197405o00152L56728M83463
40709i55470J61623L72670J003301J093444L63313m09478n26400j90420j4392
40700H98191k31252o75943j133537j319779q43976K99314J364136J500198P21545
40691E78897k19174p97849r83616o84827K06386J101887J009765m3539p53360
40682e85430k75253N92690O95571K09892P8466L60295K96477k71098o80084n81818
40672a60292k84938M6146N59579R81365O90920j87065o38509j35759N34350L21229
40662A727026o84655j391354j016494R0720Q65829O34986j78353n50995j09211
$$ plain form
40653 -612501 -146357 336103 478673 421806 197827 -395724 -1084120 -1103897 -394815 -37735
40643 -37735 -791945 -1829361 -1813757 -801816 -68803 -245982 -681145 -727058 -661211 -923507
40633 -923507 -1198305 -864410 5855 644521 519602 -56478 -281772 323939 1500876
40624 1500876 2561902 3009662 2789856 2104237 1261292 671992 600062 785289 646285
40615 646285 -836 -757721 -1278526 -1637214 -1879002 -1743910 -1178694 -623611 -365746 -72985
40605 -72985 549922 1105576 1093800 783592 853351 1407056 1934917 2046305 1715900 1039151
40595 1039151 261175 -220500 -393508 -812817 -1663611 -2109509 -1407872 -309242 -302492 -1548343
40585 -1548343 -2597241 -2313925 -1173948 -364149 -367428 -823834 -1208175 -1219904 -835574 -283939
$$ packed form
40653f12501M66144M82460J42570n6867k23979n93551o88396j9777P09082L57080
40643c7735p54210j037416J5604J011941P33013j77179m35163m5913O5847k62296
40633i23507k74798L33895Q70265O38666j24919n76080k25294O05711J176937
40624A500876J061026M47760k19806o85619q42945n89300p1930J85227j39004
40615F46285o47121p56885n20805l58688k41788J35092N65216N55083K57865K92761
40605g2985O22907N55654j1776l10208O9759N53705N27861J11388l30405o76749
40595A039151p77976m81675j73008m19309q50794m45898P01637J098630O750j245851
40585a548343j048898K83316J139977Q09799l279m56406l84341j1729L84330N51635
$$ plain form
40575 -283939 158996 389374 385857 132831 -120948 93622 752036 1119284 805124 500407
40565 500407 876181 1284612 615810 -914200 -2016867 -2160111 -1896073 -1495890 -677636
40556 -677636 209455 225665 -552704 -854661 -154997 527715 373220 -33689 -9465 18663
40546 18663 -388835 -521372 369752 1678366 2326511 2321641 2323440 2325916 1919959 1307951 915263
40535 915263 483764 -307388 -795376 -160200 1032057 1394502 661726 -162453 -491291
40526 -491291 -698097 -912834 -595604 337219 1084424 1135922 966979 1088845 1236248 1034732
40516 1034732 757255 804100 969037 824089 436984 141012 -108665 -579394 -1120066 -1226041
40506 -1226041 -784840 -332716 -379816 -723367 -695493 -40288 736876 1020374 823780 578779
$$ packed form
40575b83939M42935K30378l517k53026k53779K14570O58414L67248l14160l04717
40565E00407L75774M08431o68802j530010j102667j43244K64038M00183Q18254
40556f77636Q87091J6210p78369l01957O99664O82712j54495m06909K4224K8128
40546A8663m07498j32537Q91124J308614O48145m870J799K476m05957o12008l92688
40535I15263m31499p91152m87988O35176J192257L62445p32776q24179l28838
40526d91291k06806k14737L17230R32823P47205N1498j68943J21866J47403k01516
40516A034732k77477M6845J64937j44948l87105k95972k49677m70729n40672j05975
40506a226041M41201M52124m7100l43551K7874O55205P77164K83498j96594k45001
$$ plain form
40496 578779 394100 22727 -486082 -718380 -606647 -562262 -639090 -270893 701442 1433120
40486 1433120 1178482 444962 278645 815166 1347803 1501496 1465066 1268378 728099 45050
40476 45050 -369530 -631239 -1161039 -1785440 -1916035 -1628986 -1626128 -1973624 -1839375 -828841
40466 -828841 273548 565320 141968 -311436 -443531 -280514 121272 568081 683552
40457 683552 401320 138269 128513 19014 -470457 -933604 -839352 -367480 -132625 -293388
40447 -293388 -473997 -459308 -449932 -594683 -679324 -420980 137755 628720 683792 288001
40437 288001 -130966 -58542 572597 1301929 1676296 1735312 1831351 2068269 2116490 1643076
40427 1643076 828874 300502 445571 904836 985713 549844 127830 63331 10024 -435075
$$ packed form
40496E78779j84679l71373n08809k32298J11733M4385p6828L68197R72335P31678
40486A433120k54638p33520j66317N36521N32637J53693l6430j96688n40279o83049
40476D5050m14580k61709n29800o24401j30595K87049K858l47496J34249J010534
40466h28841J102389K91772m23352m53404j32095J63017M01786M46809J15471
40457F83552k82232k63051r756j09499m89471m63147R4252M71872K34855j60763
40447b93388j80609J4689R376j44751q4641K58344N58735M90965N5072l95791
40437B88001m18967P2424O31139P29332L74367N9016R6039K36918M8221m73414
40427A643076q14202n28372J45069M59265Q0877m35869m22014o4499n3307m45099
$$ plain form
40417 -435075 -1060949 -1450998 -1639727 -1778651 -1531608 -591888 404012 393381 -614497 -1398217
40407 -1398217 -1110113 -269530 129070 -164461 -706266 -1052425 -967512 -397416 329012 622388
40397 622388 341967 74916 356700 909450 1038809 580783 82245 104731 579015 850153
40387 850153 345645 -708944 -1359703 -956906 38372 647510 572577 260478 -37526 -489431
40377 -489431 -964496 -959608 -444283 49252 434505 1247851 2398614 2738764 1619588 59446
40367 59446 -530367 -143862 247363 370656 758885 1428873 1625142 1010676 200994 -135547
40357 -135547 -33626 120550 115748 -118066 -578256 -1015046 -1073471 -757154 -416598 -217409
40347 -217409 -19563 135113 -109600 -810644 -1327994 -918799 331948 1420150 1375820
$$ packed form
40417d35075o25874l90049j88729j38924K47043R39720R95900j0631j007878p83720
40407a398217K88104Q40583L98600k93531n41805l46159Q4913N70096P26428K93376
40397F22388k80421k67051K81784N52750J29359m58026m98538K2486M74284K71138
40387H50153n04508j054589o50759M02797R95278O09138p4933l12099k98004m51905
40377d89431m75065M888N15325M93535L85253Q13346J150763L40150j119176j560142
40367E9446n89813L86505L91225J23293L88229O69988J96269o14466q09682l36541
40357a35547J01921J54176m802k33814m60190m36790n8425L16317L40556J99189
40347b17409J97846J54676k44713p01044n17350M09195J250747J088202m4330
$$ plain form
40338 1375820 309473 -595311 -319683 782189 1335439 614477 -558801 -906609 -293320
40329 -293320 304154 219661 -140506 -33133 625664 1232665 1204696 528752 -266957 -586093
40319 -586093 -254813 427981 1066964 1433389 1382074 843372 37883 -628980 -1078285 -1610793
40309 -1610793 -2237486 -2439840 -1988558 -1484482 -1458901 -1368517 -356837 1169821 1741792
40300 1741792 798069 -451760 -637276 -17244 50110 -926417 -1930239 -1833038 -808996
40291 -808996 10162 -40300 -580950 -998955 -1270619 -1633255 -1851738 -1443191 -538782 138012
40281 138012 268701 296806 578559 834151 813876 855523 1227896 1506595 1314578 1198086
40271 1198086 1870218 2833506 2725014 1104815 -889501 -1866508 -1548298 -625335 207334
$$ packed form
40338A375820j066347r04784K75628J101872N53250p20962j173278l47808O13289
40329b93320N97474q4493l60167J07373O58797O07001k7969o75944p95709l19136
40319e86093L31280O82794O38983L66425n1315n38702q05489o66863m49305n32508
40309a610793o26693k02354M51282N04076K5581R0384J011680J526658N71971
40300A741792r43723j249829j85516O20032O7354r76527j003822R7201J024042
40291h08996Q19158n0462n40650m18005k71664l62636k18483M08547R04409O76794
40281A38012J30689K8105K81753K55592k0275M1647L72373K78699j92017j16492
40271A198086O72132R63288j08492j620199j994316r77007L18210R22963Q32669
$$ plain form
40262 207334 769769 1259490 1815578 2160862 1816951 856263 114034 253464 943445 1460428
40252 1460428 1707286 1927357 1797078 813194 -542671 -1127803 -763166 -482270 -862374
40243 -862374 -1150845 -573509 411295 857976 615047 136879 -405213 -1060586 -1566589 -1625074
40233 -1625074 -1457870 -1461266 -1528407 -1280820 -759569 -333959 -105837 70928 159820 69170
40223 69170 53708 422432 931837 1031855 704159 522587 820958 1279845 1452753 1298135
40213 1298135 1054007 911376 934091 1036558 961126 526097 -54590 -346605 -215634 84045
40203 84045 335716 556170 739504 768033 668142 584039 372082 -338430 -1415587 -1999008
40193 -1999008 -1471224 -371973 201818 -40747 -428015 -511023 -672988 -1258850 -1756192
$$ packed form
40262B07334N62435M89721N56088L45284l43911r60688p42229J39430O89981N16983
40252A460428K46858K20071j30279r83884j355865n85132L64637K80896l80104
40243h62374k88471N77336R84804M46681k42929m78168n42092o55373n06003n8485
40233a625074J67204l396o7141K47587N21251M25610K28122J76765Q8892r0650
40223F9170j5462L68724N09405J00018l27696j81572K98371M58887J72908j54618
40213A298135k44128j42631K2715J02467p5432m35029n80687k92015J30971K99679
40203H4045K51671K20454J83334K8529r9891q4103k11957p10512j077157n83421
40193a999008N27784J099251N73791k42565l87268q3008j61965n85862m97342
$$ plain form
40184 -1756192 -1457942 -582497 -39130 -170251 -375186 -68417 563167 966694 904632 454626
40174 454626 -263957 -1025396 -1467163 -1464833 -1303772 -1192371 -893493 -201590 501072 658850
40164 658850 356360 188639 350433 397298 43548 -292461 -49648 678450 1289708 1504024
40154 1504024 1650152 2009409 2214382 1694444 635887 -22857 222038 743898 716976
40145 716976 281141 72393 -33034 -669947 -1561520 -1575110 -510909 384279 303887 111430
40135 111430 779291 1666194 1575116 724567 272794 414647 421790 264205 637660 1393911
40125 1393911 1464872 611484 -115168 -54894 166904 -66419 -319660 -9640 590334 920969
40115 920969 941965 774673 276113 -431696 -693624 -221199 309202 163601 -430587 -735527
$$ packed form
40184a756192K98250Q75445N43367j31121k04935L06769O31584M03527o2062m50006
40174D54626p18583p61439m41767K330J61061J11401K98878O91903P02662J57778
40164F58850l02490j67721J61794M6865l53750l36009K42813P28098O11258K14316
40154A504024J46128L59257K04973n19938j058557o58744K44895N21860k6922
40145G16976m35835k08748j05427o36913q91573j3590J064201Q95188q0392j92457
40135A11430O67861Q86903r1078q50549m51773J41853P143j57585L73455P56251
40125A393911P0961q53388p26652O0274K21798k33323k53241L10020N99974L30635
40115I20969K0996j67292m98560p07809k61928M72425N30401j45601n94188l04940
$$ plain form
40105 -735527 -556751 -319508 -385933 -681102 -775892 -201787 973111 1899517 1821379 1121095
40095 1121095 738655 636526 -93587 -1479470 -2286854 -1840434 -1017443 -771979 -808580
40086 -808580 -534073 -258528 -459314 -736863 -534236 -157222 -94858 -37458 435933 896347
40076 896347 825764 647446 915919 1202141 1013188 1110581 2419075 4098540 4338822 2938831
40066 2938831 1534042 1182928 1216051 771486 102626 -167382 -30069 200987 358204
40057 358204 218912 -412837 -1145568 -1287372 -925093 -884724 -1354032 -1479870 -784724 -66972
40047 -66972 -200908 -767632 -735036 -60513 299973 -104356 -524802 -80281 1021420 1777684
40037 1777684 1678221 1178359 838769 573411 152136 -75507 275047 671587 297105 -397254
$$ packed form
40105g35527J78776K37243o6425k95169r4790N74105J174898R26406p8138p00284
40095A121095l82440j02129p30113j385883q07384M46420Q22991K45464l6601
40086h08580K74507K75545k00786k77549K02627L77014O2364N7400M73391M60414
40076H96347p0583j78318K68473K86222j88953R7393J308494J679465K40282j399991
40066B938831j404789l51114L3123m44565o68860k70008J37313K31056J57217
40057C58204j39292o31749p32731j41804L62279M0369m69308j25838O95146P17752
40047f6972j33936n66724L2596O74523L60486m04329m20446M44521J101701P56264
40037A777684r9463m99862l39590k65358m21275k27643L50554L96540l74482o94359
$$ plain form
40027 -397254 -1836 1660281 2935387 2615272 1599312 1324799 1657485 1589939 1118636
40018 1118636 968636 1089916 927764 742994 1152071 1671557 1285407 309719 103917
40009 103917 893215 1439573 1080758 600846 718330 1083783 1223634 1246791 1177125 742102
39999 742102 229815 410138 1217159 1683968 1561466 1705402 2366982 2518681 1665758 1013086
39989 1013086 1803058 3540360 4907341 5528896 5768859 5636802 5141527 5118672 6354242
39980 6354242 8072790 8458446 6786396 4236944 2482970 2074376 2322377 2275512 1581038
39971 1581038 608756 -57051 -150290 239245 881058 1404736 1390954 903812 644627 1015376
39961 1015376 1365243 935130 235164 447732 1565899 2289931 1938980 1332037 1379917
$$ packed form
40027c97254L95418J662117J275106l20115j015960k74513L32686o7546m71303
40018A118636j50000J21280j62152j84770M09077N19486l86150r75688k05802
40009A03917P89298N46358l58815m79912J17484L65453J39851K3157o9666m35023
39999G42102n12287J80323Q07021M66809j22502J43936O61580J51699q52923o52672
39989A013086P89972J737302J366981O21555K39963j32057m95275k2855J235570
39980F354242J718548L85656j672050k549452j753974m08594K48001m6865o94474
39971A581038r72282o65807r3239L89535O41813N23678j3782m87142k59185L70749
39961A015376L49867m30113o99966K12568J118167P24032l50951o06943M7880
$$ plain form
39952 1379917 1793196 1727095 967920 -33934 -796629 -1126168 -1177739 -1291029 -1438008 -1100129
39942 -1100129 -209202 327308 -94300 -570337 53950 1294194 1846487 1790055 2224328
39933 2224328 3045903 3072570 2297785 1942800 2168771 1886169 1063852 974829 1779043 2193249
39923 2193249 2004412 2393733 3202032 2698372 977675 582059 2396701 3951905 3526404
39914 3526404 2900101 3872316 5017329 4567904 3835271 4693544 5927933 5375255 3919753
39905 3919753 4111779 6260897 9006737 12425739 17388879 22789746 26284287 27074009
39897 27074009 25896484 23697728 22252183 23866278 28264597 32656611 37223064 46331884
39889 46331884 61317030 78674901 101516479 144200680 211824295 277994948 299924593
$$ packed form
39952A379917M13279o6101p59175j001854p62695l29539n1571j13290j46979L37879
39942a100129Q90927N36510m21608m76037O24287J240244N52293n6432M34273
39933B224328Q21575K6667p74785l54985K25971k82602q22317q9023Q04214M14206
39923B193249j88837L89321Q08299n03660j720697l95616J814642J555204m25501
39914C526404o26303R72215J145013m49425p32633Q58273J234389n52678j455502
39905C919753J92026K149118K745840L419002M963140N400867L494541P89722
39897B7074009j177525k198756j445545J614095M398319M392014M566453R108820
39889D6331884J4985146J7357871K2841578M2684201O7623615O6170653K1929645
$$ plain form
39882 299924593 261693100 191538272 130349681 93475756 70798357 52384941 39156033
39875 39156033 32393943 27574169 21503250 16576463 14868219 14166095 12253304 10132405
39867 10132405 8899839 7533933 5552380 4314697 4219771 3814609 2845895 3003729 4469803
39858 4469803 4901229 3232660 1541355 1593142 2227523 1844181 1055807 1032789 1244925
39849 1244925 723444 -25593 -86306 171230 -51470 -528339 -687645 -731038 -970609 -1027375
39839 -1027375 -662030 -407617 -486840 -182535 768656 1271622 468894 -739702 -978421
39830 -978421 -408102 -208861 -616186 -738420 -93567 773584 1217415 1202068 976847 652165
39820 652165 305951 172464 488369 1177902 1801686 1976249 1839811 1796583 1759744 1231742
$$ packed form
39882B99924593l8231493p0154828o1188591l6873925k2677399j8413416j3228908
39875C9156033o762090m819774o070919m926787j708244p02124j912791k120899
39867A0132405j232566j365906j981553j237683r4926m05162r68714J57834J466074
39858D469803M31426j668569j691305N1787O34381l83342p88374k3018K12136
39849A244925n21481p49037o0713K57536k22700m76869j59306m3393k39571n6766
39839a027375L65345K54413p9223L04305R51191N02966q02728j208596k38719
39830i78421N70319J99241m07325j22234O44853Q67151M43831j5347k25221l24682
39820F52165l46214j33487L15905O89533O23784J74563j36438m3228l6839n28002
$$ plain form
39810 1231742 387883 257938 1191085 1973643 1448230 280375 -102972 293935 378844
39801 378844 63537 298608 1130556 1504940 1204551 1245398 1913638 2098205 1245229 397921
39791 397921 407965 513602 -249514 -1371958 -1709280 -1109163 -191861 733256 1588228 2024300
39781 2024300 1875995 1575263 1429670 1125503 578317 468015 1107774 1547130 793222
39772 793222 -637454 -1383974 -1065888 -513352 -437187 -712945 -853146 -513323 366455 1407924
39762 1407924 1936112 1675911 1075078 616001 179638 -535111 -1365441 -1877940 -1872345 -1376647
39752 -1376647 -526203 300697 690503 743532 872045 947137 440460 -411929 -631927 -98762
39742 -98762 13727 -935761 -1936283 -1927502 -1411437 -1321991 -1303925 -543760 457033 547611
$$ packed form
39810A231742q43859j29945R33147P82558n25413j167855l83347L96907Q4909
39801C78844l15307K35071Q31948L74384l00389M0847O68240J84567q52976q47308
39791C97921J0044J05637p63116j122444l37322O00117R17302R25117Q54972M36072
39781B024300j48305l00732j45593l04167n47186j10302O39759M39356p53908
39772G93222j430676p46520L18086N52536P6165k75758j40201L39823Q79778J041469
39762A407924N28188k60201o00833m59077m36363p14749q30330n12499N595M95698
39752a376647Q50444Q26900L89806N3029J28513P5092n06677q52389k19998N33165
39742i8762J12489r49488j000522Q781N16065Q9446J8066P60165J000793R0578
$$ plain form
39732 547611 -85332 -236737 190762 39612 -972188 -1549012 -780810 436839 667779
39723 667779 -222666 -1175521 -1351343 -864410 -362707 -203431 7475 933185 2353207
39714 2353207 2929735 1750426 -263012 -1354939 -1124275 -700605 -796790 -776751 21048
39705 21048 1116482 1649271 1522267 1149124 657255 -17376 -667272 -1058160 -1386060 -1995048
39695 -1995048 -2798133 -3350268 -3365660 -2896110 -2160407 -1441409 -999987 -859594 -758182 -440093
39685 -440093 99428 701621 1216653 1555783 1737220 1881433 1998004 1861300 1342012 748516
39675 748516 495547 510453 361568 -71850 -494477 -730487 -861928 -813365 -391004 118991
39665 118991 33029 -707652 -1165633 -563430 604045 1206095 971062 682629 925606 1329332
$$ packed form
39732E47611o32943j51405M27499j51150j011800n76824P68202J217649K30940
39723F67779q90445r52855j75822M86933N01703J59276K10906R25710J420022
39714B353207N76528j179309k013438j091927K30664M23670r6185K0039P97799
39705B1048J095434N32789j27004l73143m91869o74631o49896l90888l27900o08988
39695a995048q03085n52135j5392M69550P35703P18998M41422J40393J01412L18089
39685d40093N39521O02193N15032L39130J81437J44213J16571j36704n19288n93496
39675G48516k52969J4906j48885m33418m22627k36010j31441M8563M22361N09995
39665A18991q5962p40681m57981O02203J167475O02050k35033k88433K42977M03726
$$ plain form
39655 1329332 1331930 1144534 1378579 1903672 1751279 408412 -1269205 -1937803 -1362660
39646 -1362660 -585865 -519112 -962774 -1195531 -953535 -458879 52633 386264 349459 113866
39636 113866 260028 974675 1572910 1389345 778530 536855 647921 444799 -154774 -506720
39626 -506720 -350495 -147961 -147241 27446 550794 920167 672477 -40312 -878164 -1666107
39616 -1666107 -2037493 -1464987 -91121 1117382 1501856 1379267 1147028 489749 -830352
39607 -830352 -2057943 -2215112 -1414784 -604686 -299441 -322550 -490646 -679306 -398999 752772
39597 752772 2197212 2777369 2161431 1093399 178930 -711427 -1613316 -1989264 -1612618
39588 -1612618 -1174548 -1307503 -1544419 -1045009 -29545 390856 -202610 -932300 -865842
$$ packed form
39655A329332K598j87396K34045N25093j52393j342867j677617o68598N75143
39646a362660P76795O6753m43662k32757K41996M94656N11512L33631l6805k35593
39636A13866J46162P14647N98235j83565o10815k41675J11066k03122n99573l51946
39626e06720J56225K02534P20J74687N23348L69373k47690p12789q37852p87943
39616a666107l71386N72506J373866J208503L84474j22589k32239o57279j320101
39607h30352j227591j57169Q00328Q10098L05245k3109j68096j88660K80307J151771
39597G52772J444440N80157o15938j068032r14469q90357r01889l75948L76646
39588a612618M38070j32955k36916M99410J015464M20401n93466p29690O6458
$$ plain form
39579 -865842 -240157 13971 -399095 -844790 -722463 -214276 106638 50894 -127206 -231048
39569 -231048 -262068 -114607 356177 778975 296112 -1355206 -3073750 -3340841 -1954250
39560 -1954250 -262246 489148 515305 860759 1830151 2593744 2252247 823076 -912442
39551 -912442 -2195371 -2729925 -2541474 -1703845 -369887 963096 1483355 712101 -833042
39542 -833042 -1977340 -2114588 -1804704 -1862248 -2197285 -2104062 -1500387 -1123725 -1356396 -1582342
39532 -1582342 -1136488 -334418 36853 -100192 -112619 304285 747329 808530 579637 299855
39522 299855 4296 -224748 -68348 620085 1440744 1769200 1338023 353907 -776388
39513 -776388 -1673714 -2133367 -2239921 -2209151 -2005506 -1329290 -156918 923391 1183996
$$ packed form
39579h65842O25685K54128m13066m45695J22327N08187L20914n5744j78100j03842
39569b31048l1020J47461M70784M22798m82863j651318j718544k67091J386591
39560a954250J692004P51394K6157L45454R69392P63593l41497j429171j735518
39551i12442j282929n34554J88451Q37629J333958J332983N20259p71254j545143
39542h33042j144298j37248L09884n7544l35037R3223O03675L76662k32671k25946
39532a582342M45854Q02070L71271j37045j2427M16904M43044O1201k28893k79782
39522B99855k95559k29044J56400O88433Q20659L28456m31177r84116j130295
39513g76388q97326m59653j06554L0770K03645O76216J172372J080309K60605
$$ plain form
39504 1183996 497022 -555206 -1227357 -1183046 -687584 -363788 -606985 -1133334 -1278120
39495 -1278120 -813804 -211220 22863 -77013 -238108 -456119 -818679 -1085175 -891352 -275076
39485 -275076 349230 653858 565172 152447 -307403 -350623 150194 613123 372104 -392645
39475 -392645 -849723 -632970 -220836 -104284 -140444 -9389 156283 27292 -289951 -321332
39465 -321332 98916 544313 509379 64941 -172355 213966 850728 975679 450452 21948
39455 21948 328056 966630 1012997 316476 -263876 3041 814393 1295495 1056616 504725
39445 504725 243546 430302 772382 1019170 1265455 1662422 2006423 1952163 1600521 1426039
39435 1426039 1536368 1561272 1491231 1902017 2824830 3133502 1955076 194577 -422847
$$ packed form
39504A183996o86974j052228o72151M4311M95462L23796k43197n26349j44786
39495a278120M64316O02584K34083r9876j61095k18011l62560k66496J93823O16276
39485b75076O24306L04628q8686m12725m59850m3220N00817M62929k41019p64749
39475c92645m57078K16753M12134J16552l6160J31055J65672j28991l17243l1381
39465c21332M20248M45397l4934m44438k37296L86321O36762J24951n25227m28504
39455B1948L06108O38574M6367o96521n80352K66917Q11352M81102k38879n51891
39445E04725k61179J86756L42080K46788K46285L96967L44001n4260l51642j74482
39435A426039J10329K4904p0041M10786R22813L08672j178426j760499o17424
$$ plain form
39426 -422847 401389 1357938 1513995 1273312 1191484 1071463 717701 515318 622326 503199
39416 503199 -38551 -226739 460910 1192145 882065 -177044 -836464 -844747 -959157 -1462915
39406 -1462915 -1701772 -1241299 -523733 -65907 209237 451585 371752 -208834 -751912 -581151
39396 -581151 85467 274894 -425697 -1130653 -649962 898060 2000782 1531481 148025
39387 148025 -656683 -581313 -697280 -1578182 -2332106 -2046129 -1263655 -1091420 -1437493 -1250550
39377 -1250550 -273692 562312 573747 151460 -125604 -335820 -726418 -1073139 -1081019 -936365
39367 -936365 -904400 -737593 -61488 871133 1389980 1304772 1071348 1021671 920207 476362
39357 476362 -100500 -379987 -319316 -254842 -390700 -628778 -877563 -1161854 -1334321 -1041625
$$ packed form
39426d22847Q24236R56549J56057k40683q1828j20021l53762k02383J07008j19127
39416E03199n41750j88188O87649P31235l10080j059109o59420q283j14410n03758
39406a462915k38857M60473P17566M57826K75144K42348p9833n80586n43078J70761
39396e81151O66618J89427p00591p04956M80691J548022J102722m69301j383456
39387A48025q04708P5370j15967q80902p53924K85977P82474J72235l46073J86943
39377a250550R76858Q36004J1435m22287k77064k10216l90598l46721p880J44654
39367i36365L1965J66807O76105R32621N18847q5208k33424m9677j01464m43845
39357D76362n76862k79487O0671O4474j35858k38078k48785k84291j72467K92696
$$ plain form
39347 -1041625 -208753 706748 1201695 1253460 1118852 883336 553916 328943 315507 187398
39337 187398 -349551 -926146 -963170 -636336 -646995 -1023476 -994728 -281027 311403 5592
39327 5592 -909761 -1630379 -1859304 -1819049 -1755036 -1875204 -2303185 -2687859 -2380646 -1391487
39317 -1391487 -564015 -371971 -250498 344738 1030847 1379418 1846007 2802925 3379002
39308 3379002 2528474 802240 -252273 -198219 76152 74294 212563 561261 494903 -35695
39298 -35695 -144497 559948 1270266 1270608 948001 882873 815612 249887 -610043 -1226383 -1464479
39287 -1464479 -1355478 -704781 413844 1298556 1435524 1236427 1298472 1364547 798707 -197293
39277 -197293 -698723 -356455 169270 232712 75795 366826 1197508 1896339 1808170 1033895
$$ packed form
39347a041625Q32872R15501M94947N1765j34608k35516l29420k24973j3436j28109
39337A87398n36949n76595l7024L26834j0659l76481K8748P13701N92430l05811
39327E592r15353p20618k28925M0255O4013j20168m27981l84674L07213R89159
39317a391487Q27472J92044J21473N95236O86109L48571M66589R56918N76077
39308C379002q50528j726234j054513N4054K74371j858J38269L48698o6358n30598
39298c5695j08802P04445P10318L42l22607o5128o7261n65725q59930o16340k38096
39287a464479J09001O50697J118625Q84712J36968j99097O2045O6075n65840r96000
39277a97293n01430L42268N25725O3442j56917K91031Q30682O98831q8169p74275
$$ plain form
39267 1033895 259320 -61911 -92986 -130082 -129509 -19603 -85626 -504380 -790162 -394056
39257 -394056 324669 518046 161610 49768 427125 620295 276275 -64108 -64026 -233202
39247 -233202 -825838 -1059961 -320982 623136 626750 -140762 -531548 -103304 538108 897542
39237 897542 1122020 1360027 1415720 1190862 891228 700738 666599 835060 1080775 987044
39227 987044 397941 -123142 38847 628669 898412 707322 511288 393127 -35336 -704303
39217 -704303 -912131 -340541 449807 834800 833929 699280 388960 -135261 -545750 -534496
39207 -534496 -261981 -60588 46014 205020 377766 475285 655180 1116262 1689092 1943366
39197 1943366 1668163 1000686 128814 -838632 -1648780 -1847512 -1212180 -178498 435250
$$ packed form
39267A033895p74575l21231l1075l7096N73J09906o6023m18754k85782L96106
39257c94056P18725J93377l56436j11842L77357J93170l44020l40383Q2j69176
39247b33202n92636k34123P38979R44118L614p67512l90786M28244O41412L59434
39237H97542K24478K38007N5693k24858k99634j90490l4139J68461K45715r3731
39227I87044n89103n21083J61989N89822K69743j91090j96034j18161m28463o68967
39217g04303k07828N71590P90348L84993q71j34649l10320n24221m10489J1254
39207e34496K72515K01393J06602J59006J72746R7519J79895M61082N72830K54274
39197A943366k75203o67477q71872r67446q10148j98732O35332J033682O13748
$$ plain form
39188 435250 259923 -228042 -324909 19158 238234 31614 -204969 -3235 476961 696739
39178 696739 485695 186954 121958 224523 259705 203694 283191 646588 1045991 991953
39168 991953 362514 -302863 -406173 -53895 198786 255123 512009 942023 898447 159118
39158 159118 -535738 -481531 52825 443742 691512 1086358 1394025 1206136 785048 718677
39148 718677 929276 841295 393905 45674 -158707 -635124 -1304976 -1474474 -905486 -245937
39138 -245937 -83741 -225367 -249275 -184610 -236686 -304890 -209915 -120612 -401467 -1149508 -2019681
39127 -2019681 -2415790 -1958067 -1016230 -576967 -1151185 -2028792 -2199597 -1776773 -1665133
39118 -1665133 -1903890 -1424955 229758 1953997 2431615 1691056 680180 -49371 -501026
$$ packed form
39188D35250j75327m87965r6867L44067K19076k06620k36583K01734M80196K19778
39178F96739k11044k98741o4996J02565L5182n6011P9497L63397L99403n4038
39168I91953o29439o65377j03310L52278K52681N6337K56886M30014m3576p39329
39158A59118o94856N4207N34356L90917K47770L94846L07667j87889m21088o6371
39148G18677K10599q7981m47390l48231k04381m76417o69852j69498N68988O59549
39138b45937J62196j41626k3908O4665n2076o8204R4975Q9303k80855p48041q70173
39127b019681l96109M57723R41837M39263n74218q77607j70805M22824J11640
39118a665133k38757M78935J654713J724239M77618p40559j010876p29551m51655
$$ plain form
39109 -501026 -595463 -221003 283844 380235 -20918 -619322 -1220010 -1659282 -1473113 -297727
39099 -297727 1400532 2537447 2470572 1534922 557206 191146 666024 1706756 2568018
39090 2568018 2534401 1647418 763864 695212 1355573 1876363 1528195 457098 -474207 -515743
39080 -515743 309365 1300249 1735273 1450247 908379 745254 1104532 1394169 923814 -169453
39070 -169453 -992060 -1044053 -810393 -849651 -858582 -319573 361439 297143 -465732 -962974
39060 -962974 -794108 -586515 -738995 -696347 34933 972837 1350005 1077860 498350 -186476
39050 -186476 -681959 -458046 476847 1213700 1063578 525439 375937 318513 -487545 -1860674
39040 -1860674 -2613967 -2124838 -978942 46519 796490 1300700 1283078 576244 -375599
$$ packed form
39109e01026r4437L74460N04847R6391m01153n98404o00688m39272J86169J175386
39099b97727J698259J136915o6875r35650r77716l66060M74878J040732Q61262
39090B568018l3617q86983q83554o8652O60361N20790l48168j071097r31305m1536
39080e15743Q25108R90884M35024k85026n41868j63125L59278K89637m70355j093267
39070a69453q22607n1993K33660l9258q931N39009O81012o4296p62875m97242
39060i62974J68866K07593j52480M2648P31280R37904L77168k72145n79510o84826
39050a86476m95483K23913R34893P36853j50122n38139j49502n7424q06058j373129
39040a860674p53293M89129J145896J025461P49971N04210j7622p06834r51843
$$ plain form
39031 -375599 -827599 -428645 510572 1310851 1511078 1337000 1481769 2234752 3066658 3375988
39021 3375988 3318892 3402743 3547757 3252673 2594334 2285156 2584205 2827422 2345084 1338584
39011 1338584 518908 267240 464236 814698 1012310 836978 409620 170306 318231
39002 318231 438028 13503 -765997 -1094305 -559448 244311 425596 -13247 -149456 537423
38992 537423 1295853 1079202 116005 -282723 429560 1218882 958681 45098 -206812 606420
38982 606420 1541723 1594954 736441 -364519 -1073510 -1138102 -746420 -373925 -288943 -204852
38972 -204852 294369 1063837 1502250 1322264 873038 693073 1005894 1595503 1952096 1705875
38962 1705875 1150447 1019512 1407035 1385650 305826 -1005962 -1269892 -675779 -607130
$$ packed form
39031c75599m52000L98954R39217Q00279K00227j74078J44769P52983Q31906L09330
39021C375988n7096Q3851J45014k95084o58339l09178K99049K43217m82338j006500
39011A338584q19676k51668J96996L50462J97612j75332m27358k39314J47925
39002C18231J19797m24525p79500l28308N34857Q03759J81285m38843j36209O86879
38992E37423P58430k16651r63197l98728P12283P89322k60201r13583k51910Q13232
38982F06420R35303N3231q58513j100960p08991o4592L91682L72495Q4982Q4091
38972b04852M99221P69468M38413j79986m49226j79965L12821N89609L56593k46221
38962A705875n55428j30935L87523k1385j079824j311788k63930N94113O8649
$$ plain form
38953 -607130 -1401877 -1687972 -480229 1170097 1511059 370133 -856530 -1110265 -638734
38944 -638734 -167519 59097 223070 470402 783439 1072865 1251950 1342282 1503390 1801434
38934 1801434 1987742 1716698 1008542 308831 -1652 -33808 -190024 -576474 -813957 -560124
38924 -560124 -41266 235896 220136 318292 597805 557723 -4857 -498684 -461545 -447128
38914 -447128 -1187792 -2230661 -2409879 -1610186 -1018742 -1415740 -2186340 -2443765 -2262810
38905 -2262810 -2191488 -2225804 -1996580 -1527057 -1092950 -605881 185215 985275 1046940 65228
38895 65228 -1367559 -2287379 -2197284 -1426637 -745541 -533815 -363464 352443 1382479 1832944
38885 1832944 1346641 562930 157121 47266 -43855 125814 807720 1480430 1376610 632612
$$ packed form
38953f07130p94747k86095J207743J650326L40962j140926j226663k53735M71531
38944f38734M71215K26616J63973K47332L13037K89426J79085R0332J61108K98044
38934A801434J86308k71044p08156o99711l10483l2156j56216l86450k37483K53833
38924e60124N18858K77162j5760R8156K79513m0082n62580m93827L7139J4417
38914d47128p40664j042869j79218P99693N91444l96998p70600k57425J80955
38905b262810P1322l4316K29224M69523M34107M87069P91096Q00060O1665r81712
38895F5228j432787r19820R0095P70647O81096K11726J70351P15907J030036M50465
38885A832944m86303p83711m05809j09855r1121J69669O81906O72710j03820p43998
$$ plain form
38875 632612 168495 401065 751673 635253 383845 774287 1873746 2779254 2621664
38866 2621664 1637559 959715 1257814 1909045 1879468 1165476 699028 839188 805472 -8169
38856 -8169 -916944 -847980 95217 743303 352549 -682763 -1527437 -1696792 -1138963 -108392
38846 -108392 860696 1226134 872712 138801 -548836 -887098 -711426 -135298 406219 586773
38836 586773 616589 922277 1444224 1615327 1101288 265963 -240416 -206519 -49582 -279924
38826 -279924 -809051 -939896 -230236 803906 1267749 1099178 1077596 1492931 1569049 675968
38816 675968 -557003 -1035822 -639700 -107708 167817 409407 711761 888299 1043808
38807 1043808 1502276 2057331 2011183 1158034 137239 -383825 -352491 -13039 469812 822827
$$ packed form
38875F32612m64117K32570L50608j16420k51408L90442J099459R05508j57590
38866B621664r84105o77844K98099O51231k9577p13992m66448J40160l3716q13641
38856h169r08775O8964R43197O48086l90754j035312q44674j69355N57829J030571
38846a08392R69088L65438l53422p33911o87637l38262J75672N76128N41517J80554
38836E86773K9816L05688N21947J71103n14039q35325n06379L3897J56937k30342
38826b79924n29127j30845P09660J034142M63843j68571k1582M15335P6118q93081
38816F75968j232971m78819L96122N31992K75525K41590L02354J76538J55509
38807A043808M58468N55055m6148q53149j020795n21064L1334L39452M82851L53015
$$ plain form
38797 822827 646642 -31347 -543484 -279051 610033 1437352 1739478 1631601 1551666 1774624
38787 1774624 2108318 2082766 1516386 726828 17038 -733595 -1592096 -2025321 -1472956 -332125
38777 -332125 351318 244376 110091 652739 1608203 2273038 2391165 2134328 1625366 920253
38767 920253 238399 -150529 -201038 -96825 -74563 -279963 -652679 -971057 -1144650 -1290832
38757 -1290832 -1306378 -733309 433759 1162321 439676 -1169106 -1931673 -1063703 423705
38748 423705 1234755 1256080 1093960 1007832 961471 1107350 1530276 1926812 2078283 2205593
38738 2205593 2370524 2070033 1039155 -49187 -387331 -117069 89238 95601 142051 23982
38728 23982 -567389 -1090141 -631231 596079 1282355 832916 197168 404226 1079735 1123261
$$ packed form
38797H22827j76185o77989n12137K64433Q89084Q27319L02126j07877p9935K22958
38787A774624L33694k5552n66380p89558p09790p50633q58501m33225N52365J140831
38777c32125O83443j06942j34285N42648R55464O64835J18127k56837n08962p05113
38767I20253o81854l88928n0509J04213K2262k05400l72716l18378j73593j46182
38757a290832j5546N73069J167068P28562p22645j608782p62567Q67970J487408
38748D23705Q11050K1325j62120q6128m6361J45879M22926L96536J51471J27310
38738B205593J64931l00491j030878j088342l38144K70262K06307O363M6450j18069
38728B3982n91371n22752M58910J227310O86276m49439o35748K07058O75509M3526
$$ plain form
38718 1123261 345063 -349388 -236459 400438 758931 401674 -446419 -1213778 -1485979
38709 -1485979 -1327507 -1152364 -1222127 -1340417 -1169692 -765549 -550898 -711290 -883855 -675144
38699 -675144 -315333 -424893 -1119071 -1764389 -1829403 -1585544 -1601128 -1887180 -2076761 -2195629
38689 -2195629 -2541731 -2860774 -2457619 -1321296 -365725 -188736 -309801 -127368 86156
38680 86156 -139903 -405901 3811 806776 970116 271617 -289136 156309 1313070 2313724
38670 2313724 2699452 2457462 1648234 523145 -292496 -257408 478740 1219790 1443687
38661 1443687 1189520 814171 620156 756556 1252636 1927502 2292737 1817187 533652
38652 533652 -721650 -1017001 -347441 347047 298765 -283918 -717942 -770036 -718582 -771038
$$ packed form
38718A123261p78198o94451J12929O36897L58493l57257q48093p67359k72201
38709a485979J58472J75143o9763j18290J70725M04143K14651j60392j72565K08711
38699f75144L59811j09560o94178o45318o5014K43859j5584k86052j89581j18868
38689b195629l46102l19043M03155J136323R55571J76989j21065J82433K13524
38680H6156k26059k65998M09712Q02965J63340o98499n60753M45445J156761J000654
38670B313724L85728k41990q09228j125089q15641L5088P36148P41050K23897
38661A443687k54167l75349j94015J36400M96080O74866L65235m75550j283535
38652E33652j255302k95351O69560O94488m8282n82683m34024n2094N1454n2456
$$ plain form
38642 -771038 -871032 -970067 -1091552 -1156505 -1044692 -777243 -399785 179571 941826 1480883
38632 1480883 1316107 436410 -691632 -1534083 -1732402 -1238482 -540831 -456973 -1269014
38623 -1269014 -2308281 -2809186 -2836123 -2840965 -2724564 -2126319 -1352642 -1056015 -1078955 -640073
38613 -640073 242159 585135 2427 -625892 -561344 -306887 -568384 -953794 -645281 201001
38603 201001 725169 719053 750558 1043307 1120908 656680 -36678 -519465 -661216 -444055
38593 -444055 121607 702854 757853 202484 -398300 -531133 -297989 -46548 228403 751760
38583 751760 1425199 1831379 1802616 1662634 1756413 1963648 1931081 1697960 1753946 2349665
38573 2349665 3029501 3121846 2523227 1680562 948061 405803 241785 687424 1377030 1393981
$$ packed form
38642g71038r9994r9035j21485o4953J11813K67449L77458N79356P62255N39057
38632A480883j64776q79697j128042q42451j98319M93920O97651Q3858q12041
38623a269014j039267n00905k6937m842J16401N98245P73677K96627k2940M38882
38613f40073Q82232L42976n82708o28319O4548K54457k61497l85410L08513Q46282
38603B01001N24168o116L1505K92749P7601m64228o93358m82787j41751K17161
38593d44055N65662N81247N4999n55369o00784j32833K33144K51441K74951N23357
38583G51760O73439M06180k8763j39982R3779K07235l2567k33121N5986N95719
38573B349665O79836R2345n98619q42665p32501n42258j64018M45639O89606J6951
$$ plain form
38563 1393981 418492 -632944 -721663 -143763 -139417 -1087933 -1856791 -1239827 516948 2071920
38553 2071920 2536852 2177787 1695897 1315304 750885 -191723 -1219998 -1732842 -1352359
38544 -1352359 -355607 437154 407002 -144998 -269244 434985 1175607 958063 43316 -261905
38534 -261905 601299 1604650 1559384 749566 381987 801209 1188063 958756 522732 446610
38524 446610 681942 979384 1382055 1871063 2095593 1915879 1705308 1651722 1295795 343402
38514 343402 -556621 -568507 143517 749319 1014165 1348194 1681916 1299744 103680 -793039
38504 -793039 -328379 1124861 2223317 2245942 1658960 1165034 779563 138018 -602874
38495 -602874 -659413 458093 2210277 3512688 3858952 3641580 3379365 3066020 2482406
$$ packed form
38563A393981r75489j051436q8719N77900M346r48516p68858O16964J756775J554972
38553B071920M64932l59065m81890l80593n64419r42608j028275n12844L80483
38544a352359R96752P92761l0152n52000j24246P04229P40622k17544r14747l05221
38534b61905Q63204J003351m5266q09818l67579M19222L86854k29307m36024p6122
38524D46610K35332K97442M02671M89008K24530j79714k10571n3586l55927r52393
38514C43402r00023j1886P12024O05802K64846L34029L33722l82172j196064q96719
38504g93039M64660J453240J098456K2625n86982m93926l85471o41545p40892
38495f02874n6539J117506J752184J302411L46264k17372k62215l13345n83614
$$ plain form
38486 2482406 1758204 1238432 996985 853923 764923 859691 1156209 1524386 1872809 2106523
38476 2106523 1992030 1394796 633977 273662 479894 811503 742386 254731 -159651 -46562
38466 -46562 472224 770121 479245 107351 528284 1782421 2843428 2845666 2122466 1649257
38456 1649257 1829487 2276333 2451822 2007496 818362 -695480 -1522984 -1035624 112949
38447 112949 735214 644251 672865 1189848 1503844 1004609 100196 -424798 -399265 -171149
38437 -171149 5386 42740 -163413 -572964 -893938 -935293 -840668 -765233 -616890 -336900
38427 -336900 -113932 -51270 101399 609900 1350212 1937922 2078728 1696487 977752 374391
38417 374391 257553 492194 665454 713661 865458 999643 735538 295932 498609 1501420
$$ packed form
38486B482406p24202n19772k41447j43062q9000R4768K96518L68177L48423K33714
38476B106523j14493n97234p60819l60315K06232L31609o9117m87655m14382J13089
38466d6562N18786K97897k90876l71894M20933J254137J061007K238p23200m73209
38456A649257J80230M46846J75489m44326j189134j513842q27504M87360J148573
38447A12949O22265r0963K8614N16983L13996m99235r04413n24994K5533K28116
38437a71149J76535L7354k06153m09551l20974m1355R4625P5435J48343K79990
38427c36900K22968O2662J52669N08501P40312N87710J40806l82241p18735o03361
38417C74391j16838K34641J73260M8207J51797J34185k64105m39606K02677J002811
$$ plain form
38407 1501420 2257213 1773213 393863 -703774 -834920 -129206 965824 1891947 2094695
38398 2094695 1553957 908371 572177 162809 -646783 -1257192 -909795 97244 837044
38389 837044 1094540 1351062 1628988 1361398 443203 -483114 -910464 -886056 -514417 152552
38379 152552 655574 402749 -414292 -939372 -831798 -543658 -312864 173607 858342 1073394
38369 1073394 673532 431848 718217 762231 31913 -572195 10906 1189440 1426310
38360 1426310 465673 -369801 -110534 743966 1292540 1473227 1750025 2174706 2302854
38351 2302854 1812161 910677 250694 463066 1505747 2464633 2355951 1206433 18930
38342 18930 -384981 -115352 277223 584580 929077 1267158 1305582 896058 288927 -70198
$$ packed form
38407A501420P55793m84000j379350j097637j31146P05714J095030R26123K02748
38398B094695n40738o45586l36194m09368q09592o10409L47397J007039P39800
38389H37044K57496K56522K77926k67590r18195r26317m27350K4408L71639O66969
38379A52552N03022k52825q17041n25080J07574K88140K30794M86471O84735K15052
38369A073394l99862k41684K86369M4014p30318o04108N83101J178534K36870
38360A426310r60637q35474K59267Q54500N48574J80687K76798M24681J28148
38351B302854m90693r01484o59983K12372J042681R58886j08682j149518j187503
38342A8930m03911K69629L92575L07357L44497L38081L8424m09524o07131l59125
$$ plain form
38332 -70198 39890 394389 557948 407728 330144 732672 1438901 1827122 1585959 1069280
38322 1069280 808451 905919 1068007 1058468 894499 635318 172279 -661130 -1776540 -2704677
38312 -2704677 -2920824 -2385254 -1667185 -1383593 -1548548 -1620874 -1171871 -342474 368438 598621
38302 598621 360659 -46847 -264158 -119300 221334 387427 180104 -196250 -348646 -157345
38292 -157345 43839 -171728 -790816 -1303116 -1252511 -746296 -286703 -188372 -353249 -541133
38282 -541133 -579964 -324257 235842 720655 574783 -259176 -1171978 -1591085 -1530261 -1210129
38272 -1210129 -558962 472909 1449118 1872508 1880017 1922341 1888152 1251929 136797 -515891
38262 -515891 -144448 643355 882993 427062 -137061 -421359 -558907 -686691 -598342 -88389
$$ packed form
38332g0198J10088L54499J63559j50220p7584M02528P06229L88221k41163n16679
38322A069280k60829R7468J62088r539j63969k59181m63039q33409j115410r28137
38312b704677k16147N35570P18069K83592j64955p2326M49003Q29397P10912K30183
38302E98621k37962m07506k17311J44858L40634J66093k07323l76354j52396J91301
38292a57345K01184k15567o19088n12300N0605N06215M59593R8331j64877j87884
38282e41133l8831K55707N60099M84813j45872q33959r12802m19107O0824L20132
38272a210129O51167J031871R76209M23390P509M2324l4189o36223j115132o52688
38262e15891L71443P87803K39638m55931n64123k84298j37548j27784Q8349N09953
$$ plain form
38252 -88389 569211 707730 -72133 -1341099 -2112936 -1847334 -1048785 -616910 -743770 -842170
38242 -842170 -485841 103519 587453 975261 1309132 1376493 1107666 890114 1081499 1475298
38232 1475298 1629402 1503500 1399466 1454268 1557407 1632737 1673391 1622261 1504734 1516081
38222 1516081 1672003 1563121 840912 -165415 -704121 -451719 181533 564760 437172
38213 437172 57065 -52929 368188 913992 882455 220616 -293063 -104898 351533 426581
38203 426581 297146 529834 972853 962395 472474 140648 143148 -32326 -530138 -726082
38193 -726082 -182470 755510 1599109 2175078 2160106 1094119 -591694 -1448768 -712006
38184 -712006 550282 862658 372003 450870 1597101 2796780 2990427 2280303 1494727
$$ packed form
38252h8389O57600J38519p79863j268966p71837K65602P98549M31875j26860r8400
38242h42170L56329N89360M83934L87808L33871O7361k68827k17552J91385L93799
38232A475298J54104j25902j04034N4802J03139P5330M0654n1130j17527J1347
38222A516081J55922j08882p22209j006327n38706K52402O33252L83227j27588
38213D37172l80107j09994M21117N45804l1537o61839n13679J88165M56431P5048
38203D26581j29435K32688M43019j0458m89921l31826K500j75474m97812j95944
38193g26082N43612R37980Q43599N75969j4972j065987j685813q57074P36762
38184g12006J262288L12376m90655P8867J146231J199679J93647p10124p85576
$$ plain form
38175 1494727 1208881 1391885 1559145 1188693 363891 -101521 327784 964714 692984
38166 692984 -358823 -840239 -88934 903409 963501 402857 408297 1218384 1829718 1476885
38156 1476885 611229 165534 400014 849670 1086400 1095452 973668 644356 26099 -694719
38146 -694719 -1137859 -1055408 -532678 65104 312541 54841 -350502 -296367 367064 1073687
38136 1073687 1260969 1097004 1044323 976483 486810 -13371 461541 1802618 2418285 1238974
38126 1238974 -704775 -1604953 -1127222 -322316 159723 507240 660440 160882 -763498
38117 -763498 -1134522 -558400 320768 948533 1497374 2106660 2446805 2403626 2331729 2337637
38107 2337637 2217994 2311219 3303480 4961166 6417496 8044336 11293635 16073277 20630632
$$ packed form
38175A494727k85846J83004J67260l70452q24802m65412M29305O36930k71730
38166F92984j051807m81416P51305R92343O0092n60644N440Q10087O11334l52833
38156A476885q65656m45695K34480M49656K36730R052j21784l29312o18257p20818
38146f94719m43140Q2451N22730N97782K47437k57700m05343N4135O63431P06623
38136A073687J87282j63965n2681o7840m89673n00181M74912J341077O15667j179311
38126A238974j943749r00178M77731Q04906M82039L47517J53200m99558r24380
38117g63498l71024N76122Q79168O27765N48841O09286L40145m3179p1897N908
38107B337637j19643R3225R92261J657686J456330J626840L249299M779642M557355
$$ plain form
38098 20630632 25576652 35330364 52112308 69632438 76830520 68903815 52033623 36290542
38090 36290542 26378526 20622815 16243668 12595910 10064941 8526683 7542042 6829932
38082 6829932 6143910 5315511 4444911 3583038 2487571 1205351 468933 814783 1647306
38073 1647306 1907560 1395650 718722 221531 -215238 -497206 -312112 164121 286236
38064 286236 -222201 -995038 -1610796 -1930800 -1862536 -1329096 -531490 175456 644983 842769
38054 842769 633207 149605 58534 757782 1557176 1486099 760784 502229 1022231 1446076
38044 1446076 1222001 932599 1195434 1723867 2010443 2074879 1952002 1295404 197261
38035 197261 -413212 -47744 384103 -110813 -951606 -827374 178602 631496 -105821
$$ packed form
38098B0630632M946020R753712J6781944J7520130P198082p926705j6870192j5743081
38090C6290542r912016n755711m379147l647758k530969j538258r84641p12110
38082F829932o86022q28399q70600q61873j095467j282220p36418L45850Q32523
38073A647306K60254n11910o76928m97191m36769k81968J85094M76233J22115
38064B86236n08437p72837o15758l20004O8264N33440P97606P06946M69527J97786
38054H42769k09562m83602r1071O99248P99394p1077p25315k58555N20002M23845
38044A446076k24075k89402K62835N28433K86576O4436j22877o56598j098143
38035A97261o10473L65468M31847m94916q40793J24232J005976M52894p37317
$$ plain form
38026 -105821 -1027878 -1075013 -476171 -23455 84159 25669 -322603 -1069874 -1678847 -1414668
38016 -1414668 -379451 477097 503328 116684 198177 905533 1430898 1083257 348301 394032
38006 394032 1463391 2343145 1852205 397413 -585810 -443924 208361 681603 1015338
37997 1015338 1445756 1870110 2161665 2383423 2384160 1806006 829636 258671 422964 627917
37987 627917 229090 -353198 -361551 73943 229803 -31631 -175882 107423 660345 1355376
37977 1355376 2102660 2461802 2005056 1068927 448560 337664 263132 46041 1631 89427
37967 89427 -223348 -938024 -1219515 -596048 272745 602794 609491 917150 1338904 1072168
37957 1072168 -81138 -1397887 -2107845 -2062162 -1562226 -974863 -519494 -98826 608758
$$ packed form
38026a05821r22057m7135N98842M52716J07614n8490l48272p47271o08973K64179
38016a414668J035217Q56548K6231l86644Q1493P07356N25365l47641p34956M5731
38006C94032J069359Q79754m90940j454792r83223J41886O52285M73242L33735
37997A015338M30418M24354K91555K21758P37n78154r76370n70965J64293K04953
37987F27917l98827n82288q353M35494J55860k61434j44251K83305N52922O95031
37977A355376P47284L59142m56746r36129o20367j10896p4532k17091m4410Q7796
37967H9427l12775p14676k81491O23467Q68793L30049O697L07659M21754k66736
37957A072168j153306j316749p09958M5683M99936N87363M55369M20668P07584
$$ plain form
37948 608758 1615964 2360927 2334043 1779872 1319930 1026250 440496 -476860 -1023086 -645047
37938 -645047 239028 656784 184268 -614410 -871458 -452495 -185171 -872808 -2119278
37929 -2119278 -2546229 -1423422 310234 1093563 515353 -510334 -1106874 -1228321 -1088159
37920 -1088159 -618511 137810 687101 627301 204806 -72966 -140557 -331030 -804794 -1341097
37910 -1341097 -1604617 -1425701 -958361 -688552 -1024347 -1686642 -1826307 -1046715 -6431
37901 -6431 384855 102974 -143456 -5369 166438 42577 -251692 -572296 -1036627 -1560808
37891 -1560808 -1627684 -985874 -227782 -107771 -456597 -376052 473541 1383796 1617093 1386159
37881 1386159 1379813 1651725 1559135 753175 -306313 -987914 -1243405 -1447035 -1720883 -1761796
$$ packed form
37948F08758J007206P44963k6884n54171m59942k93680n85754r17356n46226L78039
37938f45047Q84075M17756m72516p98678k57048M18963K67324o87637j246470
37929b119278m26951J122807J733656P83329n78210j025687n96540j21447J40162
37920a088159M69648P56321N49291n9800m22495k77772o7591j90473m73764n36303
37910a341097k63520J78916M67340K69809l35795o62295j39665P79592J040284
37901f431L91286k81881k46430J38087J71807j23861k94269l20604m64331n24181
37891a560808o6876O41810P58092J20011l48826Q0545Q49593R10255K33297k30934
37881A386159o346K71912r2590q05960j059488o81601k55491k03630k73848m0913
$$ plain form
37871 -1761796 -1322101 -627143 -194907 -254702 -415182 -73870 733814 1130488 416617 -824560
37861 -824560 -1227358 -395352 476439 150805 -1024477 -1683200 -1259867 -435301 99076
37852 99076 428699 779709 877123 393761 -420220 -975764 -959262 -485698 57711 156133
37842 156133 -452276 -1325684 -1649789 -1235978 -724529 -549272 -320242 291698 693104 175223
37832 175223 -810384 -1094039 -407095 286120 151300 -574251 -1178795 -1325075 -1027027 -390714
37822 -390714 249890 421660 117215 -92567 96823 209301 -205804 -645109 -194252 1127584
37812 1127584 2223869 2241768 1534805 1074024 1265522 1677280 1747967 1400117 910293 440493
37802 440493 -72246 -588247 -762140 -279427 635417 1286294 1225955 786559 709002 1275336
$$ packed form
37871a761796M39695O94958M32236n9795j60480L41312Q07684L96674p13871j241177
37861h24560m02798Q32006Q71791l25634j175282o58723M23333Q24566N34377
37852I9076L29623L51010R7414m83362q13981n55544J6502M73564N43409R8422
37842A56133o08409q73408l24105M13811N11449J75257K29030O11940M01406n17881
37832A75223r85607k83655O86944O93215j34820p25551o04544j46280K98048O36313
37822c90714O40604J71770l04445k09782J89390J12478m15105m39305M50857J321836
37812A127584J096285J7899p06963m60781J91498M11758P0687l47850m89824m69800
37802D40493n12739n16001j73893M82713R14844O50877o0339m39396p7557N66334
$$ plain form
37792 1275336 1984987 2135315 1581023 812117 365054 320730 404790 404066 308235 111981
37782 111981 -264973 -765025 -1106505 -1097970 -913810 -851838 -912919 -867674 -679189 -545303
37772 -545303 -483947 -212177 392889 976897 1097486 782041 473103 514086 876304 1282714
37762 1282714 1377370 867299 -215484 -1386689 -2089296 -2227706 -2105455 -1865998 -1371328
37753 -1371328 -740390 -538753 -1041534 -1627425 -1458971 -655765 -188208 -535103 -1081655
37744 -1081655 -1129833 -887349 -924290 -1135370 -978475 -487536 -229388 -298722 -193501 192253
37734 192253 327208 95854 181151 840262 1191650 601252 27091 745586 2127172 2139661
37724 2139661 210190 -1787350 -1970308 -746964 158142 109781 -101489 130386 461563
$$ packed form
37792A275336P09651J50328n54292p68906m47063m4324Q4060p24r5831j96254
37782A11981l76954n00052l41480Q535J84160O1972o1081M5245J88485J33886
37772e45303O1356K71770O05066N84008J20589l15445l08938M0983L62218M06410
37762A282714R4656n10071j082783j171205p02607j38410J22251K39457M94670
37753a371328O30938K01637n02781n85891J68454Q03206M67557l46895n46552
37744a081655m8178K42484l6941k11080J56895M90939K58148o9334J05221L85754
37734A92253J34955k31354Q5297O59111L51388n90398n74161P18495J381586J2489
37724B139661j929471j997540j82958J223344R05106m8361k11270K31875L31177
$$ plain form
37715 461563 478952 385780 476273 568884 377683 55489 -52860 -10297 -255643 -961656
37705 -961656 -1694285 -1867296 -1438546 -939905 -741318 -523085 205821 1167571 1397605 479055
37695 479055 -732958 -1049668 -377996 278904 179894 -322429 -462789 -143150 25552 -415690
37685 -415690 -1238923 -1900588 -2184776 -2296735 -2452811 -2646817 -2835698 -3039355 -3070452 -2475173
37675 -2475173 -1119363 372744 1257415 1638897 2191547 2914379 2939910 1866593 501297
37666 501297 -265360 -625232 -1145479 -1501737 -956711 190058 777560 457587 124738
37657 124738 410327 754138 469545 -142069 -423864 -433163 -593043 -756164 -470921 75020
37647 75020 220753 -119742 -356998 -256978 -328838 -901000 -1435136 -1246081 -543903 -221754
$$ packed form
37715D61563J7389r3172R0493R2611j91201l22194j08349M2563k45346p06013
37705i61656p32629j73011M28750M98641J98587K18233P28906R61750K30034r18550
37695D79055j212013l16710O71672O56900r9010n02323j40360L19639J68702m41242
37685d15690q23233o61665k84188j11959j56076j94006j88881k03657l1097N95279
37675b475173J355810J492107Q84671L81482N52650P22832K5531j073317j365296
37666E01297p66657l59872n20247l56258N45026J146769N87502l19973l32849
37657A24738K85589L43811k84593o11614k81795r299j59880j63121K85243N45941
37647G5020J45733l40495k37256J00020p1860n72162n34136J89055P02178L22149
$$ plain form
37637 -221754 -687181 -1339474 -1314920 -483385 479637 899691 782508 658585 900303 1324924
37627 1324924 1429967 892564 -163095 -1269412 -1948527 -2027364 -1664628 -1087396 -447037
37618 -447037 -22440 -286954 -1399823 -2744652 -3413289 -3151883 -2410593 -1514097 -424380
37609 -424380 562989 701126 -151047 -1024251 -1039695 -571963 -463556 -577422 -120419 852080
37599 852080 1360549 967914 285846 -181221 -685579 -1362676 -1682012 -1342919 -890202 -774609
37589 -774609 -549048 223428 938101 781221 116738 -4365 530551 806010 350285 -315502
37579 -315502 -703904 -982536 -1308460 -1391699 -1100946 -797299 -667698 -365975 258884 691542
37569 691542 512991 94292 -42372 -95237 -568912 -1328868 -1774744 -1795772 -1871254 -2211613
$$ packed form
37637b21754m65427o52293K4554Q31535R63022M20054j17183j23923K41718M24621
37627A324924J05043n37403j055659j106317o79115p8837L62736N77232O40359
37618d47037M24597k64514j112869j344829o68637K61406P41290Q96496J089717
37609d24380R87369J38137q52173q73204j5444M67732J08407j13866M57003R72499
37599H52080N08469l92635o82068m67067n04358o77097l19336L39093M52717J15593
37589g74609K25561P72476P14673j56880o64483j21103N34916K75459m55725o65787
37579c15502l88402k78632l25924q3239K90753L03647J29601L01723O24859M32658
37569F91542j78551m18699j36664n2865m73675p59956m45876k1028p5482l40359
$$ plain form
37559 -2211613 -2396454 -2029801 -1341048 -920216 -1056043 -1466559 -1623452 -1348830 -1079015
37550 -1079015 -1355387 -2052964 -2473005 -2296570 -1939391 -1710650 -1267589 -455077 -61608
37541 -61608 -856329 -2241142 -2869641 -2473533 -2020168 -2006161 -1746412 -743939 293394
37532 293394 497189 134667 94895 599482 1148927 1374869 1275407 901356 437788 339388
37522 339388 760287 1053850 454526 -887613 -2109917 -2685620 -2664831 -2087256 -960117
37513 -960117 168529 431472 -299598 -1184807 -1512217 -1480233 -1584150 -1754536 -1578854 -1054845
37503 -1054845 -619208 -511281 -481749 -185806 327266 605117 265708 -535544 -1206252 -1336860
37493 -1336860 -1037894 -538533 209115 1144020 1638728 1110949 51419 -298818 478463
$$ packed form
37559b211613j84841L66653O88753M20832j35827m10516j56893K74622K69815
37550a079015k76372o97577m20041J76435L57179K28741M43061Q12512L93469
37541f1608p94721j384813o28499L96108M53365J4007K59749J002473J037333
37532B93394K03795l62522l9772N04587N49445K25942r9462l74051m63568r8400
37522C39388M20899K93563n99324j342139j222304n75703K0789N77575J127139
37513i60117J128646K62943p31070q85209l27410L1984j03917j70386J75682N24009
37503a054845M35637J07927K9532K95943N13072K77851l39409q01252o70708j30608
37493a336860K98966M99361P47648R34905M94708n27779j059530l50237P77281
$$ plain form
37484 478463 1370791 1271408 381010 -232498 -87857 299701 319440 16051 -157618 10325
37474 10325 282114 329815 199866 314204 915187 1647590 1951918 1773309 1502285 1265876
37464 1265876 801440 134985 -184413 196563 947414 1563664 1904215 1940556 1514934 752437
37454 752437 190811 36094 -178192 -683149 -873509 -331428 208980 -79714 -612511 -177422
37444 -177422 1053685 1688586 1293011 921550 1128984 956839 -318743 -1730607 -2016310
37435 -2016310 -1505153 -1369255 -1666525 -1476747 -657047 -135427 -441984 -1057804 -1367925
37426 -1367925 -1326030 -1025339 -508531 -194564 -587037 -1274142 -1137014 23652 981035
37417 981035 806859 229700 395894 975278 673995 -641824 -1565161 -1091187 42413
$$ packed form
37484D78463Q92328r9383q90398o13508J44641L87558J9739l03389j73669J67943
37474A0325K71789M7701j29949J14338O00983P32403L04328j78609k71024k36409
37464A265876m64436o66455l19398L80976P50851O16250L40551L6341m25622p62497
37454G52437n61626j54717k14286n04957j90360N42081N40408k88694n32797M35089
37444a77422J231107O34901l95575l71461K07434j72145j275582j411864k85703
37435b016310N11157J35898k97270J89778Q19700N21620l06557o15820l10121
37426a367925M1895L00691N16808L13967l92473o87105J37128J160666R57383
37417I81035j74176n77159J66194N79384l01283j315819r23337M73974J133600
$$ plain form
37408 42413 430914 -233742 -1011045 -950923 -11597 1067936 1451408 876174 -81855 -472085
37398 -472085 134331 1273902 2147071 2311343 1746506 642473 -520643 -978324 -299853
37389 -299853 1019809 1993646 2177294 1897908 1491364 880318 120036 -211319 298782
37380 298782 1106707 1215237 454103 -256461 -67024 779546 1331310 1053864 283829 -292227
37370 -292227 -328705 -33496 90839 -276621 -895191 -1093696 -476842 511707 973284 568553
37360 568553 -90879 -207190 278477 776111 891074 802637 796241 816348 697670 568512
37350 568512 697168 1021336 1133352 789701 240629 -36752 171233 655644 1052429 1220673
37340 1220673 1355269 1685555 2054384 1939294 1028400 -326681 -1414508 -1854069 -1793266
$$ packed form
37408D2413L88501o64656p77303O0122R39326J079533L83472n75234r58029l90230
37398d72085O06416J139571Q73169J64272n64837j104033j163116m57681O78471
37389b99853J319662R73837J83648k79386m06544o11046p60282l31355N10101
37380B98782Q07925J08530p61134p10564J89437Q46570N51764k77446p70035n76056
37370b92227l6478K95209J24335l67460o18570j98505O16854R88549M61577m04731
37360E68553o59432j16311M85667M97634J14963q8437o396K0107j18678j29158
37350E68512J28656L24168J12016l43651n49072k77381K07985M84411L96785J68244
37340A220673J34596L30286L68829j15090r10894j355081j087827m39561O0803
$$ plain form
37331 -1793266 -1521501 -1203003 -993069 -1020537 -1059411 -538581 780476 2262806 2871622
37322 2871622 2239946 1097933 560817 1062095 2023487 2523000 2194702 1391398 551372
37313 551372 -278026 -1128538 -1691537 -1664329 -1313500 -1118336 -939048 -248246 746389 1079267
37303 1079267 481767 -23206 365263 923953 577387 -228361 -52798 1352209 2645315
37294 2645315 2816397 2369731 2265293 2701145 3415860 4274204 4938073 4747879 3656137
37285 3656137 2670863 2654935 3199309 3382587 3110289 2860844 2549174 1670017 430952
37276 430952 -236849 90368 846317 1340386 1417632 1119020 390992 -551143 -1103550 -894819
37266 -894819 -244269 208254 97785 -499399 -1180872 -1443344 -1103335 -514625 -84899 283949
$$ packed form
37331a793266K71765L18498K09934k7468l8874N20830J319057J482330O08816
37322B871622o31676j142013n37116N01278R61392M99513l28298q03304q40026
37313E51372q29398q50512n62999K7208L50829J95164J79288O90802R94635L32878
37303A079267n97500n04973L88469N58690l46566q05748J75563J405007J293106
37294B645315J71082m46666j04438M35852P14715Q58344O63869j90194j091742
37285C656137r85274j5928N44374J83278k72298k49445l11670q79157j239065
37276D30952o67801L27217P55949M94069P7246k98612p28028r42135n52407K08731
37266h94819O50550M52523j10469n97184o81473k62472L40009N88710M29726L68848
$$ plain form
37256 283949 818295 1119266 523280 -728687 -1482467 -1135318 -417374 -300655 -744912
37247 -744912 -1039693 -880670 -522025 -221183 -81096 -165087 -294408 -38080 618911 952864
37237 952864 418279 -443170 -683689 -276798 13936 -52784 89602 683054 1082514 674630
37227 674630 -286982 -1150704 -1638521 -1750771 -1400026 -659649 -36010 63298 -29647 375313
37217 375313 1366506 2280970 2522376 2152261 1605593 1182286 1006132 1196846 1725944 2140095
37207 2140095 1791291 587010 -657788 -985049 -451264 -124071 -691655 -1479393 -1338936
37198 -1338936 -248116 673620 743556 543288 872435 1555892 1837693 1486606 857492
37189 857492 146362 -688571 -1337781 -1200458 -226333 820641 1185240 847747 256879
$$ packed form
37256B83949N34346L00971n95986j251967p53780L47149P17944J16719m44257
37247g44912k94781J59023L58645L00842J40087q3991j29321K56328O56991L33953
37237I52864n34585q61449k40519M06891K90734o6720J42386N93452L99460m07884
37227F74630r61612q63722m87817j12250L50745P40377O23639R9308r2945M04960
37217C75313R91193R14464K41406l70115n46668m23307j76154J90714N29098M14151
37207B140095l48804j204281j244798l27261N33785L27193n67584p87738J40457
37198a338936J090820R21736O9936k00268L29147O83457K81801l51087o29114
37189H57492p11130q34933o49210J37323R74125J046974L64599l37493n90868
$$ plain form
37180 256879 -267377 -595115 -579268 -158196 451910 917676 1076449 949168 637949 355692
37170 355692 336999 500442 412392 -127961 -665539 -641139 -254967 -289441 -992259 -1610517
37160 -1610517 -1307316 -198347 886690 1452622 1701515 1895266 1844895 1274473 409067
37151 409067 -146958 -89233 268487 411825 209744 989 198978 905458 1844530 2549183
37141 2549183 2634058 2058283 1227369 742451 897949 1423497 1809238 1842015 1673905 1415348
37131 1415348 965724 376787 57939 261833 542989 212672 -634929 -1048098 -406723
37122 -406723 714759 1234960 835364 133252 -200920 -1989 615923 1466777 2154123
37113 2154123 2211230 1616986 842838 226298 -328430 -860804 -1073185 -915162 -977965 -1722422
$$ packed form
37180B56879n24256l27738J5847M21072O10106M65766J58773j27281l11219k82257
37170C55692j8693J63443q8050n40353n37578K4400L86172l4474p02818o18258
37160a610517L03201J108969J085037N65932K48893J93751n0371n70422q65406
37151D09067n56025N7725L57720J43338k02081k08755J97989P06480R39072P04653
37141B549183Q4875n75775q30914m84918J55498N25548L85741L2777j68110k58557
37131A415348m49624n88937l18848K03894K81156l30317q47601m13169O41375
37122d06723J121482N20201l99596p02112l34172J98931O17912Q50854O87346
37113B154123N7107n94244p74148o16540n54728n32374k12381J58023o2803p44457
$$ plain form
37103 -1722422 -2621608 -2773249 -2238506 -1973257 -2288814 -2187535 -735373 1444516 2737399
37094 2737399 2426236 1404770 945285 1260352 1556004 1203843 449463 -55678 -95578
37085 -95578 -7740 -79632 -186345 -159239 -184511 -479868 -751995 -456380 367258 981216
37075 981216 846969 228978 -351197 -857349 -1527810 -2236131 -2601469 -2606163 -2553421 -2419732
37065 -2419732 -1830470 -835005 -133572 -161045 -383969 -35796 698462 863134 112556 -704012
37055 -704012 -637922 118329 561584 237495 -295556 -420622 -327367 -556810 -1030659 -1094985
37045 -1094985 -511278 122701 176442 -156469 -171412 361110 942432 1106939 1077100 1440297
37035 1440297 2322347 3114502 3067899 2075778 802804 37454 -30174 170436 224331 193303
$$ packed form
37103a722422q99186j51641N34743K65249l15557J01279J452162K179889J292883
37094B737399l11163j021466m59485L15067K95652l52161p54380n05141l9900
37085i5578Q7838p1892j06713K7106k5272k95357k72127K95615Q23638O13958
37075I81216j34247o17991n80175n06152o70461p08321l65338m694N2742J33689
37065b419732N89262R95465P01433k7473k22924L48173P34258J64672p50578q16568
37055g04012O6090P56251M43255l24089n33051j25066R3255k29443m73849o4326
37045a094985N83707O33979N3741l32911j4943N32522N81322J64507k9839L63197
37035A440297Q82050P92155m6603r92121j272974p65350o7628K00610N3895l1028
$$ plain form
37025 193303 364392 742319 1046927 1158664 1273509 1515429 1628668 1280904 594652 141787
37015 141787 327775 904322 1222424 949469 418261 221286 567076 1155825 1617414 1863814
$$ packed form
37025A93303J71089L77927L04608J11737J14845K41920J13239l47764o86252m52865
37015A41787J85988N76547L18102k72955n31208j96975L45790N88749M61589K46400
$$ [...]
##END NTUPLES=NMR SPECTRUM
##END=
