##TITLE=31Pdec_LR-661-CK1
 CH2Cl2, 124 sc
 13.3.2019
##JCAMPDX= 6.0         $$ Bruker NMR JCAMP-DX V2.0
##DATA TYPE= NMR SPECTRUM
##DATA CLASS= NTUPLES
##ORIGIN= UXNMR, Bruker Analytische Messtechnik GmbH
##OWNER= root
$$ XWIN-NMR		Version 3.5
$$ Thu Mar 14 14:14:52 2019 Russian Standard Time (UT+4h)  she@DPX200
##.OBSERVE FREQUENCY= 81.013821
##.OBSERVE NUCLEUS= ^31P
##.ACQUISITION MODE= SIMULTANEOUS
##.ACQUISITION SCHEME= undefined
##.AVERAGES= 124
##.DIGITISER RES= 17
##SPECTROMETER/DATA SYSTEM= spect
##.PULSE SEQUENCE= zgpg30
##.SOLVENT NAME= CDCl3
##.SHIFT REFERENCE= (INTERNAL, CDCl3, 0, 182.463)
##AUDIT TRAIL= $$ (NUMBER, WHEN, WHO, WHERE, WHAT)
$$ ##TITLE= Audit trail, XWIN-NMR		Version 3.5
$$ ##JCAMPDX= 5.01
$$ ##ORIGIN= Bruker BioSpin GmbH
$$ ##OWNER= she
$$ F:/spectra/data/she/nmr/P31/1/pdata/1/auditp.txt
$$ ##AUDIT TRAIL=  $$ (NUMBER, WHEN, WHO, WHERE, WHAT)
(   1,<2019-03-14 14:13:55.42 +0400>,<she>,<DPX200>,
      <continue with go, POWCHK disabled, PULCHK disabled
       configuration hash MD5:
       00 E9 B6 7A A2 85 ED C7 34 08 36 98 17 FE 4E 26
       data hash MD5: 32K
       37 55 DE C3 71 D4 E0 5D CD EA 77 00 3C BE 6A FF>)
(   2,<2019-03-14 14:13:59.60 +0400>,<she>,<DPX200>,
      <Start of raw data processing
       efp BC_mod = 2 LB = 1 FT_mod = 6 PKNL = 1 PHC0 = -1812.92 PHC1 = 56.79897 SI = 64K 
       data hash MD5: 64K
       FE 50 C6 FA 09 FE B0 06 FC 8B 20 AE 6B 1F 79 5E>)
(   3,<2019-03-14 14:14:24.29 +0400>,<she>,<DPX200>,
      <pk PHC0 = -43.82087 PHC1 = 127.6 
       data hash MD5: 64K
       66 2C 8B 29 89 1D B9 19 FE 1C B3 C0 D9 04 07 6B>)
(   4,<2019-03-14 14:14:27.84 +0400>,<she>,<DPX200>,
      <abs ABSG = 5 
       data hash MD5: 64K
       B7 3D B4 D6 9D 3E 59 C0 62 91 98 43 68 47 BB 03>)
$$ ##END=
$$ 
$$ hash MD5
$$ FB 99 93 F0 CF E9 FA 0F E8 D9 DE FF 1B F9 41 3E
##$RELAX= 
##$RELAX= 
##$RELAX= 
##$RELAX= 
##$RELAX= 
##$RELAX= 
##$RELAX= 
##$RELAX= 
$$ Bruker specific parameters
$$ --------------------------
##$DU= <F:/spectra>
##$EXPNO= 1
##$NAME= <P31>
##$PROCNO= 1
##$TYPE= <nmr>
##$USER= <she>
##$AMP= (0..31)
100 100 100 100 100 100 100 100 100 100 100 100 100 100 100 100 100 100 
100 100 100 100 100 100 100 100 100 100 100 100 100 100 
##$AQSEQ= 0
##$AQ_mod= 1
##$AUNM= <au_zg>
##$AUTOPOS= <>
##$BF1= 81.014009
##$BF2= 200.13
##$BF3= 200.13
##$BF4= 200.13
##$BF5= 200.13
##$BF6= 200.13
##$BF7= 200.13
##$BF8= 200.13
##$BYTORDA= 1
##$CFDGTYP= 0
##$CFRGTYP= 5
##$CHEMSTR= <none>
##$CNST= (0..31)
1 1 145 1 1 1 1 1 1 1 1 1 1 1 1 1 1 1 1 1 1 1 1 1 1 1 1 1 1 1 1 1 
##$CPDPRG= <waltz16>
##$CPDPRG1= <>
##$CPDPRG2= <waltz16>
##$CPDPRG3= <>
##$CPDPRG4= <mlev>
##$CPDPRG5= <mlev>
##$CPDPRG6= <mlev>
##$CPDPRG7= <mlev>
##$CPDPRG8= <mlev>
##$CPDPRGB= <>
##$CPDPRGT= <>
##$D= (0..31)
0 1 0 0 0 0 0 0 0 0 0 0.03 2e-05 3e-06 0 0 0 0 0 0 0 0 0 0 0 0 0 0 0 0 
0 0 
##$DATE= 1552558256
##$DBL= (0..7)
120 120 120 11 120 120 24 19 
##$DBP= (0..7)
150 150 150 150 150 150 150 150 
##$DBP07= 0
##$DBPNAM0= <>
##$DBPNAM1= <>
$$ [...]
##$SUBNAM3= <"">
##$SUBNAM4= <"">
##$SUBNAM5= <"">
##$SUBNAM6= <"">
##$SUBNAM7= <"">
##$SUBNAM8= <"">
##$SUBNAM9= <"">
##$SW= 369.568048894756
##$SWIBOX= (0..15)
0 1 3 0 0 0 0 0 0 0 0 0 0 0 0 0 
##$SW_h= 29940.119760479
##$TD= 32768
##$TD0= 1
##$TE= 0
##$TE2= 300
##$TE3= 300
##$TEG= 300
##$TL= (0..7)
0 120 53 12 22 120 120 120 
##$TP= (0..7)
150 150 150 150 150 150 150 150 
##$TP07= 0
##$TPNAME0= <>
##$TPNAME1= <>
##$TPNAME2= <>
##$TPNAME3= <>
##$TPNAME4= <>
##$TPNAME5= <>
##$TPNAME6= <>
##$TPNAME7= <>
##$TPOAL= (0..7)
0.5 0.5 0.5 0.5 0.5 0.5 0.5 0.5 
##$TPOFFS= (0..7)
0 0 0 0 0 0 0 0 
##$TUNHIN= 0
##$TUNHOUT= 0
##$TUNXOUT= 0
##$USERA1= <user>
##$USERA2= <user>
##$USERA3= <user>
##$USERA4= <user>
##$USERA5= <user>
##$V9= 5
##$VALIST= <valist>
##$VCLIST= <CCCCCCCCCCCCCCC>
##$VD= 0
##$VDLIST= <DDDDDDDDDDDDDDD>
##$VPLIST= <PPPPPPPPPPPPPPP>
##$VTLIST= <TTTTTTTTTTTTTTT>
##$WBST= 1024
##$WBSW= 4
##$XGAIN= (0..3)
0 0 0 0 
##$XL= 0
##$YL= 0
##$YMAX_a= 19288
##$YMIN_a= -35998
##$ZGOPTNS= <>
##$ZL1= 120
##$ZL2= 120
##$ZL3= 120
##$ZL4= 120
##$ABSF1= 182.463
##$ABSF2= -187.1042
##$ABSG= 5
##$ABSL= 3
##$ALPHA= 0
##$AQORDER= 0
##$ASSFAC= 0
##$ASSFACI= 0
##$ASSFACX= 0
##$ASSWID= 0
##$AUNMP= <proc_1d>
##$AZFE= 0.1
##$AZFW= 0.5
##$BCFW= 0
##$BC_mod= 2
##$BYTORDP= 0
##$COROFFS= 0
##$CY= -3
##$DATMOD= 1
##$DC= 0
##$DFILT= <>
##$DTYPP= 0
##$F1P= 0
##$F2P= 0
##$FCOR= 1
##$FTSIZE= 65536
##$FT_mod= 6
##$GAMMA= 0
##$GB= 0
##$INTBC= 1
##$INTSCL= 5.30512e-09
##$ISEN= 30
##$LB= 1
##$LEV0= 0
##$LPBIN= 0
##$MAXI= 10000
##$MC2= 0
##$MEAN= 0
##$ME_mod= 0
##$MI= 50
##$NCOEF= 0
##$NC_proc= -8
##$NLEV= 6
##$NOISF1= 182.463
##$NOISF2= 159.3651
##$NSP= 0
##$NTH_PI= 0
##$NZP= 0
##$OFFSET= 182.463
##$PC= 4
##$PHC0= -1856.741
##$PHC1= 184.399
##$PH_mod= 1
##$PKNL= yes
##$PPARMOD= 0
##$PSCAL= 0
##$PSIGN= 0
##$REVERSE= no
##$SF= 81.0140089999434
##$SI= 65536
##$SIGF1= 159.3651
##$SIGF2= -187.1042
##$SINO= 113.3802
##$SIOLD= 16384
##$SREGLST= <1H.CDCl3>
##$SSB= 0
##$STSI= 65536
##$STSR= 0
##$SW_p= 29940.119760479
##$SYMM= 0
##$S_DEV= 0
##$TDeff= 32768
##$TDoff= 0
##$TI= <>
##$TILT= no
##$TM1= 0
##$TM2= 0
##$TOPLEV= 0
##$USERP1= <user>
##$USERP2= <user>
##$USERP3= <user>
##$USERP4= <user>
##$USERP5= <user>
##$WDW= 1
##$XDIM= 65536
##$YMAX_p= 496938244
##$YMIN_p= -86001147
$$ End of Bruker specific parameters
$$ ---------------------------------
##NTUPLES= NMR SPECTRUM
##VAR_NAME=  FREQUENCY,     SPECTRUM/REAL,   SPECTRUM/IMAG
##SYMBOL=    X,             R,               I
##VAR_TYPE=  INDEPENDENT,   DEPENDENT,       DEPENDENT
##VAR_FORM=  AFFN,          ASDF,            ASDF
##VAR_DIM=   65536,         65536,           65536
##UNITS=     HZ,            ARBITRARY UNITS, ARBITRARY UNITS
##FACTOR=    0.456856943014862, 1,           1
##FIRST=     14782.0589164792, 0,            0
##LAST=      -15158.0608439998, 0,           0
##MIN=       -15158.0608439998, -86001147,   0
##MAX=       14782.0589164792, 496938244,    0
$$ Real data points
##PAGE= N=1
##DATA TABLE= (X++(R..R)), XYDATA
$$ [...]
$$ plain form
42206 -79427 -7216875 -10701543 -12093747 -9380387 -1575258 5989562 9638806 14546681
42198 14546681 24766901 32455778 28270363 18011201 16748392 28010755 39792082
42191 39792082 41271409 34180375 26799648 24251323 25529811 24618505 15599810 1881785
42183 1881785 -2993634 8828932 26141120 30387690 18805304 5654772 1035417 -20078
42175 -20078 -5025428 -11631954 -13328187 -10005888 -6957303 -7677708 -11259538 -13084472 -6598819
42166 -6598819 9990375 27185490 31645325 23536224 18751074 28282673 42681521 45337290
42158 45337290 35930021 29832549 35281562 42273063 37809329 23468619 10963823 5553770
42150 5553770 2702017 -30416 2421173 11937830 18712027 12108333 -2386499 -6268784
$$ packed form
42206g9427p137448l484668j392204K713360P805129P564820L649244M907875
42198A4546681J0220220P688877m185415j0259162j262809J1262363J1781327
42191C9792082J479327p091034p380727k548325J278488r11306r018695j3718025
42183A881785m875419J1822566J7312188M246570j1582386j3150532m619355j055495
42175b0078n005350o606526j696233L322299L048585p20405l581830j824934O485653
42166f598819J6589194J7195115M459835q109101m785150R531599J4398848K655769
42158D5337290r407269o097472N449013O991501m463734j4340710j2504796n410053
42150E553770k851753k732433K451589R516657O774197o603694j4494832l882285
$$ plain form
42142 -6268784 10100165 35946552 53398566 55456763 46269346 30902754 13301461
42135 13301461 464662 -1158249 5952319 12245096 11910388 6597917 -727616 -8526313
42127 -8526313 -12627675 -7151597 6820766 18387915 16550624 1049777 -17137092 -23680888
42119 -23680888 -10867506 14949797 36265962 40665804 33915798 30483987 32668862 29737033
42111 29737033 18883653 13348441 22575795 36414967 40317845 37049705 39115435 45204935
42103 45204935 40805880 22547185 6427715 6571624 17520063 24802164 24559474 24381745
42095 24381745 29468012 35534947 34129640 21017945 1061341 -13341421 -12441145 -148073
42087 -148073 9459331 8877236 4579647 4618401 7174310 8669855 15218717 33622517 54452945
$$ packed form
42142f268784J6368949K5846387J7452014K058197r187417j5366592j7601293
42135A3301461j2836799j622911P110568O292777l34708n312471p325533p798697
42127h526313m101362N476078J3972363J1567149j837291j5500847j8186869o543796
42119b3680888J2813382K5817303K1316165M399842o750006l431811K184875k931829
42111B9737033j0853380n535212R227354J3839172L902878l268140K065730O089500
42103D5204935m399055j8258695j6119470J43909J0948439P282101k42690j77729
42095B4381745N086267O066935j405307j3111695j9956604j4402762R00276J2293072
42087a48073R607404n82095m297589L8754K555909J495545O548862J8403800K0830428
$$ plain form
42078 54452945 58491926 42421347 25744574 26278687 38305860 42910535 33509622 22221497
42070 22221497 23258707 36796661 49044012 45181788 24247616 3082364 990421
42063 990421 17639994 32274778 29099543 15567023 8188077 9008643 8575480 5964065
42055 5964065 9197162 16497276 14485395 -335755 -13447029 -12989571 -5311901 -601769
42047 -601769 4729596 18555479 34635703 38222182 26357397 10099730 -1870115 -11179222
42039 -11179222 -22022829 -34591822 -45823204 -49705051 -39484277 -17449016 1442823
42032 1442823 5809370 4084322 12401128 29237643 37448691 31683422 26265518 30585991
42024 30585991 33748256 24058950 9589373 4991767 7384672 1759380 -13522865 -22680806
$$ packed form
42078E4452945M038981j6070579j6676773N34113J2027173M604675r400913j1288125
42070B2221497J037210J3537954J2247351l862224k0934172k1165252k091943
42063I90421J6649573J4634784l175235j3532520p378946Q20566m33163k611415
42055E964065L233097P300114k011881j4821150j3111274M57458P677670M710132
42047f01769N331365J3825883J6080224L586479j1864785j6257667j1969845r309107
42039a1179222j0843607j2568993j1231382l881847J0220774K2035261J8891839
42032A442823M366547j725048Q316806J6836515Q211048n765269n417904M320473
42024C0585991L162265r689306j4469577m597606K392905n625292j5282245r157941
$$ plain form
42016 -22680806 -15542844 -1636264 4121401 1213128 1819183 12799933 25841817 26768669
42008 26768669 11650785 -9322455 -24076731 -31020305 -35811434 -39015680 -34281701 -19575443
42000 -19575443 -2923686 6673792 8748498 8152543 7462597 6918682 7360022 8391032
41992 8391032 7523502 5838400 10171001 23653960 37572390 39688135 29039141 15829798
41984 15829798 7393713 1113513 -7779570 -17666604 -22883200 -20674652 -12248181 1096270
41976 1096270 18538308 35039592 39476527 23311428 -6717547 -29767321 -30792638
41969 -30792638 -17025304 -8138133 -11655143 -16180246 -8639988 11320093 35572311 55584453
41961 55584453 62811653 52441488 33479652 25021767 34066408 45864257 45389409 39051780
$$ packed form
42016b2680806P137962J3906580N757665k908273O06055J0980750J3041884R26852
42008B6768669j5117884k0973240j4754276o943574m791129l204246M733979J4706258
42000a9575443J6651757R597478K074706n95955o89946n43915M41340J031010
41992H391032q67530j685102M332601J3482959J3918430K115745j0648994j3209343
41984A5829798q436085o280200q893083r887034n216596K208548Q426471J3344451
41976A096270J7442038J6501284M436935j6165099l0028975k3049774j025317
41969c0792638J3767334Q887171l517010m525103P540258J9960081K4252218K0012142
41961E5584453P227200j0370165j8961836q457885R044641J1797849m74848o337629
$$ plain form
41953 39051780 42736933 55411554 59512441 45261547 21423612 2053301 -6234163
41946 -6234163 -3350268 7547185 20329879 29884278 36489343 41690152 43349538 41089551
41938 41089551 40861809 45006194 44412714 32901576 22833762 29841671 46003906 48067250
41930 48067250 32633013 21630634 27464015 34554166 27236351 16976578 24110359 44626258
41922 44626258 54735109 43978500 26615873 19667361 23451144 27911475 28464848 28561056
41914 28561056 30047882 27911276 17734737 5715258 4707102 17726393 31881352
41907 31881352 34289450 27522715 21451383 17586108 13655191 16194301 31192466 46639651
41899 46639651 45428202 35206079 41643751 67290082 82072861 65554517 35531163
$$ packed form
41953C9051780L685153J2674621M100887j4250894k3837935j9370311q287464
41946f234163K883895J0897453J2782694R554399O605065N200809J659386k259987
41938D1089551k27742M144385n93480j1511138j0067814P007909J6162235K063344
41930D8067250j5434237j1002379N833381P090151p317815j0259773P133781K0515899
41922D4626258J0108851j0756609j7362627o948512L783783M460331N53373R6208
41914B8561056J486826k136606j0176539j2019479j008156J3019291J4154959
41907C1881352K408098o766735o071332l865275l930917K539110J4998165J5447185
41899D6639651j211449j0222123O437672K5646331J4782779j6518344l0023354
$$ plain form
41892 35531163 19528361 18495291 17024248 11567383 7504772 2603407 -4893646 -3768798
41884 -3768798 12476282 26303536 18350046 344191 361582 20599769 36020161 33088163
41876 33088163 23824314 19972713 18397151 16726757 20299635 26656078 23581800 10163047
41868 10163047 1679555 6547791 15445242 19385667 20859494 20776638 13527301 3443326
41860 3443326 6737661 25689798 38836760 30577506 15187483 16381472 35128658 52395556
41852 52395556 54392911 42121599 24154257 11603731 13008494 24580175 32465498
41845 32465498 30977520 28685902 31352985 33080629 31393055 33755651 38870782 30994439
41837 30994439 7650075 -6968585 3926699 20776775 16973033 634201 -1963429
$$ packed form
41892C5531163j6002802j033070j471043n456865m062611m901365p497053J124848
41884c768798J6245080J3827254p953490j8005855J7391K0238187J5420392k931998
41876C3088163r263849l851601j575562j670394L572878O356443l074278j3418753
41868A0163047q483492M868236Q897451L940425J473827q2856p249337j0083975
41860C443326L294335J8952137J3146962q259254j5390023J193989J8747186J7266898
41852E2395556J997355j2271312j7967342j2550526J404763J1571681P885323
41845C2465498j487978k291618K667083J727644j687574K362596N115131p876343
41837C0994439k3344364j4618660J0895284J6850076l803742j6338832k597630
$$ plain form
41830 -1963429 7831858 5685371 -10727569 -16646809 -2387516 12406517 13802573 12328760
41822 12328760 15851764 12418862 -4368888 -17857429 -14920734 -9426728 -18665081 -32931771
41814 -32931771 -30593985 -11607271 5938204 14991431 23976956 35667895 41205872 35816972
41806 35816972 25157513 14478065 3730579 -5346504 -8028059 -4039961 2175866 8634676
41798 8634676 15280819 17691683 11023320 340843 -2833337 3777422 9648466 6653956
41790 6653956 418587 2217815 14553813 28945015 35300545 30655590 20516489 13907470
41782 13907470 16623487 27829526 41357304 48507885 41718649 21249335 -897265
41775 -897265 -10260582 -5991169 -1237795 -4288178 -7777922 -2641782 6579417 10383957
$$ packed form
41830a963429R795287k146487j6412940n919240J4259293J4794033J396056j473813
41822A2328760L523004l432902j6787750j3488541K936695N494006r238353j4266690
41814c2931771K337786J8986714J7545475R053227Q985525J1690939N537977n388900
41806C5816972j0659459j0679448j0747486r077083k681555L988098O215827O458810
41798H634676O646143K410864o668363j0682477l174180O610759N871044k994510
41790F653956o235369J799228J2335998J4391202O355530m644955j0139101o609019
41782A3907470K716017J1206039J3527778P150581o789236k0469314k2146600
41775h97265r363317M269413M753374l050383l489744N136140R221199L804540
$$ plain form
41767 10383957 10367041 13437436 15275674 5510686 -11390472 -16775769 -3330436 13823046
41759 13823046 17569115 8727052 -1469246 -8286128 -13696141 -17156028 -15894626 -10677199
41751 -10677199 -4235369 2912403 10172512 14945767 17799048 23952576 33840527 38217794
41743 38217794 29963088 15454806 6128998 3496034 1395195 -1491045 -2140648 -3078628
41735 -3078628 -9500909 -17120906 -15543336 -5571489 -377975 -4781065 -5624966 8922592
41727 8922592 30187495 39937555 34798954 28386693 31003504 37889566 39458643 34910485
41719 34910485 31096484 31931977 33374926 28495488 15611084 892842 -6947669 -3993250
41711 -3993250 7370195 22415329 36418581 44394077 44277326 41611552 44731448 52165320
$$ packed form
41767A0383957j6916L070395J838238r764988j6901158n385297J3445333J7153482
41759A3823046L746069q842063j0196298o816882n410013l459887J261402N217427
41751a0677199O441830P147772P260109M773255K853281O153528R887951M377267
41743C8217794q254706j4508282r325808k632964k100839k886240o49603r37980
41735c078628o422281p619997J577570R971847N193514m403090q43901J4547558
41727H922592K1264903R750060n138601o412261K616811O886062J569077m548158
41719C4910485l814001Q35493J442949m879438j2884404j4718242p840511K954419
41711c993250J1363445J5045134J4003252P975496j16751k665774L119896P433872
$$ plain form
41703 52165320 51748111 37887902 22753366 21101312 28894742 29180511 18096015 11395363
41695 11395363 21270458 39074335 48903698 48478322 45715647 41276314 28267712 8475649
41687 8475649 -4163467 -760351 10892369 17770057 18068786 18919105 21891324 19941740
41679 19941740 9322593 -3197533 -8760889 -7081063 -3781886 -294941 7002320 17589093
41671 17589093 23543646 19185849 9641069 4704278 6275665 7359001 3310212 -1374603
41663 -1374603 567173 9782217 19729301 23286803 18439093 9608296 4481806 6978184
41655 6978184 12332456 12328342 6560763 3951484 10158768 18356347 18021343 9745832 4476029
41646 4476029 8724838 17130600 20761692 16991202 9063436 1261329 -2174487 1861966
$$ packed form
41703E2165320m17209j3860209j5134536j652054P793430K85769j1084496o700652
41695A1395363R875095J7803877R829363m25376k762675m439333j3008602j9792063
41687H475649j2639116L403116J1652720O877688K98729Q50319K972219j949584
41679A9941740j0619147j2520126n563356J679826L299177L486945P297261J0586773
41671A7589093N954553m357797r544780m936791J571387J083336m048789m684815
41663a374603J941776R215044R947084L557502m847710q830797n126490K496378
41655F978184N354272m114n767579k609279O207284Q197579l35004q275511n269803
41646D476029M248809Q405762L631092l770490p927766p802107l435816M036453
$$ plain form
41638 1861966 10224181 12542222 1813905 -14094197 -17771850 -2317209 17871605 21495568
41630 21495568 4896137 -12943980 -12076572 6093962 23034704 27068803 25328182 29632789
41622 29632789 38078750 37964743 24016117 5729633 -4354841 -3964469 -959580 -4312045
41614 -4312045 -16770720 -32235312 -38655272 -28182254 -7423071 6354195 2766346
41607 2766346 -10970573 -19620193 -15747067 -1706938 18450426 40116233 53304038
41600 53304038 47950098 28038455 12266462 14033378 25481915 28295151 17495738
41593 17495738 6711944 9796710 25012742 40907016 51717408 60077540 66324577
41586 66324577 63113913 44740075 17852786 -3083364 -11111622 -12267376 -13637606 -11975377
$$ packed form
41638A861966Q362215K318041j0728317j5908102l677653J5454641K0188814L623963
41630B1495568j6599431j7840117Q67408J8170534J6940742M034099j740621M304607
41622B9632789Q445961j14007j3948626j8286484j0084474L90372L004889l352465
41614d312045j2458675j5464592o419960J0473018K0759183J3777266l587849
41607B766346j3736919q649620L873126J4040129K0157364K1665807J3187805
41600E3304038n353940j9911643j5771993J766916J1448537K813236j0799413
41593A7495738j0783794L084766J5216032J5894274J0810392Q360132O247037
41586F6324577l210664j8373838k6887289k0936150q028258j155754j370230J662229
$$ plain form
41578 -11975377 -1058884 12911683 14201421 -708431 -13796538 -6344242 16441197
41571 16441197 31605716 26524832 9689823 -6298803 -19271414 -30114869 -33448895
41564 -33448895 -26264621 -18068000 -20082299 -27779637 -25908929 -9989368 8323243 17996368
41556 17996368 19649561 17259811 10266471 247687 -3547533 5906714 22616772 33909218
41548 33909218 34603822 29353783 24362956 22825305 25889716 31911261 36006695 35112098
41540 35112098 31679466 28250755 22144964 12113183 6939629 17671594 40378123 55654254
41532 55654254 49620539 29559676 13871866 10612510 11757833 7247229 -1537169 -5115852
41524 -5115852 502799 8655672 11487891 9835231 9129532 8769602 3278514 -6164240
$$ packed form
41578a1975377J0916493J3970567J289738j4909852j3088107P452296K2785439
41571A6441197J5164519n080884j6835009j5988626j2972611j0843455l334026
41564c3448895P184274Q196621k014299p697338J870708J5919561J8312611R673125
41556A7996368J653193k389750o993340j0018784l795220R454247J6710058J1292446
41548C3909218O94604n250039m990827j537651L064411O021545M095434q94597
41540C5112098l432632l428711o105791j0031781n173554J0731965K2706529J5276131
41532E5654254o033715k0060863j5687810l259356J145323m510604q784398l578683
41524e115852N618651Q152873K832219j652660p05699l59930n491088r442754
$$ plain form
41516 -6164240 -10531608 -6546894 -2554193 -4969118 -7306431 -1222144 8551810 10907070
41508 10907070 5027550 -1090124 -5173779 -11075308 -16436737 -13619525 -3783506 2853889
41500 2853889 2454512 299817 -3394070 -14499996 -27047104 -22010412 5151620 30797464
41492 30797464 31340584 13846742 2862320 6132166 11595757 12443107 14337996 17583974
41484 17583974 12052668 -4171158 -16730996 -13747656 -1013376 9397653 15258956
41477 15258956 19721609 19620708 10152361 -2993192 -7618378 -951572 7200153 8467082
41469 8467082 5835061 6885575 12806282 18461506 20446668 20372719 20254819 18310326 11372329
41460 11372329 44812 -10697287 -15895358 -13999605 -6321498 4058695 11855661 11246418
$$ packed form
41516f164240m367368L984714L992701k414925k337313O084287R773954K355260
41508A0907070n879520o117674m083655n901529n361429K817212R836019O637395
41500B853889l99377k154695l693887j1105926j2547108N036692K7162032K5645844
41492C0797464N43120j7493842j0984422L269846N463591Q47350J894889L245978
41484A7583974n531306j6223826j2559838K983340J2734280J0411029N861303
41477A5258956M462653j00901r468347j3145553m625186O666806Q151725J266929
41469H467082k632021J050514N920707N655224J985162p3949j17900j944493o937997
41460A1372329j1327517j0742099n198071J895753P678107J0380193P796966o09243
$$ plain form
41452 11246418 1235997 -11610703 -18492817 -16248045 -8335480 622699 8178258 12351383
41444 12351383 10575137 2624753 -7150555 -13107955 -14029626 -13777311 -14963313 -13534848
41436 -13534848 -3532698 11601302 17838429 6948679 -8502720 -5983714 18680586
41429 18680586 42797258 43260938 24865462 12630860 19056621 30531733 28615807 14585526
41421 14585526 5206985 9349587 18668889 22697065 24601868 34558462 50668590 56867392
41413 56867392 44074733 25246152 20236154 29758890 35579422 26284268 10945454 3923006
41405 3923006 7458720 15206105 22374383 24286925 14917356 -2335573 -10858471 -971919
41397 -971919 12101835 5287107 -20093066 -38477160 -32956998 -13304058 1918875 7241851
$$ packed form
41452A1246418j0010421j2846700o882114K244772P912565Q958179P555559M173125
41444A2351383j776246p950384r775308n957400r21671K52315j186002J428465
41436a3534848J0002150J5134000O237127j0889750j5451399K519006K4664300
41429A8680586K4116672M63680j8395476j2234602O425761J1475112j915926j4030281
41421A4585526r378541M142602R319302M028176J904803R956594J6110128O198802
41413E6867392j2792659j8828581n009998R522736N820532r295154j5338814p022448
41405C923006L535714P747385P168278J912542r369569j7252929q522898R886552
41397i71919J3073754o814728k5380173j8384094N520162J9652940J5222933N322976
$$ plain form
41389 7241851 8008454 7860416 7554751 9536079 15413603 21495538 21464396 12031817 -4483467
41380 -4483467 -19539198 -22100475 -10500129 179946 -7172789 -27565187 -35617359 -16965691
41372 -16965691 11601367 21264151 3969507 -21607533 -32533952 -22878799 -4719848
41365 -4719848 6362460 6409443 4761842 9853963 16859150 15762183 8270485 5581433
41357 5581433 9948411 12276115 10633414 15187349 27359439 30261117 13070034 -7636173
41349 -7636173 -7296014 13472688 31319563 31274566 19761798 8785740 2838420 3045800
41341 3045800 11112663 25035377 38861440 47983031 48433350 34404498 7237486 -15537595
41333 -15537595 -14189345 8181699 27329833 28229933 21344366 22665470 29699242 28054854
$$ packed form
41389G241851P66603j48038l05665J981328N877524O081935l1142r432579j6515284
41380d483467j5055731k561277J1600346J0680075p352735k0392398q052172J8651668
41372a6965691K8567058R662784j7294644k5577040j0926419R655153J8158951
41365d719848J1082308M6983j647601N092121P005187j096967p491698k689052
41357E581433M366978K327704j642701M553935J2172090K901678j7191083k0706207
41349g636173L40159K0768702J7846875m4997j1512768j0976058n947320K07380
41341C045800Q066863J3922714J3826063R121591M50319j4028852k7167012k2775081
41333a5537595J348250K2371044J9148134R00100o885567J321104P033772j644388
$$ plain form
41325 28054854 14797380 2978648 3575759 12156577 16670088 13492146 10760609 15843773
41317 15843773 23838605 22828569 9209670 -8262119 -20481072 -26394777 -26189565 -15553568
41309 -15553568 5093727 23001015 25567948 16574651 10116706 11971549 17057913 21361668
41301 21361668 24482449 23361231 16461200 11995651 17952904 25709644 19899009 4450520
41293 4450520 -234755 10355509 15705674 2088930 -15757279 -18120294 -9593327 -8547049
41285 -8547049 -18662696 -27772746 -27714501 -19957361 -7007803 7393473 13928670 7302020
41277 7302020 -3207674 -5256563 -1270358 -1462493 -3665410 3446504 18421024 25688467
41269 25688467 18870491 9880019 9741585 14109186 14766519 13703136 16895500 22534408
$$ packed form
41325B8054854j3257474j1818732N97111Q580818M513511l177942k731537N083164
41317A5843773P994832j010036j3618899j7471789j2218953n913705K05212J0635997
41309a5553568K0647295J7907288K566933q993297o457945J854843N086364M303755
41301B1361668L120781j121218o900031m465549N957253P756740n810635j5448489
41293D450520m685275J0590264N350165j3616744j7846209k363015Q526967J046278
41285h547049j0115647r110050N8245P757140J2949558J4401276O535197o626650
41277G302020j0509694k048889L986205j92135k202917P111914J4974520P267443
41269B5688467o817976q990472j38434M367601O57333j063383L192364N638908
$$ plain form
41261 22534408 24488987 22415435 21009241 22301987 23928810 22658182 16775584 8235762
41253 8235762 3727341 8087321 14995096 11851543 -2077452 -10523460 -254778 20261316
41245 20261316 31423140 27814362 22507075 26483150 34195675 33520618 22335401 8606968
41237 8606968 -2072052 -11475940 -20980234 -25282310 -18269753 -2965068 8734669 6907944
41229 6907944 -7835146 -26160448 -37419366 -35699749 -23316765 -10177659 -5266359
41222 -5266359 -5828128 547819 18964168 37071007 38578067 24085876 10482358 9924475
41214 9924475 17218463 19778532 13179121 3390043 -1436013 2455664 13086809 25008886
41206 25008886 34130746 40518290 44303918 41019620 26964211 8645714 -1207586 356036
$$ packed form
41261B2534408J954579k073552j406194J292746J626823j270628n882598q539822
41253H235762m508421M359980O907775l143553j3928995q446008J0268682K0516094
41245B0261316J1161824l608778n307287L976075P712525o75057j1185217j3728433
41237H606968j0679020r403888r504294m302076P012557J5304685J1699737j826725
41229F907944j4743090j8325302j1258918J719617J2382984J3139106M911300
41222e266359n61769O375947J8416349J8106839J507060j4492191j3603518n57883
41214I924475P293988K560069o599411r789078m826056L891677J0631145J1922077
41206B5008886R121860O387544L785628l284298j4055409j8318497r853300J563622
$$ plain form
41198 356036 2008685 -6035000 -18631744 -24303775 -21385064 -17367077 -15342320 -10369348
41190 -10369348 -228084 7509150 3037515 -13501884 -29681150 -30899181 -14172907
41183 -14172907 7340575 16100481 8077397 -4352193 -9235245 -8915620 -11563487 -14702874
41175 -14702874 -7936427 8461402 19105324 12621874 -2824676 -10404389 -6459869 -3172433
41167 -3172433 -9881586 -19278453 -16392391 1444902 18520822 16915893 -2793104 -21003091
41159 -21003091 -21246399 -9050848 -3211780 -10200110 -16097380 -7114967 10676348 20655303
41151 20655303 19629239 20866010 32501825 44167174 41111931 24114630 7348132
41144 7348132 458865 793290 1518189 -681289 -6104238 -12506894 -13592854 -4416634
$$ packed form
41198C56036J652649q043685j2596744n672031K918711M017987K024757M972972
41190a0369348J0141264P737234m471635j6539399j6179266j218031J6726274
41183a4172907K1513482Q759906q023084j2429590m883052L19625k647867l139387
41175a4702874O766447J6397829J0643922o483450j5446550p579713L944520L287436
41167c172433o709153r396867K886062J7837293J7075920j604929j9708997j8209987
41159b1003091k43308J2195551N839068o988330n897270Q982413J7791315R978955
41151B0655303j026064J236771J1635815J1665349l055243j6997301j6766498
41144G348132o889267L34425P24899k199478n422949o402656j085960R176220
$$ plain form
41136 -4416634 9253603 14752788 9706040 6863485 14730369 21849140 12274042 -8275997
41128 -8275997 -17034766 -5784022 7726324 6336678 -2549023 -1419397 8954648 11872663
41120 11872663 2143733 -6003743 -2037335 4837827 1949984 -5248221 -1102891 15075832
41112 15075832 25735865 18923914 3912235 -2853452 1231874 6826150 10335452 18166029
41104 18166029 32518885 43167124 38878827 21342862 2594266 -7183600 -4766545
41097 -4766545 7812961 22839144 28544374 20091729 7679680 5036058 10746764 11467784
41089 11467784 4247351 2204913 12488254 22055443 16389284 2024234 -3953670 -359913
41081 -359913 -1391231 -11795540 -19845883 -17856184 -13577076 -14362949 -13877166 -4481317
$$ packed form
41136d416634J3670237N499185n046748k842555P866884P118771r575098k0550039
41128h275997q758769J1250744J3510346j389646q885701J129626J0374045K918015
41120A1872663r728930q147476L966408O875162k887843p198205M145330J6178723
41112A5075832J0660033o811951j5011679o765687M085326N594276L509302P830577
41104A8166029J4352856J0648239m288297j7535965j8748596r777866K417055
41097d766545J2579506J5026183N705230q452645j2412049k643622N710706P21020
41089A1467784p220433k042438J0283341R567189n666159j4365050n977904L593757
41081c59913j031318j0404309q050343J989699M279108p85873M85783R395849
$$ plain form
41073 -4481317 7800036 12119380 9075970 6622464 5376501 181356 -7154113 -9245314
41065 -9245314 -6424921 -6890264 -12606013 -15809556 -11583579 -3750071 4520989 15540618
41057 15540618 27970433 32947098 26348032 16923465 14334595 15589754 11874842 3475459
41049 3475459 -1843834 -2052995 -2243655 -3620715 -817795 8105435 16814131 18795816
41041 18795816 14930657 10684574 10110899 14241989 21219151 26327751 25356386 19008049
41033 19008049 11066331 2753605 -6648525 -14282641 -15249226 -10964700 -9666378 -15578820
41025 -15578820 -22468313 -21220543 -10246388 3965630 13289743 13571157 7579878 3011418
41017 3011418 3312718 1675820 -8605167 -18949359 -12125996 13286917 37629690 45042939
$$ packed form
41073d481317J2281353M319344l043410k453506j245963n195145p335469k091201
41065i245314K820393m65343n715749l203543M225977P833508Q271060J1019629
41057A5540618J2429815M976665o599066r424567k588870J255159l714912q399383
41049C475459n319293k09161j90660j377060K802920Q923230Q708696J981685
41041A8795816l865159m246083n73675M131090O977162N108600r71365o348337
41033A9008049p941718q312726r402130p634116r66585M284526J298322n912442
41025a5578820o889493J247770J0974155J4212018R324113K81414n991279m568460
41017C011418L01300j636898j0280987j0344192O823363K5412913K4342773P413249
$$ plain form
41009 45042939 40401974 32886000 18034916 -8087160 -29373908 -26201696 -5964815
41002 -5964815 5575174 2510056 4741591 21814433 35206680 27905390 10841294 4080661
40994 4080661 7808722 9771942 8948728 12104509 15267986 8866158 -3483668 -10744922
40986 -10744922 -15637065 -29376874 -46243339 -46325373 -27780534 -13414048 -15999478 -19267821
40978 -19267821 -8175386 2299108 -9413443 -33403453 -40214082 -24963069 -11874842
40971 -11874842 -13002575 -10242061 10382794 30499634 25172457 1612073 -10916351
40964 -10916351 -2883706 7142232 5617859 2076107 6290063 7960045 -4989586 -21224017
40956 -21224017 -19168791 -581803 9124195 -3414499 -21432160 -23862549 -14305734 -10292668
$$ packed form
41009D5042939m640965p515974j4851084k6122076k1286748L172212K0236881
41002e964815J1539989l065118K231535J7072842J3392247p301290j7064096o760633
40994D080661L728061J963220q23214L155781L163477o401828j2349826p261254
40986a0744922m892143j3739809j6866465q2034J8544839J4366486k585430l268343
40978a9267821J1092435J0474494j1712551k3990010o810629J5251013J3088227
40971a1874842j127733K760514K0624855K0116840n327177k3560384j2528424
40964a0916351Q032645J0025938j524373l541752M213956J669982j2949631j6234431
40956b1224017K055226J8586988R705998j2538694j8017661k430389R556815M013066
$$ plain form
40948 -10292668 -13011971 -5754161 18209255 43001606 51396276 46060681 40155221 35926785
40940 35926785 25511650 9200339 -1111600 1052405 7692815 9505173 8780280 11598387
40932 11598387 14571340 9831634 -243348 -4448350 820114 6576624 5291835 1113147
40924 1113147 1699942 7183979 12648197 15691942 15867092 11769873 4657963 80364
40916 80364 -587452 -5169975 -19070975 -32788088 -31117956 -13388905 5077008 11469383
40908 11469383 6425148 -3179909 -11880468 -14446138 -7776689 2074519 4001390 -2605808
40900 -2605808 -5041331 5357234 21845832 33502167 38285741 37985425 30120763 14967061
40892 14967061 2713503 1944755 6607841 6338379 4888381 14162333 31539356 38119249
$$ packed form
40948a0292668k719303P257810K3963416K4792351Q394670n335595n905460m228436
40940C5926785j0415135j6311311j0311939K164005O640410J812358p24893K818107
40932A1598387K972953m739706j0074982m205002N268464N756510j284789m178688
40924A113147N86795N484037N464218L043745J75150m097219p111910m577599
40916H0364o67816m582523j3901000j3717113J670132J7729051J8465913O392375
40908A1469383n044235r605057q700559k565670O669449R851208J926871o607198
40900b605808k435523J0398565J6488598J1656335M783574l00316p864662j5153702
40892A4967061j2253558p68748M663086k69462j449998R273952J7377023O579893
$$ plain form
40884 38119249 22946893 -2581050 -19282931 -20399604 -12504149 -3593795 3749209 10891973
40876 10891973 18958925 25268872 24484790 15771967 5771568 -788718 -9617882 -27714159
40868 -27714159 -48749872 -58582376 -54480420 -46553888 -39172125 -25335178 -4111647 11199323
40860 11199323 11669674 7364020 11606380 19966246 18221991 4948910 -7673138 -12055727
40852 -12055727 -10695855 -5296640 5314559 14831689 10732233 -8465558 -27232576 -30798175
40844 -30798175 -21488234 -11348671 -5876319 -3514266 -6022659 -17822099 -34220420 -40338723
40836 -40338723 -27619634 -6023561 7168396 8211712 8370363 13941798 14910815 660745
40828 660745 -20324765 -28374514 -18570320 -6187949 -3637213 -4496346 2404380 13853584
$$ packed form
40884C8119249j5172356k5527943j6701881j116673P895455Q910354P343004P142764
40876A0891973Q066952O309947p84082q712823j0000399o560286q829164j8096277
40868b7714159k1035713r832504M101956P926532P381763J3836947K1223531J5310970
40860A1199323M70351m305654M242360Q359866j744255j3273081j2622048m382589
40852a2055727J359872N399215J0611199R517130m099456j9197791j8767018l565599
40844c0798175R309941J0139563N472352K362053k508393j1799440j6398321o118303
40836d0338723J2719089K1596073J3191957J043316J58651N571435R69017j4250070
40828F60745k0985510q049749R804194J2382371K550736q59133O900726J1449204
$$ plain form
40820 13853584 18478129 15265173 12705673 11612762 1832309 -21034820 -44875687 -51723226
40812 -51723226 -34931202 -4361143 21056000 25743507 8499145 -16455978 -32436197
40805 -32436197 -34574412 -29138459 -22681657 -18489453 -20408315 -29958117 -39429506 -38099863
40797 -38099863 -27505732 -20598281 -22421377 -22266165 -10806687 5126151 13241095 13033426
40789 13033426 12764195 15669541 19423571 24118956 29557186 28478421 15138669 -917827
40781 -917827 -3134560 8617504 16155386 8788349 -1503711 2018948 18332298 33646535
40773 33646535 40862121 42661312 40034690 29971440 14048276 -443545 -8588128 -9638038
40765 -9638038 -2152287 12980148 25108408 21505861 5560962 -4663937 -1378730 2130140
$$ packed form
40820A3853584M624545l212956k559500j092911r780453k2867129k3840867o847539
40812e1723226J6792024L0570059K5417143M687507j7244362k4955123j5980219
40805c2436197k138215N435953O456802M192204j918862r549802r471389J329643
40797c8099863J0594131O907451j823096J55212J1459478J5932838Q114944k07669
40789A3033426k69231K905346L754030M695385N438230j078765j3339752j6056496
40781i17827k216733J1752064P537882p367037j0292060L522659J6313350J5314237
40773C3646535P215586J799191k626622j0063250j5923164j4491821q144583j049910
40765i638038P485751J5132435J2128260l602547j5944899j0224899L285207L508870
$$ plain form
40757 2130140 -5452363 -12839570 -3952571 12893072 13862697 -4564069 -19522964 -15145620
40749 -15145620 -1960475 5670541 12485056 27722843 42091575 38776287 20248229
40742 20248229 5340723 2474498 2976123 104884 -2542384 -3417796 -7123352 -11810324
40734 -11810324 -8096429 3199936 7059167 -3901826 -17636049 -22581325 -25349892 -35258377
40726 -35258377 -43950293 -38217068 -24791104 -22246616 -31205777 -32866573 -19238570 -6047823
40718 -6047823 -8953606 -22293051 -30416977 -28159034 -20248015 -9957316 977760 7838642
40710 7838642 8465614 8348302 11013671 8680878 -6468093 -25447268 -29942261 -16672249
40702 -16672249 -1593534 3218824 4602571 13679699 27016707 33163132 31415258 31236488
$$ packed form
40757B130140p582503p387207Q886999J6845643R69625j8426766j4958895M377344
40749a5145620J3185145P631016O814515J5237787J4368732l315288j8528058
40742B0248229j4907506k866225N01625k871239k647268q75412l705556m686972
40734a1810324L713895J1296365L859231j0960993j3734223m945276k768567r908485
40726c5258377q691916N733225J3425964K544488q959161j660796J3628003J3190747
40718f047823k905783j3339445q123926K257943P911019J0290699J0935076O860882
40710G838642O26972j17312K665369k332793j5148971j8979175m494993J3270012
40702a6672249J5078715M812358J383747R077128J3337008O146425j747874j78770
$$ plain form
40694 31236488 34661423 32235699 19663022 7390045 6644565 13844898 17697291 16317327
40686 16317327 16359284 17191406 8734351 -11116487 -27539976 -25384118 -8942576 3235095
40678 3235095 685411 -9396660 -14045821 -8695766 1958036 11384281 15998918 15108612
40670 15108612 9333224 55086 -9218493 -12128756 -3958737 11589519 24453202 30190286
40662 30190286 35086524 44456006 51352613 45169244 27988732 12585095 5673602 3720516
40654 3720516 5151946 14122110 28709723 37575223 34978785 28928389 26619622 21316892
40646 21316892 3966047 -19140651 -31664564 -26714368 -11920336 1545780 6669909
40639 6669909 1663744 -7167269 -7472006 4360343 14697447 10225089 -691486 1058736
$$ packed form
40694C1236488L424935k425724j2572677j2272977p45480P200333L852393j379964
40686A6317327M1957Q32122q457055j9850838j6423489K155858J6441542J2177671
40678C235095k549684j0082071m649161N350055J0653802R426245M614637q90306
40670A5108612n775388r278138r273579k910263Q170019J5548256J2863683N737084
40662C0190286M896238R369482O896607o183369j7180512j5403637o911493j953086
40654C720516J431430Q970164J4587613Q865500k596438o050396k308767n302730
40646B1316892j7350845k3106698j2523913M950196J4794032J3466116N124129
40639F669909n006165q831013l04737J1832349J0337104m472358j0916575J750222
$$ plain form
40631 1058736 15661598 23413210 14965002 3598281 1062617 -74170 -8235682 -12987788
40623 -12987788 197486 25310041 42499084 43463571 35057253 22604476 6276222
40616 6276222 -7604775 -8522786 2425587 12548487 16435671 21497146 30547727 33142537
40608 33142537 22681836 10417730 11040643 21788455 27575032 22608210 15410412 13621528
40600 13621528 14503643 12445448 7755579 4657620 5851406 11643876 19755412 23365035
40592 23365035 14463796 -5917996 -23901457 -25361695 -12422026 -1983977 -5808219
40585 -5808219 -16727303 -18657509 -6810703 8129466 14655322 11788395 4240416 -5748242
40577 -5748242 -16342233 -22189015 -20680671 -18816832 -24917802 -34473956 -33646748 -18538231
$$ packed form
40631A058736J4602862P751612q448208j1366721k535664j136787q161512m752106
40623a2987788J3185274K5112555J7189043R64487q406318j2452777j6328254
40616F276222j3880997r18011J0948373J0122900L887184N061475R050581K594810
40608C3142537j0460701j2264106O22913J0747812N786577m966822p197798j788884
40600A3621528Q82115k058195m689869l097959J193786N792470Q111536L609623
40592B3365035q901239k0381792j7983461j460238J2939669J0438049l824242
40585e808219j0919084j930206J1846806J4940169O525856k866927p547979r988658
40577e748242j0593991n846782J508344J863839o100970r556154Q27208J5108517
$$ plain form
40569 -18538231 -2033790 2696714 -2070823 -5351734 -4020329 -4749772 -11890274 -21144933
40561 -21144933 -26172754 -26043481 -23938510 -21731805 -18655155 -14392247 -10953102 -9912525
40553 -9912525 -8527846 -1513333 11555680 23009446 24420487 15943331 5657536 1658123
40545 1658123 7809369 23221138 39738453 43852314 30596790 13897023 12136854 23467840
40537 23467840 28160270 17307013 3872450 -549857 -3026830 -11778732 -17004445 -6494225
40529 -6494225 10639817 15741442 9441309 7947012 14206116 15347195 9566498 11967646
40521 11967646 26995492 36495481 26152054 6072326 -7150648 -12557224 -14713346
40514 -14713346 -6941826 16318967 40657851 45630294 32693357 20617072 16150441
$$ packed form
40569a8538231J6504441M730504m767537l280911J331405p29443p140502r254659
40561b1144933n027821J29273K104971K206705L076650M262908L439145J040577
40553i912525J384679P014513J3069013J1453766J411041q477156j0285795l999413
40545A658123O151246J5411769J6517315M113861j3255524j6699767j760169J1330986
40537B3467840M692430j0853257j3434563m422307k476973q751902n225713J0510220
40529f494225J7134042N101625o300133j494297O259104J141079n780697K401148
40521A1967646J5027846R499989j0343427k0079728j3222974n406576k156122
40514a4713346P771520K3260793K4338884M972443j2936937j2076285m466631
$$ plain form
40507 16150441 8733873 -5209858 -12847443 -6079994 4297889 5087493 -481262 -516116
40499 -516116 7305760 15256083 17834987 15320263 8378139 -2328660 -12084954 -14540055
40491 -14540055 -9073295 -1817058 1048195 -1298103 -4821760 -4379067 1937993 10199567
40483 10199567 13524144 9057517 475069 -7467339 -13821068 -18776242 -19832903 -14958979
40475 -14958979 -7465320 -2906140 -1732072 589085 6235760 12299788 15887296 17007861
40467 17007861 14659690 5546456 -8938192 -18772042 -15213195 -3425396 2135642 -3462149
40459 -3462149 -8430503 -351784 16002752 23949612 15748974 939462 -6481671 -2715389
40451 -2715389 5874950 11577021 10425682 2694190 -7080241 -12405126 -10891549 -7328730
$$ packed form
40507A6150441p416568j3943731p637585O767449J0377883P89604n568755l4854
40499e16116P821876P950323K578904k514724o942124j0706799r756294k455101
40491a4540055N466760P256237K865253k346298l523657M42693O317060Q261574
40483A0199567L324577m466627q582448p942408o353729m955174j056661M873924
40475a4958979P493659M559180J174068K321157N646675O064028L587508J120565
40467A7007861k348171r113234j4484648r833850L558847J1787799N561038n597791
40459c462149m968354Q078719J6354536P946860q200638j4809512p421133L766282
40451b715389Q590339N702071j151339p731492r774431n324885J513577L562819
$$ plain form
40443 -7328730 -8278105 -14140554 -18115210 -12463544 4380609 24936665 36713523 32502328
40435 32502328 18215154 7729395 8719137 16485923 22014063 21079804 14141681 3906966
40427 3906966 -3310322 -243187 12053073 23108848 26470234 27511686 30849287 28061849
40419 28061849 9816684 -14986012 -26876708 -21920920 -15724476 -19054896 -23581161 -17540939
40411 -17540939 -3129080 9837363 17410881 19325880 12021358 -4335264 -16606322
40404 -16606322 -8768073 18315058 45360705 54003636 42573604 23384099 10158965
40397 10158965 8639603 14858200 20810839 22967110 24265164 27101422 28152183 23018601
40389 23018601 12492675 865188 -8332778 -11440229 -4423709 11004975 25040628
$$ packed form
40443g328730r49375n862449l974656N651666J6844153K0556056J1776858m211195
40435C2502328j4287174j0485759R89742P766786N528140r34259o938123j0234715
40427C906966p217288L067135J2296260J1055775L361386J041452L337601k787438
40419B8061849j8245165k4802696j1890696M955788O196444l330420m526265O040222
40411a7540939J4411859J2966443P573518J914999p304522j6356622j2271058
40404a6606322P838249K7083131K7045647Q642931j1430032j9189505j3225134
40397A0158965j519362O218597N952639K156271J298054K836258J050761n133582
40389B3018601j0525926j1627487r197966l107451P016520J5428684J4035653
$$ plain form
40382 25040628 29704049 27965712 27340366 28719367 28811794 29059982 32265239 33401789 25437713
40373 25437713 13474544 10287636 15866447 14727139 -1000268 -18208528 -21087636 -12457659
40365 -12457659 -5800568 -3617549 2876065 15638033 24926044 24019461 17945548 13954958
40357 13954958 12001081 9661487 9622274 15445795 23334220 24615471 15901511 2381413
40349 2381413 -8680776 -13675113 -11840498 -3761056 6647212 12560449 11446031 10033254
40341 10033254 16226271 25915307 25130961 8968127 -8753967 -12186972 -4795470 -3660637
40333 -3660637 -14292073 -23436065 -19522612 -8038491 20587 4294499 9990294 15173457
40325 15173457 15279531 14949264 22096732 32575050 34149527 25497349 17490150 13591077
$$ packed form
40382B5040628M663421j738337o25346J379001R2427K48188L205257J136550p964076
40373B5437713j1963169l186908N578811j139308j5727407j7208260k879108Q629977
40365a2457659O657091K183019O493614J2761968R288011r06583o073913l990590
40357A3954958j953877k339594l9213N823521P888425J281251q713960j3520098
40349B381413j1062189m994337J834615Q079442J0408268N913237j114418j412777
40341A0033254O193017R689036p84346j6162834j7722094l433005P391502J134833
40333c660637j0631436r143992L913453J1484121Q059078M273912N695795N183163
40325A5173457J06074l30267P147468J0478318J574477q652178q007199l899073
$$ plain form
40317 13591077 3542716 -17469795 -36332740 -37781198 -23419781 -6327874 5155096
40310 5155096 9563894 6587603 -86880 -672635 8901977 18350961 17109674 11198237
40302 11198237 13040731 19735998 17682853 6695520 1444971 6691109 8843917 -1576920
40294 -1576920 -14652496 -16733542 -8451044 1799905 10553421 16046960 13621494 4901297
40286 4901297 1248438 7005696 9677364 -537980 -11633585 -5611331 14542507 30248869
40278 30248869 33644057 31367243 27251664 20340055 17217526 25705624 36321579 31272314
40270 31272314 14359362 9615346 24334217 36510081 29514714 16979178 17737055 25709976
40262 25709976 24590474 17057960 16489560 19790584 12668987 -2714260 -8954433 -2319018
$$ packed form
40317A3591077j0048361k1012511j8862945j448458J4361417J7091907J1482970
40310E155096M408798k976291o674483n85755R574612R448984j241287n911437
40302A1198237J842494O695267k053145j0987333n250549N246138K152808j0420837
40294a576920j3075576k081046Q282498J0250949Q753516N493539k425466q720197
40286D901297l652859N757258K671668j0215344j1095605O022254K0153838J5706362
40278C0248869L395188k276814m115579o911609l122529Q488098J0615955n049265
40270C1272314j6912952m744016J4718871J2175864o995367j2535536P57877P972921
40262B5709976j119502p532514n68400L301024p121597j5383247o240173O635415
$$ plain form
40254 -2319018 1335822 -6494881 -13607909 -8118089 3344591 8372100 7410166 8407308
40246 8407308 11029653 7982430 -1053314 -6610273 -1511069 10021214 17878717 18765481
40238 18765481 20329127 30116955 41828110 39217332 17232835 -7399200 -14114009 -2592174
40230 -2592174 9979902 12910610 12691314 19028043 29711029 33208214 21646313 -135176
40222 -135176 -15736052 -10484597 11223838 26653690 20571801 4647335 245469 8432027
40214 8432027 13369834 11492983 15578869 27068947 27493575 8005467 -12177546 -11663321
40206 -11663321 4076674 15714472 19027179 22282814 24769687 19259434 11218188 14381098
40198 14381098 27084267 32167252 23372891 14294218 15579696 19271528 14423470 5276344
$$ packed form
40254b319018L654840p830703p113028N489820J1462680N027509r61934R97142
40246H407308K622345l047223r035744n556959N099204J1532283P857503Q86764
40238A8765481J563646R787828J1711155k610778k1984497k4632035o714809J1521835
40230b592174J2572076K930708k19296O336729J0682986L497185j1561901k1781489
40222a35176j5600876N251455K1708435J5429852o081889j5924466m401866Q186558
40214H432027M937807j876851M085886J1490078M24628j9488108k0183013N14225
40206a1663321J5739995J1637798L312707L255635K486873n510253q041246L162910
40198A4381098J2703169N082985q794361r078673J285478L691832m848058r147126
$$ plain form
40190 5276344 3035429 8373450 13128758 14182120 15461946 18330719 18482440 12653926
40182 12653926 2789719 -7029622 -13949311 -16185172 -12588264 -3933714 5781370 9982669
40174 9982669 3275793 -12868926 -28489225 -32410227 -22513390 -7220703 3323326 5534555
40166 5534555 2407292 -1352867 -3308954 -4787131 -8935323 -15404268 -17892697 -10733420
40158 -10733420 2117635 9343146 5311174 -2978564 -4586802 2732605 11828346 16216692
40150 16216692 16987743 19116986 23467961 24842601 18402542 6374212 -3844364 -7869628
40142 -7869628 -7523090 -5317465 -327466 7412537 12790656 11422770 7214810 8168448
40134 8168448 15712836 24121119 29827473 34393362 37492012 34589518 25047484 16513362
$$ packed form
40190E276344k240915N338021M755308J053362J279826K868773J51721n828514
40182A2653926r864207r819341o919689k235861L596908Q654550R715084M201299
40174I982669o706876j6144719j5620299l921002R896837J5292687J0544029K211229
40166E534555l127263l760159j956087j478177m148192o468945k488429P159277
40158a0733420J2851055P225511m031972q289738j608238P319407R095741M388346
40150A6216692P71051K129243M350975J374640o440059j2028330j0218576m025264
40142g869628L46538K205625M989999P740003N378119j367886m207960R53638
40134H168448P544388Q408283N706354M565889L098650k902494r542034q534122
$$ plain form
40126 16513362 16652027 24487139 33784400 40880222 44407323 41024105 28410895 12276257
40118 12276257 4207597 9690770 21141118 25800991 19787723 11667437 11298796 17898126
40110 17898126 22814469 22833534 23904614 28749841 28632343 16260257 2161102 5289740
40102 5289740 26051535 41513362 33808819 13030969 2836686 11340023 27821944
40095 27821944 42937104 57440344 69993745 70108909 50252960 17514059 -12965318
40088 -12965318 -31203690 -34570655 -23245119 -1464445 19563723 28325113 23796075
40081 23796075 14998211 9735537 8353019 8562092 10555650 14951125 19933957 23358347
40073 23358347 25027633 25219652 24076297 23622380 25890115 27270983 20818224 7750301
$$ packed form
40126A6513362J38665P835112R297261P095822L527101l383218j2613210j6134638
40118A2276257q068660N483173J1450348M659873o013268q120286l68641O599330
40110A7898126M916343J9065J071080M845227j17498j2372086j4099155L128638
40102E289740K0761795J5461827p704543k0777850j0194283Q503337J6481921
40095B7821944J5115160J4503240J2553401J15164j9855949l2738901l0479377
40088a2965318j8238372l366965J1325536K1780674K1028168Q761390m529038
40081B3796075q797864n262674j382518K09073J993558M395475M982832L424390
40073B3358347J669286J92019j143355m53917K267735J380868o452759j3067923
$$ plain form
40065 7750301 -531303 1872258 5394808 567781 -3855238 6491098 24575951 27273275
40057 27273275 11103134 2454775 21268551 51345212 62390517 49122164 30383925
40050 30383925 18270969 9021055 1251922 1804991 10390454 16164764 15186744 16932528
40042 16932528 27513618 39024124 41883742 36735659 28231794 17773633 8424325 6103903
40034 6103903 8972933 6318103 -3977714 -7235722 8787812 34692109 49998274 47300946
40026 47300946 36659193 30485487 32209364 36425118 34232883 22100536 8620310 5950782
40018 5950782 12440057 14343139 8242399 7179088 17165876 24392030 18404043 11677414
40010 11677414 18923536 31489454 33247186 29459789 35137771 44136922 38434469 23765949
$$ packed form
40065G750301q281604K403561L522550m827027m423019J0346336J8084853K697324
40057B7273275j6170141q648359J8813776L0076661J1045305j3268353j8738239
40050C0383925j2112956r249914p769133N53069Q585463N774310r78020J745784
40042A6932528J0581090J1510506K859618n148083q503865j0458161r349308k320422
40034F103903K869030k654830j0295817l258008J6023534K5904297J5306165k697328
40026D7300946j0641753o173706J723877M215754k192235j2132347j3480226k669528
40018E950782O489275J903082o100740j063311R986788P226154n987987o726629
40010A1677414P246122J2565918J757732l787397N677982Q999151n702453j4668520
$$ plain form
40002 23765949 25235079 45751122 59280989 52104628 41386450 41871196 42797430 34215571
39994 34215571 30214778 44257537 61849070 61729768 49281037 44938166 50868146 53525532
39986 53525532 51401060 55290118 64013298 63245950 49821926 37617201 36360972 40983256
39978 40983256 44989030 49775353 57162331 64976175 72679783 80352170 80986578 65805110
39970 65805110 39313559 18068318 12377874 18641006 29375854 39355466 42277292 34936178
39962 34936178 26260327 29078077 41489755 50574040 55799238 70820443 96568536 111402116
39954 111402116 99078864 71302881 49984154 40474396 36331644 38136793 49829963
39947 49829963 64203774 70490310 72949853 84784936 104373187 114049529 105146106 89956738
$$ packed form
40002B3765949J469130K0516043J3529867p176361j0718178M84746R26234q581859
39994C4215571m000793J4042759J7591533j19302j2448731m342871N929980K657386
39986E3525532k124472L889058Q723180p67348j3424024j2204725j256229M622284
39978D0983256M005774M786323P386978P813844P703608P672387O34408j5181468
39970F5805110k6491551k1245241n690444O263132J0734848R979612K921826p341114
39962C4936178q675851K817750J2411678R084285N225198J5021205K5748093J4833580
39954A11402116j2323252k7775983k1318727r509758m142752J805149J1693170
39947D9829963J4373811O286536K459543J1835083J9588251R676342q903423j5189368
$$ plain form
39939 89956738 83795104 86729010 89583293 89125572 89300678 92013276 93719876 90471149
39931 90471149 82934510 76387150 76244580 82719343 90586437 95517557 98690570 102943564
39923 102943564 107140437 107768638 103555091 95034867 83038419 71921628 69643956 77983060
39915 77983060 86825242 86684972 83692900 91754029 111219604 127364922 131746618 133037213
39907 133037213 141840651 155258815 163391141 162769118 155746829 143474309 127897116 115811756
39899 115811756 112757134 116276629 121950027 131359787 145723619 156499588 154215261 145487457
39891 145487457 148453577 168044104 187059257 188334208 177143291 172899476 184022924
39884 184022924 200955255 212552632 219756621 230347923 246857177 264401756 277690987
$$ packed form
39939H9956738o161634K933906K854283m57721J75106K712598J706600l248727
39931I0471149p536639o547360j42570O474763P867094M931120L173013M252994
39923A02943564M196873O28201m213547q520224j1996448j1116791k277672Q339104
39915G7983060Q842182j40270k992072Q061129J9465575J6145318M381696J290595
39907A33037213Q803438J3418164Q132326o22023p022289j2272520j5577193j2085360
39899A15811756l054622L519495N673398R409760J4363832J0775969k284327q727804
39891A45487457K966120J9590527J9015153J274951j1190917m243815J1123448
39884A84022924J6932331J1597377P203989J0591302J6509254J7544579J3289231
$$ plain form
39877 277690987 286354019 293878187 303060798 312306194 316613925 314048855 310693839 315145565
39869 315145565 326798951 334448594 330215793 320566416 317875422 324460777 332896932 340933311
39861 340933311 356239176 383218225 413380469 434286591 442400757 442133821 437977671
39854 437977671 433742520 434357940 441069695 448671004 454342949 464264687 482331544 496938244
39846 496938244 491576112 467903833 445987796 440210225 446651784 456028082 464839372 467994259
39838 467994259 455157785 426105410 399537476 393176060 400991815 402915062 392866094
39831 392866094 383313621 383192341 385611342 380968267 370430778 359678599 347327408 328099485
39823 328099485 304408213 286992646 282237399 282810215 274824164 254833335 236224050
$$ packed form
39877B77690987Q663032P524168R182611R245396M307731k565070l355016M451726
39869C15145565J1653386P649643m232801r649377k690994O585355Q436155Q036379
39861C40933311J5305865K6979049L0162244K0906122Q114166k66936m156150
39854D37977671m235151O15420O711755P601309N671945R921738J8066857J4606700
39846D96938244n362132k3672279k1916037n777571O441559R376298Q811290L154887
39838D67994259j2836474k9052375k6567934o361416P815755J923247j0048968
39831C92866094r552473j21280K419001m643075j0537489j0752179j2351191j9227923
39823C28099485k3691272j7415567m755247N72816p986051j9990829j8609285
$$ plain form
39816 236224050 234637076 248622078 260874175 258905772 246659793 233386064 221197648
39809 221197648 210503961 207914987 216845601 226038041 220769502 203355486 189750949
39802 189750949 186214159 182587642 170926793 157804567 152457816 152807787 150362000 142744932
39794 142744932 135717820 136463172 146791795 158405225 156081902 134294664 110090201
39787 110090201 107136597 124428933 134620222 119460099 93013771 80162290 84937385
39780 84937385 93298835 96995225 98627281 98942076 95502667 92277015 96263853 104612974
39772 104612974 107624318 104652181 104417192 108267785 106039350 92392379 76134838 68176300
39764 68176300 69152702 73750502 78880382 82177393 79907173 72684242 68023714 71887084
$$ packed form
39816B36224050j586974J3985002J2252097j968403j2245979j3273729j2188416
39809B21197648j0693687k588974Q930614R192440n268539j7414016j3604537
39802A89750949l536790l626517j1660849j3122226n346751L49971k445787p617068
39794A42744932p027112P45352J0328623J1613430k323323k1787238k4204463
39787A10090201k953604J7292336J0191289j5160123k6446328j2851481M775095
39780H4937385Q361450L696390J632056L14795l439409l225652L986838Q349121
39772A04612974L011344k972137k34989L850593k228435j3646971j6257541p958538
39764F8176300R76402M597800N129880L297011k270220p222931m660528L863370
$$ plain form
39756 71887084 81572784 89952641 91427437 81506755 58913252 33370868 22576011 32492548
39748 32492548 46766808 46001126 33485131 30035308 44645352 63614446 72171914 73872259
39740 73872259 79311113 84968191 77490504 57091669 42030556 44414821 52887780 49569576
39732 49569576 37222938 35866522 53230603 72844676 76741602 68056683 61609997 60776648
39724 60776648 56451104 45144137 34702743 30931553 29590661 25209927 19454251 16633654
39716 16633654 17277963 19818827 23457106 26821171 29086107 33938775 45380957 57299929
39708 57299929 56034445 38599602 20470201 18247231 31089653 46626429 57961764
39701 57961764 64150186 59349589 36270651 1687609 -24054903 -28261651 -18383852 -8616898
$$ packed form
39756G1887084R685700Q379857J474796r920682k2593503k5542384j0794857R916537
39748C2492548J4274260p65682j2515995l449823J4610044J8969094Q557468J700345
39740G3872259N438854N657078p477687k0398835j5061113K384265Q472959l318204
39732D9569576j2346638j356416J7364081J9614073L896926q684919o446686q33349
39724F0776648m325544j1306967j0441394l771190j340892m380734n755676k820597
39716A6633654O44309K540864L638279L364065K264936M852668J1442182J1918972
39708E7299929j265484j7434843j8129401k222970J2842422J5536776J1335335
39701E7961764O188422m800597k3078938l4583042k5742512m206748R877799R766954
$$ plain form
39693 -8616898 -1906864 7637233 20032760 26872426 24016862 19952937 27290977 47239529
39685 47239529 65370579 64690117 43175054 16331590 579332 -3260462 -5630981 -9907976
39677 -9907976 -7264102 7291360 22750761 24433911 13656378 5156541 6740096 12576864
39669 12576864 17954652 28052881 45171050 57709323 53188184 36730641 25077178
39662 25077178 25165244 30188275 34927719 41184368 46703471 43645066 33532436 29440389
39654 29440389 34404199 31233220 7216574 -21730406 -28599083 -10957219 9004288
39647 9004288 17905418 25213782 40330266 53793880 51068090 33175621 13380869 678861
39639 678861 -5167148 -7831735 -10629748 -14257500 -14026468 -4863211 7823609 10645866
$$ packed form
39693h616898O710034R544097J2395527O839666k855564m063925P338040J9948552
39685D7239529J8131050o80462k1515063k6843464j5752258l839794k370519m276995
39677i907976K643874J4555462J5459401J683150j0777533q499837J583555N836768
39669A2576864N377788J0098229J7118169J2538273m521139j6457543j1653463
39662B5077178Q8066N023031M739444O256649N519103l058405j0112630m092047
39654B9440389M963810l170979k4016646k8946980o868677J7641864J9961507
39647I004288Q901130P308364J5116484J3463614k725790j7892469j9794752j2702008
39639F78861n846009k664587k798013l627752K31032R163257J2686820K822257
$$ plain form
39631 10645866 796489 -7141440 -837744 11912416 15366763 9135689 6737236 14192665
39623 14192665 22940796 24417668 20568132 17346688 16587038 17661250 20341739 22413692
39615 22413692 19557239 11035845 2132906 -1422137 1091583 6555622 11633860 14096233
39607 14096233 13378192 11395571 11134412 13529296 16806807 18953295 19700189 20211401 21532586
39598 21532586 23006109 22516379 19746437 18149491 20417629 22883463 19469149 10923851
39590 10923851 3203925 -4198246 -18865265 -40162485 -53410999 -47819057 -32525318
39583 -32525318 -24418766 -25627520 -24846778 -17580937 -11959429 -14121076 -19733338 -22933083
39575 -22933083 -24077839 -24886846 -23757904 -20108616 -17419700 -18228219 -20411803 -20468205 -16016012
$$ packed form
39631A0645866r849377p937929O303696J2750160L454347o231074k398453P455429
39623A4192665Q748131J476872l849536l221444p59650J074212K680489K071953
39615B2413692k856453q521394q902939l555043K513720N464039N078238K462373
39607A4096233p18041j982621k61159K394884L277511K146488P46894N11212J321185
39598B1532586J473523m89730k769942j596946K268138K465834l414314q545298
39590A0923851p719926p402171j4667019k1297220j3248514N591942J5293739
39583c2525318Q106552j208754P80742P265841N621508k161647n612262l199745
39575b2933083j144756q09007J128942L649288K688916q08519k183584n6402M452193
$$ plain form
39566 -16016012 -4352731 14991986 34056380 39637155 27295713 7669513 -5681873
39559 -5681873 -11206994 -17248330 -27324869 -33838252 -28385638 -14172660 -3265614 -1968564
39551 -1968564 -5012091 -7393822 -14480362 -30705942 -43211692 -32581622 -2174355 19869703
39543 19869703 16128801 2307829 2124776 14002316 19814184 15818254 13765260 16652319
39535 16652319 15162545 7590868 3098056 3238804 -1044315 -10858551 -15604418 -11627375
39527 -11627375 -7024143 -3409514 8309355 26921251 34320783 20242424 -2050967
39520 -2050967 -15015958 -17137056 -14239323 -6449805 3630552 4370504 -8573845 -20867314
39512 -20867314 -18185098 -5700852 4005858 10807988 19937295 25865495 20282030 8896725
$$ packed form
39566a6016012J1663281J9344717J9064394N580775j2341442j9626200j3351386
39559e681873n525121o041336j0076539o513383N452614J4212978J0907046J297050
39551a968564l043527k381731p086540j6225580j2505750J0630070L0407267K2044058
39543A9869703l740902j3820972j83053J1877540N811868l995930k052994K887059
39535A6652319j489774p571677m492812J40748m283119r814236m745867L977043
39527a1627375M603232L614629J1718869J8611896P399532j4078359k2293391
39520b050967j2964991k121098K897733P789518J0080357P39952j2944349j2293469
39512b0867314K682216J2484246R706710O802130R129307N928200n583465j1385305
$$ plain form
39504 8896725 4774402 10630725 20362665 30206551 35663572 27923856 9130818 535631
39496 535631 16661219 40522202 45225071 32155999 24358336 27837048 26051417 12301694
39488 12301694 1035045 2388322 8773792 12880219 17734222 22186277 17171561 4716652
39480 4716652 1083198 11518196 20244034 15546643 6499934 3283997 -621614 -11899786
39472 -11899786 -19653650 -11850208 2928802 8023325 3654292 2171114 5833364 6672267
39464 6672267 3675483 3425816 5825184 4022630 -2305678 -6678581 -8157863 -11545371
39456 -11545371 -15331565 -11980520 -2143854 2934623 -2575052 -9432522 -4724343 12644844
39448 12644844 31942849 42356730 41460614 34080786 25498381 16604512 6269208 -3041430
$$ packed form
39504H896725m122323N856323R731940R843886N457021p739716j8793038q595187
39496E35631J6125588K3860983M702869j3069072p797663L478712j785631j3749723
39488A2301694j1266649J353277O385470M106427M854003M452055n014716j2454909
39480D716652l633454J0434998Q725838m697391r046709l215937l905611j1278172
39472a1899786p753864P803442J4779010N094523m369033j483178L662250Q38903
39464F672267k996784k49667K399368j802554o328308m372903j479282l387508
39456a1545371l786194L351045R836666N078477n509675o857470M708179J7369187
39448A2644844J9298005J0413881q96116p379828q582405q893869j0335304r310638
$$ plain form
39440 -3041430 -6338291 -3686867 -1596366 -4308437 -8551289 -9759644 -8051165 -4657544
39432 -4657544 1269516 7707532 8325828 2064948 -2234608 2000517 8233637 6468311
39424 6468311 -1617114 -6768747 -7178785 -8767653 -12863345 -14525771 -12739394 -12065815
39416 -12065815 -13210300 -10989279 -3112636 7035107 17389953 28790669 38438864 40683172
39408 40683172 36761046 34962814 37408410 35245751 22461572 6891833 188796 2255516
39400 2255516 3862088 1549699 919037 5008116 8008708 4606341 -180542 2959856
39392 2959856 13465294 19782313 14657540 5758758 5827343 15996618 25919017 28576134
39384 28576134 26451138 23119472 19114175 18763853 28939803 43736187 42298359 14568328
$$ packed form
39440c041430l296861K651424K090501k712071m242852j208355J708479L393621
39432d657544N927060O438016O18296o260880m299556M235125O233120j765326
39424F468311q085425n151633m10038j588868m095692j662426J786377O73579
39416a2065815j144485K221021P876643J0147743J0354846J1400716R648195K244308
39408D0683172l922126j798232K445596k162659j2784179j5569739o703037K066720
39400B255516J606572k312389o30662M089079L000592l402367m786883L140398
39392B959856J0505438O317019n124773q898782O8585J0169275R922399K657117
39384B8576134k124996l331666m005297l50322J0175950J4796384j437828k7730031
$$ plain form
39376 14568328 -18826443 -27443257 -7823050 15632817 24264181 22401328 19595612 14499767
39368 14499767 4600093 -3483781 -5028588 -7059648 -14767434 -17573515 -3349701 19411087
39360 19411087 29301127 20202059 7212793 3374953 4542022 1987960 -2209998 -573579
39352 -573579 6805464 13197997 15013209 13854527 11611302 9128691 7543749 6168057
39344 6168057 1413393 -7487596 -14361383 -13092281 -6344349 -1164823 1893452 7503928
39336 7503928 14455440 15497820 10461402 9773488 19231250 29049584 25847512 10575050
39328 10575050 -3427298 -7054314 -2438665 4492136 10539090 14692840 17748811 22534290
39320 22534290 29396947 33255247 31462380 31806924 43294389 59900236 64861770 53744049
$$ packed form
39376A4568328l3394771q616814J9620207K3455867Q631364j862853k805716n095845
39368A4499767r899674q083874j544807k031060p707786k806081J4223814K2760788
39360A9411087R890040r099068j2989266l837840J167069k554062m197958J636419
39352e73579P379043O392533J815212j158682k243225k482611j584942j375692
39344F168057m754664q900989o873787J269102O747932N179526L058275N610476
39336G503928O951512J042380n036418o87914R457762R818334l202072j5272462
39328A0575050j4002348l627016M615649O930801O046954M153750L055971M785479
39320B2534290O862657L858300j792867L44544J1487465J6605847M961534j1117721
$$ plain form
39312 53744049 42415906 46569608 61837698 70608508 62033189 39572179 15142985
39305 15142985 1925114 6713130 22043135 30511713 23784792 13023273 13560420 23922152
39297 23922152 28976311 21434948 10543077 8089316 12983677 13413349 2007326 -13247354
39289 -13247354 -14674402 5882377 34555566 48046320 39392548 23375497 14082911
39282 14082911 7771217 -5178881 -21487511 -29333801 -25407765 -16714651 -9650872 -7319093
39274 -7319093 -13017217 -24904541 -30762228 -20709299 -3641102 1608267 -8176852 -15835104
39266 -15835104 -6721721 13773493 28368440 25921469 10033570 -4022902 -2206189
39259 -2206189 11783816 17173564 2604073 -14787047 -11775722 4996004 6667302 -13918643
$$ packed form
39312E3744049j1328143M153702J5268090Q770810q575319k2461010k4429194
39305A5142985j3217871M788016J5330005Q468578o726921j0761519N37147J0361732
39297B3922152N054159p541363j0891871k453761M894361M29672j1406023j5254680
39289a3247354j427048K0556779K8673189J3490754q653772j6017051r292586
39282A4082911o311694j2950098j6308630p846290L926036Q693114P063779K331779
39274g319093n698124j1887324n857687J0052929J7068197N249369r785119p658252
39266a5835104R113383K0495214J4594947k446971j5887899j4056472J816713
39259b206189J3990005N389748j4569491j7391120L011325J6771726J671298k0585945
$$ plain form
39251 -13918643 -29849836 -19691580 2634586 11297192 3829049 -4484126 -8143863 -13680570
39243 -13680570 -21681602 -25220491 -23607198 -22395757 -21085706 -14468831 -5623499 -4488909
39235 -4488909 -12290762 -18884318 -17903306 -14615296 -15684137 -19663229 -21432755 -19317187
39227 -19317187 -13992652 -5892929 2135022 3841087 -3710075 -13748435 -14350165 -882418
39219 -882418 17653929 26836575 21484434 9578808 672085 -4754649 -9949726 -11422148
39211 -11422148 -3363723 9370318 13902142 6339306 -4465009 -12013897 -18611592 -22930536
39203 -22930536 -15944978 2017630 13945574 8286833 -2999015 -2848728 4761802 4685162
39195 4685162 -1177003 2989692 17454294 22896204 10518569 -3197372 -814756 12538777
$$ packed form
39251a3918643j5931193J0158256K2326166Q662606p468143q313175l659737n536707
39243a3680570q001032l538889J613293J211441J310051O616875Q845332J134590
39235d488909p801853o593556R81012L288010j068841l979092j769526K115568
39227a9317187N324535Q099723Q027951J706065p551162j0038360o01730J3467747
39219h82418J8536347R182646n352141j1905626q906723n426734n195077j472422
39211a1422148Q058425J2734041M531824p562836j0804315p548888o597695m318944
39203b2930536O985558J7962608J1927944n658741j1285848J50287P610530p6640
39195D685162n862165M166695J4464602N441910j2377635j3715941K382616J3353533
$$ plain form
39187 12538777 21315495 23178079 27007590 34699699 39193856 38712391 40433997 47393942
39179 47393942 50834497 41293124 22964598 10688903 12570232 20645787 21733261 13757685
39171 13757685 5797749 3969045 5371869 7159711 12261385 21165005 26419937 22756560
39163 22756560 15994642 13614197 12486984 5229017 -6823745 -17184766 -25000704 -30204399
39155 -30204399 -23908322 4218 26356218 30748253 12856710 -375081 8980504
39148 8980504 27064045 30725905 17461107 718232 -11873061 -20515802 -22074744 -13112689
39140 -13112689 -863853 2518446 -4073290 -11195863 -14043852 -16381293 -19631547 -19400770
39132 -19400770 -15601536 -16324244 -26236034 -37238002 -36550262 -21679719 -3108525 7427362
$$ packed form
39187A2538777Q776718J862584L829511P692109M494157m81465J721606O959945
39179D7393942L440555r541373j8328526j2275695J881329Q075555J087474p975576
39171A3757685p959936j828704J402824J787842N101674Q903620N254932l663377
39163B2756560o761918k380445j127213p257967j2052762j0361021p815938n203695
39155c0204399O296077K3912540K6352000M392035j7891543j3231791R355585
39148H980504J8083541L661860j3264798j6742875j2591293q642741j558942Q962055
39140a3112689J2248836L382299o591736p122573k847989k337441l250254K30777
39132a9400770L799234p22708r911790j1001968O87740J4870543J8571194J0535887
$$ plain form
39124 7427362 8596554 8385443 12628975 17954008 18804403 18151537 23813331 33622610 33340370
39115 33340370 14452256 -13242772 -33816149 -43942508 -50870122 -56587518 -55108213
39108 -55108213 -44320782 -29938500 -16537433 -3964800 5699205 7336631 2466451
39101 2466451 317757 3537648 1200826 -15776127 -38121347 -46636699 -34758274 -14250215
39093 -14250215 647308 6432889 6979820 5322873 2873426 1693055 3197498 6962188
39085 6962188 12793868 20536406 25733038 20337086 2750928 -15448335 -18532553 -2781050
39077 -2781050 19593440 32673617 30774898 21256958 16255447 20935734 28010628 25806239
39069 25806239 13610573 4482465 8052978 15869703 12881407 405000 -4466249 6666276
$$ packed form
39124G427362J169192k11111M243532N325033Q50395o52866N661794R809279k82240
39115C3340370j8888114k7695028k0573377j0126359o927614n717396J479305
39108e5108213J0787431J4382282J3401067J2572633R664005J637426m870180
39101B466451k148694L219891k336822j6976953k2345220q515352J1878425K0508059
39093a4250215J4897523N785581N46931j656947k449447j180371J504443L764690
39085F962188N831680P742538N196632n395952j7586158j8199263l084218J5751503
39077b781050K2374490J3080177j898719r517940n001511M680287P074894k204389
39069B5806239j2195666r128108L570513P816725k988296j2476407m871249J1132525
$$ plain form
39061 6666276 22461931 30141786 32593625 38404207 44760096 42257259 31313912 22180755
39053 22180755 21054888 25739045 32539336 37730138 34385335 18779685 207254 -5604407
39045 -5604407 5322953 21244887 29198274 25740808 14422666 2975161 3149890 20709190
39037 20709190 41843744 41903040 14932539 -15119715 -21095221 -3156830 15865345 19181769
39029 19181769 9817221 -813230 -7034329 -10160805 -13300414 -18648658 -26954633 -37118426
39021 -37118426 -46571748 -52524373 -53636563 -51596272 -49568343 -46518799 -35529802 -13078671
39013 -13078671 11716550 24858788 24915205 23993899 28966982 31559548 22919823 9143443
39005 9143443 3212952 7021830 11112187 9586048 6099106 5567135 8044819 12037788
$$ packed form
39061F666276J5795655P679855K451839N810582O355889k502837j0943347r133157
39053B2180755j125867M684157O800291N190802l344803j5605650j8572431n811661
39045e604407J0927360J5921934P953387l457466j1318142j1447505J74729J7559300
39037B0709190K1134554N9296k6970501l0052254n975506J7938391J9022175L316424
39029A9181769r364548j0630451o221099l126476l139609n348244q305975j0163793
39021c7118426r453322n952625j112190K040291K027929L049544J0988997K2451131
39013a3078671K4795221J3142238N6417r21306M973083K592566q639725j3776380
39005I143443n930491L808878M090357j526139l486942n31971K477684L992969
$$ plain form
38997 12037788 17402864 22827539 25107299 23078890 18928208 13977775 6490628 -3757910
38989 -3757910 -10998225 -7497335 7002960 22494384 28105717 23461333 17137346 13577673
38981 13577673 6783651 -9664408 -30833741 -44109409 -42380066 -29239635 -14000695
38974 -14000695 -5999482 -9410089 -17306222 -15466831 -9995 13713500 9806382 -5612733
38966 -5612733 -13306795 -8416007 -3550903 -6397544 -12040133 -18196586 -28295055 -35404417
38958 -35404417 -24158238 3141341 22675151 22088251 17075381 21814568 24687337 12803348
38950 12803348 489327 7285382 22000346 18277299 -1731083 -9642855 4500298
38943 4500298 18986899 16323892 6401342 4990569 10629318 14105374 14376371 13934009
$$ packed form
38997A2037788N365076N424675K279760k028409m150682m950433p487147j0248538
38989c757910p240315L500890J4500295J5491424N611333m644384o323987l559673
38981A3577673o794022j6448059k1169333j3275668J729343J3140431J5238940
38974a4000695Q001213l410607p896133J839391J5456836J3723495l907118j5419115
38966e612733p694062M890788M865104k846641n642589o156453j0098469p109362
38958c5404417J1246179K7299579J9533810n86900n012870M739187K872769j1883989
38950A2803348j2314021O796055J4714964l723047k0008382p911772J4143153
38943D500298J4486601k663007r922550j410773N638749L476056K70997m42362
$$ plain form
38935 13934009 11031672 6098334 5380614 10406387 13410787 9564742 4178805 2262091
38927 2262091 933050 -2399422 -4736242 -6130814 -12965426 -26077117 -36191096 -38503540
38919 -38503540 -41021518 -49228294 -52715677 -39268293 -15373782 554630 2720167 3539917
38911 3539917 13764964 26874159 27806881 12257867 -7907147 -18340029 -17828357 -16851960
38903 -16851960 -21315080 -23867717 -15340507 623770 11313425 10157019 1168074 -8917058
38895 -8917058 -15284212 -14632273 -8775193 -6556921 -13468611 -21617422 -18974329 -5556020
38887 -5556020 9283883 21113514 29942394 30960165 21597644 13703811 19768107 29202162
38879 29202162 20420406 -2555942 -10740416 6283662 23201813 17388408 614845
$$ packed form
38935A3934009k902337m933338p17720N025773L004400l846045n385937j916714
38927B262091j329041l332472k336820j394572o834612j3111691j0113979k312444
38919c8503540k517978q206776l487383J3447384K3894511J5928412K165537Q19750
38911C539917J0225047J3109195R32722j5549014k0165014j0432882N11672R76397
38903a6851960m463120k552637Q527210J5964277J0689655j156406q988945j0085132
38895h917058o367154O51939N857080K218272o911690q148811K643093J3418309
38887e556020J4839903J1829631Q828880J017771r362521p893833O064296R434055
38879B9202162q781756k2976348q184474J7024078J6918151n813405j6773563
$$ plain form
38872 614845 -4294062 2288641 6038524 5521045 7634397 8112696 -1362836 -14283366
38864 -14283366 -17549242 -12851010 -11763946 -14893209 -13704550 -8943740 -9932992 -17950553
38856 -17950553 -25303087 -28038140 -26165099 -16342388 1076597 13660127 11834200 6431960
38848 6431960 13561964 27524648 29036632 16527486 6916539 6538846 5058406 100936
38840 100936 2965420 13368862 12599159 -6911957 -25605923 -23826532 -8280654 2060977
38832 2060977 2167777 -864029 -3531866 -5538420 -3370395 2652338 3607974 -3834234
38824 -3834234 -8074711 -508826 7181574 -276256 -15739972 -19180337 -9382643 -6296014
38816 -6296014 -20404243 -37908250 -41674130 -31782517 -18226203 -6540050 118197 -3880719
$$ packed form
38872F14845m908907O582703L749883n17479K113352M78299r475532j2920530
38864a4283366l265876M698232J087064l129263J188659M760810r89252q017561
38856a7950553p352534k735053J873041R822711J7418985J2583530j825927n402240
38848F431960P130004J3962684J511984j2509146r610947l77693j480440m957470
38840A00936K864484J0403442p69703j9511116j8693966J779391J5545878J0341631
38832B060977J06800l031806k667837k006554K168025O022733R55636p442208
38824c834234m240477P565885P690400p457830j5463716l440365R797694L086629
38816f296014j4108229j7504007l765880R891613J3556314J1686153O658247l998916
$$ plain form
38808 -3880719 -17084083 -23964616 -10934249 13728594 28545996 26608108 21648745 24287802
38800 24287802 26425189 17301362 3196810 -2106998 122777 -4067083 -17641942 -26693791
38792 -26693791 -21947739 -12393058 -9760230 -10282132 -2444017 13733120 26012692 25965331
38784 25965331 17253437 8929385 6120751 5939190 -657952 -18980622 -39605347 -44509169
38776 -44509169 -29887681 -14566162 -16865007 -30716058 -36026210 -26316851 -12309489
38769 -12309489 -2089194 6623309 14418945 15564383 9432764 5086257 9556516 19256884
38761 19256884 25690846 23140017 10764343 -5125170 -12361200 -6290315 33331 -8688191
38753 -8688191 -25616590 -28419742 -12135539 2168654 -1510774 -11008972 -5876576 12222373
$$ packed form
38808c880719j3203364o880533J3030367K4662843J4817402j937888m959363K639057
38800B4287802K137387r123827j4104552n303808K229775m189860j3574859r051849
38792b6693791M746052R554681K632828n21902P838115J6177137J2279572m7361
38784B5965331q711894q324052k808634j81561o597142j8322670k0624725m903822
38776d4509169J4621488J5321519k298845j3851051n310152R709359J4007362
38769a2309489J0220295Q712503P795636J145438o131619m346507M470259R700368
38761A9256884O433962k550829j2375674j5889513p236030O070885O323646q721522
38753h688191j6928399k803152J6284203J4304193l679428r498198N132396J8098949
$$ plain form
38745 12222373 23490784 17185336 1035085 -13289082 -21998598 -26209677 -26117094 -21084208
38737 -21084208 -12333299 -4456958 -3684984 -11403475 -19686238 -19115380 -12082532 -11066584
38729 -11066584 -20824208 -29833190 -24561432 -6589715 10008883 14957470 11381846 11154639
38721 11154639 21915610 36535964 37973408 20342281 1215783 2191330 19066625
38714 19066625 25714332 9856351 -10566607 -13282680 609970 14899290 21940722
38707 21940722 25112419 25763673 21455067 14332834 11019615 14853590 23390391 30553653
38699 30553653 28394707 13513581 -4434862 -9572875 -654972 4985091 -4256611 -16905756
38691 -16905756 -15550251 -941574 13920065 24848076 35769435 42435309 34566843
$$ packed form
38745A2222373J1268411o305448j6150251j4324167q709516m211079R2583N032886
38737b1084208Q750909P876341P71974p718491q282763N70858P032848J015948
38729a1066584r757624r008982N271758J7971717J6598598M948587l575624k27207
38721A1154639J0760971J4620354J437444j7631127j9126498R75547J6875295
38714A9066625O647707j5857981k0422958k716073J3892650J4289320P041432
38707B1940722L171697O51254m308606p122233l313219L833975Q536801P163262
38699C0553653k158946j4881126j7948443n138013Q917903N640063r241702j2649145
38691a6905756J355505J4608677J4861639J0928011J0921359O665874p868466
$$ plain form
38684 34566843 14875467 1066527 4614100 17555679 24552915 20932965 14724051 14981099
38676 14981099 21500790 25708561 21405775 12824196 8194538 7308924 3234141 -4338167
38668 -4338167 -8571423 -9938976 -17614049 -31484319 -37413575 -28751277 -18340753 -18752352
38660 -18752352 -24878588 -28440155 -34264349 -45582009 -47660348 -27345385 1179041 12298379
38652 12298379 3541140 -7532219 -14327869 -24430829 -34966058 -31129994 -12165737
38645 -12165737 4338145 8807629 9571268 11602501 6498598 -8441351 -19822434 -16605659
38637 -16605659 -4628847 4904937 8370189 5764755 -2065948 -7019167 947864 17001595
38629 17001595 24801774 20943831 18812922 22610452 17594705 -3703311 -24613272 -27431214
$$ packed form
38684C4566843j9691376j3808940L547573J2941579O997236l619950o208914K57048
38676A4981099O519691M207771m302786q581579m629658q85614m074783p572308
38668d338167m233256j367553p675073j3870270n929256Q662298J0410524m11599
38660a8752352o126236l561567n824194j1317660k078339K0314963K8524426J1119338
38652A2298379q757239j1073359o795650j0102960j0535229L836064J8964257
38645a2165737J6503882M469484P63639K031233n103903j4939949j1381083L216775
38637a6605659J1976812R533784L465252k605434p830703m953219P967031J6053731
38629A7001595P800179l857943k130909L797530n015747k1298016k0909961k817942
$$ plain form
38621 -27431214 -17694702 -11014298 -9488812 -6333293 -2097525 -683149 1300248 6718678
38613 6718678 8224042 201999 -8510722 -8354418 -6886832 -16801032 -32898555 -38191566
38605 -38191566 -29036202 -17379827 -9633338 125608 14241707 23550508 20658758 11604071
38597 11604071 8949364 17847989 31072088 35298645 23656372 4656443 -5197316 -982241
38589 -982241 4756323 909695 -5750029 -2632521 7016882 7818048 -4414168 -16132565
38581 -16132565 -15187005 -6159460 -1538123 -4015273 -4132298 5148318 16208584 13745459
38573 13745459 -4923003 -22657991 -22946335 -13300887 -15985408 -35305309 -48878408 -37342069
38565 -37342069 -9746991 9642706 9692629 -1736027 -11166603 -8857287 7491777 28346458
$$ packed form
38621b7431214R736512O680404J525486L155519M235768J414376J983397N418430
38613F718678J505364q022043q712721J56304J467586r914200j6097523n293011
38605c8191566R155364J1656375P746489R758946J4116099R308801k891750r054687
38597A1604071k654707Q898625J3224099M226557j1642273j8999929r853759M215075
38589i82241N738564l846628o659724L117508R649403Q01166j2232216j1718397
38581a6132565R45560R027545M621337k477150j17025R280616J1060266k463125
38573A3745459j8668462j7734988k88344R645448k684521j9319901j3573099J1536339
38565c7342069K7595078J9389697M9923j1428656r430576K309316J6349064K0854681
$$ plain form
38557 28346458 37437181 29049808 13968425 2920093 -5478905 -13461591 -14615228 -7012903
38549 -7012903 -2507471 -8668365 -14039801 -7992628 -2557302 -13267502 -28286326 -22308659
38541 -22308659 2518025 15778918 1268387 -23074538 -33539641 -28575712 -20114326
38534 -20114326 -14144253 -10284114 -8765198 -8815730 -8013610 -8074729 -13112403 -19654245 -18248922
38525 -18248922 -7648752 2770482 7431404 11046702 17562061 22649347 21269503 14813877
38517 14813877 8006082 5313780 10555640 22724985 33582134 37150409 37966935 40852215
38509 40852215 39240738 26954253 14136912 13662702 17941362 10917821 -1422718 1237794
38501 1237794 16068013 17233236 -1021541 -12271410 -433339 15557286 16622594
$$ packed form
38557B8346458R090723q387373j5081383j1048332q398998p982686j153637P602325
38549g012903M505432o160894n371436O047173N435326j0710200j5018824N977667
38541b2308659K4826684J3260893j4510531k4342925j0465103M963929Q461386
38534b0114326N970073L860139J518916n0532Q02120o1119n037674o541842J405323
38525a8248922J0600170J0419234M660922L615298O515359N087286j379844o455626
38517A4813877o807795k692302N241860J2169345J0857149L568275Q16526K885280
38509D0852215j611477j2286485j2817341m74210M278660p023541j2340539K660512
38501A237794J4830219J165223j8254777j1249869J1838071J5990625J065308
$$ plain form
38494 16622594 14867956 26957519 40195172 33366070 14440104 7943312 15160836 15313326
38486 15313326 958278 -13983931 -19814101 -21211847 -20777057 -12593962 4571150 22776129
38478 22776129 35300970 39750209 33036888 16287636 1508143 -645597 3535042 1402909
38470 1402909 -4815875 -3899586 1916809 -56072 -9437160 -13184665 -10677701 -16881427
38462 -16881427 -35272798 -47579963 -39128585 -18050950 -319837 9803741 15234703
38455 15234703 15875221 13986889 18418784 31561553 40071801 29624561 3560533 -21880524
38447 -21880524 -35842905 -38533639 -33724940 -24548373 -15063604 -9420192 -9009752 -12152772
38439 -12152772 -14476674 -9506115 6078287 26396347 40460678 43050595 36344153 22080042
$$ packed form
38494A6622594j754638J2089563J3237653o829102j8925966o496792P217524J52490
38486A5313326j4355048j4942209n830170j397746M34790Q183095J7165112J8204979
38478B2776129J2524841M449239o713321j6749252j4779493k153740M180639k132133
38470A402909o218784R16289N816395j972881r381088l747505K506964o203726
38462a6881427j8391371j2307165Q451378K1077635J7731113J0123578N430962
38455A5234703O40518j888332M431895J3142769Q510248j0447240k6064028k5441057
38447b1880524j3962381k690734M808699R176567R484769N643412M10440l143020
38439a2152772k323902M970559J5584402K0318060J4064331K589917o706442j4264111
$$ plain form
38431 22080042 1114209 -18666632 -25280534 -18168546 -11489219 -16165846 -26289252 -28924375
38423 -28924375 -20271890 -6456819 4997005 8924644 4496502 -857941 3705215 17532682
38415 17532682 25207855 15209945 -4303640 -15818075 -13016287 -3226124 5509921 10801839
38407 10801839 12311881 10114094 5735822 -325539 -9450093 -18815657 -19469392 -6977095
38399 -6977095 10440541 21266730 23619557 21706623 15371264 3356899 -7706646 -10241791
38391 -10241791 -10015448 -20203336 -39551233 -49076306 -35499323 -8233706 12767927
38384 12767927 18400693 13596254 5707925 -2427277 -10135243 -15761248 -16987892 -13207511
38376 -13207511 -7798415 -6010679 -7397979 -3645674 9153278 18802815 8906355 -16098049
$$ packed form
38431B2080042k0965833j9780841o613902P111988O679327m676627j0123406k635123
38423b8924375Q652485J3815071J1453824L927639m428142n354443M563156J3827467
38415A7532682P675173r997910j9513585j1514435K801788R790163Q736045N291918
38407A0801839J510042k197787m378272o061361r124554r365564o53735J2492297
38399f977095J7417636J0826189K352827j912934o335359j2014365j1063545k535145
38391a0241791K26343j0187888j9347897r525073J3576983K7265617K1001633
38384A2767927N632766m804439p888329q135202p707966n626005j226644L780381
38376a3207511N409096J787736j387300L752305J2798952R649537r896460k5004404
$$ plain form
38368 -16098049 -30628265 -19006752 4549728 16196244 12343358 6481665 4420825
38361 4420825 42472 -6527657 -4811089 7773712 18628686 18033636 12441574 11906793
38353 11906793 15372168 18099744 23505786 35045449 43817738 38581712 24008243 14620538
38345 14620538 12761772 7828955 -2254696 -5195557 5318928 18043989 20662623 16095805
38337 16095805 13942547 15880782 18640352 22270885 25571441 21540248 7961519 -4866475
38329 -4866475 -8009839 -8122065 -15226803 -23367298 -18951760 -3933543 6531894 8413464
38321 8413464 13135415 25215475 32360144 23781455 4929203 -12046921 -20522974 -16726744
38313 -16726744 2039312 28402273 45036075 42443199 28343597 13575525 -308819
$$ packed form
38368a6098049j4530216J1621513K3556480J1646516l852886n861693k060840
38361D420825m378353o570129J716568J2584801J0854974n95050n592062n34781
38353A1906793L465375K727576N406042J1539663Q772289n236026j4573469r387705
38345A4620538j858766m932817j0083651k940861J0514485J2725061K618634m566818
38337A6095805k153258J938235K759570L630533L300556m031193j3578729j2827994
38329d866475l143364j12226p104738q140495M415538J5018217J0465437J881570
38321H413464M721951J2080060P144669q578689j8852252j6976124q476053L796230
38313a6726744J8766056K6362961J6633802k592876j4099602j4768072j3884344
$$ plain form
38306 -308819 -12197909 -13523820 -1658565 8837585 2724546 -14295879 -23736102 -19221134
38298 -19221134 -9891134 -2418665 6150440 17485301 26026536 26313057 18334561 5246993
38290 5246993 -7322357 -11312866 -3721709 7115426 10527932 7142827 5629612 8421251
38282 8421251 10190209 8770825 7334726 6386834 3722860 1814744 4523116 6608021
38274 6608021 -1513257 -16880628 -23842849 -14239252 3020026 16045942 22585907 24179258
38266 24179258 19484807 10727566 7227716 14379034 26274483 35856379 44444665 53893196
38258 53893196 57876038 51165770 41561969 41492783 50630327 56761631 52671584 43293919
38250 43293919 36040394 31827492 27285857 20147108 10279671 -1175479 -11877698 -18854671
$$ packed form
38306c08819j1889090j325911J1865255J0496150o113039j7020425r440223M514968
38298a9221134R330000P472469Q569105J1334861Q541235K86521p978496j3087568
38290E246993j2569350l990509P591157J0837135L412506l385105j513215K791639
38282H421251J768958j419384j436099r47892k663974j908116K708372K084905
38274F608021q121278j5367371o962221R603597J7259278J3025916O539965J593351
38266B4179258m694451q757241l499850P151318J1895449R581896Q588286R448531
38258E3893196L982842o710268r603801o9186R137544O131304m090047r377665
38250D3293919p253525m212902m541635p138749r867437j1455150j0702219o976973
$$ plain form
38242 -18854671 -19904536 -15358436 -9930620 -10725367 -18878555 -25196562 -21803783 -16923108
38234 -16923108 -25831771 -44029115 -44753560 -14334119 22418539 29060385 3674326 -20068361
38226 -20068361 -17232854 1430146 11849256 9229976 6702936 11477733 16356899 13239581
38218 13239581 4554414 -1576722 -2433259 -3546359 -11092103 -22806203 -28252118 -20073205
38210 -20073205 -3964677 6130903 3484852 -4085405 -3982593 6908665 20324787 27329278
38202 27329278 27506303 26553368 27141954 25826584 20232406 15577797 19061169 28719406
38194 28719406 33989138 28889244 18938848 12496412 11325289 13450266 18561652 24446048
38186 24446048 24073744 14432485 4326057 4949708 15275676 24632598 26911329 23553141
$$ packed form
38242a8854671j049865M546100N427816p94747q153188o318007L392779M880675
38234a6923108q908663j8197344p24445L0419441L6752658O641846k5386059k3742687
38226b0068361K835507J8663000J0419110k619280k527040M774797M879166l117318
38218A3239581q685167o131136q56537j113100p545744j1714100n445915Q178913
38210b0073205J6108528J0095580k646051p570257J02812J0891258J3416122P004491
38202B7329278J77025r52935N88586j315370n594178m654609L483372R658237
38194B8719406N269732n099894r950396o442436j171123K124977N111386N884396
38186B4446048l72304r641259j0106428O23651J0325968R356922K278731l358188
$$ plain form
38178 23553141 15314869 1609274 -12850224 -21266376 -24804313 -29331932 -32345531 -25025855
38170 -25025855 -8723652 3539088 5777445 6575079 12672353 18070199 17306934 17137939
38162 17137939 24239599 31403190 28215499 17962113 11588620 10790610 9448587 6832235
38154 6832235 6263763 4316347 -4568910 -14002951 -10247653 7863060 26205887 34855393
38146 34855393 38486187 44131378 50090962 52031684 50264458 45629303 37145562 29001682
38138 29001682 30240399 40539525 45717346 36581427 23939084 23133491 29828614 25769297
38130 25769297 6934253 -9567916 -10282495 -2978985 -1112616 -1941653 6891001 24446816
38122 24446816 34976402 30575009 22791691 26333456 40781896 55444264 64024200 65146768
$$ packed form
38178B3553141q238272j3705595j4459498q416152l537937m527619l013599P319676
38170b5025855J6302203J2262740K238357P97634O097274N397846p63265j68995
38162A7137939P101660P163591l187691j0253386o373493p98010j342023k616352
38154F832235n68472j947416q885257r434041L755298J8110713J8342827Q649506
38146C4855393L630794N645191N959584J940722j767226m635155q483741q143880
38138B9001682J238717J0299126N177821r135919j2642343q05593O695123m059317
38130B5769297j8835044j6502169p14579P303510J866369q29037Q832654J7555815
38122B4446816J0529586m401393p783318L541765J4448440J4662368Q579936J122568
$$ plain form
38114 65146768 55337680 34478371 15273583 12911417 24161316 30737369 26883975 28261332
38106 28261332 45230719 62239395 58170594 37275872 22954453 25446183 32705863
38099 32705863 33029130 30512229 33593097 40654455 43800006 39911228 33171619 30745324
38091 30745324 37219127 49230442 57201265 57775655 60197280 71524918 80993507 73239503
38083 73239503 54735611 50074656 69782504 98209491 117409005 125878985 126989475
38076 126989475 117072778 96919173 80327178 77734748 83037176 88815845 101490501
38069 101490501 126235071 149204276 153668233 145673318 144467706 152798342 155832592 146566215
38061 146566215 133619499 124625831 119154586 117933239 122423253 125248050 117928600 108283687
$$ packed form
38114F5146768r809088k0859309j9204788k362166J1249899O576053l853394J377357
38106B8261332J6969387J7008676m068801k0894722j4321419K491730P259680
38099C2705863L23267k516901L080868P061358L145551l888778o739609k426295
38091C0745324O473803J2011315P970823N74390K421625J1327638R468589p754004
38083G3239503j8503892m660955J9707848K8426987J9199514Q469980J110490
38076A26989475r916697k0153605j6591995k592430N302428N778669J2674656
38069A01490501K4744570K2969205M463957p994915j205612Q330636L034250r266377
38061A46566215j2946716q993668n471245j221347M490014K824797p319450r644913
$$ plain form
38053 108283687 112025219 125856069 128708695 113426607 96699153 91127579 88602396
38046 88602396 81584543 79934373 91162287 101253968 93770691 75832627 66514503 68459394
38038 68459394 69617043 66745153 68046965 74937561 78844123 76683535 74551764 74578286
38030 74578286 71764886 66535193 67771433 78459644 88118941 85424506 72275432 60734705
38022 60734705 59718755 67183697 72684003 67024710 51954311 39452677 39019786 48466712
38014 48466712 60220208 71247617 80594475 82920446 74468357 62623806 58634365 60854385
38006 60854385 55589150 36802821 16174023 9863849 21420496 40706524 54721075
37999 54721075 57073444 50892861 44708075 43784526 46058036 47651813 47757311 44437671
$$ packed form
38053A08283687L741532J3830850K852626j5282088j6727454n571574k525183
38046H8602396p017853j650170J1227914J0091681p483277j7938064r318124J944891
38038F8459394J157649k871890J301812O890596L906562k160588k131771K6522
38030G4578286k813400n229693J236240J0688211R659297k694435j3149074j1540727
38022F0734705j015950P464942N500306n659293j5070399j2501634m32891R446926
38014D8466712J1753496J1027409R346858K325971q452089j1844551l989441K220020
38006F0854385n265235j8786329k0628798o310174J1556647J9286028J4014551
37999E4721075K352369o180583o184786r23549K273510J593777J05498l319640
$$ plain form
37991 44437671 32857146 15811439 8964164 23017109 44706807 50126039 35888653
37984 35888653 21683487 20623836 23682441 18480911 7259048 -2431319 -10733186 -18374998
37976 -18374998 -18349225 -6739923 7457947 15254743 21845821 34978319 46835343 42751888
37968 42751888 23666534 4717625 -6329009 -13783625 -17274887 -7257522 16978682
37961 16978682 38466001 41152423 29457910 20840634 23918815 31584631 32879286 24686600
37953 24686600 12215925 3299017 3221292 11605284 22225812 27082173 22729552 13376338
37945 13376338 6716134 5555883 4950919 70757 -4941546 -1408035 10190763 17805668
37937 17805668 12625350 435418 -6584768 -3900974 5549017 19860565 37369620 50215501
$$ packed form
37991D4437671j1580525j7045707o847275J4052945K1689698N419232j4237386
37984C5888653j4205166j059651L058605n201530j1221863r690367q301867p641812
37976a8374998K5773J1609302J4197870P796796O591078J3132498J1857024m083455
37968D2751888j9085354j8948909j1046634p454616l491262J0017365K4236204
37961A6978682K1487319K686422j1694513q617276L078181P665816J294655q192686
37953B4686600j2470675q916908p7725Q383992J0620528M856361m352621r353214
37945A3376338o660204j160251o04964m880162n012303L533511J1598798P614905
37937A7805668n180318j2189932p020186K683794R449991J4311548J7509055J2845881
$$ plain form
37929 50215501 48894403 34322835 17872268 8178278 4336086 2856844 4009404 8558602
37921 8558602 13863401 16251740 13742466 5595753 -6140507 -13870856 -9113870 7261518
37913 7261518 23312278 26721815 14877225 -5031543 -21221882 -23112598 -8716873
37906 -8716873 11369978 22044052 17576590 4266791 -9160224 -17384661 -16508121 -6583804
37898 -6583804 2128965 -3508498 -20927629 -30433664 -19027521 2989149 16386624 15142201
37890 15142201 5616451 -6813552 -17792261 -18096371 -3562176 11832380 8782452 -10604594
37882 -10604594 -23953627 -19511236 -10527796 -12136313 -18649603 -15783346 -4897128 -31995
37874 -31995 -5422344 -10574118 -7710790 -1293844 2907793 7026956 12922187 13000338 -1335344
$$ packed form
37929E0215501j321098j4571568j6450567r693990l842192j479242J152560M549198
37921H558602N304799K388339k509274q146713j1736260p730349M756986J6375388
37913G261518J6050760L409537j1844590j9908768j6190339j890716J4395725
37906h716873K0086851J0674074m467462j3309799j3427015q224437Q76540R924317
37898f583804Q712769n637463j7419131r506035J1406143K2016670J3397475j244423
37890A5142201r525750j2430003j0978709l04110J4534195J5394556l049928j9387046
37882a0604594j3349033M442391Q983440j608517o513290K866257J0886218M865133
37874c1995n390349n151774K863328O416946M201637M119163N895231P8151j4335682
$$ plain form
37865 -1335344 -24578482 -38835547 -32433565 -12293613 4192020 6708502 -486565 -6341452
37857 -6341452 -5150466 -492461 1145435 -1435335 -3604046 -1890891 1298493 1894636
37849 1894636 741706 1765753 3948055 427882 -11886032 -25964813 -31780835 -27155079
37841 -27155079 -17989538 -10751363 -9279268 -15659153 -27115337 -33343667 -25151760 -6993924
37833 -6993924 6551552 8881848 8339867 13927145 22309403 24835996 20418109 13872809
37825 13872809 6709188 -2271623 -11100737 -17823667 -26440717 -40342465 -51663388 -47736907
37817 -47736907 -29216364 -12024540 -8149058 -12701824 -14224906 -10804407 -10195968 -17941653
37809 -17941653 -30206129 -36733983 -29238485 -9939559 7235246 8420795 -5346672
$$ packed form
37865a335344k3243138j4257065O401982K0139952J6485633K516482p195067n854887
37857f341452J190986M658005J637896k580770k168711J713155L189384N96143
37849A894636j152930J024047K182302l520173j2313914j4078781n816022M625756
37841b7155079R165541P238175J472095o379885j1456184o228330Q191907J8157836
37833f993924J3545476K330296n41981N587278Q382258K526593m417887o545300
37825A3872809p163621q980811q829114o722930q617050j3901748j1320923L926481
37817d7736907J8520543J7191824L875482m552766j523082L420499O08439p745685
37809a7941653j2264476o527854P495498J9298926J7174805J185549j3767467
$$ plain form
37802 -5346672 -19084460 -20695520 -11666465 -32102 9743379 16145129 17426742 15405110
37794 15405110 16747933 23297646 25725188 15247699 -1270761 -7546548 829608 10726091
37786 10726091 10077130 4123767 7034790 22106500 38028399 44436613 43811256 43846412
37778 43846412 42945333 31508239 8416143 -12173576 -16602316 -8996430 -4557946 -8498286
37770 -8498286 -11643913 -7026635 -13475 1559941 -2208053 -7913224 -15465422 -23915189
37762 -23915189 -28077025 -25881640 -22186526 -18887681 -9524362 7863488 21233617 19498043
37754 19498043 10081387 8024296 12340510 8268363 -8827396 -27115219 -36549238 -38866083
37746 -38866083 -36931464 -28396617 -14831120 -4703746 -1246466 2399930 10757008 18721196
$$ packed form
37802e346672j3737788j611060R029055J1634363R775481O401750J281613k021632
37794A5405110J342823O549713K427542j0477489j6518460o275787Q376156R896483
37786A0726091o48961n953363K911023J5071710J5921899O408214o25357L5156
37778D3846412r01079j1437094k3092096k0589719m428740P605886M438484l940340
37770h498286l145627M617278P013160J573416l767994n705171p552198q449767
37762b3915189m161836K195385L695114L298845R363319J7387850J3370129j735574
37754A9498043r416656k057091M316214m072147j7095759j8287823r434019k316845
37746c8866083J934619Q534847J3565497J0127374L457280L646396Q357078P964188
$$ plain form
37738 18721196 21627069 22284174 22555918 18450600 9852615 4549171 5181401 2375493
37730 2375493 -10730195 -26438746 -33546545 -31412368 -24511373 -13064817 613386 6544352
37722 6544352 465671 -5616975 566829 12656649 16536543 12156026 8337483 2945522
37714 2945522 -11907004 -28017847 -26007748 -4590929 14061864 13348369 318577 -10672368
37706 -10672368 -16313724 -18790989 -16605017 -10861072 -9375752 -14713874 -17149192 -8273343
37698 -8273343 6454285 16607361 20219956 20545280 17547128 11467244 7982145 10668013
37690 10668013 13665470 10129604 3066931 -116224 872274 1162075 255677 1811808
37682 1811808 6472755 10943677 11544662 4730990 -10645250 -26903462 -30408363 -17909116
$$ packed form
37738A8721196K905873O57105K71744m105318q597985n303444O32230k805908
37730B375493j3105688j5708551p107799K134177O900995J1446556J3678203N930966
37722F544352o078681o082646O183804J2089820L879894m380517l818543n391961
37714B945522j4852526j6110843K010099K1416819J8652793p13495j3029792j0990945
37706a0672368n641356k477265K185972N743945J485320n338122k435318Q875849
37698h273343J4727628J0153076L612595L25324k998152o079884l485099K685868
37690A0668013K997457l535866p062673l183155R88498K89801r06398J556131
37682A811808M660947M470922O00985o813672j5376240j6258212l504901J2499247
$$ plain form
37674 -17909116 -3625318 -2138854 -10405036 -15694557 -15136474 -15780171 -18842620 -16455740
37666 -16455740 -4578111 10663745 21348914 25764071 26988614 28299793 30119339 29086444
37658 29086444 22979955 18108122 24518103 39760459 47319971 38917439 27432679 26076538
37650 26076538 26051890 12011896 -8744620 -14004828 -628328 11422037 10624875 7598888
37642 7598888 11765335 15449603 11247729 6988120 10546991 14609006 10700913 6252079
37634 6252079 12061935 21360226 17518951 -1443405 -20103021 -26067801 -22203419 -18915981
37626 -18915981 -22730866 -32173029 -38885696 -34353889 -20160116 -8251504 -6751619 -10842433
37618 -10842433 -12842041 -14012945 -18305937 -21187584 -15297852 -3024400 6898267 11905005
$$ packed form
37674a7909116J4283798J486464q266182n289521N58083o43697l062449K386880
37666a6455740J1877629J5241856J0685169M415157J224543J311179J819546j032895
37658B9086444o106489m871833O409981J5242356P559512q402532j1484760j356141
37650B6076538k4648j4039994k0756516n260208J3376500J2050365p97162l025987
37642G598888M166447L684268m201874m259609L558871M062015l908093m448834
37634F252079N809856R298291l841275j8962356j8659616n964780L864382L287438
37626a8915981l814885r442163o712667M531807J4193773J1908612J499885m090814
37618a0842433j999608j170904m292992k881647N889732J2273452R922667N006738
$$ plain form
37610 11905005 14107548 9559020 -7963842 -32104250 -45516638 -40388659 -27928398
37603 -27928398 -22474002 -23395654 -18510412 -1198826 21075151 34162778 30873780 17809394
37595 17809394 8504403 8861996 11699833 8393934 2388205 5025910 18809951 31434364
37587 31434364 28960641 11330831 -7909854 -16129838 -13827817 -11208169 -13221586 -12533543
37579 -12533543 -1611500 13006564 18279433 14846182 16433298 26476997 30631554 20761667
37571 20761667 11410028 18369547 32242535 30653318 10164589 -11457213 -21279124 -22552613
37563 -22552613 -21447742 -18668616 -14869949 -10527732 -1044089 14276315 21515181 8213296
37555 8213296 -11759636 -11026451 11749487 28671120 24826257 18317523 25900383 33250046
$$ packed form
37610A1905005K202543m548528j7522862k4140408j3412388N127979J2460261
37603b7928398N454396r21652M885242J7311586K2273977J3087627l288998j3064386
37595A7809394r304991L57593K837837l305899o005729K637705J3784041J2624413
37587C1434364k473723j7629810j9240685q219984K302021K619648k013417O88043
37579a2533543J0922043J4618064N272869l433251J587116J0043699M154557r869887
37571B0761667r351639O959519J3872988j589217k0488729k1621802r821911j273489
37563b2552613J104871K779126L798667M342217R483643J5320404P238866j3301885
37555H213296j9972932P33185K2775938J6921633l844863o508734P582860P349663
$$ plain form
37547 33250046 19354438 -8097965 -24860932 -25400248 -23045022 -23007071 -18361340 -9525432
37539 -9525432 -6101437 -8629732 -6800681 2084735 8743942 8276554 5922111 3362186
37531 3362186 -5921029 -21941344 -31780438 -25969458 -12421920 -6077840 -10336529 -15675624
37523 -15675624 -13591552 -6377864 -3239203 -8765598 -16224437 -14705390 -3951253 2959128
37515 2959128 -4102195 -18617882 -26404834 -23415402 -16375691 -9590259 -919826 10628184
37507 10628184 22141607 30715171 32906185 23488252 3839986 -11851049 -10023109 4288170
37499 4288170 13890152 11899827 5954867 2680213 2757194 10256994 29249941 48878478
37491 48878478 50451253 35282452 27179677 38478836 51854633 48581233 37802669
$$ packed form
37547C3250046j3895608k7452403j6762967n39316K355226L7951M645731Q835908
37539i525432L423995k528295J829051Q885416O659207m67388k354443k559925
37531C362186r283215j6020315r839094N810980J3547538O344080m258689n339095
37523a5675624K084072P213688L138661n526395p458839J519047J0754137O910381
37515B959128p061323j4515687p786952K989432P039711O785432Q670433J1548010
37507A0628184J1513423Q573564K191014r417933j9648266j5691035J827940J4311279
37499D288170R601982j990325n944960l274654P6981P499800J8992947J9628537
37491D8878478J572775j5168801q102775J1299159J3375797l273400j0778564
$$ plain form
37484 37802669 40088443 54430323 61540946 52677388 35703060 16513221 -5864193
$$ packed form
37484C7802669K285774J4341880P110623q863558j6974328j9189839k2377414
$$ [...]
##END NTUPLES=NMR SPECTRUM
##END=
