##TITLE=31Pdec_LR-661-B1
 D2O, 124 sc
 15.3.2019
##JCAMPDX= 6.0         $$ Bruker NMR JCAMP-DX V2.0
##DATA TYPE= NMR SPECTRUM
##DATA CLASS= NTUPLES
##ORIGIN= UXNMR, Bruker Analytische Messtechnik GmbH
##OWNER= root
$$ XWIN-NMR		Version 3.5
$$ Fri Mar 15 16:09:44 2019 Russian Standard Time (UT+4h)  she@DPX200
##.OBSERVE FREQUENCY= 81.013821
##.OBSERVE NUCLEUS= ^31P
##.ACQUISITION MODE= SIMULTANEOUS
##.ACQUISITION SCHEME= undefined
##.AVERAGES= 124
##.DIGITISER RES= 17
##SPECTROMETER/DATA SYSTEM= spect
##.PULSE SEQUENCE= zgpg30
##.SOLVENT NAME= D2O
##.SHIFT REFERENCE= (INTERNAL, D2O, 0, 182.463)
##AUDIT TRAIL= $$ (NUMBER, WHEN, WHO, WHERE, WHAT)
$$ ##TITLE= Audit trail, XWIN-NMR		Version 3.5
$$ ##JCAMPDX= 5.01
$$ ##ORIGIN= Bruker BioSpin GmbH
$$ ##OWNER= she
$$ F:/spectra/data/she/nmr/P31/1/pdata/1/auditp.txt
$$ ##AUDIT TRAIL=  $$ (NUMBER, WHEN, WHO, WHERE, WHAT)
(   1,<2019-03-15 16:08:53.82 +0400>,<she>,<DPX200>,
      <continue with go, POWCHK disabled, PULCHK disabled
       configuration hash MD5:
       00 E9 B6 7A A2 85 ED C7 34 08 36 98 17 FE 4E 26
       data hash MD5: 32K
       AE 72 83 EE AC 03 5A 14 70 4C 5B 6F E0 EB 09 24>)
(   2,<2019-03-15 16:09:01.89 +0400>,<she>,<DPX200>,
      <Start of raw data processing
       efp BC_mod = 2 LB = 1 FT_mod = 6 PKNL = 1 PHC0 = -1854.223 PHC1 = 103.1989 SI = 64K 
       data hash MD5: 64K
       35 00 8A A9 CF 6F A2 3C 62 2E 1F 06 BB C8 A9 6B>)
(   3,<2019-03-15 16:09:05.98 +0400>,<she>,<DPX200>,
      <abs ABSG = 5 
       data hash MD5: 64K
       35 B3 D3 8F 4F BC A5 EA 2E A2 47 94 86 CC 9D 15>)
$$ ##END=
$$ 
$$ hash MD5
$$ 7E 12 03 7D 4B F8 E0 CC 1B 6B 05 54 23 4B 70 18
##$RELAX= 
##$RELAX= 
##$RELAX= 
##$RELAX= 
##$RELAX= 
##$RELAX= 
##$RELAX= 
##$RELAX= 
$$ Bruker specific parameters
$$ --------------------------
##$DU= <F:/spectra>
##$EXPNO= 1
##$NAME= <P31>
##$PROCNO= 1
##$TYPE= <nmr>
##$USER= <she>
##$AMP= (0..31)
100 100 100 100 100 100 100 100 100 100 100 100 100 100 100 100 100 100 
100 100 100 100 100 100 100 100 100 100 100 100 100 100 
##$AQSEQ= 0
##$AQ_mod= 1
##$AUNM= <au_zg>
##$AUTOPOS= <>
##$BF1= 81.014009
##$BF2= 200.13
##$BF3= 200.13
##$BF4= 200.13
##$BF5= 200.13
##$BF6= 200.13
##$BF7= 200.13
##$BF8= 200.13
##$BYTORDA= 1
##$CFDGTYP= 0
##$CFRGTYP= 5
##$CHEMSTR= <none>
##$CNST= (0..31)
1 1 145 1 1 1 1 1 1 1 1 1 1 1 1 1 1 1 1 1 1 1 1 1 1 1 1 1 1 1 1 1 
##$CPDPRG= <waltz16>
##$CPDPRG1= <>
##$CPDPRG2= <waltz16>
##$CPDPRG3= <>
##$CPDPRG4= <mlev>
##$CPDPRG5= <mlev>
##$CPDPRG6= <mlev>
##$CPDPRG7= <mlev>
##$CPDPRG8= <mlev>
##$CPDPRGB= <>
##$CPDPRGT= <>
##$D= (0..31)
0 1 0 0 0 0 0 0 0 0 0 0.03 2e-05 3e-06 0 0 0 0 0 0 0 0 0 0 0 0 0 0 0 0 
0 0 
##$DATE= 1552651548
##$DBL= (0..7)
120 120 120 11 120 120 24 19 
##$DBP= (0..7)
150 150 150 150 150 150 150 150 
##$DBP07= 0
##$DBPNAM0= <>
##$DBPNAM1= <>
##$DBPNAM2= <>
##$DBPNAM3= <>
##$DBPNAM4= <>
##$DBPNAM5= <>
##$DBPNAM6= <>
##$DBPNAM7= <>
##$DBPOAL= (0..7)
0.5 0.5 0.5 0.5 0.5 0.5 0.5 0.5 
##$DBPOFFS= (0..7)
0 0 0 0 0 0 0 0 
##$DE= 6
$$ [...]
##$SUBNAM3= <"">
##$SUBNAM4= <"">
##$SUBNAM5= <"">
##$SUBNAM6= <"">
##$SUBNAM7= <"">
##$SUBNAM8= <"">
##$SUBNAM9= <"">
##$SW= 369.568048894756
##$SWIBOX= (0..15)
0 1 3 0 0 0 0 0 0 0 0 0 0 0 0 0 
##$SW_h= 29940.119760479
##$TD= 32768
##$TD0= 1
##$TE= 0
##$TE2= 300
##$TE3= 300
##$TEG= 300
##$TL= (0..7)
0 120 53 12 22 120 120 120 
##$TP= (0..7)
150 150 150 150 150 150 150 150 
##$TP07= 0
##$TPNAME0= <>
##$TPNAME1= <>
##$TPNAME2= <>
##$TPNAME3= <>
##$TPNAME4= <>
##$TPNAME5= <>
##$TPNAME6= <>
##$TPNAME7= <>
##$TPOAL= (0..7)
0.5 0.5 0.5 0.5 0.5 0.5 0.5 0.5 
##$TPOFFS= (0..7)
0 0 0 0 0 0 0 0 
##$TUNHIN= 0
##$TUNHOUT= 0
##$TUNXOUT= 0
##$USERA1= <user>
##$USERA2= <user>
##$USERA3= <user>
##$USERA4= <user>
##$USERA5= <user>
##$V9= 5
##$VALIST= <valist>
##$VCLIST= <CCCCCCCCCCCCCCC>
##$VD= 0
##$VDLIST= <DDDDDDDDDDDDDDD>
##$VPLIST= <PPPPPPPPPPPPPPP>
##$VTLIST= <TTTTTTTTTTTTTTT>
##$WBST= 1024
##$WBSW= 4
##$XGAIN= (0..3)
0 0 0 0 
##$XL= 0
##$YL= 0
##$YMAX_a= 18567
##$YMIN_a= -46905
##$ZGOPTNS= <>
##$ZL1= 120
##$ZL2= 120
##$ZL3= 120
##$ZL4= 120
##$ABSF1= 182.463
##$ABSF2= -187.1042
##$ABSG= 5
##$ABSL= 3
##$ALPHA= 0
##$AQORDER= 0
##$ASSFAC= 0
##$ASSFACI= 0
##$ASSFACX= 0
##$ASSWID= 0
##$AUNMP= <proc_1d>
##$AZFE= 0.1
##$AZFW= 0.5
##$BCFW= 0
##$BC_mod= 2
##$BYTORDP= 0
##$COROFFS= 0
##$CY= -3
##$DATMOD= 1
##$DC= 0
##$DFILT= <>
##$DTYPP= 0
##$F1P= 0
##$F2P= 0
##$FCOR= 1
##$FTSIZE= 65536
##$FT_mod= 6
##$GAMMA= 0
##$GB= 0
##$INTBC= 1
##$INTSCL= 5.30512e-09
##$ISEN= 30
##$LB= 1
##$LEV0= 0
##$LPBIN= 0
##$MAXI= 10000
##$MC2= 0
##$MEAN= 0
##$ME_mod= 0
##$MI= 50
##$NCOEF= 0
##$NC_proc= -8
##$NLEV= 6
##$NOISF1= 182.463
##$NOISF2= 159.3651
##$NSP= 0
##$NTH_PI= 0
##$NZP= 0
##$OFFSET= 182.463
##$PC= 4
##$PHC0= -1854.223
##$PHC1= 103.1989
##$PH_mod= 1
##$PKNL= yes
##$PPARMOD= 0
##$PSCAL= 0
##$PSIGN= 0
##$REVERSE= no
##$SF= 81.0140089999434
##$SI= 65536
##$SIGF1= 159.3651
##$SIGF2= -187.1042
##$SINO= 113.3802
##$SIOLD= 16384
##$SREGLST= <1H.CDCl3>
##$SSB= 0
##$STSI= 65536
##$STSR= 0
##$SW_p= 29940.119760479
##$SYMM= 0
##$S_DEV= 0
##$TDeff= 32768
##$TDoff= 0
##$TI= <>
##$TILT= no
##$TM1= 0
##$TM2= 0
##$TOPLEV= 0
##$USERP1= <user>
##$USERP2= <user>
##$USERP3= <user>
##$USERP4= <user>
##$USERP5= <user>
##$WDW= 1
##$XDIM= 65536
##$YMAX_p= 327877631
##$YMIN_p= -111047984
$$ End of Bruker specific parameters
$$ ---------------------------------
##NTUPLES= NMR SPECTRUM
##VAR_NAME=  FREQUENCY,     SPECTRUM/REAL,   SPECTRUM/IMAG
##SYMBOL=    X,             R,               I
##VAR_TYPE=  INDEPENDENT,   DEPENDENT,       DEPENDENT
##VAR_FORM=  AFFN,          ASDF,            ASDF
##VAR_DIM=   65536,         65536,           65536
##UNITS=     HZ,            ARBITRARY UNITS, ARBITRARY UNITS
##FACTOR=    0.456856943014862, 1,           1
##FIRST=     14782.0589164792, 0,            0
##LAST=      -15158.0608439998, 0,           0
##MIN=       -15158.0608439998, -111047984,  0
##MAX=       14782.0589164792, 327877631,    0
$$ Real data points
##PAGE= N=1
##DATA TABLE= (X++(R..R)), XYDATA
$$ [...]
45035B1555744J846449r456021j0996988l154889K731929K178605J209653L154100
45027I068582L271235j460917o640915p781374o227629m749756l114435r21175
45019a8556384k5480j247249j906713J213799Q102760J4960911J6236617R140672
45011B7918933j775303p491795m746450L86890K167074K611610M197587K321122
45003B5589668o252827j3364098r203361J401843M699038j513271o068735l588023
44995h299766j750056n781798q675610l751578L453512M392804J135914J937347
44987a7339231P989252J2917205J2812607R396415M331629k887966j0383156j2405858
44979D430897n746126L956453N849912m041919j5917469j5532001j263911J2887999
$$ plain form
45035 21555744 23402193 13946172 2949184 -205705 2526224 4704829 5914482 9068582
45027 9068582 12339817 10878900 4237985 -3543389 -9771018 -14520774 -17635209 -18556384
45019 -18556384 -18581864 -19829113 -21735826 -20522027 -12419267 2541644 18778261 27918933
45011 27918933 26143630 18651835 13905385 14292275 16459349 19070959 23268546 25589668
45003 25589668 19336841 5972743 -3230618 -1828775 2870263 1356992 -4711743 -8299766
44995 -8299766 -10049822 -15831620 -24507230 -28258808 -24805296 -20412492 -19276578 -17339231
44987 -17339231 -9349979 3567226 16379833 25776248 30107877 27219911 16836755 4430897
44979 4430897 -1315229 2641224 8491136 4449217 -11468252 -27000253 -28264164 -15376165
44971a5376165J3865171L954626n226130p191689k930171N269987J3593394J4648977
44963B0608000N633332m282564m839832l7395r19698n886609l449838N125913
44955A1951309L846831j1326978k0747653p605284J6203440K4653273J0750710
44948B7725648q166541j4411835p135424L384543Q244895M983118l182567j0797991
44940F43846j5032372j6464772j4565798p168937L082426Q182931N628922L494115
44932c2199639P945462J2104092O871078k139568j145577R332734J2395282o03562
44924A2560302j5568597j4576356o46923Q105958M758154K83363L030674N955215
44916C901790J827075j411808N624106J2726573J799056k1274031k7634360n672421
$$ plain form
44971 -15376165 -1510994 2443632 -2782498 -9974187 -12904358 -7634371 5959023 20608000
44963 20608000 26241332 21958768 17118936 17081541 16161843 10275234 6825396 11951309
44955 11951309 15798140 4471162 -16276491 -23881775 -7678335 16974938 27725648
44948 27725648 19559107 5147272 -1988152 1396391 9641286 14624404 11441837 643846
44940 643846 -14388526 -30853298 -45419096 -52588033 -49505607 -41322676 -35693754 -32199639
44932 -32199639 -24254177 -12150085 -5279007 -7418575 -8564152 768582 13163864 12560302
44924 12560302 -3008295 -17584651 -18231574 -10125616 -5367462 -5084099 -2053425 3901790
44916 3901790 5728865 4317057 9941163 22667736 24466792 3192761 -24441599 -30114020
44908c0114020J9262936J9215289J420041p184397r66148K691449l147034o099027
44900d920911j136878j242355j2600191j9690522p956289J3495380K4942768K1023021
44892A1914023J0840977J972441l994764n891632k994434K316391P053173Q591968
44884B9808143K135846j3508743k6088844j9253439L450070J8553007J3903491
44877H999531M295560N885146J1813170Q184547q84843l272417k239911q333987
44869B4446796j5611460r067359O930164J0601580m293061j7812188j2593218
44862a7398746L309632J1290908P662101L669561O488428J0018094M645557q822730
44854B0862805j8436239j5468439n892593j203230o38605N523430J4820409J1937187
$$ plain form
44908 -30114020 -10851084 8364205 9784246 2599849 1633701 4325150 1178116 -4920911
44900 -4920911 -6057789 -7300144 -19900335 -39590857 -47547146 -34051766 -9108998 11914023
44892 11914023 22755000 24727441 20732677 14841045 11846611 14163002 21216175 29808143
44884 29808143 31943989 18435246 -7653598 -26907037 -23456967 -4903960 8999531
44877 8999531 13295091 19180237 30993407 39177954 38293111 35020694 32780783 24446796
44869 24446796 8835336 -232023 6698141 17299721 13006660 -4805528 -17398746
44862 -17398746 -14089114 -2798206 4863895 8533456 15021884 25039978 29685535 20862805
44854 20862805 2426566 -13041873 -18934466 -20137696 -20776301 -15252871 -432462 11504725
44846A1504725m588191j4110737m804442O033990O19052q281230O04713J8005515
44838D983395J6927977k825155j4428690p193218Q96436k472667o475134k067669
44830a2654725K141585m97344k375557M84703L5780m164794M06011J3494490J4826300
44821A1696449k661039j6011808p173016P502143M851163p861538r289705j620092
44813b0567443k660173j0565889o828070R220057J7454381R813695Q47568J318302
44805a967572L790644J056740p88738L671411P993002N617677K42326l394185
44797A6221305p843542j4331545j5844134p211964N395364J2418333J2286033
44790A089850Q915196M229538k60588n429O815089J3198743J0117102j525848
$$ plain form
44846 11504725 6916534 -7194203 -11998645 -5964655 -5345603 -13626833 -13022120 4983395
44838 4983395 21911372 19086217 4657527 -2535691 -1639255 -4111922 -10587056 -12654725
44830 -12654725 -10513140 -11010484 -13386041 -12901338 -12865558 -17030352 -16624341 -3129851 11696449
44821 11696449 9035410 -6976398 -14149414 -6647271 -1796108 -9657646 -18947351 -20567443
44813 -20567443 -23227616 -33793505 -40621575 -31401518 -13947137 -4133442 -3285874 -1967572
44805 -1967572 1823072 2879812 2091074 5762485 13755487 19373164 19615490 16221305
44797 16221305 8377763 -5953782 -21797916 -29009880 -23614516 -11196183 1089850
44790 1089850 10005046 14234584 13973996 13968567 20783656 33982399 44099501 42573653
44782D2573653j1394750j2522126r068854r299048j3485665j2634705o06768J5262366
44774a1175897K0276060R655399n279679j1072199p543671m171840m708431l060565
44766a7080823N164938J3870670J3061228J314615j1997174j6734370j1790500
44759b4191416l661224K777044Q092277J2489930J2128183N833279M35871K027493
44751A5931437N473524J789824o495192q514203k866716N47332k011393k717572
44743A137041J755213L029579l516263r578024q164779l930865p81621O552134
44735a3497585J7935486J9957531O550984o718882n085671K353454L93358n161002
44727A6727673p10844O413259r36148j7125466k0422728q826505n45979K80378
$$ plain form
44782 42573653 31178903 18656777 9587923 288875 -13196790 -25831495 -26438263 -11175897
44774 -11175897 9100163 18755562 13475883 2403684 -5139987 -9311827 -14020258 -17080823
44766 -17080823 -11915885 1954785 15016013 16330628 4333454 -12400916 -24191416
44759 -24191416 -27852640 -25075596 -16983319 -4493389 7634794 13468073 13903944 15931437
44751 15931437 21404961 23194785 16699593 8185390 5318674 5866006 3854613 1137041
44743 1137041 2892254 5921833 2405570 -7172454 -15337233 -19268098 -20049719 -13497585
44735 -13497585 4437901 24395432 30946416 24227534 19141863 21495317 21888675 16727673
44727 16727673 16016829 22430088 21493940 4368474 -16054254 -24880759 -25426738 -25146360
44719b5146360P678186K0698633J8348696l434731j9971621j5531124m661789
44712b2020110j583101K940522J5405401J8307246k61159j9367721j5208739J222553
44704b0565108N449966J017327P095179J8134253J2191915p112683j3536695k346652
44696C27502L618667m622406r012266m08252N335480n97383k774441P645457J3375567
44687A2887925J985855r272340k760568P834379J544395j2398526j0438580M939409
44679e678051J1266678M712296K106120P578903P203141j976029o290832l117938
44671A5804288o369811j7033974j5926722K453491J5322110P175261m080072K778186
44663A22757J6801850J4420503j284568q598077m357869m210004j0347405q095613
$$ plain form
44719 -25146360 -17468174 3230459 21579155 18144424 -1827197 -17358321 -22020110
44712 -22020110 -23603211 -20662689 -5257288 13049958 12788799 -6578922 -21787661 -20565108
44704 -20565108 -15115142 -14097815 -7002636 11131617 23323532 16210849 2674154 327502
44696 327502 3946169 -676237 -9688503 -10096755 -4761275 -5358658 -8133099 -487642 12887925
44687 12887925 14873780 5601440 2840872 10675251 12219646 -178880 -10617460 -5678051
44679 -5678051 5588627 10300923 12407043 19985946 27189087 25213058 18922226 15804288
44671 15804288 9434477 -7599497 -23526219 -21072728 -5750618 1424643 -2655429 122757
44663 122757 16924607 31345110 30060542 21462465 17104596 12894592 2547187 -5548426
44655e548426M467607J1244496P354261P133817J4518376J1712788q723146k4670426
44647A7489347j6707831M79424K540497m380211L421680K2268851K1218734r337165
44639C6993326l7678639l2154520k442931J6688145J0121521n869319j0292985
44632b4635402j58129J3165527J8464916J2538963O15445p779215o878885m66054
44624D867166K302428k913655j1512229j5433290j0217944K914126J8415788K8463967
44616A6886357K6685818J3242457l914304j5211678j7632991j5214711j1246213
44609f405265l581472R013108J8841789J4696977k723367j6790823j1819873Q073209
44601I304283K1937928J4214284q820739k5450141k0183955Q80164J6188161J1203072
$$ plain form
44655 -5548426 -1080819 10163677 17517938 24651755 39170131 50882919 42159773 17489347
44647 17489347 781516 1260940 3801437 -578774 2842906 25111757 46330491 36993326
44639 36993326 -685313 -32839833 -35282764 -18594619 -8473098 -14342417 -24635402
44632 -24635402 -24793531 -11628004 6836912 19375875 19991320 12212105 5333220 4867166
44624 4867166 7169594 4255939 -7256290 -22689580 -32907524 -29993398 -11577610 16886357
44616 16886357 43572175 56814632 52900328 37688650 20055659 4840948 -6405265
44609 -6405265 -9986737 -973629 17868160 32565137 29841770 13050947 1231074 9304283
44601 9304283 31242211 45456495 36635756 11185615 -8998340 -8118176 8069985 19273057
44593A9273057o285863j6442919j1462778k435770r59326l506581q67483M952959
44585a7734704M428544k618367n934808q24070N756168P427582O796586P699119
44577D996050P966015N253678K451797J277416k386413r540025j1267206p27536
44569a976224J2542882J2103759k441707j3940739j1654160n059657p274608j4731596
44561c2432050j4031191l205529O423208Q260088P725008R289052Q477855K798795
44553f694764k24878M822776R782092N197088k372415P54000J2534293J6625964
44545D0424156O778620n667733j1375798j4225493j7256352j3408308M983J1435783
44537c290142J1509689P405458Q215801P768421k378877j3017006r020893N558916
$$ plain form
44593 19273057 12987194 -3455725 -14918503 -17354273 -18313599 -21820180 -22687663 -17734704
44585 -17734704 -13306160 -15924527 -21859335 -22683405 -16927237 -9499655 -2703069 4996050
44577 4996050 12962065 18215743 20667540 21944956 19558543 10018518 -1248688 -1976224
44569 -1976224 10566658 22670417 20228710 6287971 -5366189 -10425846 -17700454 -32432050
44561 -32432050 -46463241 -49668770 -43245562 -34985474 -27260466 -17971414 -9493559 -6694764
44553 -6694764 -6919642 -2096866 7685226 12882314 10509899 11263899 23798192 40424156
44545 40424156 47202776 41535043 30159245 15933752 -1322600 -14730908 -14725925 -3290142
44537 -3290142 8219547 15625005 23840806 31609227 29230350 16213344 7192451 12751367
44529A2751367J3471696J1158091R465321R621119R33626j4982955k0226746q592196
44521A3599323K293326k263349j2001274r717664K246977Q493140M316224j656182
44513E310521l182481k046568r58065r47134l671502q437842r558208l529829
44505b7021108M199984O057115K796782J065938L488027O813024P397511M026743
44497H824016j925726n994390m325448k56356j193653o313925n657062M037211
44489a2805333J2078958R432371K282982Q21795L022290R88920l394042k322815
44481A0105126K554246K068025m646482q748049o346712l271027l872796n211964
44473a7369633m506013l463956k713066L87337N936100J0130692J1481782J1988079
$$ plain form
44529 12751367 26223063 37381154 46846475 56467594 57401220 42418265 22191519 13599323
44521 13599323 15892649 13629300 1628026 -8089638 -5842661 2650479 6966703 5310521
44513 5310521 2128040 81472 -876593 -1823727 -5495229 -13933071 -23491279 -27021108
44505 -27021108 -22821124 -16764009 -13967227 -12901289 -9413262 -2600238 4797273 8824016
44497 8824016 6898290 903900 -3421548 -3677904 -4871557 -11185482 -16842544 -12805333
44489 -12805333 -726375 8705996 10988978 11810773 14833063 15821983 12427941 10105126
44481 10105126 12659372 14727397 10080915 1332866 -5013846 -8284873 -12157669 -17369633
44473 -17369633 -21875646 -25339602 -28052668 -27665331 -21729231 -11598539 -116757 11871322
44465A1871322J0859081M221784o501913j2493701p394673M961976J4863823J5234552
44457C5622251N510583q027622j5202136j0723394j141461K323483j550895l289327
44449C521482J918541O852432N024280K400963P401951J4263167Q278246j1518647
44441C8142415k6090798j9185968R95744J2178750O575254k133925j330682L512022
44433A2662812J559121l985137j750704P791018J2456509P654295J461835j496678
44425C6353071o655455j4744926j5053070l171860O763684O95498j2798754j3086804
44417b1698616L381895J8471936J6644390K251084r241500q480240J754335J1432970
44409A4516254J1915990L427465n444764p737750n495080m695630o801838r316576
$$ plain form
44465 11871322 22730403 26952187 20450274 7956573 561900 5523876 20387699 35622251
44457 35622251 41132834 33105212 17903076 7179682 6038221 8361704 6810809 3521482
44449 3521482 5440023 12292455 17316735 19717698 27119649 41382816 49661062 38142415
44441 38142415 12051617 -7134351 -6138607 6040143 12615397 10481472 9150790 12662812
44433 12662812 14221933 10236796 8486092 16277110 28733619 36387914 37849749 36353071
44425 36353071 29697616 14952690 -100380 -3272240 3491444 4186942 -8611812 -21698616
44417 -21698616 -18316721 155215 16799605 19050689 9809189 1328949 3083284 14516254
44409 14516254 26432244 29859709 24414945 16677195 11182115 6486485 -315353 -9631929
44401i631929j0380138p953695R42930J4241587K2197847J7292866L961367o840756
44393B3830079r650805o776212k846422j390496k381857o09577O723395R765125
44385A6663230m070032k5834789k7887050j975263K2918542J8192434l909744
44378e902672j0026652N020236J5470463O918607o233711q204756k210803K956459
44370b212829O101147N866890k309135j3635183j4100597r36238J0856143R180645
44362a189157p63973q119105r204482m033568N963333J1905156L958618j0751032
44354a2234210j2223331M020742J8417473J4866877J171145o747278n999556k484878
44346a213016N26582R8149o777851j3156932o527143Q913115J2171362j992498
$$ plain form
44401 -9631929 -20012067 -27965762 -27022832 -12781245 9416602 26709468 30670835 23830079
44393 23830079 14179274 7403062 4556640 3166144 784287 174710 6898105 16663230
44385 16663230 12593198 -13241591 -41128641 -43103904 -20185362 -1992928 -5902672
44378 -5902672 -15929324 -10909088 4561375 11479982 5246271 -2958485 -5169288 -2212829
44370 -2212829 3888318 9755208 7446073 -6189110 -20289707 -21225945 -10369802 -1189157
44362 -1189157 -1953130 -10072235 -19276717 -23310285 -17346952 -5441796 -1483178 -12234210
44354 -12234210 -24457541 -20436799 -2019326 12847551 14018696 7271418 1271862 -1213016
44346 -1213016 -686434 -588285 -7366136 -20523068 -27050211 -18137096 -5965734 -7958232
44338g958232j0364569L832982K2649174J9831052k96443j2840087r547568k754766
44330B551543R3731K904647N678527L415889j086588o05632K068798j280477p806709
44321E933729p300345j95476L345552P64475p58144J847314M471983M630744J840717
44312A4580549o509779j7727569j8886325l710902J2797009J3243948L988265
44305b224804L051814R005665N587556o330180p870714N092488J4109928Q661943
44297B9083696N76305J15036R5005o191961j1677053j1041596j0643164j2060875
44289b1744607n068931J0537589J6154303L393457p132809L763525K0611649J4594842
44281C5109018j2174534k9232019k0859765k684958O182492O409141P819398J1871650
$$ plain form
44338 -7958232 -18322801 -14489819 8159355 27990407 27693964 14853877 5306309 2551543
44330 2551543 2645274 5549921 11228448 14644337 13557749 12952117 15020915 13740438 5933729
44321 5933729 -1366616 -1562092 1783460 2547935 1789791 3637105 8109088 12739832 14580549
44312 14580549 8070770 -9656799 -28543124 -32254026 -19457017 -6213069 -2224804
44305 -2224804 827010 9832675 15420231 9090051 1219337 6311825 20421753 29083696
44297 29083696 29660001 29775037 29870042 23678081 12001028 959432 -9683732 -21744607
44289 -21744607 -26813538 -16275949 -121646 3271811 -3860998 -97473 20514176 35109018
44281 35109018 22934484 -6297535 -27157300 -29842258 -23659766 -17250625 -9431227 2440423
44273B440423J3472178J0656822N550732R27758j155370j465761l997120r307329
44265A7122333j0467995l246250L612408o52960j0255448r422730K232924P368463
44257c709255j368923q566778j237021R206416O098036l836510j993261Q841405
44249C434109P457369q778697j5599094K84902J8218843J4710959j229951m997811
44241A3500629N004320J0453443O820438O712290J1103462N294595j1249196j7497522
44233C0142459m005378R665326M755145r291869j3204781o451489j67026L423046
44225A4865433O343729K976823q413233j4458724o132443K924303j766180q374318
44217a2034610J727744J8615569J7161891j083020j0528307l733479Q78966m842062
$$ plain form
44273 2440423 15912601 26569423 32120155 33047913 31892543 30426782 26429662 17122333
44265 17122333 6654338 3408088 7020496 6367536 -3887912 -13310642 -11077718 -3709255
44257 -3709255 -5078178 -13644956 -14881977 -5675561 422475 -3414035 -5407296 3434109
44249 3434109 10891478 2112781 -13486313 -13201411 5017432 19728391 18498440 13500629
44241 13500629 18504949 28958392 35778830 42491120 53594582 58889177 47639981 30142459
44233 30142459 26137081 35802407 40557552 31265683 18060902 11609413 11442387 14865433
44225 14865433 21209162 24185985 15772752 1314028 -4818415 -1894112 -3660292 -12034610
44217 -12034610 -10306866 8308703 25470594 24387574 13859267 10125788 11004754 6162692
44209F162692p171840j029700m72249q677743p843193P286472J4681118J158580
44201D094137j3237564p534796P024704R231771K823362L426738P022222o84285
44193A2166289j4088451j4395164j212491P257632L534522j351120P80570M941404
44185b366809N065401J059217o298046j4150829j3288240Q37851J5045025J1521278
44177b575152o682003j7936954j0356452N836417J5430599J4739988Q577133J993471
44169I027047j623139k189268m098065r520503j2452503p069050J275928K915629
44161b3733924j294714k600979N87207J589888j735476m063334k264999J555539
44153c1960792N764606R121886P595934Q00698k393742L915928R532846J533417
$$ plain form
44209 6162692 -1009148 -2038848 -2511097 -11188840 -19032033 -11745561 2935557 4094137
44201 4094137 -9143427 -16678223 -9653519 -421748 2401614 5828352 12850574 12166289
44193 12166289 -1922162 -16317326 -17529817 -10272185 -6737663 -8088783 -7308213 -2366809
44185 -2366809 2698592 3757809 -2540237 -16691066 -29979306 -29141455 -14096430 -2575152
44177 -2575152 -9257155 -27194109 -37550561 -31714144 -16283545 -1543557 7033576 9027047
44169 9027047 7403908 5214640 1116575 -8403928 -20856431 -27925481 -26649553 -23733924
44161 -23733924 -25028638 -27629617 -27042410 -25452522 -27187998 -31251332 -33516331 -31960792
44153 -31960792 -26196186 -17074300 -9478366 -8677668 -11071410 -7155482 2377364 3910781
44145C910781j2945900j4398516m39705J0860829R101823L819284L330631Q03571
44137D042798q389583j2670350k249003J1140517Q960706o358082j4159857m195000
44129b3877854J1072731J4697421N462818m735598p382509m953063l364540k731416
44121a5812010N02703N033715N200932R90190m63938K625143J653016p358447
44113g628696j2844629l778781J0421528J1355313q65760q598229m329568R90954
44105a5277868J12916J007902Q636788J2387356L426806q581081r262256o19010
44097h168447M605922K874326J448383L823941M920464L0259r029653j6002178
44089a5496983j4328630k579374J0828670J3940381O204122j90423J367070K106531
$$ plain form
44145 3910781 -9035119 -23433635 -23873340 -13012511 -3910688 -91404 3239227 4042798
44137 4042798 -4346785 -17017135 -19266138 -8125621 835085 -5522997 -19682854 -23877854
44129 -23877854 -12805123 1892298 7355116 2619518 -4762991 -9716054 -13080594 -15812010
44121 -15812010 -15309307 -10275592 -5074660 -4084470 -4548408 -1923265 -270249 -7628696
44113 -7628696 -20473325 -24252106 -13830578 -2475265 -3341025 -11939254 -16268822 -15277868
44105 -15277868 -15164952 -14157050 -5520262 6867094 10293900 1712819 -7549437 -8168447
44097 -8168447 -3562525 -688199 760184 4584125 9504589 9534848 505195 -15496983
44089 -15496983 -29825613 -32404987 -21576317 -7635936 -1431814 -1622237 -255167 1851364
44081A851364n395308j1208083k271165J4087604J6957478J027328j5800514j6517866
44073a7269162m487403N793273P616025N296703M412782N156250L862879j635266
44065H746081p896010q347718k071381L131859J319198j714184K869105J1078598
44057G115548J0185284n95858o330172J407791J0532732O228823o667725j1747351
44049A0129072n737660o16504k613488m120857P47838O434201P504558P408298
44041A9135458P868603J785202j2098309j8626904n810972J2736907J3180332
44034A8170317m283322j6006932r658531K404241Q346572J2995948J8817501J2549059
44026D3334853j1863815l3427606k8178332l159250J3966634J2504834N691737
$$ plain form
44081 1851364 -3543944 -14752027 -17023192 -2935588 14021890 15049218 -751296 -17269162
44073 -17269162 -21756565 -15963292 -8347267 -3050564 1362218 6518468 10381347 8746081
44065 8746081 850071 -7497647 -9569028 -6437169 -5117971 -6832155 -3963050 7115548
44057 7115548 17300832 16704974 10374802 11782593 22315325 28544148 21876423 10129072
44049 10129072 4391412 3774908 1161420 -2959437 -2211599 4222602 11727160 19135458
44041 19135458 27004061 28789263 16690954 -1935950 -7746922 4989985 18170317
44034 18170317 13886995 -2119937 -11778468 -9374227 -1027655 11968293 30785794 43334853
44026 43334853 31471038 -1956568 -30134900 -33294150 -19327516 -6822682 -1130945
44019a130945M292203M326215J548820n82636l65425j92051K191960J0240315
44011B0328456J6100240Q076843p882095j2186549r54632P324951J168687o775624
44003B5200277k726622N264973K258156q252036j0632968j839438N404180J791794
43995A6468316p754163j2295933o750138L910025Q771344K104756p846460o847452
43987a0239705O518985J7575256J4366825J810902o984111n833694J924549Q239671
43979B7378678M859119q236186j7007420p299017J2817962J8652625J820217j7734508
43971A5251470k0074198r473810q26O373029J2605327J2271301N83560j0738498
43963F797355p992808K644027N161886r76018l216493J668398N570278O043984
$$ plain form
44019 -1130945 3161258 7487473 9036293 8453657 8088232 7896181 10088141 20328456
44011 20328456 36428696 44505539 36623444 24436895 23482263 30807214 31975901 25200277
44003 25200277 22473655 27738628 29996784 21744748 11111780 9272342 14676522 16468316
43995 16468316 8714153 -3581780 -10331918 -6421893 2349451 4454207 -3392253 -10239705
43987 -10239705 -3720720 13854536 28221361 30032263 23048152 17214458 19139007 27378678
43979 27378678 32237797 24001611 6994191 -304826 12513136 31165761 32985978 15251470
43971 15251470 -4822728 -14296538 -14297364 -7924335 4680992 16952293 17535853 6797355
43963 6797355 -1195453 1448574 6610460 5634442 2417949 4086347 9656625 15700609
43955A5700609P695238Q553803K186619p332650r046545l736024k845170q222970
43947B952910r476532l711031j123264n948478p324921K985507J5940070J7354268
43939A1648529O675772m384160o995617k696434J724960K621670K449653M233660
43931A5278033M482086k323092j0878329p231131R583008J9836044R132655q206361
43923B9672913q263366P235331J4329074K817595j1265560j1257628j34166R432728
43915C2566921J0559799K881521r533420j6662782j0190372L886154J0581427
43908B4089248N587604j123399j935065K60636J338980Q80261k809755r922691
43900A6365819j1987704k024380R245111M872269j0379798j3813261L31136J1540966
$$ plain form
43955 15700609 23395847 31949650 34136269 26803619 17757074 14021050 11175880 2952910
43947 2952910 -6523622 -10234653 -11357917 -17306395 -24631316 -21645809 -5705739 11648529
43939 11648529 18324301 13940141 6944524 4248090 5973050 8594720 11044373 15278033
43931 15278033 19760119 17437027 6558698 -672433 8910575 28746619 37879274 29672913
43923 29672913 21409547 28644878 42973952 45791547 34525987 23268359 23134193 32566921
43915 32566921 43126720 46008241 36474821 19812039 9621667 13507821 24089248
43908 24089248 29676852 28553453 26618388 26879024 28218004 29098265 26288510 16365819
43900 16365819 4378115 2353735 11598846 16471115 6091317 -7721944 -7390808 4150158
43892D150158N561576n291167n143997J556798K456960k696059p833457j2048091
43884a9287279j2798244k055321J7474090K6314122J3067530p011565j2794099
43877B909234m894990K197086L869910M824597M571526M32779k340522J105346
43869A2674966L767474j855272q566830n666187K177840L019448k264266m206961
43861i19788k826066m655907p151186l306867K731663K244842j10135O221390
43853g772054J5387675J1179573m557964j1129753q74296Q451970J575585j1142050
43845A118686j0305800M362928J5039892R529353n867934j5955694j3217846l522506
43837a8818921L450807O760227J2112955J7808859J3372702k484706j4193129
$$ plain form
43892 4150158 9711734 4420567 -723430 833368 3290328 594269 -7239188 -19287279
43884 -19287279 -32085523 -34140844 -16666754 9647368 22714898 15703333 2909234
43877 2909234 -1985756 211330 4081240 8905837 13477363 13910142 11569620 12674966
43869 12674966 16442440 14587168 6020338 354151 2531991 5551439 3287173 -919788
43861 -919788 -3745854 -8401761 -15552947 -18859814 -16128151 -13883309 -13993444 -7772054
43853 -7772054 7615621 18795194 14237230 3107477 2233181 10685151 12260736 1118686
43845 1118686 -9187114 -4824186 10215706 19745059 13877125 -2078569 -15296415 -18818921
43837 -18818921 -15368114 -8607887 3505068 21313927 34686629 32201923 18008794
43830A8008794r843374Q98006K201027m223970o288023l497876l025394p37684
43822f508494J1921066K5474122K0636801q237j2167832n939874J547960l017569
43814C1937943q983812m597754J021685m484449j3236557j0066164J797546O638255
43806B6693J705811q39438M277412P251448o1982r937846p595851R153569K4098468
43797B8078284J9445925j876264j6905528j0698242L296392J633596j5524485
43790G449678k4762215j2957720O496502J5361173J2882198R120409Q804281J0124476
43782C2518782J0004356M521270o894772j4758213q955048K937504K500897j0561262
43774A1313514j5550535m275545M210280m714573j6241080j1352125J537628K786069
$$ plain form
43830 18008794 8165420 9063426 11264453 7040483 752460 -2745416 -5770810 -6508494
43822 -6508494 5412572 30886694 51523495 51515258 39347426 33407552 34955512 31937943
43814 31937943 22954131 18356377 19378062 14893613 1657056 -8409108 -6611562 26693
43806 26693 1732504 893066 5170478 12421926 12359944 2422098 -5173753 3979816 28078284
43797 28078284 47524209 45647945 28742417 18044175 21340567 22974163 7449678
43790 7449678 -17312537 -30270257 -23773755 -8412582 4469616 13590025 22394306 32518782
43782 32518782 42523138 47044408 40149636 25391423 16436375 19373879 21874776 11313514
43774 11313514 -4237021 -8512566 -4302286 -9016859 -25257939 -36610064 -35072436 -32286367
43766c2286367n147385n445885K382868N375327L946723R726027J9789075J8825116
43758A7165499O862540m0834J500752k014286j2173731j1750873L946375J3361426
43750A6856868J117045j5963516j3402676N018928J5476156R425094J466535M453298
43742B4447732J2863377J3532671K749528j1347850j8993396j8577746j5869633
43735a1195317j3336697m696115J3410910K8305215K2255164k237674k1224112
43728A1281374j8150537k034726Q972471R565207M424506m152303j3688461j5918377
43720a9700846o794305M316616P205901O082776R925610J4405740Q487735n323761
43712A8605466j3408858j1784293q505589o141157R08620R984150R348587j034196
$$ plain form
43766 -32286367 -37433752 -42879637 -40496769 -35121442 -31174719 -21448692 -1659617 17165499
43758 17165499 24028039 23987205 25487957 23473671 11299940 -450933 3495442 16856868
43750 16856868 17973913 2010397 -11392279 -6373351 9102805 18527899 19994434 24447732
43742 24447732 37311109 50843780 53593308 42245458 23252062 4674316 -11195317
43735 -11195317 -24532014 -29228129 -15817219 12487996 34743160 32505486 11281374
43728 11281374 -6869163 -8903889 68582 9633789 14058295 9905992 -3782469 -19700846
43720 -19700846 -26495151 -22178535 -14972634 -8889858 1035752 15441492 23929227 18605466
43712 18605466 5196608 -6587685 -15093274 -21234431 -20325811 -10341661 -993074 -2027270
43704b027270n619031J904700P365833Q97912m163874O477222K0964599J7115074
43696D2915165l179805j7419461j6365059j1769523j0195358k931748J1858997
43689g086792J9236581J1129801J254262K458922N657626j547978r448459r99046
43681B0654917J6830588K0099785L741493j2035446j2632575n354487o00755K812675
43673C3516195N819707J501990r745658j3763786l959581N371507J069965p078367
43665A2731972l288368P067233P154768k276173n370808O17349K043216m757567
43657A3921622n699798N913573J5678561R970791l459834q833356m909894j478299
43649B1103366j505297j20503K858666J713512m559555r833110r726535o045145
$$ plain form
43704 -2027270 -7646301 -5741601 1624232 2522144 -1641730 4835492 25800091 42915165
43696 42915165 39735360 22315899 5950840 -5818683 -16014041 -18945789 -7086792
43689 -7086792 12149789 23279590 24533852 26992774 32650400 31102422 21653963 20654917
43681 20654917 37485505 57585290 61326783 49291337 36658762 31304275 30703520 33516195
43673 33516195 39335902 40837892 31092234 17328448 13368867 18740374 19810339 12731972
43665 12731972 9443604 16510837 23665605 21389432 16018624 16635973 18679189 13921622
43657 13921622 8221824 14135397 29813958 39784749 36324915 27491559 22581665 21103366
43649 21103366 19598069 19477566 22336232 24049744 19490189 9657079 -69456 -6114601
43641f114601j686991L032947P310239P417371N59481r352013j2077745n25769
43633a1437081J8503980K7228078J6110639k628413q760917n1415N923573k474356
43625D2414088j5322353j7064974p344794K887397P763511Q829920P012844K769800
43617C1945439J55579Q65245j891272j3097900k3225426j8364375j647572Q973360
43609a6286922N741211K74187L447632R343169P514494O22083j388474J769322
43601A1036702J722913l009691m260172J359731N428237M54297p385646o184627
43593h38256L893790R741991L882299m676659m381035P80803k124677j2936727
43585f658471j6751900p207547L056944L368671K297196J0035017J5881967M136306
$$ plain form
43641 -6114601 -7801592 -4768645 2541594 9958965 10518446 1166433 -10911312 -11437081
43633 -11437081 7066899 34294977 50405616 47777203 39016286 38964871 44888444 42414088
43625 42414088 27091735 10026761 2681967 5569364 13332875 22162795 29175639 31945439
43617 31945439 32101018 32966263 31074991 17977091 -5248335 -23612710 -25260282 -16286922
43609 -16286922 -10545711 -10271524 -6823892 2519277 10033771 10655854 9267380 11036702
43601 11036702 12759615 9749924 5489752 6849483 12277720 12732017 5346371 -838256
43593 -838256 3055534 12797525 16679824 12003165 7622130 8402933 6278256 -6658471
43585 -6658471 -23410371 -30617918 -27560974 -24192303 -21895107 -11860090 4021877 8158183
43577H158183j4358744j2471000R795171J9503113o91748k3347069j5106797J4342005
43569a4176886K7648305J3161062m948677p266732k251127l085944n306520k8943
43561C744538P143686N028467m924976j1673984r761736j955449P790039J5428991
43553A0819576J5757963Q448217J447199J542178N380542N825154K251888k028154
43545D9444563o890148j1922902j1393023k465116N781754K470362q391759j2482586
43537D151145n263394L901938P731626Q963831J0181102P914820J663313j982909
43529C7261472l24108n1937m920544p491060k251704J837943n571425j6238081
43521B250556j1705446Q280211K0775034R237169j3144012j9612943l183889J7069272
$$ plain form
43577 8158183 -6200561 -18671561 -8876390 10626723 9934975 -13412094 -28518891 -14176886
43569 -14176886 13471419 26632481 21683804 14417072 12165945 9080001 3773481 3744538
43561 3744538 10888224 15916691 10991715 -682269 -10444005 -12399454 -4609415 10819576
43553 10819576 26577539 35025756 36472955 38015133 43395675 49220829 51472717 49444563
43545 49444563 42554415 30631513 19238490 16773374 22555128 25025490 16633731 4151145
43537 4151145 -1112249 2789689 10521315 19485146 29666248 37581068 39244381 37261472
43529 37261472 36937364 36885427 31964883 24473823 22222119 24060062 18488637 2250556
43521 2250556 -9454890 -1174679 19600355 28837524 15693512 -3919431 -7103320 9965952
43513I965952K1257391R365654n475635j4056803j4505355o336166P997527J8226043
43505B6438608J4401464J268519n645502q19956N101003L846392J295441K726485
43497D8612454K8486j2560844k1357318j0541861J0167597J6010052L092014p642389
43489B5808191l554795M572778N293430K287710p47740r163783j9764213j5636307
43481a0904729N862494J9986062Q681427j0327835j1174849k23106j184339j1863056
43473a1147931q130909J2652492K4639535J3878239k818247p304871l591567j812058
43465A6364683n54440K963854L434693k35341N02499O493384N097969o626925
43457B7440376j0656182M916728K3094983K0261326l90001j6079101j6555578
$$ plain form
43513 9965952 31223343 40588997 35113362 21056559 6551204 215038 8212565 26438608
43505 26438608 40840072 42108591 36463089 35643133 40744136 44590528 45885969 48612454
43497 48612454 48640940 36080096 14722778 4180917 14348514 30358566 33450580 25808191
43489 25808191 22253396 26826174 32119604 34407314 33659574 24495791 4731578 -10904729
43481 -10904729 -5042235 14943827 23625254 13297419 2122570 1899464 715125 -11147931
43473 -11147931 -19278840 -6626348 18013187 31891426 29073179 21768308 18176741 16364683
43465 16364683 15810243 18774097 22208790 21973449 22475948 28969332 34067301 27440376
43457 27440376 16784194 21700922 44795905 65057231 64667230 48588129 32032551
43450C2032551j0755808p046992m556245j959981R7464M323246J2290004J6799461
43442D1223700J0489393p68807n497728m888193r474820j8530303j8261869m052420
43434i761047R218481O546322o624692j2060099l018710P450925M284918q410083
43426a2373985j0786277N762026K2823189J6799086p043525j8219527j796287
43419d835300K1494160K4860294R369852n107812r340948q397327o018498l214502
43411A8809919n057688j1548631r208545R400855K5616900J6898323o498601j3702277
43403B4710255p76864L756836j3530481k8530541j8963189K68087K106805j1145742
43395d2104834j5111727j653135J2521701J2337816J952733m723517J50940J2572262
$$ plain form
43450 32032551 21276743 14229751 9673506 7713525 7810989 12134235 24424239 41223700
43442 41223700 51713093 50944286 45446558 40558365 31083545 12553242 -5708627 -9761047
43434 -9761047 -542566 6003756 -620936 -12681035 -15699745 -8248820 -3963902 -12373985
43426 -12373985 -23160262 -17398236 5424953 22224039 15180514 -3039013 -4835300
43419 -4835300 16658860 41519154 50889006 45781194 36440246 28042919 22024421 18809919
43411 18809919 13752231 2203600 -7004945 2395910 28012810 44911133 38412532 24710255
43403 24710255 23933391 27690227 14159746 -14370795 -33333984 -33065897 -30959092 -42104834
43395 -42104834 -57216561 -58869696 -46347995 -34010179 -32057446 -36780963 -36630023 -24057761
43387b4057761K0532518J5538059L305636k803697r12646k452542j0629062j1550258
43379a3029753L227360J8945038J6842717J191754q464922n156298J171677K734858
43371A7462431J951613J969588K243174L104345M506522K144294n691422j0932742
43363A6757803n746808M162329P270633L241647N18545R94635j98627l175127
43355B3825030m723878p502307j3676093j3754316J216251J9291902J9176635
43348B3853224K280851p589854R5787Q755413L735378n875079o284827j722455
43340A7248438l160821q143074p594093k858627j143509j334063K169303P181859
43332B365413P268398K826890j347306m371093o377827l994848K199861L493575
$$ plain form
43387 -24057761 -3525243 12012816 15318452 12514755 11602109 9149567 -1479495 -13029753
43379 -13029753 -9802393 9142645 25985362 27177116 18712194 13555896 14727573 17462431
43371 17462431 19414044 21383632 23626806 26731151 31237673 33381967 27690545 16757803
43363 16757803 11010995 15173324 22443957 25685604 26204149 27198784 27000157 23825030
43355 23825030 19101152 11598845 -2077248 -15831564 -14615313 4676589 23853224
43348 23853224 26134075 18544221 18640008 27395421 31130799 25255720 18970893 17248438
43340 17248438 14087617 5944543 -1649550 -4508177 -5651686 -6985749 -4816446 2365413
43332 2365413 9633811 12460701 11113395 6742302 364475 -3630373 -1430512 2063063
43324B063063l525914p863348l39816R653690P712189k822856p459358l715811
43316f298161m28075J345454P682918J4392496J0376383j082923m616219J005836
43308B2377709k60658j3273898k1440526j4071331l396404j275050J784884J6624635
43300a2930639L0134642K1787666l382839j9766808j5444396k546720N012203
43293B863109N965541K664668n351850j4030420j4405459n175385M287469P673579
43285a5508748Q995196J2056390J2389939N810909k498084m439567l41156J747220
43277A8212099l660174j2667486j4586336k264813J7464353K6813479J6324892
43270D5636014k074025r356561l572264J216517j898104n071811l043281k195231
$$ plain form
43324 2063063 -1462851 -9326199 -9666015 -12325 7699864 4877008 -2582350 -6298161
43316 -6298161 -6726236 -5380782 2302136 16694632 27071015 25988092 21371873 22377709
43308 22377709 22117051 8843153 -12597373 -26668704 -30065108 -31340158 -29555274 -12930639
43300 -12930639 17204003 38991669 35608830 15842022 397626 -2149094 2863109
43293 2863109 8828650 11493318 6141468 -7888952 -22294411 -27469796 -23182327 -15508748
43285 -15508748 -6513552 5542838 17932777 23743686 21245602 16806035 16464879 18212099
43277 18212099 14551925 1884439 -12701897 -14966710 2497643 29311122 45636014
43270 45636014 43561989 34205428 30633164 31849681 29951577 24879766 21836485 19641254
43262A9641254n974016o038138K372900R004083M258782m459607n089443j80552
43254A3535263Q46940O79263P936636J6607902J0789965r308577k3606128j8819785
43246a338521m511109L349732K679483J946699N712310J0910669J2193661O482961
43238C7425885l658060j0332132r632610q704616j4165801j6634739k258244K0120505
43230g839812K3583416K134440j5902166p664139J0458711J0015724m061075l912807
43222F812292J2362835J5495943o081710k3472847j0064870J6734005K0352987
43215C2138635k126394j8510023r379770P619223P326481q514806j8424576j1473202
43207b1344432K710175R930809O710022m36454m120752k946218j822624m873066
$$ plain form
43262 19641254 13667238 7629100 10002000 19006083 23264865 18805258 13715815 13535263
43254 13535263 14382203 15061466 22998102 39606004 50395969 41087392 17481264 -1338521
43246 -1338521 -5849630 -2499898 179585 2126284 7838594 18749263 30942924 37425885
43238 37425885 33767825 23435693 13803083 5098467 -9067334 -25702073 -27960317 -7839812
43230 -7839812 15743604 17878044 1975878 -5688261 4770450 14786174 10725099 6812292
43222 6812292 19175127 34671070 28589360 5116513 -4948357 11785648 32138635
43215 32138635 30012241 11502218 2122448 9741671 17068152 8553346 -9871230 -21344432
43207 -21344432 -18634257 -8703448 -1993426 -2429880 -6550632 -9496850 -11319474 -16192540
43199a6192540p540743o54804J4731711K3739486J6172177K077716k336622N68047
43191C0564428n079940j9535461k2835601o190328J1132209J0198774J547658
43184a98261O270719J9627758J8357413j05470j2476858o834581P94354l436984
43176B1998090q159234L92813J1882548Q636876m418253q903870l973203m681509
43168A2774258j2147335r656262O990987J7336790N912012j2293258j1782132
43161b864940O864298J7452668M619314j4935746j4495758P647386K5613116J8113314
43153D8013652n892531j9450029j0465626O219661R239925m857776k0332614k0002959
43145a7528297j921045J7800246J9170526Q92195j3839417m068422J8803024K3272827
$$ plain form
43199 -16192540 -23733283 -24388087 -9656376 14083110 30255287 32333003 29996381 30564428
43191 30564428 25484488 5949027 -16886574 -23076902 -11944693 -1745919 -198261
43184 -198261 6072458 25700216 44057629 43952159 31475301 24640720 25435074 21998090
43176 21998090 13838856 14231669 26114217 34751093 30332840 21428970 17455767 12774258
43168 12774258 626923 -9029339 -2038352 15298438 21210450 8917192 -2864940
43161 -2864940 3999358 21452026 26071340 11135594 -3360164 4287222 29900338 48013652
43153 48013652 42121121 22671092 12205466 18425127 27665052 22807276 2474662 -17528297
43145 -17528297 -19449342 -1649096 17521430 18413625 4574208 505786 19308810 42581637
43137D2581637J522956j8995519j5516895j9565N416597K590624M535663O110373
43129B8225871m517150j6079169p662054J2573689J5137834l136402j2935408
43122A1607211r92028R285828k07759j1960991n809104N682140J920960p457238
43114B069019l68047J5949539J4079881q291226k3259333j3975360N323010J4811360
43106F338843J2033771L298815q244262j7983420j8758762j1729764o002335l134983
43098d4182097M392611J5446681J7086575O011551k806243J316366Q446015O514713
43090A2226172K144587O694085J2405811K977106j6592873k2333786o098823J1228368
43082B650647R359644m186981q622694l51215O566014M939187K569775M752617
$$ plain form
43137 42581637 44104593 25109074 9592179 9572614 14989211 17579835 22115498 28225871
43129 28225871 23708721 7629552 -32502 12541187 27679021 24542619 11607211
43122 11607211 10615183 19901011 19693252 7732261 1923157 7605297 9526257 2069019
43114 2069019 1700972 17650511 31730392 23439166 179833 -13795527 -8472517 6338843
43106 6338843 18372614 21671429 13427167 -4556253 -23315015 -35044779 -41047114 -44182097
43098 -44182097 -39789486 -24342805 -7256230 -1244679 -4050922 -2734556 5711459 12226172
43090 12226172 14370759 21064844 33470655 36447761 19854888 -2478898 -8577721 2650647
43082 2650647 12010291 7823310 -799384 -1150599 5415415 10354602 12924377 17676994
43074A7676994M312787l912884j0825160o252372L299409L068811o942747j0967305
43066a0542467q88856J1810292J2698232L076924n194952o229579l240368q3009
43058A406217J721531m3626o332678j2293485j1026093k115447Q314995J5380641
43050d987945J8213449J5863917P069073m351060r923456o226733m42241j684027
43042A3530977q649583j1047542l677416O496612J0675325J0320495J1655006
43035B9303874J1573585J075604j5487617j9138583l125496J2195548O084739
43028B2481654j1264822j3724744P02754Q793059J058006m434551N112216J5366260
43020B4089832J0090194k213902m531609J592293L530558m78671m526967q687003
$$ plain form
43074 17676994 21989781 18076897 7251737 999365 4298774 7367585 424838 -10542467
43066 -10542467 -11431323 378969 13077201 16154125 10959173 4729594 1489226 1406217
43058 1406217 3127748 3084122 -3248556 -15542041 -26568134 -28683581 -20368586 -4987945
43050 -4987945 13225504 29089421 36158494 31807434 21883978 15657245 15215004 13530977
43042 13530977 4881394 -6166148 -9843564 -3346952 7328373 17648868 29303874
43035 29303874 40877459 41953063 26465446 7326863 4201367 16396915 22481654
43028 22481654 11216832 -2507912 -1805158 6987901 8045907 3611356 8723572 24089832
43020 24089832 34180026 31966124 27434515 29026808 32557366 32078695 27551728 18864725
43012A8864725j2176105n153661J3520668K3039249P791885j3707344j3353090
43005A8826327K293533K971146j4625406k1621218n645204R660070M946707n751689
42997h945734l011455O406197O170384q63210j504819L945612N996422L883577
42989A2076974K568576Q51631k674192j112398Q258208J2102725j797061k2326999
42981G947464k7000525j2125395N013808J1920709J3028359J5136317J4995479
42974B8916216O717277o841218j5441234j1592885J879462J3230538J2426753
42967B9294909J387828r220746j2624331r648404j691474R716054J6348714R711752
42959C3274302l124417n097469M526178O828047n292405j2074054J779206J9320687
$$ plain form
43012 18864725 6688620 1534959 15055627 38094876 45886761 32179417 18826327
43005 18826327 21119860 24091006 9465600 -12155618 -17800822 -8140752 -3194045 -8945734
42997 -8945734 -11957189 -5550992 619392 -243818 -1748637 2196975 8193397 12076974
42989 12076974 14645550 15497181 12822989 11710591 19968799 32071524 30274463 7947464
42981 7947464 -19053061 -31178456 -26164648 -14243939 -1215580 13920737 28916216
42974 28916216 35633493 28792275 13351041 1758156 3637618 16868156 29294909
42967 29294909 30682737 21461991 8837660 -810744 -2502218 7213836 23562550 33274302
42959 33274302 30149885 25052416 29578594 36406641 31114236 19040182 20819388 40140075
42951D0140075J6183755r49892o201480L327972M935407j0789205k4886339k0250192
42943A510101n391536K367818J629345K790575Q958126J2667676Q310080j14591
42935C2727594m458377k874130k160403o903219r177845J603007J8299177J9895541
42927D6951345J684377j4657124j2240205k976498l786739o362983M819391J7900991
42919C1332555Q260124j7753105k6606581p318238J3627415J4219423M790898
42912B0552491K730900N777672N430654M483338M920768k073873j7118103k1412950
42904C290897k936902K0960252K5801765J2444369p82838o693013j0319680j0555830
42896C1209020j773452J0342035J2992683M887972l575045o208610m392274J418101
$$ plain form
42951 40140075 56323830 55373938 49172458 52500430 57435837 46646632 21760293 1510101
42943 1510101 -3881435 -1513617 115728 2906303 11864429 24532105 32842185 32727594
42935 32727594 28269217 25395087 23234684 16331465 7153620 8756627 27055804 46951345
42927 46951345 48635722 33978598 21738393 18761895 14975156 8612173 13431564 31332555
42919 31332555 39592679 21839574 -4767007 -12085245 1542170 15761593 20552491
42912 20552491 23283391 29061063 34491717 38975055 43895823 41821950 24703847 3290897
42904 3290897 353995 21314247 47116012 59560381 58777543 52084530 41764850 31209020
42896 31209020 29435568 39777603 52770286 57658258 54083213 47874603 43482329 44900430
42888D4900430J0122525J3618392N575338o413991j0316838p718542q797690j2833132
42880B8136492r242837L018469J2441347J2441208Q168552M339514n70511n590430
42872E3141804n213991L30992L474411J170438j504935k155222n049103j0880178
42864C3314216j2547194n668616M931526J2835836J6134823J3319291K715095
42857F5034977r729674j1812873o99970J0526360Q718060l179799j2281110j2210976
42849C4364995o204010J447468Q668342J2269653Q941896L60597p308762r720624
42841D2819555p442723l271190N18916K352846J713691K60422P26046L332703
42833D1010266M399311P84984m036124j831981R154495J7868471J2038946m280558
$$ plain form
42888 44900430 55022955 68641347 74216685 67802694 57485856 49767314 40969624 28136492
42880 28136492 18893655 21912124 34353471 46794679 54963231 59302745 58732234 53141804
42872 53141804 47927813 48258805 51733216 52903654 51398719 49243497 44194394 33314216
42864 33314216 20767022 15098406 20029932 32865768 49000591 62319882 65034977
42857 65034977 55305303 43492430 42792460 53318820 62036880 58857081 46575971 34364995
42849 34364995 28160985 29608453 38276795 50546448 59488344 59848941 52540179 42819555
42841 42819555 35376832 32105642 32624558 34977404 36691095 36951517 37677563 41010266
42833 41010266 45409577 46194561 42158437 40326456 49480951 67349422 79388368 75107810
42825G5107810j3177199n501482P764234J1808343O539317Q61757k923440p701360
42817G2777980j0942358q565764n243890p193025p912450L284521J9692360K1641195
42809G7538569M830085j3071267j8604397j7387460j5816853p386565J0022723
42802B0124835K0607533J1946765k808393l084850P951371J0576380R92230m775435
42794F1530436J741734J0509357J1813730P997681K460015o323491j4490149j2231676
42786F3007637j06884Q558259Q056606P725788J1452481P647010p874058j6856099
42778H1610740n099573J0385265M284733j5886959j8542179L818312K2901034
42771H3471373J6950255o63006p194492l106175j922626m268263k328637N97872
$$ plain form
42825 75107810 61930611 56429129 64193363 76001706 82541023 83402780 80479340 72777980
42817 72777980 61835622 53269858 48025968 40832943 32920493 36205014 55897374 77538569
42809 77538569 82368654 69297387 50692990 33305530 17488677 10102112 20124835
42802 20124835 40732368 52679133 49870740 46785890 54737261 65313641 66305871 61530436
42794 61530436 63272170 73781527 85595257 93592938 96052953 89729462 75239313 63007637
42786 63007637 62900753 71459012 79515618 87241406 98693887 106340897 98466839 81610740
42778 81610740 76511167 86896432 91181165 75294206 56752027 60570339 83471373
42771 83471373 100421628 99758622 92564130 89457955 87535329 83267066 80938429 81536301
42763H1536301l803556r127990j823509J3076007J4888141p02243j2188836l052831
42755G8801484J4229320J6883924K997347r539842q667084L14300O474299N528779
42747A07022527k9769n016340m477919K056018Q696312R617287O447070M633774
42739A28948960L918720r56483r277471j1062308P11306J7945972K2928255P269832
42731A60426783j6850334k6943953j2911007J1742029K3814809J5149416k65025
42724A54162718m808021K489760Q755447O489222K097661M156464J0163674J0544781
42716A94051706L279250k110821K451119J1123508J0373659k940236j6302410
42709A99925775j7389709r125254k646756K0771O451122J7857914K3766093J6650536
$$ plain form
42763 81536301 77732745 68604755 66781246 79857253 94745394 94043151 81854315 78801484
42755 78801484 93030804 109914728 112912075 103372233 94705149 95019449 101493748 107022527
42747 107022527 106992758 101976418 97498499 99554517 108250829 117868116 124315186 128948960
42739 128948960 132867680 131911197 122633726 111571418 112282724 130228696 153156951 160426783
42731 160426783 143576449 116632496 103721489 115463518 139278327 154427743 154162718
42724 154162718 149354697 151844457 160599904 167089126 169186787 173343251 183506925 194051706
42716 194051706 197330956 195220135 197671254 208794762 219168421 216228185 199925775
42709 199925775 182536066 173410812 170764056 170784827 177235949 195093863 218859956 235510492
42701B35510492L216359m830700m853955j977953P00184L266955M016207R38694
42693B35986283k997825k124689M342055J0776669J0885010L387025n608445n180389
42685B49465694R816403K8244973L0186445J0164116j4369419k4251799k0088394
42678B69168019j3476726o125975P194258K0033838J7189979j697719j7727641
42671B74558033j7661327r915355q336676j1900944j0744702m044688k39894k865770
42663B08848677n909033k978394N186466J2261327J1436919L74197j4958421k2795294
42655A91466444j6353884k390389M153777m516249j9907182k4758882j1175416
42648A16518219R047235J5695961L261921j2303607j4006810m601471J130968
$$ plain form
42701 235510492 238726851 233896151 229042196 227064243 227764427 231031382 235047589 235986283
42693 235986283 232988458 230863769 235205824 245982493 256867503 260254528 254646083 249465694
42685 249465694 259282097 287527070 317713515 327877631 313508212 289256413 269168019
42678 269168019 255691293 249565318 256759576 276793414 293983393 292285674 274558033
42671 274558033 256896706 246981351 238644675 226743731 215999029 211954341 211714447 208848677
42663 208848677 202939644 199961250 205147716 217409043 228845962 229220159 214261738 191466444
42655 191466444 175112560 172722171 176875948 172359699 152452517 127693635 116518219
42648 116518219 125565454 141261415 144523336 132219729 118212919 113611448 114742416
42641A14742416r74208k401688k64848j897761q261070q708949K41454N673050
42633I8148396j018722p371577Q36469J3667911R913591q615414j7187324m995735
42625H3377595Q626963M022334r634055r738324N595947J5977315Q302415p671496
42617I8858694j5394859j0672689l8300R828228J4045568Q486877m438215j3257788
42609H7417516r447335K87266K308092m703382q717101l658930J210871l452655
42601F1244342j1609416j0248658J850524J2604197J2061381K355884p135493
42594F1122761r135373l236587M643759P928933O561486O206975Q780976Q920971
42586I1793901L418772j982675j148502K322191M37893p671974j5710794j7533861
$$ plain form
42641 114742416 113768208 111366520 111101672 109203911 100942841 92233892 92475346 98148396
42633 98148396 97129674 89758097 90594566 104262477 114176068 105560654 88373330 83377595
42625 83377595 92004558 96026892 86392837 76654513 82250460 98227775 106530190 98858694
42617 98858694 83463835 72791146 72752846 82581074 96626642 105113519 100675304 87417516
42609 87417516 77970181 78257447 80565539 75862157 67145056 63486126 64696997 61244342
42601 61244342 49634926 39386268 41236792 53840989 65902370 68258254 61122761
42594 61122761 51987388 48750801 53394560 61323493 67884979 74091954 82872930 91793901
42586 91793901 95212673 93229998 92081496 94403687 94841580 87169606 71458812 53924951
42578E3924951r744037O116893J8363044J2416635p622969j6838493k763664J2121645
42570F5974005J555392k1574629k1146597O908226K6495313J4206082r454386
42563F2963406j4748117l124777N115932L913880J830704K285265J881118L5216
42555F0152627l421701j1241485j8628206j2731520N750256J5458059M072384
42548C9410414j0357403o508577O904592Q127710j96256J269790J0878032P151706
42540E6680008j2075580k1647062p446511J2662662J7057474Q503370J423686
42533E5158047j638214o087591r874604o719680J593876P259738O947484K912061
42525D9551117k357427o663828o796610j449508O779709J4268283J8413759J6857551
$$ plain form
42578 53924951 44180914 50297807 68660851 81077486 73454517 56616024 53852360 65974005
42570 65974005 67529397 45954768 24808171 31716397 58211710 72417792 62963406
42563 62963406 48215289 45090512 50206444 54120324 55951028 58236293 60117411 60152627
42555 60152627 56730926 45489441 26861235 14129715 19879971 35338030 39410414
42548 39410414 29053011 22544434 29449026 37576736 37380480 38650270 49528302 56680008
42540 56680008 44604428 22957366 15510855 28173517 45230991 53734361 55158047
42533 55158047 53519833 47432242 37557638 30837958 32431834 39691572 46639056 49551117
42525 49551117 47193690 40529862 33733252 32283744 39063453 53331736 71745495 88603046
42517H8603046R144713q67817q406603j2226633j1783093m596068O676420J0351085
42509G6895050l09891j3534693j2464535K79583O002219k269044j1023748q447493
42501C5127448n09609J421960k773202n034507p51768Q173423J5869228J5535348
42493F7058321N952291m898024r169078r173246r632366o369036L505854P355366
42485D4630082o631623k3168571j5734859J0322937J9780711K59648j7601441
42478A1856884p901936J1827071J2389300j590156o505065j348965k434234q341464
42470G951435l363176Q867499P292715r945761j9932883j0864540K632315O955603
42462a0406793P679159J0621671P875407l837000j0449892j926279R381561Q142406
$$ plain form
42517 88603046 97747759 96879942 88473339 76246706 64463613 59867545 66543965 76895050
42509 76895050 76585159 63050466 50585931 50865514 56867733 54598689 43574941 35127448
42501 35127448 34617839 36039799 33266597 28232090 27480322 35653745 51522973 67058321
42493 67058321 73010612 68112588 58943510 49770264 40137898 33768862 37274716 44630082
42485 44630082 37998459 14829888 -904971 9417966 29198677 29458325 11856884
42478 11856884 3954948 15782019 28171319 26581163 20076098 18727133 16292899 7951435
42470 7951435 4588259 13455758 20748473 10802712 -9130171 -19994711 -17362396 -10406793
42462 -10406793 -2727634 7894037 15769444 11932444 1482552 -443727 8937834 17080240
42454A7080240M40941P32589N211412p79953j4103691j4652206L672562K2252361
42446A9854255K4255737J5634786R888860N276117q035133k5214709k8542718
42439A3117195j3538354J137257k565854j7835879k2662906r033210Q812283J5228351
42431b7341117J1234830O971560M849362m42033q304036r180457J405061J3019185
42423g787645J1919661M4083o362106O79965Q707787K842856j1140993j4623237
42415a5719629m214106M367319L172081M136674J4594591J9020358K838427j9341930
42407H853785k1752913n615668N032536J768570k92331N807976O760877l630130
42399c067298j0050091q95660J3180452J8964583J9320078J8369049Q107632j2992247
$$ plain form
42454 17080240 17521181 18253770 23465182 22685229 8581538 -6070668 -2398106 19854255
42446 19854255 44109992 59744778 69633638 74909755 66874622 41659913 13117195
42439 13117195 -421159 716098 -1849756 -19685635 -42348541 -51381751 -42569468 -27341117
42431 -27341117 -16106287 -9134727 -4285365 -4727398 -13031434 -22211891 -20806830 -7787645
42423 -7787645 4132016 4176099 -2186007 -1506042 7201745 10044601 -1096392 -15719629
42415 -15719629 -19933735 -15566416 -12394335 -8257661 6336930 25357288 28195715 8853785
42407 8853785 -12899128 -18514796 -13482260 -11713690 -12006021 -6198045 562832 -3067298
42399 -3067298 -13117389 -14013049 -832597 18131986 37452064 55821113 63928745 50936498
42391E0936498k6339933j8104928k302962J382960k159792J714757O620462l029326
42383H717736j8675531j6402917L568011J5212255O588738n407386n506342m50299
42375a2355735j68113k38401N399131J1216593J0921960P987473N627275j095463
42367B7294720j3139187j8727160q006424J0796233J9514403J0264888q209867
42360A9787606k0277491j6132436L98760J4573296J5609086Q160516L148554Q64943
42352B6132834o073855j5215524j4019015M17966J4227412J4299594L329669o747369
42344A6351712q424897l072129J523363k246177j1369298j2026214J375901J3667792
42336d219947Q962264l966323m925282M815777O280199k839089m633314N291334
$$ plain form
42391 50936498 24596565 6491637 4188675 5571635 3411843 5126600 11747062 8717736
42383 8717736 -9957795 -26360712 -22792701 -7580446 -991708 -6399094 -11905436 -12355735
42375 -12355735 -12523848 -12762249 -7363118 3853475 14775435 22762908 28390183 27294720
42367 27294720 14155533 -4571627 -12578051 -1781818 17732585 27997473 19787606
42360 19787606 -489885 -16622321 -16223561 -1650265 13958821 22119337 25267891 26132834
42352 26132834 20058979 4843455 -9175560 -8757594 5469818 19769412 23099081 16351712
42344 16351712 7926815 4854686 6378049 4131872 -7237426 -19263640 -17887739 -4219947
42336 -4219947 4742317 775994 -4149288 666489 6946688 4107599 -525715 4765619
42328D765619R003843p26584o536787K184666J0799675P537801M120180R726998
42320D0875411R594516p490458k2927894j5774148K487430Q168659L438604M565349
42312B2937469P128759l771963j8985393j6041434Q24398O014252l854268o544311
42304a2292491L862858P112100m290134j0683982j622053N140349l278514j1311636
42296b7363503l003997J1102078J4861070J2142549J1209717M991936r914641
42289A4025209j4679418L891869K3275360J4014131j2727022k0191792l305086
42282D303251N562574q420746j8355642r91403K4457275K6107772P064899l536676
42274C6191304M027631J0631977K292520j0582320j3389059q014901l836593j669039
$$ plain form
42328 4765619 13769462 13042878 6506091 8690757 19490432 27028233 31148413 40875411
42320 40875411 50469927 42979469 20051575 4277427 6764857 14933516 18372120 22937469
42312 22937469 30066228 26294265 7308872 -8732562 -7908164 -1893912 -5748180 -12292491
42304 -12292491 -8429633 -1317533 -5607667 -16291649 -17913702 -12773353 -16051867 -27363503
42296 -27363503 -30367500 -19265422 -4404352 7738197 18947914 23939850 14025209
42289 14025209 -654209 3237660 26513020 40527151 27800129 7608337 4303251
42282 4303251 9865825 1445079 -16910563 -17901966 6555309 32663081 39727980 36191304
42274 36191304 40218935 50850912 53143432 42561112 29172053 21157152 17320559 15651520
42266A5651520J633030J887749n636550j2884076o784309R328758J5707678K610309
42258B1514109j4696913j5974606k652232O698721K614047o134968q505985l540090
42250b0677917N286392J5597298K0905543J1841419q524751k0431992j0542327
42243f546335P221038P964333r901678k2053116j1698779R574029K1097964J9879280
42235A5536736J6440503J3280142L253081j2438689j9846218j0834817M066792
42228I457530Q433874j08170r239788q066597J821645R943634P289868n802808
42220A3729188j8831920j9733742p458371O175162J0578089Q783081R828330J2332861
42212A5402678O194814q032836j3476187R36502K0543661J9793425m033821k4465022
$$ plain form
42266 15651520 17284550 19172299 13535749 651673 -6132636 3196122 18903800 21514109
42258 21514109 6817196 -9157410 -11809642 -5110921 -2496874 -8631842 -17137827 -20677917
42250 -20677917 -15391525 205773 21111316 32952735 24427984 3995992 -6546335
42243 -6546335 674703 8639036 -1262642 -23315758 -35014537 -25440508 -4342544 15536736
42235 15536736 31977239 45257381 48510462 36071773 16225555 5390738 9457530
42228 9457530 17891404 17783234 8543446 476849 2298494 12242128 19531996 13729188
42220 13729188 -5102732 -24836474 -32294845 -26119683 -15541594 -6758513 3069817 15402678
42212 15402678 21597492 13564656 88469 1024971 21568632 41362057 37328236 12863214
42204A2863214j8235052N498033J7789147O842512r859796j1656723p73713N828988
42196H296610K382413q79925K706272N473551o70277r767086r741460P84582J1754009
42187A0338689J4546392Q653663j498280r204127p564802L046501J1015210N363518
42179C4696764q545201j3705902l319911J0127838J0832549j737514j4243827
42172A4104796j5104574m869327O757301J1419848R445618O407583L740904j756607
42164C0145542p725734m751416Q167545J5807840N618308j2714292k0136333j4670899
42156b59439q977895o581846n11163O289166K427344p129183k206414J8496138
42148A546708K8493725J1666232j2585379j8698627r722874l562329k199231K675652
$$ plain form
42204 12863214 -5371838 126195 17915342 24757854 14898058 3241335 2467622 8296610
42196 8296610 10679023 9799098 12505370 17978921 17308644 7541558 -2199902 -1415320 10338689
42187 10338689 24885081 33538744 32040464 22836337 15271535 18318036 29333246 34696764
42179 34696764 26151563 12445661 9125750 19253588 30086137 28348623 14104796
42172 14104796 -999778 -5869105 888196 12308044 21753662 28161245 31902149 30145542
42164 30145542 22419808 17668392 25835937 41643777 47262085 34547793 14411460 -259439
42156 -259439 -9237334 -15819180 -16330343 -10041177 -7613833 -14743016 -16949430 1546708
42148 1546708 30040433 41706665 29121286 10422659 699785 -2862544 -5061775 -2386123
42140b386123P071705K121998n225249k457164M653795J413279q533226q856132
42132a2197117P46443N437055K359412K605815O984172M665101l092364l236394
42124D272123K762142k36308r418942k963942J9600282K6766350K203071k5128976
42116A7855800k1653284K277254J2222446J865534n531645K36245L683459n084376
42108E871433j3471733q681714K865777Q153679N740335K029181o30646l485427
42100a609115n744728o557846p867957r635649o501419M769841J7128094J8772671
42092B753892P059386p692263j3743582r797851k796830K946660Q975975J5259316
42084B964703J6130225P551028n627516j3985389j2569016l057687Q454956J2659603
$$ plain form
42140 -2386123 4685582 6807580 1582331 -874833 3778962 5192241 -3340985 -12197117
42132 -12197117 -11450674 -6013619 -3654207 -1048392 5935780 10600881 7508517 4272123
42124 4272123 7034265 6797957 -2620985 -5584927 14015355 40781705 42984776 17855800
42116 17855800 -3797484 -1520230 10702216 12567750 7036105 7272350 10955809 5871433
42108 5871433 -7600300 -16282014 -13416237 -5262558 477777 2506958 1876312 -1609115
42100 -1609115 -7353843 -13911689 -21779646 -31415295 -37916714 -33146873 -16018779 2753892
42092 2753892 9813278 2121015 -11622567 -21420418 -24217248 -21270588 -12294613 2964703
42084 2964703 19094928 26645956 21018440 7033051 -5535965 -8593652 -138696 12520907
42076A2520907L130009j2738080j6788736k995620J0959192P189635n578584n747325
42068a0048602O504946J0313938l93906o758002K948685J3906502R817348j648362
42060B4642547m121294J556299L539566o17k789632m981066r645667j1245797
42052c045661l247039P569353R172906K910918R5669L263590M796545J967126
42044B3483407l45301q58121l060992n993121n887140n782862j0901205j5604613
42036b4949948r145714M957021J0354258K165251m755886J411501J0985698O972003
42028b005816j0187506k2234847j4579883Q627663K9465191L2148751J5487765
42021C6721318p364849k1558927k2875565j6689562q127698J343037R222334J1309884
$$ plain form
42076 12520907 15650916 2912836 -13875900 -16871520 -5912328 1277307 -4301277 -10048602
42068 -10048602 -3543656 6770282 6376376 -381626 2567059 16473561 26290909 24642547
42060 24642547 20521253 22077552 25617118 25616501 22826869 17845803 8200136 -3045661
42052 -3045661 -6292700 1276653 10449559 13360477 13456146 16719736 21516281 23483407
42044 23483407 23138106 22279985 19218993 13225872 7338732 1555870 -9345335 -24949948
42036 -24949948 -34095662 -29138641 -18784383 -16619132 -21375018 -19963517 -8977819 -2005816
42028 -2005816 -12193322 -34428169 -49008052 -40380389 -10915198 21233553 36721318
42021 36721318 29356469 7797542 -15078023 -31767585 -39895283 -38552246 -29329912 -18020028
42013a8020028P462049K619280K30525r00236j849782m77916M457161R614109
42005C135162J0117736M658543l353010q186069n715325K599147R687926Q898745
41997B1842855M6613j1255507j8396914j6928703o716318O135271J2960789J1529206
41989g82708P874420O090482J965165p534939j4464421r082530M002984R493277
41981b438270J952145o907887m980795L865080O177656k102481r729996m641999
41973a8806547R426533J5880082O253661p434217q222624J608230L542677r127987
41965f880192k0358553j5131970q02314O875433P969328J2956740J9984645J5841223
41957B0454340p60964j3244632q689921O184911J4876674Q848541p015756j9699445
$$ plain form
42013 -18020028 -10557979 -7938699 -7708174 -8608410 -10458192 -10936108 -6478947 3135162
42005 3135162 13252898 17911441 14558431 6372362 657037 3256184 12944110 21842855
41997 21842855 21889468 10633961 -7762953 -24691656 -31407974 -25272703 -12311914 -782708
41989 -782708 7091712 13182194 15147359 7612420 -6852001 -15934531 -11931547 -2438270
41981 -2438270 -486125 -7394012 -12374807 -8509727 -2332071 -4434552 -14164548 -18806547
41973 -18806547 -9380014 6500068 12753729 5319512 -2903112 -1294882 2247795 -6880192
41965 -6880192 -27238745 -42370715 -43173029 -36297596 -28328268 -15371528 4613117 20454340
41957 20454340 19693376 6448744 -2241177 3943734 18820408 27668949 20653193 953748
41949I53748j7912139l399863Q339525N862528k599500j402209P890655Q543054
41941F275799m427243j5647297j2879487l918481q84909m91599P078006J7755337
41933g139874J6926265J612199j3345453j4434525o102361k489017p257355r641658
41925d1871779j708565Q170450O653547l452311n044559Q067181K0170083J5535851
41917F519898O22461p044554l963609m92815p57051J361645P160267R275651N034995
41908A7716888P24478l84705k670186p475343q532556k313903N745672Q979560
41900A1789905O406901M25572n144265m849006K117688O437083n24386j1670864
41892D988628j1824753J9544R417255Q478569N027668O666639R187274N699276
$$ plain form
41949 953748 -16958391 -20358254 -12018729 -6156201 -8755701 -10157910 -2267255 6275799
41941 6275799 1848556 -13798741 -26678228 -30596709 -31481618 -31973217 -24895211 -7139874
41933 -7139874 9786391 11398590 -1946863 -16381388 -22483749 -24972766 -32230121 -41871779
41925 -41871779 -43580344 -35409894 -28756347 -32208658 -37253217 -29186036 -9015953 6519898
41917 6519898 7142359 97805 -3865804 -4358619 -5115670 -3754025 3406242 12681893 17716888
41908 17716888 18441366 18056661 15386475 7911132 -621424 -2935327 2810345 11789905
41900 11789905 18196806 18622378 13478113 8629107 10746795 17183878 16659492 4988628
41892 4988628 -6836125 -6816581 2600674 11079243 16106911 22773550 31960824 37660100
41884C7660100l630987j4371678k0457498j3843309N953353K2611173J8926378
41877C2847532K264029l783886N586116J0704447Q03730j0200947r787644n688929
41869B2744448o845854p365483l400961m674095j3185384j1908232O150607J8492186
41861G232N639747j5711369j8225739o363850l768777j0744031p139556Q573179
41853d7733164J6284675J0112313O383371J1936187J2955571K615073n835769
41846F718257l204295J094524m92124O48877R995583J4337516J602642j6552240
41838A4148740j8734277l567197R277528N788053o046675q775816J760155J0997483
41830D847994M330295j2106766j7479282m792487Q477426O166520l056777k165625
$$ plain form
41884 37660100 34029113 19657435 -800063 -14643372 -8690019 13921154 32847532
41877 32847532 35111561 31327675 36913791 47618238 48421968 38221021 28433377 22744448
41869 22744448 15898594 8533111 5132150 458055 -12727329 -24635561 -18484954 7232
41861 7232 5646979 -10064390 -28290129 -34653979 -38422756 -49166787 -56306343 -47733164
41853 -47733164 -31448489 -21336176 -14952805 -3016618 9938953 12554026 6718257
41846 6718257 3513962 4608486 4116362 4765239 14760822 29098338 30700980 14148740
41838 14148740 -4585537 -8152734 1124794 6912847 866172 -7909644 -6149489 4847994
41830 4847994 9178289 -2928477 -20407759 -25200246 -16722820 -10556300 -13613077 -15778702
41822a5778702N548072M132813n735109q093801l38919K883423l577324p424245
41814b8383792k475975J617509o3391J182274P311778N608280p365508j4321785
41806c6890610m252712P737967M706833m286405l06170J3939388J9656066J1274318
41798A1578675N63468l980005m435629l164549n23542k66245l774311k857033
41790f859171P794721J6036095O939609j1169066j4487876J574881J4827607Q765084
41782B3421884n074300o921724K942749Q461953K158853p509516j0368636o171743
41774I39520j646773k089044p044696j1236399r301679r84393Q763093J5000706
41766g599665J6371325J3473791O882893j556607p810570q375424l649796J863555
$$ plain form
41822 -15778702 -10230630 -6097817 -11832926 -19926727 -20265646 -17382223 -20959547 -28383792
41814 -28383792 -30859767 -29242258 -29305649 -28123375 -20811597 -15203317 -22568825 -36890610
41806 -36890610 -41143322 -33405355 -28698522 -32984927 -33291097 -19351709 304357 11578675
41798 11578675 12142143 8162138 3726509 561960 38418 -227827 -4002138 -6859171
41790 -6859171 935550 16971645 23911254 12742188 -1745688 -170807 14656800 23421884
41782 23421884 18347584 11425860 14368609 22830562 24989415 17479899 7111263 939520
41774 939520 -707253 -2796297 -9840993 -21077392 -30379071 -31363464 -22600371 -7599665
41766 -7599665 8771660 22245451 29128344 27571737 19761167 11385743 7735947 9599502
41758I599502K479345m140612j3374571j5958497p219295O587859J4733673J4178203
41750F885607J0525859P070216L35631r972978j4352895n344684Q147820R352197
41742A2646773l167381j2175229o269076L223954m40818j3277987j5816504k137045
41734c7413313J1375932R559005k322133r483612p199598j163377L413672M076918
41726b9156506p84890p093470m668706Q469524J7626699R195281p932051j2560208
41718b6904327n31678J0917414Q792712n16316n580524n677408n187482l188572
41710b7876181K393423P082708M756082k958128p972117m933763L413220Q513371
41702a7581385M149240m712445m505401R113118K0292691J0840195j2942082k5103759
$$ plain form
41758 9599502 12078847 7938235 -5436336 -21394833 -28614128 -22026269 -7292596 6885607
41750 6885607 17411466 24481682 24817313 14844335 491440 -4853244 3294576 12646773
41742 12646773 9479392 -2695837 -8964913 -5740959 -6181777 -19459764 -35276268 -37413313
41734 -37413313 -26037381 -16478376 -18800509 -28284121 -35483719 -36647096 -33233424 -29156506
41726 -29156506 -29941396 -37034866 -41703572 -33234048 -15607349 -6412068 -14344119 -26904327
41718 -26904327 -27436005 -16518591 -7725879 -8242195 -13822719 -19500127 -24687609 -27876181
41710 -27876181 -25482758 -18400050 -13643968 -16602096 -24574213 -29507976 -26094756 -17581385
41702 -17581385 -13432145 -18144590 -22649991 -13536873 6755818 17596013 4653931 -20449828
41694b0449828j3402608O500901J4761251J0898184N737479K822842q09257m111696
41686A947268l607029k99671L329731P997235J2585779J1149457K190948o019414
41678B9274304o971418n464517p593407r342067n100105K09897n18382k306053
41670g811748M378706J5526276J6902614M807844q821385j3061213r325282m713360
41662b117548l360919o205886j1309254j2535242m759503Q098130J6022446J4391459
41654a776317P153951m13878n284888m060663M483229J3052731J0844394j456160
41646B2542399r091124j331815J2709240J3514642m334095k3591371k3969199
41639a3551323o951518N901901R58182r462260m934914J3390398K4405024J7411486
$$ plain form
41694 -20449828 -33852436 -27351535 -12590284 -1692100 4045379 6868221 6058964 1947268
41686 1947268 -1659761 -1959432 1370299 9367534 21953313 33102770 35293718 29274304
41678 29274304 22302886 16838369 9244962 -97105 -5197210 -4987313 -5505695 -7811748
41670 -7811748 -3433042 12093234 28995848 33803692 24982307 11921094 2595812 -2117548
41662 -2117548 -5478467 -11684353 -22993607 -35528849 -40288352 -32190222 -16167776 -1776317
41654 -1776317 5377634 4963756 -321132 -4381795 101434 13154165 23998559 22542399
41646 22542399 13451275 12119460 24828700 38343342 34009247 10417876 -13551323
41639 -13551323 -20502841 -14600940 -13642758 -23105018 -28039932 -14649534 9755490 27166976
41631B7166976N070227J157079J044485n270594j3545798j2771630m004606K422685
41623A268824L177456K494475J215237j865230k057215M386992R392302L426308
41615B1439149o546429n685124L689498L825081r602651j8736988r989178O927094
41607a4679548J5339636J3360434Q668051K846849o304501j3890941j2292602
41600f952622m037321n62m683670j0752349r346433n74779Q211662J1640341J1159192
41591e336541J0701803J0061269O105569M0286k541443j040389j961444o885320
41583I143790o982796J979430P952313j092806j5772664j6588115l486682M161790
41575b0685740k119966q626700l420325O347909R312900O458829L064399j865421
$$ plain form
41631 27166976 32237203 33394282 34438767 29168173 15622375 2850745 -1153861 1268824
41623 1268824 4446280 6940755 8155992 6290762 4233547 8620539 18012841 21439149
41615 21439149 14892720 9207596 12897094 16722175 7119524 -11617464 -21606642 -14679548
41607 -14679548 660088 14020522 22688573 25535422 19230921 5339980 -6952622
41600 -6952622 -10989943 -10990505 -15674175 -26426524 -35772957 -36347736 -28136074 -16495733 -5336541
41591 -5336541 5365262 15426531 21532100 21572386 19030943 17990554 16029110 9143790
41583 9143790 2160994 4140424 12092737 10999931 -4772733 -21360848 -24847530 -20685740
41575 -20685740 -22805706 -31432406 -34852731 -28504822 -19191922 -12733093 -9668694 -11534115
41567a1534115p361144m918198O478902J1903091J267009j1950416q775934O812546
41559a8078259J5192073J1180348P363095Q819169M783165r716766k1113014j5554682
41551a7124871J457312J3420520J3561285Q289955M610707K879416R69445j333009
41543B6730760l570496o161091q461545p262130j13188R400985J2496161M323236
41535B7382692q805562j5176697j0660695j728874M572594P644286Q628317N943722
41527A7799783J25167l194959j276181J14682l850966p034753q02455J0787904
41519A2668222J4649194O693364m136445j0593452j4815773j7764881j2192948
41512b5492719N524772K3737784K5922519J0776607o053013j0258287k683128
$$ plain form
41567 -11534115 -18895259 -23813457 -17334555 -5431464 -4164455 -16114871 -24890805 -18078259
41559 -18078259 -2886186 8294162 15657257 24476426 29259591 19542825 -1570189 -17124871
41551 -17124871 -15667559 -2247039 11314246 19604201 24214908 27094324 28063769 26730760
41543 26730760 23160264 16999173 8537628 1275498 1162310 10563295 23059456 27382692
41535 27382692 18577130 3400433 -7260262 -8989136 -4416542 3227744 11856061 17799783
41527 17799783 17924950 14729991 13453810 13568492 9717526 2682773 1880318 12668222
41519 12668222 27317416 34010780 29874335 19280883 4465110 -13299771 -25492719
41512 -25492719 -19967947 3769837 29692356 40468963 34415950 24157663 21474535
41505B1474535N635858O433509P8138p295411r408098m533692L046656O826439
41497B2257934M096019k394195q057812r588945n305029L459700J0486969R032398
41489B3987039O26413n115638l022545N28051j627741n492659l491767Q62057
41481G253210j610513p483508l335716J0272523J3831111l149010k3317944k3718528
41473c1258375o442370P661045Q373005L326072O76856J124273N268947J2799241
41465A528694J4488967J001857j8791491k4112263j0103720N768867R118038M981734
41457a6119317L451673M851325O703801J0048969J0031818l758433k6172695l2125706
41449d3088565r099642J9988736K5310194J0466667K765304J0644371J5430343
$$ plain form
41505 21474535 27110393 33543902 33622040 26326629 16918531 12384839 15431495 22257934
41497 22257934 26353953 23959758 15901946 6313001 1007972 4467672 14954641 23987039
41489 23987039 24613452 19497814 16475269 17003320 15375579 9882920 6391153 7253210
41481 7253210 5642697 -1840811 -5176527 5095996 18927107 15778097 -7539847 -31258375
41473 -31258375 -37700745 -30039700 -21666695 -18340623 -17663767 -16539494 -11270547 1528694
41465 1528694 16017661 17019518 -1771973 -25884236 -35987956 -30219089 -21101051 -16119317
41457 -16119317 -12667644 -7816319 -1112518 8936451 18968269 15209836 -10962859 -43088565
41449 -43088565 -52188207 -32199471 -6889277 3577390 6342694 16987065 32417408
41442C2417408M795074r656449j3839025j0090758n908379l30130P754776J0808151
41434A5950668L936858m605267n426319k498350m105604o303360P28592J3280930
41426A0958148J5975748M413382p355461o887062K04517J381372l896288o401881
41418H392475l171026k38800q93557j792582j655938l781708p308633n787786
41410a6237555J316461N383014K564569Q43376N249794O631981l074060j3431458
41402a0753878q644497P380598J5620327R236767j80540l359815l671049m817329
41394H10584m149148j483942j9120L463849J3194953J8327626L189949k2257147
41386A1077604k6912976l687488J5329582N337659j4046610j1363897Q066042
$$ plain form
41442 32417408 37212482 27556033 13717008 3626250 -2282129 -2612259 5142517 15950668
41434 15950668 19887526 15282259 9855940 7357590 3251986 -3051374 -2322782 10958148
41426 10958148 26933896 31347278 23991817 17104755 17309272 18690644 14794356 8392475
41418 8392475 5221449 4982649 4089092 2296510 640572 -3141136 -10449769 -16237555
41410 -16237555 -14921094 -9538080 -6973511 -6130135 -880341 5751640 2677580 -10753878
41402 -10753878 -19398375 -12017777 3602550 12839317 12658777 9298962 5627913 810584
41394 810584 -3338564 -4822506 -4841626 -1377777 11817176 30144802 33334751 11077604
41386 11077604 -15835372 -19522860 -4193278 1144381 -12902229 -24266126 -16200084
41379a6200084J5731674P579933M442312J1028836Q838919p432467j7609732r288496
41371b909105K436526J076941o179332m154844N312055R673681O581641L765240
41363A5602803L882758K210090k768676o411864o052648n335151p841004r425774
41355a6139466j346696J6320374K7947207J7575346q073151k2742891j2301583
41348A239140P965114J5867962R547489J86869q928650j8093429j7187343J019761
41340h383087J9939777J6303978m122598j3326910l738434L363569l322767p110259
41332c96731M162206J4389231N793854j1524138j6252933o669782L701671Q401251
41324A604629Q358333J448246j0449472j3955727j794549J0748488N579935r240286
$$ plain form
41379 -16200084 -468410 7111523 11553835 22582671 31421590 23989123 6379391 -2909105
41371 -2909105 -472579 604362 -5574970 -9729814 -4417759 5255922 11837563 15602803
41363 15602803 19485561 21695651 18926975 12515111 6462463 1127312 -6713692 -16139466
41355 -16139466 -17486162 -1165788 26781419 44356765 36283614 13540723 1239140
41348 1239140 9204254 25072216 34619705 34806574 25877924 7784495 -9402848 -8383087
41340 -8383087 11556690 27860668 23738070 10411160 6672726 10036295 6713528 -396731
41332 -396731 3765475 18154706 23948560 12424422 -3828511 -10498293 -6796622 1604629
41324 1604629 9962962 11411208 961736 -12993991 -14788540 -4040052 1539883 -7700403
41316g700403j0524977M064971J2232161N33770j7061630j9749090n487233J0573793
41308c3118638J4686451O503136k359621K74135J3229685K0566481R270226j3639472
41300A5412383k8053190k3272303p141177N951577R349165O222921L037175K809523
41292a5683926L403081K560907K773086O368002P858544O62222q661726o226770
41284f946580N763040P593809p601784j9322093r723654P842997J0085844P12807
41276a1595614J331305J2803958J3875300j335291j2304696n805879M044593J524261
41268B537937n747609l400731M296249L830565l411081m765378J755736O183481
41260A279169M766865L624773L964207j310574j2261155j6205312n016475J0814067
$$ plain form
41316 -7700403 -18225380 -14160409 -1928248 -1394478 -18456108 -38205198 -43692431 -33118638
41308 -33118638 -18432187 -11929051 -14288672 -14014537 -784852 19781629 29051855 15412383
41300 15412383 -12640807 -35913110 -43054287 -37102710 -27753545 -21530624 -18493449 -15683926
41292 -15683926 -12280845 -9719938 -6946852 -578850 7279694 7941916 -719810 -6946580
41284 -6946580 -1183540 6410269 -1191515 -20513608 -30237262 -22394265 -12308421 -11595614
41276 -11595614 -10264309 2539649 16414949 15079658 2774962 -3030917 1013676 2537937
41268 2537937 -3209672 -6610403 -2314154 1516411 -1894670 -6660048 -4904312 1279169
41260 1279169 6046034 9670807 13635014 12324440 63285 -16142027 -21158502 -10344435
41252a0344435J4646119N160632m060561m030716R66677N346675J1428299J9603060
41244C8715750J8763946j89014k4598002k9634347j1373551M708963k045934j7490748
41236b3142937j2652685J3294840K9615995J5285531j4039691k8582458k0759558
41229d0980963o802972p6972K521344Q011894J4002014J3653070P096132J017910
41221a558543p31534k53331K84055J823429L695731J149815p412853j4137200
41213a7140431r500261M180171J3971899J2396909N503577K164241K495944K273329
41205A6345378K480403N947453P628639j550368j9219914k8458275j6387839P982951
41197b5231572K1788793J4533247o13384n615612q11531J91619m981604l578887
$$ plain form
41252 -10344435 4301684 9462316 5401755 1371039 2337716 7684391 19112690 38715750
41244 38715750 57479696 57290682 32692680 3058333 -8315218 -3606255 -5652189 -23142937
41236 -23142937 -35795622 -22500782 7115213 22400744 8361053 -20221405 -40980963
41229 -40980963 -47783935 -47860907 -45339563 -37327669 -23325655 -9672585 -2576453 -1558543
41221 -1558543 -2290077 -2543408 -2259353 -435924 3259807 4409622 -3003231 -17140431
41213 -17140431 -26640692 -22460521 -8488622 3908287 9411864 11576105 14072049 16345378
41205 16345378 18825781 24773234 32401873 30851505 11631591 -16826684 -33214523 -25231572
41197 -25231572 -3442779 11090468 10477084 4861472 4049941 4241560 -740044 -4318931
41189d318931P898788J2795277K55315j2931620n929267J1279970J1532724n738723
41181A4843533j3237113r57446P917093k921142j6171550j2319577j892899k493489
41173b7232590n259427O552343K0999830J2450551j3910810k5114798q423180
41166c9938081J2479703J4138435J456917q133291p973081j129772P765130J2204296
41158i129744P847804Q05050L07159L503753J907191J91638Q921601J9784082
41150C4138534J2471068j0067173j9432086m028527J2094867P067815n670367
41143B6574131j913686J4159198J8812978N735236q392642j0703295n813820l424856
41135C5033244n804258q360201n254414L839906R465434J860544j2552331j5979281
$$ plain form
41189 -4318931 3579857 16375134 16630449 3698829 -2230438 9049532 20582256 14843533
41181 14843533 1606420 648974 8566067 5644925 -10526625 -22846202 -24739101 -27232590
41173 -27232590 -32492017 -25939674 -4939844 7510707 -6400103 -31514901 -39938081
41166 -39938081 -27458378 -13319943 -11863026 -19996317 -27969398 -29099170 -21334040 -9129744
41158 -9129744 -1281940 -476890 -169731 3334022 5241213 5432851 14354452 34138534
41150 34138534 46609602 36542429 17110343 13081816 25176683 32244498 26574131
41143 26574131 24660445 38819643 57632621 63367857 54975215 44271920 38458100 35033244
41135 35033244 29228986 20868785 15614371 19454277 28919711 30780255 18227924 2248643
41127B248643n459163J122338o075965j1549797m31021J4879353J3766868K71305
41119H772561n606437o88157J355638j866379J661198J2638464J5086111K077819
41111C3430818j2709530j6088681j1425466o464657n98476O809961Q803281K077762
41103C835012m242595j503756M549012K969194n068164q786663m840419j474579
41095a4562958m563679p743069j439965J1836080J7764175P885713p872130j2574270
41087a1270103m053012L919953L397609L002653R929496J3678614J887094j5612144
41079D880160j6965134j019036R309964J127574q893581m48895J7976599J9064616
41071B5032267n092334l0283672k9489012m783350J7438092J8739139P301892
$$ plain form
41127 2248643 -3210520 -2088182 -8164147 -19713944 -20144965 -5265612 8501256 8772561
41119 8772561 3166124 2477967 3833605 1967226 3628424 16266888 31352999 33430818
41111 33430818 20721288 4632607 -6792859 -13257516 -13855992 -7046031 1757250 3835012
41103 3835012 -407583 -1911339 2637673 5606867 538703 -8247960 -13088379 -14562958
41095 -14562958 -19126637 -26869706 -28309671 -16473591 1290584 9176297 1304167 -11270103
41087 -11270103 -15323115 -11403162 -8005553 -5002900 4926596 18605210 20492304 4880160
41079 4880160 -12084974 -13104010 -3794046 -2666472 -11560053 -12008948 5967651 25032267
41071 25032267 19939933 -10343739 -39832751 -44616101 -27178009 -8438870 -1136978
41064a136978K480042Q637009J2970676O847250k433108n261143m245114n990396
41056A1868238o687442J067553J1377924J0254592j587896o386390M822016J7526384
41048D2254979J4256199q55391j0458534j0012215j0249666j5009823j2908964
41041b983415K536215J7227655J2929455o728599j9809711j4531796j249285O448202
41033f161279Q917333J1106064Q720444k715460j3263822r690276K257614M184845
41025C355463o147141j0701279j58925J1190165Q345606k639097p422313m530755
41017h708276q50164K502566N890039K890837q453435j4530602k762891J6496552
41009g525374K1122302O762510r956103j4858060q181283M075575J5454048J7170634
$$ plain form
41064 -1136978 1343064 9980073 22950749 29797999 27364891 22103748 17858634 11868238
41056 11868238 5180796 6248349 17626273 27880865 26292969 19906579 24728595 42254979
41048 42254979 56511178 55655787 45197253 35185038 24935372 9925549 -2983415
41041 -2983415 -447200 16780455 29709910 22981311 3171600 -11360196 -12609481 -6161279
41033 -6161279 2756054 13862118 22582562 19867102 6603280 -3086996 -829382 3355463
41025 3355463 -2791678 -13492957 -13651882 -2461717 5883889 3244792 -4177521 -8708276
41017 -8708276 -9558440 -7055874 -1165835 1725002 -6728433 -21259035 -24021926 -7525374
41009 -7525374 13596928 20359438 10403335 -4454725 -12636008 -8560433 6893615 24064249
41001B4064249N906755o973878p604081M78714K785484k159201k213028N235416
40993A9520430P506886k675979j6305279k1757274j6276541k469364J2725720
40986a9731401J6010096J504037j3641840p187992J3576510J8431497l26363j5558275
40978f923731q329391M380869K052172n103227J463819J2280021N315196j4238450
40970i102722j9802320m497987J1290733J3534847J0237959R501615N486194m858298
40962A1790021j0386762l240220O276322N377195m94022L143377J4824306J6248358
40954D3538575j490743k2591923k5235862r285289N231466O194645L102444P011953
40946F475266R921159j240272j7794519j6735095M198540J8957286Q371073j3858413
$$ plain form
41001 24064249 29971004 22997126 15393045 15871759 18657243 16498042 14285014 19520430
40993 19520430 27027316 24351337 8046058 -13711216 -29987757 -32457121 -19731401
40986 -19731401 -3721305 -2217268 -15859108 -23047100 -9470590 8960907 8634544 -6923731
40978 -6923731 -15253122 -10872253 -8820081 -13923308 -12459489 -179468 5135728 -9102722
40970 -9102722 -28905042 -33403029 -22112296 -8577449 1660510 11162125 16648319 11790021
40962 11790021 1403259 -1836961 4439361 9816556 9322534 12465911 27290217 43538575
40954 43538575 42047832 19455909 -5779953 -15065242 -9833776 -3639131 -536687 6475266
40946 6475266 16396425 15156153 -2638366 -19373461 -15174921 3782365 12153438 -1704975
40938a704975k1774750j0873488K005299L708124l232169q689457n056804P118700
40930c8499520J7389248J4746266K882539k584809L586200Q862479M309647j165324
40922I526726J725710N580427O81118o363912m427362K227652K526846j768424
40914I708781j526893K517558L910209L825199M854834J052760r480856j3657431
40906A204161l980137L134685p031906j6940002j311332K7775517L4506225J3558799
40898E0916010n419827p646199r275496j7777305j5709886K100689J1673281l84439
40890H476828j2357109n139994M479789n608741k3352442k2340639l003626J3606170
40882d5239764J9031196J8666167J2303191j306149j0596726n614807K776068
$$ plain form
40938 -1704975 -23479725 -34353213 -32347914 -28639790 -31871959 -40561416 -45618220 -38499520
40930 -38499520 -21110272 -6364006 -3481467 -6066276 -2480076 6382403 10692050 9526726
40922 9526726 11252436 16832863 17513981 11150069 6722707 8950359 11477205 9708781
40914 9708781 8181888 10699446 14609655 18434854 23289688 24342448 14861592 1204161
40906 1204161 -2775976 358709 -6673197 -23613199 -24924531 2850986 37357211 50916010
40898 50916010 45496183 37849984 28574488 10797183 -4912703 -2812014 8861267 8476828
40890 8476828 -3880281 -9020275 -4540486 -10149227 -33501669 -55842308 -58845934 -45239764
40882 -45239764 -26208568 -7542401 4760790 3454641 -7142085 -12756892 -9980824
40875i980824l7649o642393j806727Q542667Q117280N88338J474308O967080O13578
40866G835658j2685761j0560811Q046964J8507147R927147J36215K870199O874064
40858C0950822j64374j0007181j0315702m024171J209084O707582J3096664J1800069
40850C9252793n11787j1553419j0164251k623425q30892m525229o412370n332875
40842b701455l306259J592136Q612297R171257n36290r432792n572786N908482
40834C734590J0113490K896964o617461j0623888r738208p090596l571367Q50309
40826b0046167N639509Q992143P505268L11684o142898m039692M167347Q160794
40818D547988M821586P70088j504245o957285j3675338j0209729N291386J7404715
$$ plain form
40875 -9980824 -10018473 -16660866 -18467593 -9924926 -1807646 -1219308 255000 7222080 7835658
40866 7835658 -4850103 -15410914 -7363950 11143197 21070344 21206559 24076758 30950822
40858 30950822 30786448 20779267 10463565 6439394 7648478 14356060 27452724 39252793
40850 39252793 38741006 27187587 17023336 14399911 13569019 9043790 2631420 -2701455
40842 -2701455 -6007714 -4415578 4196719 13367976 12831686 3398894 -2173892 3734590
40834 3734590 13848080 16745044 10127583 -496305 -10234513 -17325109 -20896476 -20046167
40826 -20046167 -14406658 -5414515 2090753 2402437 -3740461 -7780153 -3612806 4547988
40818 4547988 9369574 10139662 8635417 1678132 -11997206 -22206935 -16915549 489166
40810D89166J4315487L435253l375598o266738q157043m189242N756609Q865368
40802A0873262l28880o404035J856695Q759782k794597j8274886j3097992M321091
40794a5089560N493140q166988p060940J3061395K0438488J767153j2641354M06977
40786a791689J6541323M327849k1260978k2202832K669859J8869769J0378261
40779G531562l182645m432088j021865k977639m284978P46183L559004k175363
40771f237829n618643M864235K0630092K2426384O048352j3347924k0513967j4869468
40763f618768o308982k436229j330990M595636J7026817K5427454J7678070k230963
40755D5802045j4776103q012620O161241O519829r991110k4393248k0273207l918937
$$ plain form
40810 489166 14804653 18239906 14864308 8597570 440527 -3748715 2007894 10873262
40802 10873262 10544382 4140347 5997042 14756824 11962227 -6312659 -19410651 -15089560
40794 -15089560 -9596420 -17763408 -24824348 -11762953 8675535 10442688 -2198666 -1791689
40786 -1791689 14749634 19077483 -2183495 -24386327 -21716468 -2846699 7531562
40779 7531562 4348917 -83171 -1105036 -4082675 -8367653 -7621470 -4062466 -6237829
40771 -6237829 -11856472 -6992237 13637855 36064239 42112591 28764667 8250700 -6618768
40763 -6618768 -12927750 -15363979 -16694969 -12099333 4927484 30354938 48033008 45802045
40755 45802045 31025942 23013322 29174563 35694392 25703282 1310034 -18963173 -22882110
40747b2882110N384775K38003p543114m484107P229293J4572420J1140629L084846
40739F740635q46258J667298P732214J2628381J0528833q39207j3331913j3963469
40731A0316514k122625O743640J681213p427367m446463Q087844J2302878J716104
40723B6851738r711325q485951Q53736N628256L148950N23864J746397L230099
40715B3785764M84490o476544j3832746j6745699j2617499m002804L222034O242539
40707a9940465P533583R207192Q746586L579242l036504n136431k109641L40760
40699h15678k217040p278623q661038l851907L567246Q425683Q868900N738965
40691C776508m91285q313640j1613298l804674J1544222K0023327J2235343l291236
$$ plain form
40747 -22882110 -17497335 -17259332 -24802446 -29286553 -22057260 -7484840 3655789 6740635
40739 6740635 5894377 7561675 15293889 27922270 38451103 37611896 24279983 10316514
40731 10316514 8193889 14937529 16618742 9191375 4744912 12832756 25135634 26851738
40723 26851738 17140413 8654462 9508198 15136454 18285404 18809268 20555665 23785764
40715 23785764 24270254 17793710 3960964 -12784735 -25402234 -29405038 -26183004 -19940465
40707 -19940465 -12406882 -3199690 5546896 9126138 6089634 953203 -1156438 -815678
40699 -815678 -3032718 -10311341 -18972379 -22824286 -19257040 -10831357 -1962457 3776508
40691 3776508 3285223 -5028417 -16641715 -20446389 -8902167 11121160 23356503 20065267
40683B0065267j0097251m816430l0622n179162j2771625q808058P192236J9158875
40675D713230J3100020m728262j3668468m485599P384524K955856j0910632r236082
40667a4875413J2238731K6392553J4275903m633045k367445J3092120J1731528
40660E5854932q549026j9186605q916836p4355p380223j3222871j432911J3190193
40652A0282298J2094270N164280Q484615J0513290p154882k9379135k3988998
40645a3984262O289085K3733396J0145796j0401596j1242876K422717J0726618
40638A7688878P879532j91565r351018j5142439j0949704N43046N972165J13141
40630c437964o166910m140389M78349J411260K926404P503556P731934J668943
$$ plain form
40683 20065267 9968016 5151586 5120964 -58198 -12829823 -21637881 -14445645 4713230
40675 4713230 17813250 13084988 -583480 -5069079 2315445 5271301 -5639331 -14875413
40667 -14875413 -2636682 23755871 38031774 33398729 31031284 44123404 55854932
40660 55854932 47305906 28119301 19202465 19128110 11747887 -1474984 -2907895 10282298
40652 10282298 22376568 27540848 36025463 46538753 39383871 10004736 -13984262
40645 -13984262 -7695177 16038219 26184015 15782419 4539543 6962260 17688878
40638 17688878 25568410 25376845 16025827 883388 -10066316 -9523270 -3551105 -3437964
40630 -3437964 -9604874 -13745263 -13266914 -11855654 -8929250 -1425694 6306240 7975183
40622G975183Q06494R804936J4056357K979761r843255q601936k635921q715601
40614E826018j7837395p827077J6273464K4366615O097297j4261081j5207332
40607b569491n390347j997671l631573n89513M447825L590372J84955J378338
40599d577105K816069k861705q908936l264903R068693J0545385j402559r034222
40591g619283j688170P468008K163607j1540654j4448850k819185P169079L554527
40583a7760921o311562r669744o441611m626810m717976j18895R049385J4085895
40575b6512239J1514801Q463386R743869Q914818l18349j1119979j1750527k650139
40567a3714359M923933N578868M806571O956288Q403674N723610J949936Q2751
$$ plain form
40622 7975183 8781677 18586613 32642970 35622731 25779476 17177540 14541619 5826018
40614 5826018 -12011377 -19838454 -3564990 20801625 26898922 12637841 -2569491
40607 -2569491 -7959838 -9957509 -13589082 -14178595 -9730770 -6140398 -5955443 -4577105
40599 -4577105 -1761036 -4622741 -13531677 -16796580 -7727887 2817498 1414939 -7619283
40591 -7619283 -9307453 -1839445 324162 -11216492 -25665342 -28484527 -21315448 -17760921
40583 -17760921 -24072483 -33742227 -40183838 -44810648 -49528624 -49647519 -40598134 -26512239
40575 -26512239 -14997438 -6534052 3209817 12124635 11806286 686307 -11064220 -13714359
40567 -13714359 -8790426 -3211558 1595013 8551301 16954975 22678585 24628521 24711272
40559B4711272k741685r257179j5327449j4595866o756689K778026Q726409Q832996
40551c630165M683289K217218O699918J3883793J1865953l046409j7822072j7538052
40543b686527n039707L078497j067483p583521m216901P160426J4134552Q941537
40535A2720873m598792j6322232j7546809n859840J2494800K4416982J9051420
40528B4356402r02416j8446802j7450550j53371J4052487J0360009m384447j1651007
40520d219695n386462K787195L213736J782222P177623J3975622J0071959l374975
40512B6027225j2061935q630984j212794O76259j526799j952417n26970l03011
40504D88574p99588m20943q53635l220993m196474j889751j280761o701014j2162938
$$ plain form
40559 24711272 21969587 12712408 -2615041 -17210907 -23967596 -21189570 -12463161 -3630165
40551 -3630165 1053124 3270342 9970260 23854053 35720006 32673597 14851525 -2686527
40543 -2686527 -7726234 -4647737 -5715220 -13298741 -17515642 -10355216 3779336 12720873
40535 12720873 8122081 -8200151 -25746960 -31606800 -19112000 5304982 24356402
40528 24356402 23453986 5007184 -12443366 -12596737 1455750 11815759 7431312 -4219695
40520 -4219695 -9606157 -6818962 -3605226 -1823004 5354619 19330241 29402200 26027225
40512 26027225 13965290 5334306 4121512 4797771 3270972 1318555 791585 488574
40504 488574 -311014 -731957 -1585592 -4806585 -9003059 -10892810 -12173571 -18874585 -31037523
40495c1037523p301146P976109K1961178K4455392J5719202K329706r516454j5574504
40487I011960j4287189q391878k634362P83709J972446N28212k359201j362494
40479a6738797O378120J3492599R986204j161530o025816K74206O393302K537188
40471A5135476n465790p969865p512654j1587743j6523125j2203056K40478Q950248
40463c6936031R278912Q491718J0997935J1474126O832677L446678N865945P913337
40455B7365297L026717m098882n088739j531731j674260o900666j0660824r271142
40447h834230n386769j300773L278208O488694M959612L10520k108009k327233
40439d919980n851735j2055705j1187400J191641J4056716J3756581K754714l965772
$$ plain form
40495 -31037523 -38338669 -30362560 -8401382 16054010 31773212 34102918 24586464 9011960
40487 9011960 -5275229 -13667107 -16301469 -15517760 -13545314 -13017102 -15376303 -16738797
40479 -16738797 -10360677 3131922 13118126 11956596 5930780 6204986 12598288 15135476
40471 15135476 9669686 1699821 -5812833 -17400576 -33923701 -46126757 -45886279 -36936031
40463 -36936031 -27657119 -19165401 -8167466 3306660 10139337 13586015 19451960 27365297
40455 27365297 30392014 26293132 21204393 19672662 17998402 11097736 436912 -8834230
40447 -8834230 -14220999 -15521772 -12243564 -5754870 -795258 -484738 -2592747 -4919980
40439 -4919980 -10771715 -22827420 -34014820 -32823179 -18766463 -5009882 -2255168 -6220940
40431f220940J86203O080686M423729p00704K21856O762445R207997L069280m317144
40422A8713408l809656L265441O536691m33648j1404506j3957975m931907L888908
40414b133244k99270j3024428j5444813J312389K2023487K5201722J0384369k825540
40406B5194672j922375M270622K224719o581008j0946345p634622l545674l349793
40398b289804m432987l631481j010434L565028J0559530J6321529J4978898O686881
40390D0747160j453203m401483l797986k197861P36453L264768k85262j0669914
40382B1942672j8130691j2980362N51927Q268756L518725n822961r097015n349804
40374a7098753p73228J404330L126028N830824Q225131R742916J1043281R842270
$$ plain form
40431 -6220940 -6034737 45949 4469678 3768974 3990830 10753275 19961272 23030552 18713408
40422 18713408 14903752 18169193 24705884 24272236 12867730 -1090245 -6022152 -2133244
40414 -2133244 -2432514 -15456942 -30901755 -29589366 -7565879 17635843 28020212 25194672
40406 25194672 23272297 27542919 29767638 23186630 12240285 4605663 1059989 -2289804
40398 -2289804 -6722791 -10354272 -11364706 -7799678 2759852 19081381 34060279 40747160
40390 40747160 39293957 34892474 31094488 28896627 29633080 32897848 32612586 21942672
40382 21942672 3811981 -9168381 -8616454 -347698 3171027 -2651934 -11748949 -17098753
40374 -17098753 -17871981 -16467651 -13341623 -7510799 714332 10457248 21500529 31342799
40366C1342799J897844j0541371j7071604j2178839n144431p502540j3376483
40359c2574625n504991J6944024L1297651K0579867k844017j5542278j4643411
40352b287780j4209803j6722240r887206P130364J6146168O989537n779901n155670
40344b3776531L721423N647766O73112L61210N757169P125516L294513L798176
40336F602354J0201468J1381501K378270n935112l572108L412268L893221p26385
40328B7635477j084276K901477J661416p122159j2309682m870380P450875Q517818
40320B2780566n138926j8946488j8322253o563153J110384j154494l149525M165894
40312b5217995J3343194J0751663k291779r870830l728467N723515N907400M75520
$$ plain form
40366 31342799 33240643 22699272 5627668 -6551171 -11695602 -19198142 -32574625
40359 -32574625 -38079616 -21135592 10162059 30741926 27897909 12355631 -2287780
40352 -2287780 -16497583 -33219823 -43107029 -35976665 -19830497 -12840960 -18620861 -23776531
40344 -23776531 -20055108 -14407342 -13734230 -13373020 -7615851 -490335 2804178 6602354
40336 6602354 16803822 28185323 30563593 24628481 21056373 24468641 28361862 27635477
40328 27635477 26551201 29452678 31114094 23991935 11682253 6811873 14262748 22780566
40320 22780566 17641640 -1304848 -19627101 -26190254 -25079870 -26234364 -29383889 -25217995
40312 -25217995 -11874801 -1123138 -3414917 -13285747 -17014214 -11290699 -5383299 -4907779
40304d907779J837465J0483056J3610402M805609o045211p682501l884562o358197
$$ plain form
40304 -4907779 -3070314 7412742 21023144 25828753 19783542 12101041 8216479 1858282
$$ [...]
##END NTUPLES=NMR SPECTRUM
##END=
