##TITLE=31Pdec_LR-660-RM3
 , 124 sc
 15.3.2019
##JCAMPDX= 6.0         $$ Bruker NMR JCAMP-DX V2.0
##DATA TYPE= NMR SPECTRUM
##DATA CLASS= NTUPLES
##ORIGIN= UXNMR, Bruker Analytische Messtechnik GmbH
##OWNER= root
$$ XWIN-NMR		Version 3.5
$$ Fri Mar 15 15:39:08 2019 Russian Standard Time (UT+4h)  she@DPX200
##.OBSERVE FREQUENCY= 81.013821
##.OBSERVE NUCLEUS= ^31P
##.ACQUISITION MODE= SIMULTANEOUS
##.ACQUISITION SCHEME= undefined
##.AVERAGES= 124
##.DIGITISER RES= 17
##SPECTROMETER/DATA SYSTEM= spect
##.PULSE SEQUENCE= zgpg30
##.SOLVENT NAME= CDCl3
##.SHIFT REFERENCE= (INTERNAL, CDCl3, 0, 182.463)
##AUDIT TRAIL= $$ (NUMBER, WHEN, WHO, WHERE, WHAT)
$$ ##TITLE= Audit trail, XWIN-NMR		Version 3.5
$$ ##JCAMPDX= 5.01
$$ ##ORIGIN= Bruker BioSpin GmbH
$$ ##OWNER= she
$$ F:/spectra/data/she/nmr/P31/1/pdata/1/auditp.txt
$$ ##AUDIT TRAIL=  $$ (NUMBER, WHEN, WHO, WHERE, WHAT)
(   1,<2019-03-15 15:37:39.17 +0400>,<she>,<DPX200>,
      <continue with go, POWCHK disabled, PULCHK disabled
       configuration hash MD5:
       00 E9 B6 7A A2 85 ED C7 34 08 36 98 17 FE 4E 26
       data hash MD5: 32K
       46 2F 58 8B 75 47 AF 26 7A 86 C9 37 41 97 E3 B1>)
(   2,<2019-03-15 15:37:54.84 +0400>,<she>,<DPX200>,
      <Start of raw data processing
       efp BC_mod = 2 LB = 1 FT_mod = 6 PKNL = 1 PHC0 = -1820.73 PHC1 = 103.1989 SI = 64K 
       data hash MD5: 64K
       58 6F 89 D6 0F 27 46 8F 99 AA 2B 44 0C 97 66 67>)
(   3,<2019-03-15 15:38:11.21 +0400>,<she>,<DPX200>,
      <abs ABSG = 5 
       data hash MD5: 64K
       FD 4C 4B D9 2D 07 D5 D9 2D 51 72 A8 4A B8 40 FA>)
$$ ##END=
$$ 
$$ hash MD5
$$ FF 5E F0 F5 DE 6F B6 76 C6 88 F3 92 9D 31 45 4C
##$RELAX= 
##$RELAX= 
##$RELAX= 
##$RELAX= 
##$RELAX= 
##$RELAX= 
##$RELAX= 
##$RELAX= 
$$ Bruker specific parameters
$$ --------------------------
##$DU= <F:/spectra>
##$EXPNO= 1
##$NAME= <P31>
##$PROCNO= 1
##$TYPE= <nmr>
##$USER= <she>
##$AMP= (0..31)
100 100 100 100 100 100 100 100 100 100 100 100 100 100 100 100 100 100 
100 100 100 100 100 100 100 100 100 100 100 100 100 100 
##$AQSEQ= 0
##$AQ_mod= 1
##$AUNM= <au_zg>
##$AUTOPOS= <>
##$BF1= 81.014009
##$BF2= 200.13
##$BF3= 200.13
##$BF4= 200.13
##$BF5= 200.13
##$BF6= 200.13
##$BF7= 200.13
##$BF8= 200.13
##$BYTORDA= 1
##$CFDGTYP= 0
##$CFRGTYP= 5
##$CHEMSTR= <none>
##$CNST= (0..31)
1 1 145 1 1 1 1 1 1 1 1 1 1 1 1 1 1 1 1 1 1 1 1 1 1 1 1 1 1 1 1 1 
##$CPDPRG= <waltz16>
##$CPDPRG1= <>
##$CPDPRG2= <waltz16>
##$CPDPRG3= <>
##$CPDPRG4= <mlev>
##$CPDPRG5= <mlev>
##$CPDPRG6= <mlev>
##$CPDPRG7= <mlev>
##$CPDPRG8= <mlev>
##$CPDPRGB= <>
##$CPDPRGT= <>
##$D= (0..31)
0 1 0 0 0 0 0 0 0 0 0 0.03 2e-05 3e-06 0 0 0 0 0 0 0 0 0 0 0 0 0 0 0 0 
0 0 
##$DATE= 1552649675
##$DBL= (0..7)
120 120 120 11 120 120 24 19 
##$DBP= (0..7)
150 150 150 150 150 150 150 150 
##$DBP07= 0
##$DBPNAM0= <>
##$DBPNAM1= <>
##$DBPNAM2= <>
##$DBPNAM3= <>
##$DBPNAM4= <>
##$DBPNAM5= <>
##$DBPNAM6= <>
##$DBPNAM7= <>
##$DBPOAL= (0..7)
0.5 0.5 0.5 0.5 0.5 0.5 0.5 0.5 
##$DBPOFFS= (0..7)
0 0 0 0 0 0 0 0 
##$DE= 6
$$ [...]
##$SUBNAM3= <"">
##$SUBNAM4= <"">
##$SUBNAM5= <"">
##$SUBNAM6= <"">
##$SUBNAM7= <"">
##$SUBNAM8= <"">
##$SUBNAM9= <"">
##$SW= 369.568048894756
##$SWIBOX= (0..15)
0 1 3 0 0 0 0 0 0 0 0 0 0 0 0 0 
##$SW_h= 29940.119760479
##$TD= 32768
##$TD0= 1
##$TE= 0
##$TE2= 300
##$TE3= 300
##$TEG= 300
##$TL= (0..7)
0 120 53 12 22 120 120 120 
##$TP= (0..7)
150 150 150 150 150 150 150 150 
##$TP07= 0
##$TPNAME0= <>
##$TPNAME1= <>
##$TPNAME2= <>
##$TPNAME3= <>
##$TPNAME4= <>
##$TPNAME5= <>
##$TPNAME6= <>
##$TPNAME7= <>
##$TPOAL= (0..7)
0.5 0.5 0.5 0.5 0.5 0.5 0.5 0.5 
##$TPOFFS= (0..7)
0 0 0 0 0 0 0 0 
##$TUNHIN= 0
##$TUNHOUT= 0
##$TUNXOUT= 0
##$USERA1= <user>
##$USERA2= <user>
##$USERA3= <user>
##$USERA4= <user>
##$USERA5= <user>
##$V9= 5
##$VALIST= <valist>
##$VCLIST= <CCCCCCCCCCCCCCC>
##$VD= 0
##$VDLIST= <DDDDDDDDDDDDDDD>
##$VPLIST= <PPPPPPPPPPPPPPP>
##$VTLIST= <TTTTTTTTTTTTTTT>
##$WBST= 1024
##$WBSW= 4
##$XGAIN= (0..3)
0 0 0 0 
##$XL= 0
##$YL= 0
##$YMAX_a= 52343
##$YMIN_a= -100597
##$ZGOPTNS= <>
##$ZL1= 120
##$ZL2= 120
##$ZL3= 120
##$ZL4= 120
##$ABSF1= 182.463
##$ABSF2= -187.1042
##$ABSG= 5
##$ABSL= 3
##$ALPHA= 0
##$AQORDER= 0
##$ASSFAC= 0
##$ASSFACI= 0
##$ASSFACX= 0
##$ASSWID= 0
##$AUNMP= <proc_1d>
##$AZFE= 0.1
##$AZFW= 0.5
##$BCFW= 0
##$BC_mod= 2
##$BYTORDP= 0
##$COROFFS= 0
##$CY= -3
##$DATMOD= 1
##$DC= 0
##$DFILT= <>
##$DTYPP= 0
##$F1P= 0
##$F2P= 0
##$FCOR= 1
##$FTSIZE= 65536
##$FT_mod= 6
##$GAMMA= 0
##$GB= 0
##$INTBC= 1
##$INTSCL= 5.30512e-09
##$ISEN= 30
##$LB= 1
##$LEV0= 0
##$LPBIN= 0
##$MAXI= 10000
##$MC2= 0
##$MEAN= 0
##$ME_mod= 0
##$MI= 50
##$NCOEF= 0
##$NC_proc= -8
##$NLEV= 6
##$NOISF1= 182.463
##$NOISF2= 159.3651
##$NSP= 0
##$NTH_PI= 0
##$NZP= 0
##$OFFSET= 182.463
##$PC= 4
##$PHC0= -1820.73
##$PHC1= 103.1989
##$PH_mod= 1
##$PKNL= yes
##$PPARMOD= 0
##$PSCAL= 0
##$PSIGN= 0
##$REVERSE= no
##$SF= 81.0140089999434
##$SI= 65536
##$SIGF1= 159.3651
##$SIGF2= -187.1042
##$SINO= 113.3802
##$SIOLD= 16384
##$SREGLST= <1H.CDCl3>
##$SSB= 0
##$STSI= 65536
##$STSR= 0
##$SW_p= 29940.119760479
##$SYMM= 0
##$S_DEV= 0
##$TDeff= 32768
##$TDoff= 0
##$TI= <>
##$TILT= no
##$TM1= 0
##$TM2= 0
##$TOPLEV= 0
##$USERP1= <user>
##$USERP2= <user>
##$USERP3= <user>
##$USERP4= <user>
##$USERP5= <user>
##$WDW= 1
##$XDIM= 65536
##$YMAX_p= 315332467
##$YMIN_p= -362468699
$$ End of Bruker specific parameters
$$ ---------------------------------
##NTUPLES= NMR SPECTRUM
##VAR_NAME=  FREQUENCY,     SPECTRUM/REAL,   SPECTRUM/IMAG
##SYMBOL=    X,             R,               I
##VAR_TYPE=  INDEPENDENT,   DEPENDENT,       DEPENDENT
##VAR_FORM=  AFFN,          ASDF,            ASDF
##VAR_DIM=   65536,         65536,           65536
##UNITS=     HZ,            ARBITRARY UNITS, ARBITRARY UNITS
##FACTOR=    0.456856943014862, 1,           1
##FIRST=     14782.0589164792, 0,            0
##LAST=      -15158.0608439998, 0,           0
##MIN=       -15158.0608439998, -362468699,  0
##MAX=       14782.0589164792, 315332467,    0
$$ Real data points
##PAGE= N=1
##DATA TABLE= (X++(R..R)), XYDATA
$$ [...]
$$ plain form
4060 -1130486 5370043 2315388 -9308516 -14664662 -8200571 -1928397 -3663063 -4158521
4052 -4158521 3121439 5471098 -9744832 -30326325 -31974366 -10808850 12996955 21934701
4044 21934701 17016470 7384702 -2020219 -9687385 -15079525 -20303815 -26726367 -28650106
4036 -28650106 -18441418 319838 12884987 9880502 -1966570 -8381469 -2301082 11565303
4028 11565303 22481692 22393395 12601184 3015733 2209076 8286394 11805556 6123306
4020 6123306 -7546504 -22107808 -28323504 -21254462 -7729066 -1954027 -7711593 -11858707
4012 -11858707 -4060425 5187393 -482855 -16573083 -23034892 -14065653 -3897709 -1251696
4004 -1251696 2398444 13005728 21375699 20886426 21244619 30876666 39153258 32356615
$$ packed form
4060a130486O500529l054655j1623904n356146O464091O272174j734666m95458
4052d158521P279960K349659j5215930k0581493j648041K1165516K3805805Q937746
4044B1934701m918231r631768r404921p667166n392140n224290o422552j923739
4036b8650106J0208688J8761256J2565149l004485j1847072o414899O080387J3866385
4028A1565303J0916389q8297r792211r585451q06657O077318L519162n682250
4020F123306j3669810j4561304o215696P069042J3525396N775039n757566m147114
4012a1858707P798282R247818n670248j6090228o461809Q969239J0167944K646013
4004a251696L650140J0607284Q369971m89273L58193R632047Q276592o796643
$$ plain form
3996 32356615 17487035 12392160 17721403 16775555 2563236 -11343453 -10394761 3084450
3988 3084450 16865929 24561993 28154276 29939244 27999081 19304085 5029858 -8136772
3980 -8136772 -13026698 -8284256 2072726 14046326 24260610 26701238 16855967 268504
3972 268504 -11901992 -18185258 -27200403 -39033643 -39646244 -22352058 -1633648 7080397
3964 7080397 9644325 19205664 30199833 27054704 13523196 9893660 19655460 21742119
3956 21742119 3282604 -19613427 -25293320 -15509291 -7309086 -6910116 -6492333 -1171709
3948 -1171709 4997571 9028183 13831493 20615826 23300264 14543867 -3889605 -18753531
3940 -18753531 -15964211 3842140 23050724 25568314 15344471 8926672 11184800 9366376
$$ packed form
3996C2356615j4869580n094875N329243r45848j4212319j3906689R48692J3479211
3988C084450J3781479P696064L592283J784968j940163q694996j4274227j3166630
3980h136772m889926M742442J0356982J1973600J0214284K440628r845271j6587463
3972B68504j2170496o283266r015145j1833240o12601J7294186K0718410Q714045
3964G080397K563928R561339J0994169l145129j3531508l629536R761800K086659
3956B1742119j8459515k2896031n679893R784029Q200205L98970M17783N320624
3948a171709O169280M030612M803310O784333K684438q756397j8433472j4863926
3940a8753531K789320J9806351J9208584K517590j0223843o417799K258128j818424
$$ plain form
3932 9366376 -6470149 -28240502 -40671365 -38557499 -27230124 -13963659 -5538966 -6567098
3924 -6567098 -12533065 -11274916 918559 11901202 11293233 7775658 16443370 34317136
3916 34317136 43224787 35600755 22409378 13606749 5907318 -3874115 -7110061 3739034
3908 3739034 19075768 21886938 10179775 -2142122 -6509780 -9975943 -20239156 -30475931
3900 -30475931 -27998826 -13371809 -1077465 -837456 -6313403 -5374792 4560934 16048150
3892 16048150 22191345 22148179 18123948 12237908 6503727 2874155 3524503 11713960 28184157
3883 28184157 44225093 45473404 30041910 16522873 22351408 38085406 38373691 18613044
3875 18613044 2490145 6222207 13508866 1005901 -24500755 -34880389 -21692635
$$ packed form
3932I366376j5836525k1770353j2430863K113866J1327375J3266465Q424693j028132
3924f567098n965967J258149J2193475J0982643o07969l517575Q667712J7873766
3916C4317136Q907651p624032j3191377q802629p699431r781433l235946J0849095
3908C739034J5336734K811170j1707163j2321897m367658l466163j0263213j0236775
3900c0475931K477105J4627017J2294344K40009n475947R38611R935726J1487216
3892A6048150O143195m3166m024231n886040n734181l629572O50348Q189457J6470197
3883B8184157J6040936J248311j5431494j3519037N828535J5733998K88285j9760647
3875A8613044j6122899L732062P286659j2502965k5506656j0379634J3187754
$$ plain form
3868 -21692635 -7290398 -11807003 -26968167 -31717442 -21510851 -10340117 -9716667 -16876183
3860 -16876183 -23047978 -25037204 -26036827 -29057825 -32704880 -33355443 -30284379 -26783798
3852 -26783798 -25011843 -21943968 -13890768 -3732911 1292484 -733653 -4479467 -6769391
3844 -6769391 -11735232 -22280200 -31560985 -29622017 -16242560 -822845 9312570 13724900
3836 13724900 12344953 2844299 -11958994 -21692754 -20014873 -13681663 -12633374 -14743606
3828 -14743606 -9932956 1642077 6908849 -754645 -9334616 -3184400 15777805 30795674
3820 30795674 31765772 25595554 24497318 30499148 34728319 29901323 21331303 23364848
3812 23364848 41672553 60944798 58730936 33971451 11181299 9163479 16675873 11594314
$$ packed form
3868b1692635J4402237m516605j5161164m749275J0206591J1170734O23450p159516
3860a6876183o171795j989226r99623l020998l647055o50563L071064L500581
3852b6783798J771955L067875Q053200J0157857N025395k026137l745814k289924
3844f769391m965841j0544968r280785J938968J3379457J5419715J0135415M412330
3836A3724900j379947r500654j4803293r733760J677881O333210J048289k110232
3828a4743606M810650J1575033N266772p663494q579971O150216J8962205J5017869
3820C0795674R70098o170218j098236O001830M229171m826996q570020K033545
3812B3364848J8307705J9272245k213862k4759485k2790152k017820P512394n081559
$$ plain form
3804 11594314 -5537278 -15473284 -12861383 -12716794 -21955894 -26434810 -15373357 2732
3796 2732 5090921 4234585 9678199 20080816 26133130 28640061 33968312 37436995 28664604
3787 28664604 10783624 -1970253 -4951155 -5986484 -7682266 -3125061 7917046 14148423
3779 14148423 10110767 5350497 8911844 15522192 15484539 9864750 7248612 10977942
3771 10977942 16638150 18083636 11324365 -2279683 -12498015 -6713381 14188915 32635472
3763 32635472 33624520 21240168 8687727 -1385226 -15431603 -31430666 -36571265 -25787883
3755 -25787883 -12158919 -11832449 -23885695 -32067993 -24695535 -6782458 8309357 14155629
3747 14155629 14429174 13398805 9602341 1327529 -6946509 -9789865 -10301885 -16737961
$$ packed form
3804A1594314j7131592r936006K611901J44589r239100m478916J1061453J5376089
3796B732N088189q56336N443614J0402617O052314K506931N328251L468683q772391
3787B8664604j7880980j2753877k980902j035329j695782M557205J1042107O231377
3779A4148423m037656m760270L561347O610348l7653n619789k616138L729330
3771A0977942N660208J445486o759271j3604048j0218332N784634K0902296J8446557
3763C2635472R89048j2384352j2552441j0072953j4046377j5999063n140599J0783382
3755b5787883J3628964L26470j2053246q182298P372458J7913077J5091815N846272
3747A4155629K73545j030369l796464q274812q274038k843356n12020o436076
$$ plain form
3739 -16737961 -29000125 -36636021 -33917558 -29052290 -31532620 -36528264 -31773082 -17353081
3731 -17353081 -7458031 -10673338 -18473030 -18214267 -9771264 -2398302 -672318 -2008784
3723 -2008784 -5365750 -13187758 -23920191 -30451846 -28887888 -23002142 -16943205 -9328667
3715 -9328667 905578 7955526 5106284 -5128215 -13127571 -13685581 -10042202 -6871735
3707 -6871735 -4781081 -2460723 478681 4017075 7519971 8811594 6993125 5152513
3699 5152513 5302274 2063605 -11181219 -29585074 -38991047 -33490364 -22527252 -16616657
3691 -16616657 -14807423 -12484614 -12772971 -20193409 -28523186 -26510960 -14455603 -5030533
3683 -5030533 -6235719 -11331925 -8408177 5225048 20721892 26750447 19533277 5845860
$$ packed form
3739a6737961j2262164p635896K718463M865268k480330m995644M755182J4420001
3731a7353081R895050l215307p799692K58763Q443003P372962J725984j336466
3723b008784l356966p822008j0732433o531655J563958N885746O058937P614538
3715i328667J0234245P049948k849242j0234499p999356n58010L643379L170467
3707f871735K090654K320358K939404L538394L502896J291623j818469j840612
3699E152513J49761l238669j3244824j8403855r405973N500683J0963112N910595
3691a6616657J809234K322809k88357p420438q329777K012226J2055357R425070
3683e030533j205186n096206K923748J3633225J5496844O028555p217170j3687417
$$ plain form
3675 5845860 -3461799 -3454697 2592707 10107584 17229528 20404573 13400153 -3432802 -18399782
3666 -18399782 -20309087 -11853986 -4657862 -4092218 -5634493 -3418072 4285087 15362657
3658 15362657 23266747 19583288 4019487 -12148168 -19706971 -22909745 -28059537 -27974316
3650 -27974316 -12435029 9806601 17008609 3814906 -11660283 -14070013 -8398178 -4652996
3642 -4652996 -288966 10875616 23200800 25722431 18492664 11358783 9293648 8048870
3634 8048870 3478375 -1985458 -3441105 -775114 -218726 -7334855 -17467892 -17837542
3626 -17837542 -4772232 6498319 -245967 -18184685 -25724987 -18162137 -13543323 -22762041
3618 -22762041 -32546974 -28172802 -16161969 -10239041 -8920541 -4518333 -3475079 -16923486
$$ packed form
3675E845860r307659P102O047404P514877P121944L175045p004420j6832955j4966980
3666a8399782j909305Q455101P196124N65644j542275K216421P703159J1077570
3658A5362657P904090l683459j5563801j6167655p558803l202774n149792Q5221
3650b7974316J5539287K2241630P202008j3193703j5475189k409730N671835L745182
3642d652996M364030J1164582J2325184K521631p229767p133881k065135j244778
3634H048870m570495n463833j455647K665991N56388p116129j0133037l69650
3626a7837542J3065310J1270551o744286j7938718p540302P562850M618814r218718
3618b2762041r784933M374172J2010833N922928J318500M402208J043254j3448407
$$ plain form
3610 -16923486 -36044756 -37850271 -16571512 8063455 17121226 12436662 6356737 5098732
3602 5098732 8439695 14794794 19122808 13910531 -542146 -12756059 -13164816 -5457172
3594 -5457172 775931 3167511 4855654 3867113 -5440633 -19440159 -23355475 -8367772
3586 -8367772 14689602 26271127 20677981 9422897 2015259 -5658940 -17991586 -25270755
3578 -25270755 -15294022 5347377 15976183 8323756 -4774262 -9926623 -9233793 -9615951
3570 -9615951 -7988998 2816162 20110987 32656524 33071501 23934584 15150116 17443765
3562 17443765 31699848 42484557 31874909 4240030 -13448455 -2684180 25570783
3555 25570783 47989677 54792533 48923455 32991279 12358366 1296571 8357080 20858984
$$ packed form
3610a6923486j9121270j805515K1278759K4634967R057771m684564o079925j258005
3602E098732L340963O355099M328014n212277j4452677j2213913m08757P707644
3594e457172O233103K391580J688143r88541r307746j3999526l915316J4987703
3586h367772K3057374J1581525n593146j1255084p407638p674199j2332646p279169
3578b5270755R976733K0641399J0628806p652427j3098018n152361O92830l82158
3570i615951J626953J0805160J7294825J2545537M14977r136917q784468K293649
3562A7443765J4256083J0784709j0609648k7634879j7688485J0764275K8254963
3555B5570783K2418894O802856n869078j5932176k0632913j1061795P060509J2501904
$$ plain form
3547 20858984 20014664 7237086 -495573 2434837 5544105 3032714 1394575 4248924
3539 4248924 5609236 2333016 160963 3349147 8971685 13729338 16425195 13852959
3531 13852959 5768605 2513626 13300082 27732089 26241722 10225733 2061746 10189307
3523 10189307 15649726 4135843 -8881646 -2060825 17910942 26730611 18496765 11015765
3515 11015765 17228658 29025300 32151073 24017866 11926226 2301460 -3136777 -5015195
3507 -5015195 -4194275 -1323097 2137036 2873683 -1616053 -8440250 -11056862 -7350870 -2170237
3498 -2170237 -123447 -401505 -787849 -1508326 -2169487 -220340 4008371 5962343 4381707
3489 4381707 4672548 10023529 14365100 10061103 -1350817 -12171157 -19212120 -25007090
$$ packed form
3547B0858984q44320j2777578p732659K930410L109268k511391j638139K854349
3539D248924J360312l276220k172053L188184N622538M757653K695857k572236
3531A3852959q084354l254979J0786456J4432007j490367j6015989q163987Q127561
3523A0189307N460419j1513883j3017489O820821J9971767Q819669q233846p481000
3515A1015765O212893J1796642L125773q133207j2091640r624766n438237j878418
3507e015195Q20920K871178L460133P36647m489736o824197k616612L705992N180633
3498b170237K046790k78058l86344p20477o61161J949147M228711J953972j580636
3489D381707K90841N350981M341571m303997j1411920j0820340p040963n794970
$$ plain form
3481 -25007090 -29956500 -29897202 -22743898 -13339565 -9267443 -12709954 -17499572 -14763052
3473 -14763052 -1610559 16737331 33167404 43526535 44321375 32264368 11978539
3466 11978539 -1382028 3725296 20729072 32533809 30675803 18382256 -159347
3459 -159347 -19773711 -26574990 -8678993 21701140 34100939 15769715 -12011428 -21907021
3451 -21907021 -11495513 3466762 13224415 17723474 16162325 8604821 3373053 9264835
3443 9264835 22213540 29740196 26400592 16435537 4774853 -5481699 -9952298 -7036408
3435 -7036408 -3544199 -7955312 -18837670 -26339669 -23849343 -13297295 -1760478 2645417
3427 2645417 -4162300 -16049643 -20248048 -12204955 -1374327 2571457 1718459 1939754
$$ packed form
3481b5007090m949410N9298P153304R404333M072122l442511m789618K736520
3473a4763052J3152493J8347890J6430073J0359131P94840j2057007k0285829
3466A1978539j3360567N107324J7003776J1804737j858006j2293547j8541603
3459a59347j9614364o801279J7895997L0380133J2399799j8331224k7781143r895593
3451b1907021J0411508J4962275R757653M499059j561149p557504n231768N891782
3443I264835J2948705P526656l339604r965055j1660684j0256552m470599K915890
3435g036408L492209m411113j0882358p501999K490326J0552048J1536817M405895
3427B645417o807717j1887343m198405Q043093J0830628L945784q52998K21295
$$ plain form
3419 1939754 2124078 445238 2819311 13864994 26061261 29056381 23524833 14980090
3411 14980090 2091601 -14829235 -21747198 -5734907 21750748 35427605 29814524
3404 29814524 23835545 29707837 36062203 28675548 11955173 126854 -1771119 993323
3396 993323 2884605 2020648 -402043 -605770 2285622 785168 -11667919 -25229649
3388 -25229649 -20383851 5153615 28927948 30793873 16621985 6132170 7062299 12622406
3380 12622406 17044213 20488794 21521436 16718302 8329332 3578795 4902342 7082393
3372 7082393 5119721 -40072 -4491745 -5970223 -4579322 -2010649 -723519 -1802258
3364 -1802258 -3534815 -3548090 -1437607 2228231 7461464 12457082 11588844 877692 -13857283
$$ packed form
3419A939754J84324j678840K374073J1045683J2196267K995120n531548q544743
3411A4980090j2888489j6920836o917963J6012291K7485655J3676857n613081
3404B9814524n978979N872292O354366p386655j6720375j1828319j897973K764442
3396I93323J891282q63957k422691k03727K891392j500454j2453087j3561730
3388b5229649M845798K5537466K3774333J865925j4171888j0489815R30129N560107
3380A2622406M421807L444581J032642m803134q388970m750537J323547K180051
3372G082393j962672n159793m451673j478478J390901K568673J287130j078739
3364a802258j732557j3275K110483L665838N233233M995618q68238j0711152j4734975
$$ plain form
3355 -13857283 -19433492 -9558497 6184313 12156005 4251259 -7573163 -14282814 -18014913
3347 -18014913 -23819952 -28475115 -25343319 -16238246 -9588907 -8699950 -10269056 -12480485
3339 -12480485 -14682598 -10845312 4240949 21981693 26617198 16499106 4520130 -4077948
3331 -4077948 -15876292 -27061421 -20231784 4889670 20846744 11235981 -610277 14188831
3323 14188831 44445228 56485426 45375009 36425406 41263364 45324724 39318147 31498093
3315 31498093 24258802 8453286 -11824680 -17557552 -7470100 -4548153 -17890885 -25391651
3307 -25391651 -10083229 11773845 17679531 11271644 7182983 4066462 -4394751 -8904357
3299 -8904357 527172 12295026 9559668 -1893598 -4800440 773393 3094186 4122674
$$ packed form
3355a3857283n576209R874995J5742810N971692p904746j1824422o709651l732099
3347a8014913n805039m655163L131796R105073O649339Q88957j569106k211429
3339a2480485k202113L837286J5086261J7740744M635505j0118092j1978976q598078
3331d077948j1798344j1185129O829637K5121454J5957074r610763j1846258J4799108
3323A4188831L0256397J2040198j1110417q949603M837958M061360o006577p820054
3315C1498093p239291j5805516k0277966n732872J0087452K921947j3342732p500766
3307b5391651J5308422K1857074N905686o407887m088661l116521q461213m509606
3299h904357R431529J1767854k735358j1453266k906842N573833K320793J028488
$$ plain form
3291 4122674 14190346 27502814 28378399 18871357 15647333 20610290 19107432 8281673
3283 8281673 2551665 6541455 6004831 -6379878 -16484799 -10034192 7402752 20811124
3275 20811124 23050845 14959212 1203596 -7811135 -2975311 8886674 10774517 541675
3267 541675 -6052037 -3643539 -8923523 -31107506 -48970629 -37080072 -3969859 16474254
3259 16474254 6829721 -19028240 -40541042 -51740189 -55848440 -54558388 -49216351 -42755196
3251 -42755196 -34803517 -21680768 -4942222 6599039 7001400 -283581 -8888921 -16133678
3243 -16133678 -19230356 -12134463 5832899 21848948 19635673 -818881 -20697099 -23298912
3235 -23298912 -12676415 -6383133 -13070032 -24315964 -28246095 -23026032 -13098928 414513
$$ packed form
3291D122674J0067672J3312468Q75585r507042l224024M962957j502858j0825759
3283H281673n730008L989790n36624j2384709j0104921O450607J7436944J3408372
3275B0811124K239721q091633j3755616r014731M835824J1861985J887843j0232842
3267E41675o593712K408498n279984k2183983j7863123J1890557L3110213K0444113
3259A6474254r644533k5857961k1512802j1199147m108251J290052N342037O461155
3251d2755196P951679J3122749J6738546J1541261M02361p284981q605340p244757
3243a6133678l096678P095893J7967362J6016049k213275k0454554j9878218k601813
3235b3298912J0622497O293282o686899j1245932l930131N220063R927104J3513441
$$ plain form
3227 414513 16898467 27195862 18676033 -7343675 -31873841 -38609400 -32584221 -30444632
3219 -30444632 -35606093 -34297406 -18289402 -257957 1773004 -11718763 -24472823 -27995837
3211 -27995837 -29396861 -33705662 -32062010 -16474834 3091182 8872047 -1206056 -12047384
3203 -12047384 -12670934 -7655002 -5391527 -5447656 -2798254 2656613 6658993 6484936 2026442
3194 2026442 -5674496 -13625483 -17406682 -15342636 -10692443 -8768402 -12965171 -21753260
3186 -21753260 -26866561 -18256377 3695650 24934638 33929322 36113181 41988063 46726572
3178 46726572 37515158 18574501 9011651 13130489 13913296 3382832 -2226753 9170205
3170 9170205 21624285 14096826 -7349800 -20314769 -18136871 -11014649 -3955433 4745050
$$ packed form
3227D14513J6483954J0297395q519829k6019708k4530166o735559O025179K139589
3219c0444632n161461J308687J6008004J8031445K030961j3491767j2754060l523014
3211b7995837j401024m308801J643652J5587176J9566016N780865j0078103j0841328
3203a2047384o23550N015932K263475n6129K649402N454867M002380j74057m458494
3194B026442p700938p950987l781199K064046M650193J924041m196769q788089
3186b1753260n113301Q610184K1952027K1238988Q994684K183859N874882M738509
3178D6726572r211414j8940657r562850M118838P82807j0530464n609585J1396958
3170I170205J2454080p527459k1446626j2964969K177898P122222P059216Q700483
$$ plain form
3162 4745050 8794009 117217 -12101870 -9681773 6829556 18148829 15117617 8214955
3154 8214955 5870868 3275477 -1947027 -2198614 3705014 3651295 -8101282 -18650620
3146 -18650620 -14717038 -1462834 7551081 9188799 9217948 10719097 14054507 20697877
3138 20697877 27314959 23264610 4505568 -15851645 -21764520 -14881784 -10064514 -12957360
3130 -12957360 -14022004 -6420223 838717 -5846004 -24916203 -38258559 -30923826 -8506366
3122 -8506366 8992838 9685248 745940 -4823446 -5184202 -6936915 -11090336 -11937227 -8275189
3113 -8275189 -5336673 -4371097 246767 10631708 20252422 23160007 21970698 22384314
3105 22384314 24328198 22532665 13550584 -2217 -11300493 -15933455 -17216338 -21038324
$$ packed form
3162D745050M048959q676792j2219087K420097J6511329J1319273l031212o902662
3154H214955k344087k595391n222504k51587N903628n3719j1752577j0549338
3146a8650620L933582J3254204R013915J637718K9149J501149L335410O643370
3138B0697877O617082m050349j8759042k0357213n912875O882736M817270k892846
3130a2957360j064644P601781P258940o684721j9070199j3342356P334733K2417460
3122h506366J7499204O92410q939308n569386l60756j752713m153421q46891L662038
3113h275189K938516R65576M617864J0384941R620714K907585j189309M13616
3105B2384314J943884j795533q982081j3552801j1298276m632962j282883l821986
$$ plain form
3097 -21038324 -24040720 -14984127 6647408 23079095 19197252 1983567 -13658314 -28343312
3089 -28343312 -49041524 -64894385 -57534760 -34296582 -23627849 -31686602 -30985076 -4995352
3081 -4995352 21372052 16241349 -12697614 -29857432 -19550107 707807 10186345 7411347
3073 7411347 1533390 -2467571 -5032079 -7634788 -10941834 -13621659 -13385266 -11216076
3065 -11216076 -10260341 -8068511 2525358 19876940 29509685 21473336 4556980 -5689898
3057 -5689898 -7238311 -10435741 -20859742 -32926181 -38997626 -37291584 -30951775 -24089896
3049 -24089896 -18885874 -15082193 -12946125 -13996017 -14686334 -5345687 14457603 25667299
3041 25667299 11397218 -14603227 -22903404 -12597346 -13889597 -38372333 -55674749
$$ packed form
3097b1038324l002396R056593K1631535J6431687l881843j7213685j5641881j4684998
3089b8343312k0698212j5852861P359625K3238178J0668733q058753P01526K5989724
3081d995352K6367404n130703k8938963j7159818J0307325K0257914R478538k774998
3073G411347n877957m000961k564508k602709l307046k679825K36393K169190
3065a1216076R55735K191830J0593869J7351582R632745q036349j6916356j0246878
3057e689898j548413l197430j0424001j2066439o071445J706042O339809O861879
3049b4089896N204022L803681K136068j049892o90317R340647J9803290J1209696
3041B5667299j4270081k6000445q300177J0306058j292251k4482736j7302416
$$ plain form
3034 -55674749 -38104411 -4179529 7005089 -12479640 -38654896 -53145508 -55043002
3027 -55043002 -44944372 -24449539 -7542258 -8461906 -20164723 -24778309 -20689312 -18114855
3019 -18114855 -13881569 3903747 28374723 37569189 27478157 16857634 15474700 11623371
3011 11623371 -2611154 -16460668 -19679676 -17042175 -14335573 -7163026 6747480 18806915
3003 18806915 21628773 17227291 7952433 -6268068 -16890929 -10016791 11666841 26470531
2995 26470531 22558549 14232935 18877218 31379421 34183966 23022545 10467386 9342603
2987 9342603 20757179 34300221 36060992 21822981 3236859 -6316237 -9573641 -17351558
2979 -17351558 -25959565 -20452476 -1275192 12099425 8942626 -515323 -7063090 -16623670
$$ packed form
3034e5674749J7570338L3924882J1184618j9484729k6175256j4490612j897494
3027e5043002J0098630K0494833J6907281r19648j1702817m613586M088997K574457
3019a8114855M233286J7785316K4470976R194466j0091032j0620523j382934l851329
3011A1623371j4234525j3849514l219008K637501K706602P172547J3910506J2059435
3003A8806915K821858m401482r274858j4220501j0622861O874138K1683632J4803690
2995B6470531l911982q325614M644283J2502203K804545j1161421j2555159j124783
2987I342603J1414576J3543042J760771j4238011j8586122r553096l257404p777917
2979a7351558q608007N507089J9177284J3374617l156799r457949o547767r560580
$$ plain form
2971 -16623670 -32457199 -41955359 -34270537 -16874851 -3224715 3388460 5274287 4105146
2963 4105146 6558026 19312418 31506480 23207998 286336 -5137167 16014520 28553143
2955 28553143 4869253 -28445105 -28402628 -501764 12484802 -3249240 -17166846 -6015614
2947 -6015614 14726789 19887061 7837727 -6262060 -10772586 -2503930 12647662 18214814
2939 18214814 1510640 -25928711 -36873568 -21452491 1906456 11238494 2889028
2932 2889028 -13223275 -25249312 -23765301 -9251164 2011173 -6232225 -26742968 -36566438
2924 -36566438 -29570883 -23042173 -28130427 -33479433 -26328241 -12159214 -3023733 -1132229
2916 -1132229 -4037261 -12121785 -20631312 -17978557 -3536729 5557946 -2118138 -13801618
$$ packed form
2971a6623670j5833529r498160P684822J7395686J3650136O613175J885827j169141
2963D105146K452880J2754392J2194062q298482k2921662n423503K1151687J2538623
2955B8553143k3683890l3314358M2477K7900864J2986566j5734042j3917606J1151232
2947f015614K0742403N160272j2049334j4099787m510526Q268656J5151592N567152
2939A8214814j6704174k7439351j0944857J5421077K3358947R332038q349466
2932B889028j6112303j2026037J484011J4514137J1262337q243398k0510743r823470
2924c6566438O995555O528710n088254n349006P151192J4169027R135481J891504
2916a132229k905032q084524q509527K652755J4441828R094675p676084j1683480
$$ plain form
2908 -13801618 -11677406 -325755 1368119 -10424032 -19992651 -15854646 -5044661 -1431876
2900 -1431876 -9199985 -20842090 -26255043 -21967682 -13505070 -8697604 -9417141 -13122419
2892 -13122419 -19974049 -30217510 -35845022 -27241766 -10370225 -3225326 -9595975 -11618041
2884 -11618041 1869495 14876819 7102482 -14729831 -26329215 -19013893 -4906176
2877 -4906176 6348917 16444718 24515704 23523473 14665900 9857587 14293487 19114744
2869 19114744 16418999 9558109 3116250 -5066461 -14237061 -14376813 -246194 15528660
2861 15528660 14819658 -3389887 -21834921 -25537295 -16543028 -7876258 -7994739 -12808702
2853 -12808702 -11391031 541868 13294126 12312652 -4739952 -24090786 -30722674 -22990714
$$ packed form
2908a3801618K124212J1351651J693874j1792151r568619M138005J0809985L612785
2900a431876p768109j1642105n412953M287361Q462612M807466p19537l705278
2892a3122419o851630j0243461n627512Q603256J6871541P144899o370649k022066
2884a1618041J3487536J3007324p774337k1832313j1599384P315322J4107717
2877d906176J1255093J0095801Q070986r92231q857573m808313M435900M821257
2869A9114744k695745o860890o441859q182711r170600j39752J4130619J5774854
2861A5528660p09002j8209545j8445034l702374Q994267Q666770j18481m813963
2853a2808702J417671J1932899J2752258r81474j7052604j9350834o631888P731960
$$ plain form
2845 -22990714 -10418822 -1864792 648902 611984 3658837 12191962 20061320 16948692
2837 16948692 2250434 -10256932 -7571806 6560605 17446636 17822184 12674200 8258817
2829 8258817 5712781 5481268 8599843 11492849 8077095 228779 -1882260 5938796
2821 5938796 15053266 16833314 15009916 17873839 24110824 25373857 19585880 12714243
2813 12714243 8657231 5622938 2594006 2109182 5547445 11038214 16203017 18324878
2805 18324878 13744518 3768927 -907563 9106569 26783303 34190542 25064086 11985981
2797 11985981 7838419 10452760 10843417 6237765 -2687150 -17741779 -36028640 -44562128
2789 -44562128 -34601691 -16982568 -10433323 -16408318 -18118704 -5285918 12237787 19153573
$$ packed form
2845b2990714J2571892Q554030K513694l6918L046853Q533125P869358l112628
2837A6948692j4698258j2507366K685126J4132411J0886031L75548n147984m415383
2829H258817k546036k31513L118575K893006l415754p848316k111039P821056
2821E938796R114470J780048j823398K863923O236985J263033n787977o871637
2813A2714243m057012l034293l028932m84824L438263N490769N164803K121861
2805A8324878m580360r975591m676490J0014132J7676734P407239r126456j3078105
2797A1985981m147562K614341L90657m605652q924915j5054629j8286861q533488
2789d4562128R960437J7619123O549245n974995j710386J2832786J7523705O915786
$$ plain form
2781 19153573 13053548 2746166 -4400030 -7265791 -7332705 -5686305 -2633575 1742419
2773 1742419 5581641 4467520 -3962204 -14939473 -20031443 -15556384 -4071302 10506993
2765 10506993 23445982 26981494 16692482 1299693 -3225654 6709900 16594482 12834875
2757 12834875 34361 -7822889 -7450154 -8180644 -15962947 -24437642 -23904919 -13831863
2749 -13831863 -3701170 -3215153 -12619046 -22459336 -24005709 -19781622 -20283353 -29142829
2741 -29142829 -36926713 -33957343 -24571680 -21550705 -28411268 -35313602 -33631855 -26943514
2733 -26943514 -23256281 -21728087 -13776143 3874926 23245515 33810981 33042783 25513299
2725 25513299 14944928 2483679 -7735438 -8172750 2610117 14045829 13642075 2692116
$$ packed form
2781A9153573o100025j0307382p146196k865761o6914J646400L052730M375994
2773A742419L839222j114121q429724j0977269n091970M475059J1485082J4578295
2765A0506993J2938989L535512j0289012j5392789m525347R935554R884582l759607
2757A2834875j2800514p857250L72735p30490p782303q474695N32723J0073056
2749a3831863J0130693M86017r403893r840290j546373M224087n01731q859476
2741b9142829p783884K969370R385663L020975o860563o902334J681747O688341
2733b6943514L687233J528194P951944J7651069J9370589J0565466p68198p529484
2725B5513299j0568371j2461249j0219117m37312J0782867J1435712m03754j0949959
$$ plain form
2717 2692116 -3730043 5787192 25770631 40541961 40901296 31037056 20676793 13829042
2709 13829042 5953336 -8809967 -28437314 -42459870 -42110473 -29815466 -15949947 -7279614
2701 -7279614 -2642591 422788 753197 -2332768 -5125835 -3871355 158633 3641999
2693 3641999 6145210 7905331 5873920 -2097720 -10648993 -11248463 -3982639 1259251
2685 1259251 -1776182 -6216171 -739568 14962777 28584220 28947029 17520861 5520901
2677 5520901 2614599 9719520 20068395 24789208 18903476 4886531 -9118058 -15965322
2669 -15965322 -14881457 -10349750 -7353990 -8785135 -14753337 -21015621 -20176023 -9866800
2661 -9866800 512046 -2313295 -18639671 -33005539 -32499662 -22450606 -17667132 -22056274
$$ packed form
2717B692116o422159R517235J9983439J4771330L59335r864240j0360263o847751
2709A3829042p875706j4763303j9627347j4022556L49397J2295007J3865519Q670333
2701g279614M637023L065379L30409l085965k793067J254480M029988L483366
2693C641999K503211J760121k031411p971640q551273n99470P265824N241890
2685A259251l035433m439989N476603J5702345J3621443L62809j1426168j1999960
2677E520901k906302P104921J0348875M720813n885732j4016945j4004589o847264
2669a5965322J083865M531707K995760j431145n968202o262284Q39598J0309223
2661i866800J0378846k825341j6326376j4365868N05877J0049056M783474m389142
$$ plain form
2653 -22056274 -25272370 -18939080 -7834444 -2135054 -4556958 -9572209 -11966882 -11393355
2645 -11393355 -9268542 -5437334 210168 4959430 5384617 2651853 2280192 6067262
2637 6067262 7622933 987602 -8650977 -10111726 -1588941 7772542 12811270 18344435
2629 18344435 26161368 27721098 18298477 8235418 8664734 13934054 11123295 565132
2621 565132 -7733450 -13024520 -21918825 -29447594 -21005511 3579164 24888923 28373925
2613 28373925 19202717 7453650 -5298934 -16449550 -15782937 -1197475 11501800 8244643
2605 8244643 -3780336 -9751894 -10644702 -16974856 -26642495 -27847551 -21396398 -21124509
2597 -21124509 -30384692 -36006007 -31223071 -27978832 -35892707 -42177417 -27993614 1157163
$$ packed form
2653b2056274l216096O333290J1104636N699390k421904n015251k394673N73527
2645a1393355K124813L831208N647502M749262M25187k732764l71661L787070
2637F067262J555671o635331r638579j460749Q522785R361483N038728N533165
2629A8344435P816933J559730r422621j0063059M29316N269320k810759j0558163
2621E65132q298582n291070q894305p528769Q442083K4584675K1309759L485002
2613B8373925r171208j1749067j2752584j1150616O66613J4585462J2699275l257157
2605H244643j2024979n971558q92808o330154r667639j205056O451153K71889
2597b1124509r260183n621315M782936L244239p913875o284710J4183803K9150777
$$ plain form
2589 1157163 17956129 7928951 -12043975 -16767439 -4390608 5741661 1544428 -9128465
2581 -9128465 -14862482 -15820321 -16311973 -14386069 -9291309 -9987398 -22966185 -37674154
2573 -37674154 -38196560 -25279031 -12064841 -2153232 10017369 18992122 10603745 -11618146
2565 -11618146 -24035358 -15303524 -1626493 446976 -3075481 -1012210 1591782 -3692241
2557 -3692241 -10386326 -9993762 -9322604 -15865657 -19135170 -7960251 5314819 1871785
2549 1871785 -11394243 -12562305 -1576330 1035482 -9746506 -16993712 -14174007 -16148462
2541 -16148462 -29830164 -38406637 -26738404 -3348629 14738952 23288833 26083115 23109174
2533 23109174 15037191 8869001 9398835 12651201 13035893 8674760 -2170365 -18785022
$$ packed form
2589A157163J6798966j0027178j9972926m723464J2376831J0132269m197233j0672893
2581i128465n734017r57839m91652J925904N094760o96089j2978787j4707969
2573c7674154n22406J2917529J3214190R911609J2170601Q974753q388377k2221891
2565a1618146j2417212Q731834J3677031K073469l522457K063271K603992n284023
2557c692241o694085L92564O71158o543053l269513J1174919J3275070l443034
2549A871785j3266028j168062J0985975K611812j0781988p247206K819705j974455
2541a6148462j3681702q576473J1668233K3389775J8087581Q549881K794282k973941
2533B3109174q071983o168190N29834L252366L84692m361133j0845125j6614657
$$ plain form
2525 -18785022 -31683257 -32491508 -29668460 -37158911 -48892453 -48219285 -43630385 -63182224
2517 -63182224 -102568013 -113294786 -66380013 476364 30440315 21416631 16822841
2510 16822841 35701439 52220976 44878032 29131053 29202544 43359748 52036391 44554521
2502 44554521 25752064 6138719 -6559830 -12706658 -20012077 -30530306 -31456736 -11492302
2494 -11492302 16007575 23068831 2285257 -24261042 -34992265 -31250299 -23831145 -14390216
2486 -14390216 -1354714 8998430 10709741 9105127 12008479 16568915 15956469 13889615
2478 13889615 20317451 34028477 40266693 28119539 4159435 -13885115 -14538464 -2621594
2470 -2621594 7063217 5549130 -2252935 -6711762 -6848845 -8606727 -12288798 -11193383
$$ packed form
2525a8785022j2898235q08251K823048p490451j1733542O73168M588900j9551839
2517f3182224l9385789j0726773M6914773O6856377K9963951r023684m593790
2510A6822841J8878598J6519537p342944j5746979P1491J4157204Q676643p481870
2502D4554521j8802457j9613345j2698549o146828p305419j0518229r26430J9964434
2494a1492302K7499877P061256k0783574k6546299j0731223L741966P419154R440929
2486a4390216J3035502J0353144J711311j604614K903352M560436o12446k066854
2478A3889615O427836J3711026O238216j2147154k3960104j8044550o53349J1916870
2470b621594R684811j514087p802065m458827j37083j757882l682071J095415
$$ plain form
2462 -11193383 -4134592 347569 -3250772 -8659408 -8054392 -4468418 -6469986 -14262194
2454 -14262194 -18269805 -10626959 6114098 20526503 20490034 3112494 -20738024 -34814035
2446 -34814035 -32450815 -20178901 -6969972 3025587 6200270 -1409327 -15088613 -21028567
2438 -21028567 -12903321 -593109 6428182 15059725 35048104 56998663 61013995 45613159
2430 45613159 31549825 34645914 49012154 60246123 61330728 51164503 31707468
2423 31707468 13453672 10324855 20495821 24619383 12462929 -1744830 -2253479 3843391
2415 3843391 1763856 -3561515 2892311 16401635 17239575 4215378 -2186485 5251540
2407 5251540 7906443 -5667222 -17737375 -9217676 9306980 14641316 5267577 -3241036
$$ packed form
2462a1193383P058791M482161l598341n408636O05016L585974k001568p792208
2454a4262194m007611P642846J6741057J4412405l6469j7377540k3850518j4076011
2446c4814035K363220J2271914J3208929R995559L174683p609597j3679286n939954
2438b1028567Q125246J2310212P021291Q631543J9988379K1950559M015332j5400836
2430D5613159j4063334L096089J4366240J1233969J084605j0166225j9457035
2423C1707468j8253796l128817J0170966M123562j2156454j4207759n08649O096870
2415C843391k079535n325371O453826J3509324Q37940j3024197o401863P438025
2407E251540K654903j3573665j2070153Q519699J8524656N334336r373739q508613
$$ plain form
2399 -3241036 -7237329 -15725044 -26658243 -26371100 -13797226 -4375811 -6099819 -10148617
2391 -10148617 -9979038 -11536075 -17392661 -17955973 -8640967 -1470636 -7962509 -21701904
2383 -21701904 -29205689 -28312010 -24532461 -18458152 -9627960 -5632303 -13428317 -25569514
2375 -25569514 -27988949 -19734316 -13728665 -18542088 -29096002 -35368402 -32105420 -20214477
2367 -20214477 -6050633 857373 -4137505 -15391553 -24360854 -29452929 -32726489 -31654663
2359 -31654663 -23602705 -15625335 -18670357 -31233799 -38001438 -27050417 -2391934 20748357
2351 20748357 27507878 12706715 -12815644 -26603113 -15242317 9066153 21879841
2344 21879841 15919712 5577608 1783696 -1891219 -11540382 -16689293 -5428566 13290826
$$ packed form
2399c241036l996293q487715j0933199K87143J2573874R421415j724008m048798
2391a0148617J69579j557037n856586n63312R315006P170331o491873j3739395
2383b1701904p503785Q93679L779549O074309Q830192L995657p796014j2141197
2375b5569514k419435Q254633O005651m813423j0553914o272400L262982J1890943
2367b0214477J4163844O908006m994878j1254048q969301n092075l273560J071826
2359c1654663Q051958P977370l045022j2563442o767639J0951021K4658483K3140291
2351B0748357O759521j4801163k5522359j3787469J1360796K4308470J2813688
2344B1879841n960129j0342104l793912l674915r649163n148911J1260727J8719392
$$ plain form
2336 13290826 18443627 5595711 -7907823 -8777962 -5880136 -14822830 -32756079 -40111570
2328 -40111570 -27078505 -8267755 -5257199 -19823567 -32444244 -26394998 -5334533
2321 -5334533 15025712 25012378 25935662 23234360 21530915 23102005 25327584 22178401
2313 22178401 12454869 2145068 -5866566 -17222532 -33573715 -42763418 -33719180 -15339771
2305 -15339771 -5889178 -7155534 -5939342 60005 -2119052 -15098177 -21546156 -10332140
2297 -10332140 4664131 4972457 -7159793 -18608458 -28316461 -42128882 -52351668 -42936565
2289 -42936565 -14872945 10454610 16660092 8913854 2041110 2582471 6546329 6733169
2281 6733169 -1598144 -16439792 -28082494 -27914035 -19645029 -16294868 -24687324 -38090928
$$ packed form
2336A3290826N152801j2847916j3503534q70139K897826q942694j7933249p355491
2328d0111570J3033065J8810750L010556j4566368j2620677O049246K1060465
2321e334533K0360245R986666R23284k701302j703445J571090K225579l149183
2313B2178401r723532j0309801q011634j1355966j6351183r189703R044238J8379409
2305a5339771R450593j266356J216192N999347k179057j2979125o447979J1214016
2297a0332140J4996271L08326j2132250j1448665r708003j3812421j0222786R415103
2289d2936565K8063620K5327555O205482p746238o872744N41361L963858J86840
2281F733169q331313j4841648j1642702J68459Q269006L350161q392456j3403604
$$ plain form
2273 -38090928 -45212268 -41385991 -30083674 -18513949 -12653986 -11923211 -8391944 3936026
2265 3936026 19372632 25874690 20176121 11112418 7015381 6684177 4948744 648946
2257 648946 -4095407 -7220624 -6283015 437380 9343211 12466753 6174186 -4430239
2249 -4430239 -11567934 -11407688 -4088924 6828093 13426085 9397184 326681 299663 13236773
2240 13236773 25485270 24035677 14446428 10802819 13987116 12843513 4763030 1194303
2232 1194303 9812208 22485742 26297779 18592469 5966885 -5286126 -12752117 -17063601
2224 -17063601 -21763710 -29607181 -36443793 -34940104 -27109460 -24554490 -30900405 -33548406
2216 -33548406 -21946973 -5454157 -424678 -5549467 -5230342 5010860 13122237 11857907
$$ packed form
2273c8090928p121340L826277J1302317J1569725N859963P30775L531267J2327970
2265C936026J5436606O502058n698569r063703m097037l31204j735433m299798
2257F48946m744353l125217R37609O720395Q905831L123542o292567j0604425
2249d430239p137695J60246P318764J0917017O597992m028901r070503k7018J2937110
2240A3236773J2248497j449593r589249l643609L184297j143603q080483l568727
2232A194303Q617905J2673534L812037p705310j2625584j1253011p465991m311484
2224a7063601m700109p843471o836612J503689P830644K554970o345915k648001
2216c3548406J1601433J6492816N029479n124789L19125J0241202Q111377j264330
$$ plain form
2208 11857907 8560139 8373547 4455529 -5205121 -6392591 10754455 29937247 25287514
2200 25287514 -3915979 -31444730 -37265580 -28152151 -22230353 -25401657 -29338828 -24979279
2192 -24979279 -11611036 3954862 13798929 16158359 16097066 16851610 14377928 5801545
2184 5801545 -2038204 -1885793 511910 -4892490 -12805679 -8042956 7706735 13090942
2176 13090942 -1314332 -16242039 -11594703 3601008 6579182 -3786814 -7461099 4247285
2168 4247285 16692098 15126188 3424635 -6242108 -9578958 -8860287 -5295845 -599799
2160 -599799 251738 -5272274 -12814145 -16769870 -15962655 -10492072 732731 14252108
2152 14252108 20266217 14354596 6970021 12175932 27587603 34154826 18634441 -9785707
$$ packed form
2208A1857907l297768j86592l918018r660650j187470J7147046J9182792m649733
2200B5287514k9203493k7528751n820850R113429N921798l171304l937171M359549
2192b4979279J3368243J5565898R844067K359430o1293P54544k473682q576383
2184E801545p839749J52411K397703n404400p913189M762723J5749691N384207
2176A3090942j4405274j4927707M647336J5195711K978174j0365996l674285J1708384
2168D247285J2444813j565910j1701553r666743l336850P18671L564442M696046
2160e99799Q51537n524012p541871l955725Q07215N470583J1224803J3519377
2152A4252108O014109n911621p384575N205911J5411671O567223j5520385k8420148
$$ plain form
2144 -9785707 -29476032 -29628365 -19170943 -13514502 -16705041 -18948685 -10410499 5674166
2136 5674166 15760687 11096215 -2807360 -13211736 -14258607 -10689955 -8291719 -5718699
2128 -5718699 829347 7831710 5433841 -9876755 -27445874 -31327460 -16644251 5258914
2120 5258914 18057253 15249539 3953317 -4003148 -3529842 795252 1938200 -1779334
2112 -1779334 -7854781 -15867859 -26534542 -33877200 -26381482 -1904348 24040407 32780554
2104 32780554 22238930 4515453 -12610053 -30719570 -48406917 -57440838 -55320941
2097 -55320941 -49830801 -44917262 -33353695 -12266350 4748616 4079089 -6102216 -5377134
2089 -5377134 9861068 21604009 16069375 814778 -9075781 -10579612 -10294530 -10137346
$$ packed form
2144i785707j9690325j52333J0457422N656441l190539k243644Q538186J6084665
2136E674166J0086521m664472j3903575j0404376j046871L568652K398236K573020
2128e718699O548046P002363k397869j5310596j7569119l881586J4683209K1903165
2120E258914J2798339k807714j1296222p956465M73306M325094J142948l717534
2112a779334o075447q013078j0666683p342658P495718K4477134K5944755Q740147
2104C2780554j0541624j7723477j7125506j8109517j7687347r033921K119897
2097e5320941N490140M913539J1563567K1087345J7014966o69527j0181305P25082
2089e377134J5238202J1742941n534634j5254597r890559j503831K85082J57184
$$ plain form
2081 -10137346 -5890722 1888588 4235009 -6348259 -26228481 -43366796 -48657614 -43341690
2073 -43341690 -35616854 -31461502 -30072364 -27428687 -21464842 -12794323 -3223318 4168754
2065 4168754 5491525 -811283 -12118790 -24006211 -32646686 -34528783 -27878130 -16361346
2057 -16361346 -6943501 -1227426 5958602 15531474 18398140 8010867 -6764349 -11238385
2049 -11238385 -4627485 456237 -2506674 -6661605 -6317511 -7009860 -14471055 -22335911
2041 -22335911 -19820394 -7326845 3782365 5360026 -411242 -8112219 -17209086 -30018860
2033 -30018860 -44087229 -50575372 -42673677 -25227890 -12522217 -13826384 -23720807 -30715654
2025 -30715654 -32888420 -38385835 -50708660 -61227679 -59330267 -44040733 -21848680 1487165
$$ packed form
2081a0137346M246624P779310K346421j0583268j9880222j7138315n290818N315924
2073d3341690P724836M155352J389138K643677N963845Q670519R571005P392072
2065D168754J322771o302808j1307507j1887421q640475j882097O650653J1516784
2057a6361346R417845N716075P186028R572872K866666j0387273j4775216m474036
2049a1238385O610900N083722k962911m154931L44094o92349p461195p864856
2041b2335911K515517J2493549J1109210J577661n771268p700977r096867j2809774
2033c0018860j4068369o488143P901695J7445787J2705673j304167r894423o994847
2025c0715654k172766n497415j2322825j0519019J897412J5289534K2192053K3335845
$$ plain form
2017 1487165 21854106 34131534 35796798 32006497 30998907 33924580 33974946 26585710
2009 26585710 15997862 9237214 6879329 3323673 -5265669 -16840543 -26643208 -30213356
2001 -30213356 -22601979 -793911 27742670 43298435 30337091 -2650309 -27775371
1994 -27775371 -26783001 -9633608 744590 -3896747 -12188726 -11343837 -484188 13498811
1986 13498811 24031970 26565309 19751891 8865309 2861758 3968063 3929959 -5168056
1978 -5168056 -18974289 -24899415 -18181242 -9107512 -10594545 -20943569 -25457183 -17181090
1970 -17181090 -8251171 -12663249 -23652227 -21781049 -4843917 6625501 -850149 -14466824
1962 -14466824 -16205845 -8508507 -4135328 -2978788 1942067 4495566 -5850771 -19279843
$$ packed form
2017A487165K0366941J2277428J665264l790301j007590K925673N0366p389236
2009B6585710j0587848o760648k357885l555656q589342j1574874r802665l570148
2001c0213356P611377K1808068K8536581J5555765j2961344l2987400k5125062
1994b7775371R92370J7149393J0378198m641337q291979Q44889J0859649J3982999
1986A3498811J0533159K533339o813418j0886582o003551J106305l8104r098015
1978e168056j3806233n925126O718173R073730j487033j0349024m513614Q276093
1970a7181090Q929919m412078j0988978J871178J6937132J1469418p475650j3616675
1962a4466824j739021P697338M373179J156540M920855K553499j0346337j3429072
$$ plain form
1954 -19279843 -13793827 10008713 25280205 16104295 -2325082 -9077233 -3906353 2397688
1946 2397688 6646061 9032019 4597026 -7150542 -15473115 -13937556 -11742780 -17180803
1938 -17180803 -21709950 -15159181 -5760082 -7716155 -16787989 -16259072 -2297740 13622103
1930 13622103 23940000 29910682 29828865 19464136 4109461 -5503255 -9814382 -17872682
1922 -17872682 -27702489 -25807811 -9542452 5937908 8754390 4332213 1835442 -209928
1914 -209928 -6264230 -12708157 -13803912 -10576703 -5600810 3265795 15414105 21076558
1906 21076558 12632947 -2104965 -7762913 -485559 9281944 11996504 8988265 6413718
1898 6413718 5906713 4143249 -1614820 -9864897 -15640812 -14402968 -6088367 4751436
$$ packed form
1954a9279843N486016K3802540J5271492r175910j8429377o752151N170880O304041
1946B397688M248373K385958m434993j1747568q322573J535559K194776n438023
1938a7180803m529147O550769R399099j956073r071834N28917J3961332J5919843
1930A3622103J0317897N970682q1817j0364729j5354675r612716m311127q058300
1922a7872682r829807J894678J6265359J5480360K816482m422177k496771k045370
1914b09928o054302o443927j095755L227209M975893Q866605J2148310N662453
1906B1076558q443611j4737912n657948P277354R767503K714560l008239k574547
1898F413718n07005j763464n758069q250077n775915J237844Q314601J0839803
$$ plain form
1890 4751436 13442977 19092355 23101613 24651237 19536843 4833067 -15158412 -29369692
1882 -29369692 -29207763 -17805131 -7375518 -6531043 -13415588 -22060451 -29775298 -34675179
1874 -34675179 -31965584 -19575523 -3883500 7299165 14682622 22963032 29275811 26012126
1866 26012126 14573338 5700186 4028921 2436784 -4170704 -9029939 -4194927 6121431
1858 6121431 10736977 5641869 -4198015 -13645327 -20150529 -19419521 -7012929 13390170
1850 13390170 29231838 30344056 18072624 637487 -16895416 -32997324 -42397463
1843 -42397463 -37301137 -19944433 -6592671 -10311780 -23467711 -27961399 -21329681 -18795569
1835 -18795569 -26407293 -28243899 -10473071 15494347 28745683 27932922 27252718 30006252
$$ packed form
1890D751436Q691541N649378M009258J549624n114394j4703776j9991479j4211280
1882b9369692J61929J1402632J0429613Q44475o884545q644863p714847m899881
1874c4675179K709595J2390061J5692023J1182665P383457Q280410O312779l263685
1866B6012126j1438788q873152j671265j592137o607488m859235M835012J0316358
1858F121431M615546n095108r839884r447312o505202P31008J2406592K0403099
1850A3390170J5841668J112218j2271432j7435137j7532903j6101908r400139
1843d2397463N096326J7356704J3351762l719109j3155931m493688O631718K534112
1835a8795569p611724j836606J7770828K5967418J3251336q12761o80204K753534
$$ plain form
1827 30006252 26118598 14090914 4945225 1885789 -4678453 -16917620 -23159730 -19114843
1819 -19114843 -17395753 -25771371 -33091330 -29534847 -24737110 -30106997 -37460077 -33894056
1811 -33894056 -26151512 -28584679 -34774706 -24961918 589103 18863599 16922826 6530018
1803 6530018 1511029 556072 137281 5914999 19924024 31013945 30199334 23989263
1795 23989263 21217798 17979166 8028440 -2908321 -8157964 -15918783 -35908020 -55949777
1787 -55949777 -52411948 -24397271 1450681 4749938 -6501983 -14137627 -14541945 -14644587
1779 -14644587 -15224537 -11161600 -1736298 10145263 23880157 36904903 40127578 28053611
1771 28053611 8748605 -7063591 -21658935 -41654138 -57822349 -51430966 -22833588
$$ packed form
1827C0006252l887654j2027684r145689l059436o564242j2239167o242110M044887
1819a9114843J719090q375618p319959L556483M797737n369887p353080L566021
1811c3894056P742544k433167o190027R812788K5551021J8274496j940773j0392808
1803F530018n018989r54957m18791N777718J4009025J1089921q14611o210071
1795B3989263k771465l238632r950726j0936761n249643p760819j9989237k0041757
1787e5949777L537829K8014677K5847952L299257j1251921p635644m04318j02642
1779a4644587n79950M062937R425302J1881561J3734894J3024746L222675j2073967
1771B8053611j9305006j5812196j4595344j9995203j6168211O391383K8597378
$$ plain form
1764 -22833588 3468834 9028269 2086217 -551207 1846100 174622 -4460887 -2840858
1756 -2840858 5301355 10940325 10592565 8873713 7334085 3034676 -1589053 454534
1748 454534 8372714 13401768 13197673 14742989 19522718 18791805 10474713 8118282 21408715
1739 21408715 36729181 31600777 5092809 -19925991 -25230225 -15634697 -6257593 -3278513
1731 -3278513 -4114713 -7435573 -12748988 -14446949 -6974882 4213576 5996793 -6046705
1723 -6046705 -22263183 -32784087 -38786841 -44773090 -47439128 -41096194 -29551972 -22719476
1715 -22719476 -23270683 -25941238 -28885204 -35384313 -43474084 -44162325 -32788308 -13882356
1707 -13882356 6617194 24506604 31993653 22160694 2793885 -7284054 -1878905 5139822
$$ packed form
1764b2833588K6302422N559435o942052k637424K397307j671478m635509J620029
1756b840858Q142213N638970l47760j718852j539628m299409m623729K043587
1748D54534P918180N029054k04095J545316M779729p30913q317092k356431J3290433
1739B1408715J5320466n128404k6507968k5018800n304234R595528R377104K979080
1731c278513q36200l320860n313415j697961P472067J1188458J783217j2043498
1723f046705j6216478j0520904o002754n986249k666038O342934J1544222O832496
1715b2719476n51207k670555k943966o499109q089771o88241J1374017J8905952
1707a3882356K0499550J7889410P487049r832959j9366809j0077939N405149P018727
$$ plain form
1699 5139822 2843187 -599674 5176148 13653245 12752732 4033306 -3327274 -7826700
1691 -7826700 -11222755 -9032341 21360 5328845 274219 -4273982 1767496 9281464
1683 9281464 8511753 10530484 26319747 39965196 31791927 13754260 8367051 8127419
1675 8127419 -2250046 -209945 37927070 59472827 -27930931 -215905982 -362468699
1668 -362468699 -349020056 -218853289 -105431113 -67634354 -62245728 -47494031 -33002497
1661 -33002497 -29424292 -20580128 -2878268 410208 -17214341 -30185819 -25488393 -22947241
1653 -22947241 -33927668 -38160759 -22445389 -6986957 -9015710 -12138561 799632 12942350
1645 12942350 2847489 -14587691 -11202263 6630412 8923166 -8229269 -18949108
$$ packed form
1699E139822k296635l442861N775822Q477097r00513q719426p360580m499426
1691g826700l396055K190414R053701N307485n054626m548201O041478P513968
1683I281464p69711K018731J5789263J3645449q173269j8037667n387209k39632
1675H127419j0377465K040101L8137015K1545757q7403758j87975051j46562717
1668c62468699J3448643J30166767J13422176L7796759N388626J4751697J4491534
1661c3002497L578205Q844164J7701860L288476j7624549j2971478M697426K541152
1653b2947241j0980427m233091J5715370J5458432k028753l122851J2938193J2142718
1645A2942350j0094861j7435180L385428J7832675K292754j7152435j0719839
$$ plain form
1638 -18949108 -11643793 -4063501 -9593521 -17606152 -16972931 -15680097 -23427937 -32696727
1630 -32696727 -32769743 -30077281 -37693901 -51287297 -52470304 -35694232 -17131609 -12246743
1622 -12246743 -15947081 -13368988 -2687798 4382471 2165335 -1806241 -1881384 -4369884
1614 -4369884 -14983181 -25533642 -23566184 -9732164 4444865 11784449 12583718 7428114
1606 7428114 -1124039 -3399307 6842891 18159642 12625681 -7873622 -21666486 -16311425
1598 -16311425 -2224140 7182569 12585450 17658979 16264245 3364259 -12115127 -18621043
1590 -18621043 -18882611 -23164608 -31095010 -32421090 -23038631 -9539328 1040295 7059210
1582 7059210 8285185 3770929 -5249245 -15053480 -22322017 -24874609 -21518403 -13918676
$$ packed form
1638a8949108P305315P580292n530020q012631O33221J292834p747840r268790
1630c2696727p3016K692462p616620j3593396j183007J6776072J8562623M884866
1622a2246743l700338K578093J0681190P070269k217136l971576p5143k488500
1614d369884j0613297j0550461J967458J3834020J4177029P339584P99269n155604
1606G428114q552153k275268J0242198J1316751n533961k0499303j3792864N355061
1598a6311425J4087285R406709N402881N073529j394734j2899986j5479386o505916
1590a8621043k61568m281997p930402j326080R382459J3499303J0579623O018915
1582G059210J225975m514256r020174r804235p268537k552592L356206P599727
$$ plain form
1574 -13918676 -6070377 677315 9050142 20075957 29727898 33884931 32762152 28251016
1566 28251016 21417553 14789281 11641523 9896363 1959829 -15688938 -36704053 -50972014
1558 -50972014 -52595833 -41724603 -25045900 -14986388 -19835271 -32362748 -36660038 -28386805
1550 -28386805 -18611789 -15384090 -13769470 -8957137 -5968170 -8391181 -9816405 -6004222
1542 -6004222 -3515716 -4960119 2029404 26177308 52899733 60469803 49073698 35993520
1534 35993520 27153860 14187043 -989874 -1402077 17788754 35572896 30822471 10092645
1526 10092645 -3253777 -1012043 2089104 -8167576 -25549203 -32239741 -22640605 -11099778
1518 -11099778 -14152293 -29921260 -40890288 -35849214 -21890821 -12486484 -10468370 -7762953
$$ packed form
1574a3918676P848299O747692Q372827J1025815R651941M157033j122779m511136
1566B8251016o833463o628272l147758j745160p936534j7648767k1015115j4267961
1558e0972014j623819J0871230J6678703J0059512m848883j2527477m297290Q273233
1550b8386805R775016L227699J614620M812333K988967k423011j425224L812183
1542f004222K488506j444403O989523K4147904K6722425P570070j1396105j3080178
1534C5993520q839660j2966817j5176917m12203J9190831J7784142m750425k0729826
1526A0092645j3346422K241734L101147j0256680j7381627o690538R599136J1540827
1518a1099778l052515j5768967j0969028N041074J3958393R404337K018114K705417
$$ plain form
1510 -7762953 2280674 17048879 26579371 21113656 1145440 -18029954 -18023108 2863206
1502 2863206 27294039 38787632 36121922 25408625 9738866 -5973192 -11595922 -4612788
1494 -4612788 2410624 -1129368 -7692641 -5468264 -33611 -5521175 -19365750 -24292640
1486 -24292640 -14541583 -2458902 2815870 6263387 11877634 11997871 -330572 -19367011
1478 -19367011 -34651311 -42666763 -44372777 -38948048 -26845071 -13607491 -4838222 -1039204
1470 -1039204 -851834 -4815512 -12202378 -18068437 -17562503 -11818106 -7895380 -13324244 -29029142
1461 -29029142 -45452608 -48766680 -35180754 -16514251 -7285106 -9511251 -14711998 -16078258
1453 -16078258 -12603354 -6427792 -3176088 -9087500 -20090246 -21645423 -9829223 -2890703
$$ packed form
1510g762953J0043627J4768205R530492n465715j9968216j9175394O846K0886314
1502B863206K4430833J1493593k665710j0713297j5669759j5712058n622730O983134
1494d612788P023412l539992o563273K224377N434653n487564j3844575m926890
1486b4292640R751057J2082681N274772L447517N614247J20237j2328443j9036439
1478a9367011j5284300q015452j706014N424729J2102977J3237580Q769269L799018
1470a039204J87370l963678p386866n866059N05934N744397L922726n428864j5704898
1461b9029142j6423466l314072J3585926J8666503R229145k226145n200747j366260
1453a6078258L474904O175562L251704n911412j1002746j555177J1816200O938520
$$ plain form
1445 -2890703 -16325621 -35138670 -32184356 -10058384 259964 -14611020 -30949567
1438 -30949567 -24187660 -2903184 8246232 3235068 -4562951 -5724307 -2689578 -116620
1430 -116620 -536639 -6212260 -15553843 -21203834 -19314888 -16029769 -17476751 -18786504 -11183294
1421 -11183294 4363478 18157843 22812585 17001748 2700066 -14228091 -23964223 -20095604
1413 -20095604 -6258411 7211060 10525222 -1550624 -25165119 -44518675 -43301298
1406 -43301298 -24665632 -10928143 -16344812 -28548161 -25429640 -2827115 24418558
1399 24418558 42597281 48844131 44360615 30048225 10124918 -8026289 -20055762
1392 -20055762 -26950615 -30980466 -32132304 -28404320 -19121013 -9578360 -10054690 -24004235
$$ packed form
1445b890703j3434918j8813049K954314K2125972J0318348j4870984j6338547
1438c0949567O761907K1284476J1149416n011164p798019j161356L034729K572958
1430a16620m20019n675621r341583n649991J888946L285119j446982j309753P603210
1421a1183294J5546772J3794365M654742n810837j4301682j6928157r736132L868619
1413b0095604J3837193J3469471L314162j2075846k3614495j9353556J217377
1406d3301298J8635666J3737489n416669j2203349L118521K2602525K7245673
1399B4418558J8178723O246850m483516j4312390j9923307j8151207j2029473
1392b0055762o894853m029851j151838L727984R283307R542653m76330j3949545
$$ plain form
1384 -24004235 -38868464 -38303460 -24009182 -13566998 -14035274 -12115789 2632412 19734142
1376 19734142 24656094 21193597 21942622 25383083 19755255 5913717 -556872 8567519
1368 8567519 22731611 26681243 17604650 5063640 -1503387 -3177924 -9740522 -25054952
1360 -25054952 -36310996 -27405214 -4213240 7462923 -4239588 -20204950 -18109867
1353 -18109867 -2505263 8614917 14336357 27058362 45725399 54962044 49134338 38038829
1345 38038829 28953167 20581862 14525485 14915176 15822798 6769874 -7463035 -10401813
1337 -10401813 -264902 5141826 -5181784 -20987913 -28601715 -27462067 -22941410 -18113490
1329 -18113490 -18479945 -28508485 -36926275 -23652230 9151664 31475974 23852581 3956654
$$ packed form
1384b4004235j4864229N65004J4294278J0442184m68276J919485J4748201J7101730
1376A9734142M921952l462497P49025L440461n627828j3841538o470589R124391
1368H567519J4164092L949632r076593j2541010o567027j674537o562598j5314430
1360b5054952j1256044Q905782K3191974J1676163j1702511j5965362K095083
1353a8109867J5604604J1120180N721440J2722005J8667037R236645n827706j1095509
1345C8038829r085662q371305o056377L89691R07622r052924j4232909k938778
1337a0401813J0136911N406728j0323610j5806129p613802J139648M520657M827920
1329a8113490l66455j0028540q417790J3274045L2803894K2324310p623393j9895927
$$ plain form
1321 3956654 -1319243 5542923 2679504 -13970562 -27220039 -28228554 -27081230 -31900765
1313 -31900765 -35942143 -31171217 -21329143 -14916977 -13961041 -15227048 -16825243 -19445181
1305 -19445181 -24000614 -29599461 -32475253 -29122634 -22945594 -23018059 -31166393 -35587031
1297 -35587031 -24981759 -4997804 8235836 8162605 2058715 -2728462 -6242285 -9389946
1289 -9389946 -10310092 -9636321 -10552030 -10711524 -2619161 13681548 25950021 23822685 12352772
1280 12352772 5194709 7306941 10509435 5506773 -6779648 -17664448 -22194267 -25247881
1272 -25247881 -34190543 -46387670 -49029234 -35006914 -14714017 -4934897 -7524473 -7970915
1264 -7970915 2982292 15518834 14710955 1721781 -7757541 -3925931 6822489 12776670
$$ packed form
1321C956654n275897O862166k863419j6650066j3249477j008515J147324m819535
1313c1900765m041378M770926R842074O412166R55936j266007j598195k619938
1305a9445181m555433n598847k875792L352619O177040p2465q148334m420638
1297c5587031J0605272J9983955J3233640p3231o103890m787177l513823l147661
1289i389946r20146O73771r15709j59494Q092363J6300709J2268473k127336j1469913
1280A2352772p158063K112232L202494n002662j2286421j0884800m529819l053614
1272b5247881q942662j2197127k641564J4022320K0292897R779120k589576m46442
1264g970915J0953207J2536542q07879j2989174r479322L831610J0748420N954181
$$ plain form
1256 12776670 10690801 5406609 1134767 -1712951 -3260852 -2742490 -593485 1400200
1248 1400200 2968748 5973280 11032684 15524291 16456533 13817628 9439997 4208694
1240 4208694 -933147 -2456561 2786651 10722286 10648547 -2903810 -20947184 -28281072
1232 -28281072 -21444436 -12477290 -11672699 -12725615 -2585690 16945842 28018979 19678498
1224 19678498 2437974 -6622684 -5957181 -7373701 -16242239 -25260834 -27689773 -26135715
1216 -26135715 -25706966 -27415512 -31653694 -39922208 -49163949 -52276900 -48496799 -45021552
1208 -45021552 -43664961 -35975200 -19272834 -7110910 -11574391 -22341078 -17883556 5134178
1200 5134178 27381284 31914679 21476297 9074773 2560264 2247734 4816615 4877435
$$ packed form
1256A2776670k085869n284192m271842k847718j547901N18362K149005J993685
1248A400200J568548L004532N059404M491607R32242k638905m377631n231303
1240D208694n141841j523414N243212P935635p3739j3552357j8043374p333888
1232b8281072O836636Q967146Q04591j052916J0139925J9531532J1073137q340481
1224A9678498j7240524r060658O65503j416520q868538r018595k428939J554058
1216b6135715M28749j708546m238182q268514r241741l112951L780101L475247
1208d5021552J356591P689761J6702366J2161924m463481j0766687M457522K3017734
1200E134178K2247106M533395j0438382j2401524o514509l12530K568881O0820
$$ plain form
1192 4877435 -1441645 -11220214 -17172760 -16132144 -11020232 -5930719 -4847300 -12226679
1184 -12226679 -26696868 -36919965 -33851350 -25206474 -26008759 -35661951 -38080386 -25962157
1176 -25962157 -10427153 -2821275 -1577678 -2935745 -9772012 -20818800 -24633590 -15851595
1168 -15851595 -6684812 -10038954 -20084169 -22465214 -16749580 -15004551 -22108282 -30430092
1160 -30430092 -32876546 -30800897 -28967527 -30053762 -33520469 -35141441 -30530049 -22678944
1152 -22678944 -19891859 -21975091 -17833889 -4033877 5260349 -1696219 -14591713 -16643114
1144 -16643114 -11753530 -17680626 -36136809 -49491002 -47794630 -39963735 -33780278 -22669903
1136 -22669903 -1080321 20713201 27883652 19089174 5246209 -3364112 -2833051 4892370
$$ packed form
1192D877435o319080r778569n952546J040616N111912N089513J083419p379379
1184a2226679j4470189j0223097L068615Q644876q02285r653192k418435J2118229
1176b5962157J5535004P605878J243597j358067o836267j1046788l814790Q781995
1168a5851595R166783l354142j0045215k381045N715634J745029p103731q321810
1160c0430092k446454K075649J833370j086235l466707j620972M611392P851105
1152b2678944K787085k083232M141202J3800012R294226o956568j2895494k051401
1144a6643114M889584n927096j8456183j3354193J696372P830895O183457J1110375
1136b2669903K1589582K1793522P170451q794478j3842965q610321N31061P725421
$$ plain form
1128 4892370 12017247 9452938 -3391094 -17153444 -23649127 -23241728 -18779481 -9393095
1120 -9393095 4689812 16815077 19578961 13469241 5800403 2392902 2360622 178277
1112 178277 -7059891 -13780879 -11105973 -1003131 1504176 -11618373 -25976337 -22589830
1104 -22589830 -6836441 -2122739 -14588971 -24294782 -17705276 -8516575 -13299326 -23935425
1096 -23935425 -22700966 -12832223 -12747793 -25009352 -31965339 -23169552 -9401149 -5117261
1088 -5117261 -11136787 -20538308 -30277487 -39707797 -45401569 -44359505 -37925868 -28298348
1080 -28298348 -15329374 214867 14534619 24413272 28775744 25282269 11203940 -9607175
1072 -9607175 -26359832 -31643322 -27424214 -18023778 -3893005 12320545 20508897 13369863
$$ packed form
1128D892370P124877k564309j2844032j3762350o495683M07399M462247R386386
1120i393095J4082907J2125265K763884o109720p668838l407501l2280k182345
1112A78277p238168o720988K674906J0102842K507307j3122549j4357964L386507
1104b2589830J5753389M713702j2466232r705811O589506R188701m782751j0636099
1096b3935425J234459R868743Q4430j2261559o955987Q795787J3768403M283888
1088e117261o019526r401521r739179r430310n693772J042064O433637R627520
1080b8298348J2968974J5544241J4319752R878653M362472l493475j4078329k0811115
1072i607175j6752657n283490M219108R400436J4130773J6213550Q188352p139034
$$ plain form
1064 13369863 -1064767 -7096719 -1580271 2995944 -2287588 -10410110 -11135576 -7665525
1056 -7665525 -10568138 -19194561 -20939280 -10251533 2030993 3212214 -5302591 -13315259
1048 -13315259 -17102521 -20426522 -23079473 -18602454 -5462361 7273701 9970124 3918805
1040 3918805 -1354042 -69032 3984858 3085006 -4999971 -13910910 -15735779 -11369642
1032 -11369642 -10831380 -20129698 -30996121 -29930724 -16356442 -4056834 -3190035 -8965620
1024 -8965620 -12001956 -11984624 -14059135 -17465164 -16900463 -12944084 -12174731 -16424543 -19735552
1015 -19735552 -18253506 -16196589 -17518767 -16773340 -5205906 14725009 27212111 19235974
1007 19235974 -3073355 -18157734 -10448110 13848545 33826817 34773846 19528917 1214419
$$ packed form
1064A3369863j4434630o031952N516448M576215n283532q122522p25466L470051
1056g665525k902613q626423j744719J0687747J2282526J181221q514805q012668
1048a3315259l787262l324001k652951M477019J3140093J2736062K696423o051319
1040C918805n272847J285010M053890q99852q084977q910939j824869M366137
1032a1369642N38262r298318j0866423J065397J3574282J2299608Q66799n775585
1024h965620l036336J7332k074511l406029N64701L956379P69353m249812l311009
1015a9735552J482046K056917j322178P45427J1567434J9930915J2487102p976137
1007A9235974k2309329j5084379P709624K4296655J9978272R47029j5244929j8314498
$$ plain form
999 1214419 -10100760 -12805673 -11250414 -11344361 -15682474 -20177231 -18417640 -12133892 -13047553
990 -13047553 -28715326 -49305528 -56030349 -43057844 -23712589 -12531795 -8674387 -2851977
982 -2851977 5486692 7811295 2104680 -2133708 1085299 3010503 -7406270 -24843362
974 -24843362 -32465779 -25083207 -16049967 -17212714 -22687209 -20710631 -13123552 -10825881
966 -10825881 -13573471 -8303397 9839492 26294936 23589860 2588237 -19314892 -28014889
958 -28014889 -25410051 -23392756 -28762755 -35302080 -31726005 -17884811 -8572611 -15966048
950 -15966048 -32201385 -38443541 -29733971 -19510812 -18137414 -20077275 -18090730 -17353097
942 -17353097 -25014039 -34993485 -35431017 -25693114 -14549515 -5983461 1301266 3745082
$$ packed form
999A214419j1315179k704913J555259r3947m338113m494757J759591O283748r13661
990a3047553j5667773k0590202o724821J2972505J9345255J1180794L857408N822410
982b851977Q338669K324603n706615m238388L219007J925204j0416773j7437092
974b4843362p622417P382572R033240j162747n474495J976578P587079K297671
966a0825881k747590N270074J8142889J6455444k705076k1001623k1903129q699997
958b8014889K604838K017295n369999o539325L576075J3841194R312200p393437
950a5966048j6235337o242156Q709570J0223159J373398j939861J986545P37633
942a7353097p660942r979446m37532R737903J1143599Q566054P284727K443816
$$ plain form
934 3745082 -4357674 -18459774 -26530215 -25664219 -24884627 -29587877 -34382055 -34617797 -34157831
925 -34157831 -36559150 -37763177 -33238837 -24537351 -13527815 1716169 19114814 28640175
917 28640175 23843449 10941701 -1069772 -12712614 -27393431 -38539767 -35162411 -18204661
909 -18204661 -676954 8297505 10492871 10216213 8864879 8801586 12858164 17512728 15510583
900 15510583 8054124 5067282 9589576 12029903 5856866 -1250362 -585479 2804055
892 2804055 464401 -1752100 8411448 26946910 35043116 25053421 10436436 5404838
884 5404838 8026399 10000735 10570947 11393483 8030981 -2409657 -12933750 -16684485
876 -16684485 -18098899 -22671389 -23018608 -9395258 11209510 22464855 22391006 23044411
$$ packed form
934C745082q102756j4102100q070441Q65996P79592m703250m794178k35742M59966
925c4157831k401319j204027M524340Q701486J1009536J5243984J7398645R525361
917B8640175m796726j2901748j2011473j1642842j4680817j1146336L377356J6957750
909a8204661J7527707Q974459K195366k76658j351334o3293M056578M654564k002145
900A5510583p456459k986842M522294K440327o173037p107228O64883L389534
892B804055k339654k216501J0163548J8535462Q096206r989695j4616985n031598
884E404838K621561J974336N70212Q22536l362502j0440638j0524093l750735
876a6684485j414414m572490l47219J3623350K0604768J1255345p3849O53405
$$ plain form
868 23044411 27927722 28420514 24100689 25637394 31372006 22949680 -3506432 -22155128
860 -22155128 -11607225 11310136 13880742 -6748270 -24024060 -23190752 -17014411 -18850873
852 -18850873 -23678889 -23787208 -24079613 -30227607 -35307342 -30214315 -17940499 -6895357
844 -6895357 2221451 12388859 19154737 14697684 701065 -11746683 -14717810 -9893841
836 -9893841 -3290075 1272222 3345907 3631242 949088 -7823617 -21363927 -28846908
828 -28846908 -19556465 425 8098614 -6439143 -28243814 -33864913 -20191925 -4348667
820 -4348667 206643 -4676770 -12606656 -21907874 -30912250 -34596246 -31543062 -27303657
812 -27303657 -26178282 -25908071 -24984927 -28251864 -38178978 -45480749 -37109375 -12658615
$$ packed form
868B3044411M883311M92792m319825J536705N734612q422326k6456112j8648696
860b2155128J0547903K2917361K570606k0629012j7275790Q33308O176341j836462
852a8850873m828016j08319k92405o147994n079735N093027J2273816J1045142
844f895357R116808J0167408O765878m457053j3996619j2447748k971127M823969
836i893841O603766M562297K073685K85335k682154q772705j3540310p482981
828b8846908R290443J9556890Q098189j4537757k1804671n621099J3672988J5843258
820d348667M555310m883413p929886r301218r004376l683996L053184M239405
812b7303657J125375K70211R23144l266937r927114p301771Q371374K4450760
$$ plain form
804 -12658615 13850869 28629760 29300710 21679144 11521835 1629681 -7046426 -14179334
796 -14179334 -18321462 -16334473 -7752585 536263 -622647 -10729799 -17949204 -13169371
788 -13169371 -1434011 5549094 4580849 2199530 2920481 3888361 1803059 -1706176 -3936445
779 -3936445 -5072184 -5731178 -4778327 -1875863 1389244 4239162 6258234 3438847 -8977114
770 -8977114 -27132959 -38844047 -37746389 -31071245 -27942053 -26157819 -18263693 -6204726
762 -6204726 -658162 -6851249 -18698885 -27376763 -29969409 -29143141 -28501285 -28767860 -27028759
753 -27028759 -21724722 -18253330 -22807636 -28995404 -21745285 -1024192 11259095 271689
745 271689 -17955799 -19186573 -7197277 -4246913 -11421203 -7214737 12244528 22029389
$$ packed form
804a2658615K6509484J4778891O70950p621566j0157309r892154q676107p132908
796a4179334m142128J986989Q581888Q288848j158910j0107152p219405M779833
788a3169371J1735360O983105r68245k381319P20951R67880k085302l509235k230269
779c936445j135739o58994R52851K902464L265107K849918K019072k819387j2415961
770h977114j8155845j1711088J097658O675144L129192J784234P894126J2058967
762f204726N546564o193087j1847636q677878k592646Q26268O41856k66575J739101
753b7028759N304037L471392m554306o187768P250119K0721093J2283287j0987406
745B71689j8227488j230774J1989296K950364p174290M206466J9459265R784861
$$ plain form
737 22029389 8563675 -6843138 -2387289 10021811 7800456 -4121591 -5566090 1008127
729 1008127 -4966035 -24157305 -32987085 -20019462 -1646490 5205394 4817044 8029584
721 8029584 13444875 14322009 11473257 8983061 6413074 3227273 2462088 3520836 83735
712 83735 -8820276 -15005564 -14629863 -15304687 -21938166 -25999289 -19631276 -11691393 -16281917
703 -16281917 -30125583 -35303215 -23961507 -8071346 -2221104 -6710394 -12543718 -15998167
695 -15998167 -20844725 -27865112 -29028794 -16293757 5561311 20699628 19874319 11676837
687 11676837 10527248 17529371 22095178 20227673 19142724 22257858 22646743 16746014
679 16746014 12130462 13349513 11497564 -821207 -13608001 -12287095 -258120 5464904
$$ packed form
737B2029389j3465714j5406813M455849J2409100k221355j1922047j444499O574217
729A008127n974162j9191270q829780J2967623J8372972O851884l88350L212540
721H029584N415291Q77134k848752k490196k569987l185801p65185J058748l437101
712H3735q904011o185288L75701o74824o633479m061123O368013P939883m590524
703a6281917j3843666n177632J1341708J5890161N850242m489290n833324l454449
695a5998167m846558p020387j163682J2735037K1855068J5138317q25309q197482
687A1676837j149589P002123M565807j867505j084949L115134L88885n900729
679A6746014m615552J219051j851949j2318771j2786794J320906J2028975N723024
$$ plain form
671 5464904 -2495160 -16450578 -28463869 -36157247 -35256209 -22187033 -5800181 -1275099
663 -1275099 -8522303 -11147773 -2063613 5144012 -825792 -8887342 -1764454 17042773
655 17042773 27037896 17362469 -2740217 -18432579 -23823685 -21978003 -18569286 -16790152
647 -16790152 -14419446 -7336583 1180359 26287 -14945400 -31381370 -34153046 -24488923
639 -24488923 -16279031 -16860170 -21770255 -25948467 -28292805 -25618652 -14401705 -194206
631 -194206 6355172 5428951 8022214 16211684 16717716 1795181 -15487501 -18084818 -8540785
622 -8540785 -3000632 -6681327 -8634513 -246601 12791109 19747289 17886743 12494607
614 12494607 8779578 7083399 4084778 -2833393 -12104044 -19713341 -24241576 -26662745
$$ packed form
671E464904p960064j3955418j2013291p693378R01038J3069176J6386852M525082
663a275099p247204k625470R084160P207625n969804q061550P122888J8807227
655A7042773R995123r675427k0102686j5692362n391106J845682L408717J779134
647a6790152K370706P082863Q516942j154072j4971687j6435970k771676R664123
639b4488923Q209892n81139m910085m178212k344338K674153J1216947J4207499
631a94206O549378r26221K593263Q189470N06032j4922535j7282682k597317R544033
622h540785N540153l680695j953186Q387912J3037710O956180j860546n392136
614A2494607l715029j696179k998621o918171r270651p609297m528235k421169
$$ plain form
606 -26662745 -24681140 -13849035 2106814 9650017 1646561 -10365042 -9440117 4762470
598 4762470 17305566 19093201 15046382 10698359 3247079 -8781244 -16958126 -12520264
590 -12520264 230226 7354017 575716 -15213226 -28319393 -30718177 -23264330 -13578644
582 -13578644 -9395229 -13108418 -21789110 -30453658 -34338368 -30836164 -21909971 -12556683
574 -12556683 -5058895 1528066 4324790 -3670088 -21044631 -32884853 -28030528 -15585496
566 -15585496 -12461526 -19156985 -22142637 -17610392 -16160575 -22951914 -30190017 -33130615
558 -33130615 -36934873 -41898450 -38564840 -25508613 -15633604 -15025573 -12266726 -1260483
550 -1260483 2451258 -14604550 -38293369 -45580364 -38027158 -34312910 -36797774 -30109430
$$ packed form
606b6662745J981605J0832105J5955849P543203q003456j2011603R24925J4202587
598D762470J2543096J787635m046819m348023p451280j2028323q176882M437862
590a2520264J2750490P123791o778301j5788942j3106167k398784P453847R685686
582a3578644M183415l713189q680692q664548l884710L502204Q926193R353288
574a2556683P497788O586961K796724p994878j7374543j1840222M854325J2445032
566a5585496L123970o695459k985652M532245J449817o791339p238103k940598
558c3130615l804258m963577L333610J3056227R875009O08031K758847J1006243
550a260483L711741j7055808k3688819p286995P553206L714248k484864O688344
$$ plain form
542 -30109430 -11026598 4428137 6839131 5005977 5956695 2493399 -10719151 -24376851
534 -24376851 -28056158 -24997918 -23943765 -25019666 -22442348 -15403036 -9606202 -11315068
526 -11315068 -22111109 -35389067 -39303654 -30378357 -21521492 -25878842 -35413732 -30438619
518 -30438619 -10547401 1805693 -6246002 -19293402 -16965753 -1631050 8976172 6270068
510 6270068 -3807699 -12695821 -16560468 -16727245 -19009199 -26946244 -33183032 -27557063
502 -27557063 -15943533 -15949057 -28366103 -31407488 -14321866 2468522 -2183508 -16790687
494 -16790687 -16821019 -4827925 -4462676 -20691191 -33554953 -32056011 -28642694 -34384736
486 -34384736 -41950776 -42278498 -40111971 -42396725 -45203692 -42624380 -37795777 -35622027
$$ packed form
542c0109430J9082832J5454735K410994j833154R50718l463296j3212550j3657700
534b4376851l679307L058240J054153j075901K577318P039312N796834j708866
526a1315068j0796041j3277958l914587Q925297Q856865m357350r534890M975113
518c0438619J9891218J2353094q051695j3047400K327649J5334703J0607222k706104
510F270068j0077767q888122l864647j66777k281954p937045o236788N625969
502b7557063J1613530n524j2417046l041385J7085622J6790388m652030j4607179
494a6790687l0332J1993094L65249j6228515j2863762J498942L413317n742042
486c4384736p566040l27722K166527k284754k806967K579312M828603K173750
$$ plain form
478 -35622027 -33505970 -27984003 -23020292 -23400093 -25409242 -21125760 -8344487 8043676
470 8043676 20746047 23945789 17476156 8487014 3514544 -638704 -10407128 -20978690
462 -20978690 -19529281 -4456957 10444867 14307841 9951167 2718200 -7715948 -17733148
454 -17733148 -16019394 -278121 13061636 7746201 -11453947 -27424258 -32701334 -31843686
446 -31843686 -28961188 -25065369 -22870613 -22924573 -19329698 -9703796 -3922292 -11226245 -23890828
437 -23890828 -26915576 -19631866 -13194186 -9882654 -1518854 11750652 18228721 13506869
429 13506869 7147673 5738621 3592829 -3560322 -9327648 -9059150 -9291825 -15602683 -21667166
420 -21667166 -20421867 -16809381 -18543232 -21996396 -18821905 -10512351 -4613919 -1088339
$$ packed form
478c5622027K116057N521967M963711l79801k009149M283482J2781273J6388163
470H043676J2702371L199742o469633q989142m972470m153248r768424j0571562
462b0978690J449409J5072324J4901824L862974m356674p232967j0434148j0017200
454a7733148J713754J5741273J3339757n315435j9200148j5970311n277076Q57648
446c1843686K882498L895819K194756n3960L594875R625902N781504p303953j2664583
437b3890828l024748P283710O437680L311532Q363800J3269506O478069m721852
429A3506869o359196j409052k145792p153151n767326K68498k32675o310858o064483
420b1667166J245299L612486j733851l453164L174491Q309554N898432L525580
$$ plain form
412 -1088339 5575741 13653713 15453474 10104943 4296215 697627 -4134967 -10197025
404 -10197025 -12375636 -9508356 -6403682 -6186888 -9019598 -17588122 -33006602 -45143042
396 -45143042 -40395054 -22537932 -12218849 -19385657 -29620942 -27338081 -19698369 -23274093
388 -23274093 -35961233 -39494114 -27132408 -12584476 -9570343 -15737525 -20719331 -19584328
380 -19584328 -13634062 -6395187 -3810562 -11498912 -26524794 -36747284 -32932271 -18462133
372 -18462133 -4709333 -374715 -6502156 -16860894 -21376150 -14473592 -2209937 3959551
364 3959551 1914102 804022 6124918 10852260 6054480 -6823061 -19935944 -28845713
356 -28845713 -32207928 -28275397 -19640604 -16100060 -23639470 -33903209 -33609011 -22337003
$$ packed form
412a088339O664080Q077972J799761n348531n808728l598588m832594o062058
404a0197025k178611K867280L104674K16794k832710q568524j5418480j2136440
396d5143042M747988J7857122J0319083p166808j0235285K282861P639712l575724
388b3274093j2687140l532881J2361706J4547932L014133o167182m981806J135003
380a9584328N950266P238875K584625p688350j5025882j0222490L815013J4470138
372a8462133J3752800M334618o127441j0358738m515256O902558J2263655O169488
364C959551k045449j110080N320896M727342m797780j2877541j3112883q909769
356b8845713l362215L932531Q634793L540544p539410j0263739K94198J1272008
$$ plain form
348 -22337003 -12307626 -11886922 -18069529 -24903067 -30347810 -33121596 -30270735 -20884894
340 -20884894 -7962752 4283540 11602343 10247202 1866762 -4656634 -3516302 -1785065
332 -1785065 -9819916 -23467913 -27416986 -17732957 -8995940 -14176689 -27826826 -35884921
324 -35884921 -33484258 -25156615 -14138132 -530046 13086374 21547560 21796868 14384236
316 14384236 2999005 -5589506 -6443650 -4256894 -9770064 -24168870 -34282628 -29577749
308 -29577749 -17205760 -12238557 -18409157 -27312354 -32283547 -33131343 -29523294 -19998576
300 -19998576 -8016775 -796238 -950414 -5209401 -10930499 -17182696 -19860613 -13573470
292 -13573470 -66943 11550725 15023747 12516767 8869275 5585967 2509835 860276
$$ packed form
348b2337003J0029377M20704o182607o833538n444743k773786K850861R385841
340b0884894J2922142J2246292P318803j355141q380440o523396J140332J731237
332a785065q034851j3647997l949073R684029Q737017n180749j3650137q058095
324c5884921K400663Q327643J1018483J3608086J3616420Q461186K49308p412632
316A4384236j1385231q588511q54144K186756n513170j4398806j0113758M704879
308b9577749J2371989M967203o170600q903197m971193q47796L608049R524718
300a9998576J1981801P220537j54176m258987n721098o252197k677917O287143
292a3573470J3506527J1617668L473022k506980l647492l283308l076132j649559
$$ plain form
284 860276 1539406 2596345 589817 -5599060 -12332454 -13678404 -9286999 -8598449 -20231730
275 -20231730 -36156407 -36775886 -17312074 2111937 2762334 -7039117 -7063192 2870717
267 2870717 5419656 -4058136 -11693805 -10715393 -10867574 -16521934 -16670827 -6736744 -695436
258 -695436 -7616017 -13153191 -1403929 18210885 24554735 15562581 6606028 5052289
250 5052289 5386359 5371194 8358691 11113714 6512708 -2074142 -4790274 -2532731 -3829444
241 -3829444 -5880903 2364685 17345140 21727339 12363486 6446406 12330753 15529754
233 15529754 5470462 -4319000 624465 9786657 5414190 -6857364 -7980896 2099661
225 2099661 6153527 750731 1429357 14136322 23796748 19107477 10268090 11036530 17116523
$$ packed form
284H60276O79130J056939k006528o188877o733394j345950M391405O88550j1633281
275b0231730j5924677o19479J9463812J9424011O50397r801451k4075R933909
267B870717K548939r477792p635669R78412j52181n654360j48893R934083O041308
258f95436o920581n537174J1749262J9614814O343850q992154q956553j553739
250E052289L34070j5165K987497K755023m601006q586850k716132K257543j296713
241c829444k051459Q245588J4980455M382199r363853n917080N884347L199001
233A5529754j0059292r789462M943465R162192m372467j2271554j123532J0080557
225B099661M053866n402796O78626J2706965R660426m689271q839387P68440O079993
$$ plain form
216 17116523 14967725 2835727 -9145370 -14172489 -13425577 -9027334 -2171032 2540589
208 2540589 -1350476 -14881675 -31658956 -43113845 -43942942 -34721211 -22108060 -14437792
200 -14437792 -14332338 -17400969 -19636962 -22272759 -26527255 -28092385 -22219571 -12001234
192 -12001234 -6071449 -8357974 -14323276 -17616633 -16988776 -15612547 -15713930 -15355247 -10790509
183 -10790509 -2250437 3863090 1184273 -8506343 -17000720 -19855587 -20062532 -19900043 -15113830
174 -15113830 -1958673 14176528 23097014 20851809 11659232 714207 -9745681 -18370067
166 -18370067 -24086669 -27838733 -31070965 -32842653 -32149809 -32082397 -36863485 -44790898 -48779796
157 -48779796 -44498314 -33989101 -21362072 -10055648 -5039880 -11290433 -26235734 -38023007
$$ packed form
216A7116523k148798j2131998j1981097n027119P46912M398243O856302M711621
208B540589l891065j3531199j6777281j1454889q29097R221731J2613151P670268
200a4437792J05454l068631k235993k635797m254496j565130N872814J0218337
192a2001234N929785k286525n965302l293357O27857J376229j01383L58683M564738
183a0790509Q540072O113527k678817r690616q494377k854867k06945J62489M786213
174a5113830J3155157J6135201Q920486k245205r192577j0945025j0459888q624386
166a8370067n716602l752064l232232j771688O92844O7412m781088p927413l988898
157d8779796M281482J0509213J2627029J1306424N015768o250553j4945301j1787273
$$ plain form
149 -38023007 -36149237 -22171694 -6476628 3669093 8532796 9368282 3656742 -9437809
141 -9437809 -22539069 -25530295 -18462461 -12911906 -16417622 -20874734 -13822166 2000383
133 2000383 10917607 6806570 1605982 6283718 14291135 12954575 2655361 -6720500
125 -6720500 -12275518 -18251225 -23579452 -23200893 -20506878 -23974188 -30084081 -24356725 -3931800
116 -3931800 14441680 15787882 4496863 -7156472 -16472260 -25865132 -30820322 -25821662
108 -25821662 -17032503 -15811132 -21419219 -22093406 -13802107 -7257940 -13075565 -27699571
100 -27699571 -38399825 -37673426 -28674374 -18436329 -9407190 608575 10646200 12772688
92 12772688 1351762 -15267314 -20708024 -11230587 -2490869 -9722213 -27662718 -38222787
$$ packed form
149c8023007J873770J3977543J5695066J0145721M863703Q35486n711540j3094551
141i437809j3101260k991226P067834N550555l505716m457112P052568J5822549
133B000383Q917224m111037n200588M677736Q007417j336560j0299214r375861
125f720500n555018n975707n328227L78559K694015l467310o109893N727356K0424925
116c931800J8373480J346202j1291019j1653335r315788r392872m955190M998660
108b5821662Q789159J221371n608087o74187Q291299O544167n817625j4624006
100b7699571j0700254P26399Q999052J0238045R029139J0015765J0037625K126488
92A2772688j1420926j6619076n440710R477437Q739718p231344j7940505j0560069
$$ plain form
84 -38222787 -33988093 -25137621 -23992942 -30647557 -35791883 -33088571 -26129530 -23683572
76 -23683572 -28513273 -33274631 -31043268 -26679961 -29567177 -37013908 -37522317 -31953008 -35268865
67 -35268865 -50331400 -57151615 -41194217 -17206955 -7828608 -11413280 -11639918 -8314502
59 -8314502 -13546903 -23444259 -21751475 -11628384 -15004100 -34447786 -43693675 -27790585
51 -27790585 -7281917 -5877316 -15572547 -14239033 -1387687 6131374 3417945 272628
43 272628 245872 -2834485 -9108553 -10603658 -5524232 -1264499 -2420706 -6193259 -9050957
34 -9050957 -8785749 -2160167 9990681 17994319 13565987 2413769 -2758549 1153944
26 1153944 7475785 11991856 14353652 11232790 702230 -9117823 -8668575 -2176557 -989487
$$ packed form
84c8222787M234694Q850472J144679o654615n144326K703312O959041K445958
76b3683572m829701m761358K231363M363307k887216p446731n08409N569309l315857
67c5268865j5062535o820215J5957398K3987262R378347l584672k26638L325416
59h314502n232401r897356J692784J0123091l375716j9443686r245889J5903090
51b7790585K0508668J404601r695231J333514J2851346P519061k713429l145317
43B72628k6756l080357o274068j495105N079426M259733j156207l772553k857698
34i050957K65208O625582J2150848Q003638m428332j1152218n172318L912493
26A153944O321841M516071K361796l120862j0530560r820053M49248O492018J187070
$$ plain form
17 -989487 -4045702 -841017 6494753 2310516 -17162975 -34703784 -35931991 -27331785
9 -27331785 -21468382 -18230997 -12636503 -9547338 -15654911 -23589503 -19181000 -2684992
1 -2684992 10008391
0 10008391
$$ packed form
17i89487l056215L204685P335770m184237j9473491j7540809j228207Q600206
9b7331785N863403L237385N594494L089165o107573p934592M408503J6496008
1b684992J2693383
0A0008391
$$ Imaginary data points
##PAGE= N=2
##DATA TABLE= (X++(I..I)), XYDATA
$$ plain form
65535 10414958 1290189 1941211 5134701 2926682 -3988302 -9227670 -9314701 -7209920
65527 -7209920 -7598941 -10484860 -11533014 -8298423 -3151938 544203 2175902 3000526
65519 3000526 4497743 7909835 11997109 11877105 5171307 -1619962 -269381 5802127
65511 5802127 5072103 -3397443 -6647580 1745209 10353553 7822123 808714 2014279
65503 2014279 9062521 9240535 -104747 -9515609 -12509246 -10490284 -5723981 -1359814
65495 -1359814 -4842554 -18161444 -28047792 -20731931 -4294684 225810 -10209022 -16626851
65487 -16626851 -7690879 5463227 10577100 12288888 18175182 22423468 17371675 10059516
65479 10059516 12534543 22841952 29192166 28140034 26085338 25825166 23389852 17433810
$$ packed form
65535A0414958r124769O51022L193490k208019o914984n239368q7031K104781
65527g209920l89021k885919j048154L234591N146485L696141J631699Q24624
65519C000526J497217L412092M087274j20004o705798o791269J350581O071508
65511E802127p30024q469546l250137Q392789Q608344k531430p013409J205565
65503B014279P048242J78014r345282r410862k993637K018962M766303M364167
65495a359814l482740j3318890r886348P315861J6437247M520494j0434832o417829
65487a6626851Q935972J3154106N113873J711788N886294M248286n051793p312159
65479A0059516K475027J0307409O350214j052132k054696k60172k435314n956042
$$ plain form
65471 17433810 12147662 10481921 11415576 13682000 16650872 18321762 16871199 12922551
65463 12922551 7682794 2318340 1360277 10267840 25251402 32757840 25376313 11407372
65455 11407372 1751191 -4823693 -14221276 -22640816 -21667618 -12568149 -3384687 4072972
65447 4072972 11980375 15537431 8748660 -1312032 -1744380 5131819 4667609 -4437540
65439 -4437540 -5401002 9844340 26221894 27310569 16979169 8133762 2904514 -2571890
65431 -2571890 -4398851 2333989 9878668 6721590 -3442523 -6556130 -269340 3795148
65423 3795148 579623 -426434 7995018 18716176 21671114 17385926 11484741 3730275
65415 3730275 -8254531 -19302945 -20446802 -11043629 716605 9480539 17668596 26951088
$$ packed form
65471A7433810n286148j665741R33655K266424K968872J670890j450563l948648
65463A2922551n239757n364454r58063Q907563J4983562P506438p381527j3968941
65455A1407372r656181o574884r397583q419540R73198R099469R183462P457659
65447D072972P907403L557056o788771j0060692m32348O876199m64210r105149
65439d437540r63462J5245342J6377554J088675j0331400q845407n229248n476404
65431b571890j826961O732840P544679l157078j0164113l113607O286790M064488
65423C795148l215525j006057Q421452J0721158K954938m285188n901185p754466
65415C730275j1984806j1048414j143857R403173J1760234Q763934Q188057R282492
$$ plain form
65407 26951088 31409301 23883432 5788344 -13995631 -28318852 -35497921 -35209293 -26845729
65399 -26845729 -13734423 -3350667 892837 4209556 12018115 20543590 22312995 18449420
65391 18449420 17010754 19463192 18520330 11790572 7344533 10057254 11908600 4798365
65383 4798365 -4436868 -3406857 5639984 8005726 -1453714 -11457009 -12722516 -11462068
65375 -11462068 -17548707 -28165518 -32499946 -27532234 -19456526 -11494708 -56992 15545785
65367 15545785 27998528 31135409 28648643 27799330 27639945 20627613 5770166 -7508197
65359 -7508197 -12174429 -13810687 -21311551 -31498316 -32446568 -22099827 -13740314 -18831059
65351 -18831059 -31934291 -38305674 -30950398 -14621130 1773364 10325002 6791222 -3963615
$$ packed form
65407B6951088M458213p525869j8095088j9783975j4323221p179069K88628Q363564
65399b6845729J3111306J0383756M243504L316719P808559Q525475J769405l863575
65391A8449420j438666K452438r42862o729758m446039K712721J851346p110235
65383D798365r235233J030011R046841K365742r459440j0003295j265507J260448
65375a1462068o086639j0616811m334428M967712Q075708P961818J1437716J5602777
65367A5545785J2452743L136881k486766q49313j59385p012332j4857447j3278363
65359g508197m666232j636258p500864j0186765r48252J0346741Q359513n090745
65351a8831059j3103232o371383P355276J6329268J6394494Q551638l533780j0754837
$$ plain form
65343 -3963615 -8727174 -170870 12550417 15440861 8472479 3005476 3358499 3176890
65335 3176890 -222050 -1086543 2813167 6210750 8266524 15452644 26441319 27383364
65327 27383364 11849484 -5898003 -9391400 -2645734 -1179345 -7392801 -9849825 -3592458
65319 -3592458 3834397 6495432 6813963 6621357 3477974 -1155037 -672782 5909052 10815881
65310 10815881 8769237 3421707 -494457 -3219804 -4944987 -3446589 -813993 -3579658
65302 -3579658 -10955164 -12178799 -2541402 7013178 5511268 -977927 168708 6389834
65294 6389834 3215685 -12001519 -24129428 -21052145 -8203457 2721805 8857792 12994084
65286 12994084 14487371 12523323 12088630 16945608 21141614 17733290 12454930 16415220
$$ packed form
65343c963615m763559Q556304J2721287K890444o968382n467003L53023j81609
65335C176890l398940q64493L899710L397583K055774P186120J0988675R42045
65327B7383364j5533880j7747487l493397O745666J466389o213456k457024O257367
65319c592458P426855K661035L18531j92606l143383m633011M82255O581834M906829
65310A0815881k046644n347530l916164k725347j725183J498398K632596k765665
65302c579658p375506j223635R637397R554580j501910o489195J146635O221126
65294F389834l174149j5217204j2127909L077283J2848688J0925262O135987M136292
65286A2994084J493287j964048m34693M856978M196006l408324n278360L960290
$$ plain form
65278 16415220 26083109 24777745 7800443 -7886133 -7248897 1753535 2797726 -2617333
65270 -2617333 372243 13885993 23295569 20283959 13295324 10347275 7135090 629528
65262 629528 320198 13225893 27788263 27341090 14092013 5536009 9577161 16677202
65254 16677202 16649486 10841606 5404073 2842107 3674000 8395311 14424972 17184093
65246 17184093 16206864 14714239 12801416 7685719 893475 -2425411 -2030961 -2368534
65238 -2368534 -2846916 2673769 14556809 24803679 29105300 32383744 37980773 40265690
65230 40265690 33792658 22095298 11246955 1624131 -7658486 -12735378 -10454121 -4780194
65222 -4780194 -1539026 -1188823 -1440925 -1242552 2436851 14236823 30559496 37921974
$$ packed form
65278A6415220R667889j305364j6977302j5686576O37236R002432J044191n415059
65270b617333K989576J3513750R409576l011610o988635k948049l212185o505562
65262F29528l09330J2905695J4562370m47173j3249077q556004M041152P100041
65254A6677202k7716n807880n437533k561966Q31893M721311O029661K759121
65246A7184093r77229j492625j912823n115697o792244l318886L94450l37573
65238b368534m78382N520685J1883040J0246870M301621L278444N597029K284917
65230D0265690o473032j1697360j0848343r622824r282617n076892K281257N673927
65222d780194L241168L50203k52102J98373L679403J1799972J6322673P362478
$$ plain form
65214 37921974 29005060 13150504 2648552 -3169692 -9580997 -10730883 2694249 24189762
65206 24189762 35602670 30726115 21365534 18853836 22180790 26475892 30619622 32218113
65198 32218113 26070125 13221583 3012585 1205504 3538994 5031309 7595921 13466393
65190 13466393 18550957 18264670 14223351 9824935 4368463 -3308322 -9989778 -11948888
65182 -11948888 -10030581 -6921785 -3176888 554360 1752895 509468 1734987 8714102
65174 8714102 17756153 22753789 21814667 16831386 10913150 9037526 15587923 26894138
65166 26894138 31719340 24650952 14019850 10208666 10937282 6409140 -4023579 -10106177
65158 -10106177 -6033612 1068520 1238749 -5523404 -10473105 -6997664 2999380 12324667
$$ packed form
65214C7921974q916914j5854556j0501952n818244o411305j149886J3425132K1495513
65206B4189762J1412908m876555r360581k511698L326954M295102M143730J598491
65198C2218113o147988j2848542j0208998j807081K333490J492315K564612N870472
65190A3466393N084564k86287m041319m398416n456472p676785o681456j959110
65182a1948888J918307L108796L744897L731248J198535j243427J225519O979115
65174H714102R042051M997636r39122m983281n918236j875624O550397J1306215
65166B6894138M825202p068388j0631102l811184P28616m528142j0432719o082598
65158a0106177M072565P102132J70229o762153m949701L475441R997044R325287
$$ plain form
65150 12324667 16084026 16074418 17601760 21688682 22337368 13882981 -317922 -10135901
65142 -10135901 -9738146 -2995952 3197252 7446856 12681869 18651345 20508135 16323912
65134 16323912 12043827 14619320 21496760 22331658 12741711 1420211 -323887 7155047
65126 7155047 12610529 7044035 -8255453 -25061756 -34793987 -32975573 -22260240 -10733811
65118 -10733811 -3194549 4162959 15374396 23953643 18900156 1173386 -14773443 -18103518
65110 -18103518 -12742470 -9068907 -11658222 -17819869 -21170193 -14233213 4567175 23582629
65102 23582629 26636593 13471132 2148804 5226579 13568078 12397292 3906736 1787096
65094 1787096 9402856 16742547 16838705 13081471 10183892 8640208 9768905 16752678
$$ packed form
65150A2324667L759359r608J527342M086922O48686q454387j4200903r817979
65142a0135901L97755O742194O193204M249604N235013N969476J856790m184223
65134A6323912m280085K575493O877440Q34898r589947j1321500j744098P478934
65126G155047N455482n566494j5299488j6806303r732231J818414J0715333J1526429
65118a0733811P539262P357508J1211437Q579247n053487j7726770j5946829l330075
65110a8103518N361048L673563k589315o161647l350324O936980J8800388J9015454
65102B3582629L053964j3165461j1322328L077775Q341499j170786q490556k119640
65094A787096P615760P339691R6158l757234k897579j543684J128697O983773
$$ plain form
65086 16752678 27134678 31289084 22993939 8323896 767439 7691237 21672674 25983290
65078 25983290 12057042 -8378801 -14551946 -1618210 13778039 16568289 11148725
65071 11148725 8092096 4153991 -10347022 -31065805 -42968426 -42012860 -37949766 -35387238
65063 -35387238 -27863866 -14138710 -5443273 -9297657 -17179875 -16375796 -6571995 2369289
65055 2369289 3717980 -815802 -5230919 -4549087 1482890 8290084 12131552 14289402
65047 14289402 16168722 14896960 10689514 12377686 24047571 31670163 19321308 -3595340
65039 -3595340 -10744721 3656982 16763683 12734146 4350256 7046604 12511121 6691228
65031 6691228 -2555513 1382569 13484262 13883911 672766 -7090253 228390 10034307
$$ packed form
65086A6752678J0382000M154406q295145j4670043p556457O923798J3981437M310616
65078B5983290j3926248k0435843o173145J2933736J5396249K790250n419564
65071A1148725l056629l938105j4501013k0718783j1902621R55566M063094K562528
65063c5387238P523372J3725156Q695437l854384p882218Q04079R803801Q941284
65055B369289J348691m533782m415117O81832O031977O807194L841468K157850
65047A4289402J879320j271762m207446J688172J1669885P622592j2348855k2916648
65039c595340p149381J4401703J3106701m029537q383890K696348N464517n819893
65031F691228r246741L938082J2101693L99649j3211145p763019P318643R805917
$$ plain form
65023 10034307 9447306 2758631 240513 2955779 6020224 6847471 3595878 -6190018
65015 -6190018 -19104880 -24759356 -17153139 -2668687 7714261 10450099 10326806 12707624
65007 12707624 18080324 22759684 23433596 21060608 18530236 13989473 1895225 -15712280
64999 -15712280 -26032501 -21201890 -11014956 -9503234 -13479008 -7655063 10523115 25794861
64991 25794861 27186726 21797587 21394585 26265982 28689570 24225011 14322510 4584682
64983 4584682 3414723 14075822 25667816 22464459 5861496 -4896994 801016 11218430
64975 11218430 13383651 13423043 22073042 31861218 27094408 10478455 769557 4883728
64967 4883728 9835560 4978345 -3308755 -4616607 511937 5855020 10524332 17134889
$$ packed form
65023A0034307n87001o688675k518118K715266L064445Q27247l251593r785896
65015f190018j2914862n654476P606217J4484452J0382948K735838j23293K380818
65007A2707624N372700M679360O73912k372988k530372m540763j2094248j7607505
64999a5712280j0320221M830611J0186934J511722l975774N823945J8178178J5271746
64991B5794861J391865n389139m03002M871397K423588m464559r902501r737828
64983D584682j169959J0661099J1591994l203357j6602963j0758490N698010J0417414
64975A1218430K165221L9392Q649999R788176m766810j6615953r708898M114171
64967D883728M951832m857215q287100j307852N128544N343083M669312O610557
$$ plain form
64959 17134889 24666315 28974684 26988413 18191435 6814210 2843302 12335478 24599320
64951 24599320 19832270 -4317828 -24122957 -17803027 5243699 15916016 2841856
64944 2841856 -15232673 -16176519 -1525082 9623998 6279836 -3118689 -3099841 11431731
64936 11431731 31611440 45402142 49276477 48574016 48148729 46523732 40821756 33334681
64928 33334681 28647632 26593471 23674039 20495907 21327328 25508037 26013025 19257294
64920 19257294 10372663 4975638 1316034 -4123903 -8109432 -5064601 2232085 3928855
64912 3928855 -4327187 -15668728 -19976353 -13542192 -554902 10723338 12850193 4782492
64904 4782492 -6361198 -12699626 -14631177 -17677627 -20650755 -14629352 3083980 21219537
$$ packed form
64959A7134889P531426M308369j986271q796978j1377225l970908R492176J2263842
64951B4599320m767050k4150098j9805129O319930K3046726J0672317j3074160
64944B841856j8074529r43846J4651437J1149080l344162r398525J8848J4531572
64936A1431731K0179709J3790702L874335p02461m25287j624997n701976p487075
64928C3334681m687049k054161k919432l178132Q31421M180709N04988o755731
64920A9257294q884631n397025l659604n439937l985529L044831P296686J696770
64912C928855q256042j1341541m307625O434161J2987290J1278240K126855q067701
64904D782492j1143690o338428j931551l046450k973128O021403J7713332J8135557
$$ plain form
64896 21219537 27069359 22204241 18444046 20659678 21939355 16672366 10295224 10948448
64888 10948448 16385705 16866546 10926035 10272924 23661654 41094260 43563007 28379531
64880 28379531 13948274 14361834 19877021 13098181 -3540489 -11766858 -6025486 -731964
64872 -731964 -6193983 -13976656 -13641223 -9207954 -8223458 -7166624 -1354263 680012 -11123676
64863 -11123676 -28333809 -32501208 -21321237 -10170924 -7253437 -3317330 9630350
64856 9630350 23330933 24686152 13232749 103917 -4934816 -417410 8497257 14848298
64848 14848298 15747496 14677411 15525104 16338145 13720971 10269503 10614882 13301380 15331625
64839 15331625 21169372 35493992 49154673 46593521 28451670 12836192 11242595
$$ packed form
64896B1219537N849822m865118l760195K215632J279677n266989o377142O53224
64888A0948448N437257M80841n940511o53111J3388730J7432606K468747j5183476
64880B8379531j4431257M13560N515187o778840j6638670q226369N741372N293522
64872g31964n462019p782673L35433M433269R84496J056834N812361K034275j1803688
64863a1123676j7210133m167399J1179971J1150313K917487L936107J2947680
64856I630350J3700583J355219j1453403j3128832n038733M517406Q914667O351041
64848A4848298Q99198j070085Q47693Q13041k617174l451468L45379K686498K030245
64839A5331625N837747J4324620J3660681k561152j8141851j5615478j593597
$$ plain form
64832 11242595 16892784 20561444 23170078 26632774 26578364 22246405 20815946 23804049
64824 23804049 22061656 12780796 7350282 11684739 13326354 1827727 -11354089 -9299338
$$ packed form
64832A1242595N650189L668660K608634L462696n4410m331959j430459K988103
64824B3804049j742393r280860n430514M334457J641615j1498627j3181816K054751
$$ [...]
##END NTUPLES=NMR SPECTRUM
##END=
