##TITLE=31Pdec_LR-660-RM2
 CH2Cl2, 124 sc
 14.3.2019
##JCAMPDX= 6.0         $$ Bruker NMR JCAMP-DX V2.0
##DATA TYPE= NMR SPECTRUM
##DATA CLASS= NTUPLES
##ORIGIN= UXNMR, Bruker Analytische Messtechnik GmbH
##OWNER= root
$$ XWIN-NMR		Version 3.5
$$ Thu Mar 14 14:43:03 2019 Russian Standard Time (UT+4h)  she@DPX200
##.OBSERVE FREQUENCY= 81.013821
##.OBSERVE NUCLEUS= ^31P
##.ACQUISITION MODE= SIMULTANEOUS
##.ACQUISITION SCHEME= undefined
##.AVERAGES= 124
##.DIGITISER RES= 17
##SPECTROMETER/DATA SYSTEM= spect
##.PULSE SEQUENCE= zgpg30
##.SOLVENT NAME= CDCl3
##.SHIFT REFERENCE= (INTERNAL, CDCl3, 0, 182.463)
##AUDIT TRAIL= $$ (NUMBER, WHEN, WHO, WHERE, WHAT)
$$ ##TITLE= Audit trail, XWIN-NMR		Version 3.5
$$ ##JCAMPDX= 5.01
$$ ##ORIGIN= Bruker BioSpin GmbH
$$ ##OWNER= she
$$ F:/spectra/data/she/nmr/P31/1/pdata/1/auditp.txt
$$ ##AUDIT TRAIL=  $$ (NUMBER, WHEN, WHO, WHERE, WHAT)
(   1,<2019-03-14 14:41:48.12 +0400>,<she>,<DPX200>,
      <continue with go, POWCHK disabled, PULCHK disabled
       configuration hash MD5:
       00 E9 B6 7A A2 85 ED C7 34 08 36 98 17 FE 4E 26
       data hash MD5: 32K
       EE DF 3A 74 30 91 E2 DB F0 F6 69 4E 61 AE B1 9E>)
(   2,<2019-03-14 14:41:50.76 +0400>,<she>,<DPX200>,
      <Start of raw data processing
       efp BC_mod = 2 LB = 1 FT_mod = 6 PKNL = 1 PHC0 = -1835.077 PHC1 = 135.1989 SI = 64K 
       data hash MD5: 64K
       B7 02 21 32 C7 1F A5 DB 5E 14 EE 99 7B 70 63 F1>)
(   3,<2019-03-14 14:42:03.57 +0400>,<she>,<DPX200>,
      <pk PHC0 = -8.281471 PHC1 = 0 
       data hash MD5: 64K
       E4 BD F5 B4 59 0F 30 7A 56 73 CD 63 F4 5B A0 08>)
(   4,<2019-03-14 14:42:07.18 +0400>,<she>,<DPX200>,
      <abs ABSG = 5 
       data hash MD5: 64K
       4C 64 08 B8 FB 77 12 11 0A 09 DF F8 AA F7 E9 FF>)
$$ ##END=
$$ 
$$ hash MD5
$$ D3 D1 20 C8 CE 80 90 62 BD D8 94 0E 79 6C FB A2
##$RELAX= 
##$RELAX= 
##$RELAX= 
##$RELAX= 
##$RELAX= 
##$RELAX= 
##$RELAX= 
##$RELAX= 
$$ Bruker specific parameters
$$ --------------------------
##$DU= <F:/spectra>
##$EXPNO= 1
##$NAME= <P31>
##$PROCNO= 1
##$TYPE= <nmr>
##$USER= <she>
##$AMP= (0..31)
100 100 100 100 100 100 100 100 100 100 100 100 100 100 100 100 100 100 
100 100 100 100 100 100 100 100 100 100 100 100 100 100 
##$AQSEQ= 0
##$AQ_mod= 1
##$AUNM= <au_zg>
##$AUTOPOS= <>
##$BF1= 81.014009
##$BF2= 200.13
##$BF3= 200.13
##$BF4= 200.13
##$BF5= 200.13
##$BF6= 200.13
##$BF7= 200.13
##$BF8= 200.13
##$BYTORDA= 1
##$CFDGTYP= 0
##$CFRGTYP= 5
##$CHEMSTR= <none>
##$CNST= (0..31)
1 1 145 1 1 1 1 1 1 1 1 1 1 1 1 1 1 1 1 1 1 1 1 1 1 1 1 1 1 1 1 1 
##$CPDPRG= <waltz16>
##$CPDPRG1= <>
##$CPDPRG2= <waltz16>
##$CPDPRG3= <>
##$CPDPRG4= <mlev>
##$CPDPRG5= <mlev>
##$CPDPRG6= <mlev>
##$CPDPRG7= <mlev>
##$CPDPRG8= <mlev>
##$CPDPRGB= <>
##$CPDPRGT= <>
##$D= (0..31)
0 1 0 0 0 0 0 0 0 0 0 0.03 2e-05 3e-06 0 0 0 0 0 0 0 0 0 0 0 0 0 0 0 0 
0 0 
##$DATE= 1552559929
##$DBL= (0..7)
120 120 120 11 120 120 24 19 
##$DBP= (0..7)
150 150 150 150 150 150 150 150 
##$DBP07= 0
##$DBPNAM0= <>
##$DBPNAM1= <>
$$ [...]
##$SUBNAM3= <"">
##$SUBNAM4= <"">
##$SUBNAM5= <"">
##$SUBNAM6= <"">
##$SUBNAM7= <"">
##$SUBNAM8= <"">
##$SUBNAM9= <"">
##$SW= 369.568048894756
##$SWIBOX= (0..15)
0 1 3 0 0 0 0 0 0 0 0 0 0 0 0 0 
##$SW_h= 29940.119760479
##$TD= 32768
##$TD0= 1
##$TE= 0
##$TE2= 300
##$TE3= 300
##$TEG= 300
##$TL= (0..7)
0 120 53 12 22 120 120 120 
##$TP= (0..7)
150 150 150 150 150 150 150 150 
##$TP07= 0
##$TPNAME0= <>
##$TPNAME1= <>
##$TPNAME2= <>
##$TPNAME3= <>
##$TPNAME4= <>
##$TPNAME5= <>
##$TPNAME6= <>
##$TPNAME7= <>
##$TPOAL= (0..7)
0.5 0.5 0.5 0.5 0.5 0.5 0.5 0.5 
##$TPOFFS= (0..7)
0 0 0 0 0 0 0 0 
##$TUNHIN= 0
##$TUNHOUT= 0
##$TUNXOUT= 0
##$USERA1= <user>
##$USERA2= <user>
##$USERA3= <user>
##$USERA4= <user>
##$USERA5= <user>
##$V9= 5
##$VALIST= <valist>
##$VCLIST= <CCCCCCCCCCCCCCC>
##$VD= 0
##$VDLIST= <DDDDDDDDDDDDDDD>
##$VPLIST= <PPPPPPPPPPPPPPP>
##$VTLIST= <TTTTTTTTTTTTTTT>
##$WBST= 1024
##$WBSW= 4
##$XGAIN= (0..3)
0 0 0 0 
##$XL= 0
##$YL= 0
##$YMAX_a= 62810
##$YMIN_a= -98308
##$ZGOPTNS= <>
##$ZL1= 120
##$ZL2= 120
##$ZL3= 120
##$ZL4= 120
##$ABSF1= 182.463
##$ABSF2= -187.1042
##$ABSG= 5
##$ABSL= 3
##$ALPHA= 0
##$AQORDER= 0
##$ASSFAC= 0
##$ASSFACI= 0
##$ASSFACX= 0
##$ASSWID= 0
##$AUNMP= <proc_1d>
##$AZFE= 0.1
##$AZFW= 0.5
##$BCFW= 0
##$BC_mod= 2
##$BYTORDP= 0
##$COROFFS= 0
##$CY= -3
##$DATMOD= 1
##$DC= 0
##$DFILT= <>
##$DTYPP= 0
##$F1P= 0
##$F2P= 0
##$FCOR= 1
##$FTSIZE= 65536
##$FT_mod= 6
##$GAMMA= 0
##$GB= 0
##$INTBC= 1
##$INTSCL= 5.30512e-09
##$ISEN= 30
##$LB= 1
##$LEV0= 0
##$LPBIN= 0
##$MAXI= 10000
##$MC2= 0
##$MEAN= 0
##$ME_mod= 0
##$MI= 50
##$NCOEF= 0
##$NC_proc= -8
##$NLEV= 6
##$NOISF1= 182.463
##$NOISF2= 159.3651
##$NSP= 0
##$NTH_PI= 0
##$NZP= 0
##$OFFSET= 182.463
##$PC= 4
##$PHC0= -1843.359
##$PHC1= 135.1989
##$PH_mod= 1
##$PKNL= yes
##$PPARMOD= 0
##$PSCAL= 0
##$PSIGN= 0
##$REVERSE= no
##$SF= 81.0140089999434
##$SI= 65536
##$SIGF1= 159.3651
##$SIGF2= -187.1042
##$SINO= 113.3802
##$SIOLD= 16384
##$SREGLST= <1H.CDCl3>
##$SSB= 0
##$STSI= 65536
##$STSR= 0
##$SW_p= 29940.119760479
##$SYMM= 0
##$S_DEV= 0
##$TDeff= 32768
##$TDoff= 0
##$TI= <>
##$TILT= no
##$TM1= 0
##$TM2= 0
##$TOPLEV= 0
##$USERP1= <user>
##$USERP2= <user>
##$USERP3= <user>
##$USERP4= <user>
##$USERP5= <user>
##$WDW= 1
##$XDIM= 65536
##$YMAX_p= 343744273
##$YMIN_p= -180364480
$$ End of Bruker specific parameters
$$ ---------------------------------
##NTUPLES= NMR SPECTRUM
##VAR_NAME=  FREQUENCY,     SPECTRUM/REAL,   SPECTRUM/IMAG
##SYMBOL=    X,             R,               I
##VAR_TYPE=  INDEPENDENT,   DEPENDENT,       DEPENDENT
##VAR_FORM=  AFFN,          ASDF,            ASDF
##VAR_DIM=   65536,         65536,           65536
##UNITS=     HZ,            ARBITRARY UNITS, ARBITRARY UNITS
##FACTOR=    0.456856943014862, 1,           1
##FIRST=     14782.0589164792, 0,            0
##LAST=      -15158.0608439998, 0,           0
##MIN=       -15158.0608439998, -180364480,  0
##MAX=       14782.0589164792, 343744273,    0
$$ Real data points
##PAGE= N=1
##DATA TABLE= (X++(R..R)), XYDATA
$$ [...]
40923C9093099k2869009j8156895l547017N558069K069632k672228K598169R048547
$$ 39093099 16224090 -1932805 -5479822 78247 2147879 -524349 2073820 11122367
40915A1122367K365613j0089388q742221M203744N500473j0617780k0223212o383628
$$ 11122367 13487980 3398592 -5343629 -1139885 4360588 -6257192 -26480404 -32864032
40907c2864032J4764066J9684982J0422797M152755M460163K564353k755164n779619
$$ -32864032 -18099966 1585016 12007813 16160568 20620731 23185084 20429920 14650301
40899A4650301q381379j6224525k4098951k1283922r479419m21040L164834R501638
$$ 14650301 6268922 -9955603 -34054554 -55338476 -64817895 -65238935 -62074101 -52572463
40891e2572463K0266111K5371773J8200244M533999o790229j2242088j0407123
$$ -52572463 -32306352 -6934579 11265665 15799664 9009435 -3232653 -13639776
40884a3639776j012835R318417J0487857K993086o58384N634327J1121694M722821
$$ -13639776 -14652611 -5334194 5153663 8146749 7488365 13122692 24244386 28967207
40876B8967207o076252n234174O469636J0339807l293746j9977391k1017350q839046
$$ 28967207 22890955 17656781 24126417 34466224 31172478 11195087 -9822263 -18661309
40868a8661309m89899j233667K75769J0133650J8411272J6465786J0863202R811480
$$ -18661309 -19151208 -20384875 -20109106 -9975456 8435816 24901602 35764804 45576284
40860D5576284Q120797n85009p401444j730938O296166j444660j8907144k0535019
$$ 45576284 53697081 53112072 45710628 43979690 50275856 48831196 29924052 9389033
40852I389033r46440J4627174Q394239m756461m370197L615062J343767r823562
$$ 9389033 8442593 23069767 31464006 26707545 22337348 25952410 27296177 17472615
40844A7472615j4711449j1402677j0643144j2681428o114897R745729J9910188
$$ 17472615 2761166 -8641511 -19284655 -31966083 -38080980 -28335251 -8425063
40837h425063J4876589K499279n586031p856767q589609q868177p348111m717370
$$ -8425063 6451526 8950805 3364774 -4491993 -13081602 -21949779 -29297890 -34015260
40829c4015260l299878m025755m712235j338289O320277J1042154O783772N72663
$$ -34015260 -37315138 -41340893 -46053128 -47391417 -41071140 -30028986 -23245214 -22672551
40821b2672551M485120J3906299R925760r565521k0088028n847807J3511598J1806466
$$ -22672551 -18187431 -4281132 5644628 -3920893 -24008921 -29856728 -16345130 -4538664
40813d538664l541675o086587N779728R561836q22654o367182K198113R589561
$$ -4538664 -8080339 -14166926 -8387198 1174638 351984 -6015198 -3817085 5772476
40805E772476L796732n925233q595736p760047q131937m807061M404826J2363891
$$ 5772476 9569208 3643975 -4951761 -12711808 -20843745 -25650806 -21245980 -8882089
40797h882089J5768380J8481441J7262780M362186j1194825r597743N256316N645326
$$ -8882089 6886291 25367732 42630512 46992698 35797873 26200130 31456446 37101772
40789C7101772j3910740k2115662j372935J9515345J0782875r441435p263211
$$ 37101772 23191032 1075370 -297565 19217780 30000655 20559220 13296009
40782A3296009R598313Q810269p540971p685091J0748232J3698922j0839521l0559660
$$ 13296009 22894322 31704591 24163620 16478529 27226761 40925683 30086162 -473498
40774d73498k0170242J423482N406003m800805q274662r05735P818670J5246206
$$ -473498 -20643740 -19220258 -13814255 -18615060 -26889722 -27795457 -19976787 -4730581
40766d730581K1201666J6734536k006704j8903869j6403192j292211N980486J373778
$$ -4730581 16471085 33205621 31198917 12295048 -4108144 -5400355 580131 1953909
40758A953909j226905N357533J2758825J2419952N584402k760983q564203p261279
$$ 1953909 727004 6084537 18843362 31263314 36847716 34086733 25522530 18261251
40750A8261251J933707J0107539O638302o217377j5087460j2418319m117295L62680
$$ 18261251 20194958 30302497 36940799 30723422 15635962 3217643 -899652 -536972
40742e36972j133000l550753q56224P634626J4155875R150149n011030j3086413
$$ -536972 -1669972 -5220725 -6076949 1557677 15713552 24863701 19852671 6766258
40734F766258o538297L308373K198538m195613K39118J3859865J7995676P473474
$$ 6766258 227961 3536334 5734872 1539259 1778377 15638242 33633918 41107392
40726D1107392l06264N267054R406844k769270j8459153j4895435M650424J4992479
$$ 41107392 40801128 46068182 55475026 52705756 34246603 19351168 24001592 38994071
40718C8994071O173684n925496q457264q768626j4178686j5178795l940956O405876
$$ 38994071 45167755 39242259 30784995 22016369 7837683 -7341112 -11282068 -4876192
40710d876192P89845r942229l218013J7224779K2593231K239091j8625518j5950366
$$ -4876192 -4086347 -14028576 -17246589 -21810 22571421 24810512 6184994 -9765372
40702i765372o75434K535242n478524m294373Q828501J4265778M282107k963615
$$ -9765372 -10440806 -7905564 -13384088 -17678461 -8849960 5415818 9697925 6734310
40694F734310O603362J9261099J5014132j397735r238960l620104M82651n642311
$$ 6734310 13337672 32598771 47612903 46215168 36976208 33356104 33838755 28196444
40686B8196444j2105158q017960K700602R676288R751828N201034l022858j2031813
$$ 28196444 16091286 8073326 10773928 20450216 30202044 35403078 32380220 20348407
40678B0348407j3966550n718028L067414J763161m728631k744083P812704J1167764
$$ 20348407 6381857 663829 3731243 5494404 765773 -1978310 5834394 17002158
40670A7002158q86241j6067393j9511791j3343632p538258q05342J3856413K9173440
$$ 17002158 16115917 48524 -19463267 -32806899 -40345157 -41150499 -27294086 1879354
40662A879354K7534656P556085r531611p225227N464268R703320K437349n106061
$$ 1879354 29414010 36970095 27438484 20213257 25677525 35380845 37818194 32712133
40654C2712133o510974m881498k876045n71738j448337q771889j5878285j0962504
$$ 32712133 26201159 21319661 18443616 17871878 16423541 7651652 -8226633 -19189137
40646a9189137O036224J9921729J6979243j82283j6237094j7537326l377037J2860023
$$ -19189137 -13152913 6768816 23748059 23565776 7328682 -10208644 -13585681 -725658
40638g25658J5773345N518004j337816N225531J2533939L831110j3895760j8321493
$$ -725658 15047687 20565691 19227875 24453406 36987345 40818455 26922695 8601202
40630H601202n829453L298221k587500r256281j245129J3944488J9264436J2019265
$$ 8601202 2771749 6069970 3482470 -5773811 -7018940 6925548 26189984 38209249
40622C8209249P48650j0144431j8268359j5896532q13417J2521705Q559479p072174
$$ 38209249 38957899 28813468 10545109 -5351423 -6164840 6356865 14916344 7844170
40614G844170j5254383r207064J543114R083257J3780359J5226935J1528623O799636
$$ 7844170 -7410213 -16617277 -15074163 -5990906 7789453 23016388 34545011 41344647
40606D1344647N600992J826756j1586391k3948246j6711164O392604J9402108
$$ 41344647 46945639 48772395 37186004 13237758 -3473406 2919198 22321306
40599B2321306J0354953k323399j1228P989660K480078j2980764j7201408l845319
$$ 22321306 32676259 30352860 30341632 38331292 40811370 27830606 10629198 6783879
40591F783879R492505O201765q514915j6370952q126834P738404J5922852J0971336
$$ 6783879 16276384 22478149 13963234 -2407718 -10534552 -2796148 13126704 24098040
40583B4098040J912144j82445M065799O050198L695620K832393L835385j262603
$$ 24098040 26010184 25827739 29893538 35943736 39639356 42471749 46307134 45044531
40575D5044531j3430977j9543243r363232Q188828J5391714P409407n090670j1228691
$$ 45044531 31613554 12070311 2707079 10895907 26287621 33697028 28606358 17377667
40567A7377667r437090l934740R78159L629028O039317J0430390J3039609P153226
$$ 17377667 7940577 4005837 4983996 8613024 14652341 25082731 38122340 45275566
40559D5275566m833013j0491205l936118N005039N125069j414928p106043j2131292
$$ 45275566 40442553 29951348 26015230 31020269 36145338 34730410 27624367 15493075
40551A5493075j7856151j6517803k491930J2634432J2946400K227972k254615
$$ 15493075 -2363076 -18880879 -21372809 -8738377 4208023 6435995 4181380
40544D181380K414946K565327n615020q091727K670244J4283619J4591047Q872887
$$ 4181380 6596326 9161653 3546633 -4545094 -1874850 12408769 26999816 35872703
40536C5872703N868616J285279j1011527k2542808j9855229m005707J1842855
$$ 35872703 41741319 43026598 32015071 9472263 -10382966 -14388673 -2545818
40529b545818J8641270J5144825K910846j0741985j2236561K205770J5909720
$$ -2545818 16095452 31240277 34151123 23409138 11172577 13378347 29288067
40522B9288067J1368358m808090j2255973p271977l683819n183854O06673J5794526
$$ 29288067 40656425 35848335 23592362 16320385 12636566 7452712 8059385 23853911
40514B3853911K2191326Q682988r713068j4192950q337425n855787n470688K191067
$$ 23853911 46045237 54728225 45015157 30822207 22484782 16628995 11158307 13349374
40506A3349374J1778951R522580j457287m349685K790766M009189n337380r275945
$$ 13349374 25128325 34650905 33193618 28843933 31634699 35643888 30306508 21030563
40498B1030563R6607O752934k173282j2849389p148980P011372R929395K997419
$$ 21030563 21127170 27880104 25706822 12857433 5708453 12719825 22649220 25646639
40490B5646639K227445O449490J41989j3794287j4066057J418526P944371m743293
$$ 25646639 27874084 34323574 34465563 20671276 6605219 8023745 15968116 11224823
40482A1224823j2640599K461986J9308867J0002192j2961592j4325952R499616
$$ 11224823 -1415776 1046210 20355077 30357269 17395677 3069725 12569341
40475A2569341K6598603J8422042J385907n365272n499471p787732o495435M697877
$$ 12569341 39167944 57589986 58975893 53610621 48111150 40323418 33827983 38525860
40467C8525860J5572357J2558240q92526j0436571r950066l824550K846094O473220
$$ 38525860 54098217 66656457 65763931 55327360 45377294 41552744 44398838 50872058
40459E0872058L522629m050741p350457k420532K337060j495757q947414r615893
$$ 50872058 54394687 50343946 42993489 40572957 42910017 41414260 32466846 22850953
40451B2850953l628304P4274k272016o179301p320561m788873J848238J0865201
$$ 22850953 19222649 19296923 17024907 10845606 3525045 -1263828 584410 11449611
40443A1449611J5449351J0181515j24554m748774k57314O143818O689642J895651
$$ 11449611 26898962 37080477 36955923 32207149 31949835 38093653 44783295 46678946
40435D6678946j684909R874L390949J318348o495509j0295319k678647R014365
$$ 46678946 44994037 45003911 48394860 49713208 43217699 32922380 30243733 39258098
40427C9258098J1680412N768835L076936N194504O82691j1452216j4198001K71577
$$ 39258098 50938510 56707345 59784281 64978785 65661476 54209260 40011259 40282836
40419D0282836J3211128N878286j0365813j1096965L300161R696849j212501j2812507
$$ 40282836 53493964 59372250 49006437 37909472 41209633 50906482 49693981 36881474
40411C6881474r350054L822937J1966487R120438j83962p239225m861357M848761
$$ 36881474 27531420 31354357 43320844 52441282 52257320 45018095 40156738 45005499
40403D5005499R436513J520238q990509r330937m011859m974684q220570r09825
$$ 45005499 54442012 55962250 46971741 37640804 33628945 28654261 20433691 19523866
40395A9523866J1883679J1872807o9613k283699J0918760J6948569Q66985j9955553
$$ 19523866 31407545 43280352 43210739 40927040 51845800 68794369 69661354 49705801
40387D9705801k2553310j0149704l40323K115803L181378L665893K599280N480166
$$ 49705801 27152491 17002787 16662464 18778267 21959645 25625538 28224818 33704984
40379C3704984J3787352J6947019Q926351P73983J781767J937591q825734j7531969
$$ 33704984 47492336 64439355 73365706 74139689 75921456 77859047 69033313 51501344
40371E1501344o693791J4087241J9444924N577843p588260q683162n768226n081164
$$ 51501344 44807553 58894794 78339718 83917561 76329301 67646139 61877913 56796749
40363E6796749k051930L101362J689353n986084p443426J611612R481201P119151
$$ 56796749 54744819 57846181 59535534 53549450 46106024 47717636 57198837 64317988
40355F4317988M40649k047385j304465j577439k915936m591298o797395o628899
$$ 64317988 64758637 62711252 61406787 59829348 56913412 52322114 45524719 38895820
40347C8895820j650950K651300o3837m220301j85834P281420N190435m284903
$$ 38895820 37244870 39896170 39832333 35612032 35426198 42707618 47898053 43613150
40339D3613150o259498K03286K46587q067878p723534O206213J4488684N697455
$$ 43613150 37353652 37556938 37803525 29735647 22012113 28218326 42707010 48404465
40331D8404465l916410L46841N539565l804709j4710715o875812J0290064J1625338
$$ 48404465 44488055 44834896 50374461 46569752 31859037 24983225 35273289 46898627
40323D6898627j769894n495035N904803J0369656l728292j8415894j4706067J167371
$$ 46898627 45128733 39633698 45538501 55908157 52179865 33763971 19057904 20225275
40315B0225275J1933967J3290235J1480514Q898754L944356k040437o446353q942338
$$ 20225275 32159242 45449477 56929991 65828745 69773101 67732664 61286311 52343973
40307E2343973q308288j671394R059675J6013314J4046470N488224m998930j4047785
$$ 52343973 44035685 42364291 51423966 67437280 81483750 86971974 81973044 67925259
40299F7925259j8074678j6026533j3539679j5498553j5407524l682446J3707347
$$ 67925259 49850581 33824048 20284369 4785816 -10621708 -14304154 -596807
40292e96807J9412725J0235254K626203O542088J0106412R50509j1554623r941906
$$ -596807 18815918 29051172 31677375 38219463 48325875 49276384 37721761 27779855
40284B7779855N188455J7478605J7216234Q317989k002695q095413n010032M733193
$$ 27779855 32968310 50446915 67663149 75981138 73978443 65883030 60872998 65606191
40276F5606191P628079m692540j9560476j7589823l69717J1525302P729082j010266
$$ 65606191 73234270 68541730 48981254 31391431 31021714 42547016 50276098 49265832
40268D9265832l370432k284910l380162l747595j074594j480673p985062j1248344
$$ 49265832 45895400 43610490 40230328 36482733 35408139 33927466 25942404 14694060
40260A4694060k920870R483848J2336847N008514j439975o11074M171967P984811
$$ 14694060 11773190 21257038 33593885 38602399 37162424 36551350 40723317 48708128
40252D8708128Q136669K705458n827164q546960j082594O726282K915625p781982
$$ 48708128 56844797 59550255 53723091 45176131 44093537 50819819 53735444 45953462
40244D5953462j0125530k155464K383102k232887l752648O803922J8263617J5504119
$$ 45953462 35827932 33672468 36055570 33822683 30070035 36873957 55137574 70641693
40236G0641693K550345m101838L56019N045078J709697n253748q489652p681857
$$ 70641693 73192038 69090200 69446219 74491297 76200994 70947246 62457594 54775737
40228E4775737o525473o034724m125119J302834R621596J5268432J0366151n298873
$$ 54775737 48250264 42215540 38090421 39393255 49014851 64283283 74649434 69350561
40220F9350561j8600761j4635972M871895K1005458J8197350R95669j2267528
$$ 69350561 50749800 36113828 40985723 61991181 80188531 81184200 68916672
40213F8916672r309481M966692J5018205J0448781m124163j5003161j5316106
$$ 68916672 59607191 64573883 79592088 90040869 85916706 70913545 55597439
40206E5597439j1839505j3431525j7244472j3023008J147901J5466761K1180391
$$ 55597439 43757934 30326409 13081937 58929 1206830 16673591 37853982
40199C7853982J9196247J4407095R026347M752683M412889O488131L830272o039525
$$ 37853982 57050229 71457324 80483671 85236354 89649243 96137374 99967646 93928121
40191I3928121j3760051q783563M486869R163876l335447k0779710k3379134p471825
$$ 93928121 80168070 71384507 75871376 85035252 81699805 60920095 37540961 30069136
40183C0069136R829554J1436652M32254o339269j563640N404739O070858N858578
$$ 30069136 39898690 51335342 51767596 45428327 43864687 49269426 55340284 61198862
40175F1198862J2067330J8440259J3916527J208177p052158q266151j1495408
$$ 61198862 73266192 91706451 105622978 106831155 99778997 91512846 80017438
40168H0017438j8848353k0369629j1308669m82718M554194P777583J2638765J2228787
$$ 80017438 61169085 40799456 29490787 29008069 33562263 41339846 53978611 66207398
40160F6207398J744563r358308r413450j539331K762843J290138R32164L680757
$$ 66207398 67951961 58593653 49180203 47640872 50403715 51693853 52626017 56306774
40152E6306774M193792N6764m672269n837779k654001L672814R442637R391124
$$ 56306774 60500566 60557330 55885061 50047282 47393281 51066095 60508732 69899856
40144F9899856L261145k043987j386194K391041N414318Q863577J2517752J0653389
$$ 69899856 73161001 71117014 69730820 72121861 77536179 86399756 98917508 109570897
40136A09570897J843729n757643p117989q442600j3040583j1142039K668210J3985070
$$ 109570897 111414626 105656983 98538994 90096394 77055811 65913772 68581982 82567052
40128H2567052Q228062m633078n677452J441455j016163j0654263p434609R786649
$$ 82567052 90795114 86162036 80484584 81926039 80909876 70255613 62821004 72607653
40120G2607653J8533647R888060J878346N908359P405921n097654j6380295r343009
$$ 72607653 91141300 101029360 102907706 108816065 116221986 111124332 94744037 85401028
40112H5401028O373276J1132278M891424k03001l080756q694695j1101010l118577
$$ 85401028 91774304 102906582 107798006 107595005 104514249 95819554 84718544 81599967
40104H1599967N608200J169701j0434728j1738709j080794Q055837J0002340R281351
$$ 81599967 87208167 88377868 77943140 66204431 65123637 73179474 83181814 92463165
40096I2463165M616265p711607j7024833p914472J2312703J8660384M710922q138331
$$ 92463165 97079430 89367823 72342990 64428518 76741221 95401605 100112527 91974196
40088I1974196l903766O955389R034155M562471J930487j296074q824687j2137412
$$ 91974196 88070430 95025819 104059974 108622445 110552932 109256858 100432171 88294759
40080H8294759k542305J1791262J5338302O051131n422718j1978967j3870179
$$ 88294759 85752454 97543716 112882018 118933149 113510431 101531464 87661285
40073H7661285j0972973l309339L159771K144139k712269k576401K673149M794584
$$ 87661285 76688312 73378973 76538744 78682883 75970614 73394213 76067362 80861946
40065H0861946J437175J46718N078385P947031j305208j8137042k4646067r844665
$$ 80861946 82299121 82445839 87524224 95471255 94166047 76029005 51382938 41538273
40057D1538273J4453174K3947483J0223509p317862m993960J3974766K3336448
$$ 41538273 55991447 79938930 90162439 82844577 77850617 91825383 115161831
40050A15161831R104328j2475289j8273341p844812P28632l066703j2083464j4524253
$$ 115161831 124266159 111790870 93517529 85672717 86401349 83334646 71251182 56726929
40042E6726929p155461L774173Q159035L94790j2445427j4659273o32929J5365372
$$ 56726929 49571468 53345641 61504676 61899466 49454039 34794766 34161837 49527209
40034D9527209J6389335M718798m029812m199728l735497o146015m765467J803028
$$ 49527209 65916544 70635342 66605530 62405802 58670305 52524290 47758823 49561851
40026D9561851L791308k970692p364511J65553J1557224J3524928P903694O132203
$$ 49561851 53353159 50382467 43017956 43183509 54740733 68265661 76169355 82301558
40018H2301558Q513433M395110p203629j2588729m336629N292307J327403j1571914
$$ 82301558 90814991 95210101 88006472 75417743 71081114 76373421 77700824 66128910
40010F6128910j5371632m289234P806762P814287P33224l98988N061282N560408
$$ 66128910 50757278 46468044 54274806 62089093 62822317 62423329 67484611 73045019
40002G3045019l381270j1138285p427022K613745O083832q502o880139p049923
$$ 73045019 69663749 58525464 51098442 53712187 59796019 59787517 52907378 45857455
39994D5857455j090241P128388J3139300J0417863l486529j7759012j6474416
$$ 45857455 44767214 51895602 65034902 75452765 71966236 54207224 37732808
39987C7732808k60089J1606781P679505Q33970O833283J7392594J2138611p879005
$$ 37732808 37472719 49079500 56759005 57592975 64426258 81818852 93957463 86078458
39979H6078458j9085154r841343L263237J687295q389914q232568N248236J7539586
$$ 86078458 66993304 57151961 60415198 62102493 53712579 45480011 50728247 68267833
39971F8267833J7320886O349259q779675k2548570k7892807j8577856J803290
$$ 68267833 85588719 91937978 83158303 60609733 32716926 14139070 15942360
39964A5942360J9320048K1680649Q524022r644113j9444972j3632928K438834
$$ 15942360 35262408 56943057 65467079 55822966 36377994 22745066 25183900
39957B5183900J4042274J1569686Q73517n216245l041655O05801P97030p60965
$$ 25183900 39226174 50795860 51669377 46453132 43411477 44017278 44814308 44053343
39949D4053343k961332p791731j3285732j2453788l182959P306756J1514709R484300
$$ 44053343 41092011 33300280 20014548 7560760 4377801 11684557 23199266 32683566
39941C2683566M837637m32133l686852j101489N525233P351478k67478r756407
$$ 32683566 37521203 37089070 33402218 32300729 37825962 45177440 44909962 35153555
39933C5153555j0410497j936320O549168Q091216L406606k671855n520603l205226
$$ 35153555 24743058 22806738 29355906 37447122 40853728 38181873 32661270 29456044
39925B9456044J796528M885435N067396N242653N707195K832743l356355o632359
$$ 29456044 31252572 36138007 41205403 46448056 52155251 54987994 51631639 44999280
39917D4999280l445535J661236L506887K636742K09963n317633j0789163o888552
$$ 44999280 41553745 43214981 46721868 49358610 49568573 44250940 33461777 26573225
39909B6573225P608656J8671944J4090914K54210q470041q981981n975623J744148
$$ 26573225 34181881 52853825 66944739 67198949 58728908 49746927 43771304 45515452
39901D5515452J5091163K1577187Q014707j5885307k6185750j7319630o542779
$$ 45515452 60606615 82183802 90198509 74313202 48127452 30807822 24265043
39894B4265043m180720j130157P948172J1132090Q95396r246281m893075O493155
$$ 24265043 20084323 18954166 26902338 38034428 38929824 29683543 24790468 31283623
39886C1283623Q767084K117929j115736K337945N357221N037213M074698J035971
$$ 31283623 40050707 42168636 41052900 43390845 48748066 53785279 57859977 58895948
39878E8895948p142281j4566430j0683079M132729J6381651J3964559k127117
$$ 58895948 51753667 37187237 26504158 30636887 47018538 60983097 58855980
39871E8855980j8946388k1065278m340236J5505687J6078831l790944j9329067
$$ 58855980 39909592 18844314 14504078 30009765 46088596 42297652 22968585
39864B2968585j1774582O363547J1085212J360798l753725M096860J3805569J4651519
$$ 22968585 11194003 17557550 28642762 30003560 26249835 30346695 44152264 58803783
39856E8803783P294551m506471j6611559j9237056o007341J1004051J2688727
$$ 58803783 66098334 61591863 44980304 25743248 19735907 30739958 43428685
39849D3428685R23402l355558O823957J3824556M868414q037380r192410k971182
$$ 43428685 44352087 40996529 47820486 61645042 66513456 58476076 49283666 46312484
39841D6312484k411317p508050r380430n828311L70887R430623J8679442J8327929
$$ 46312484 43901167 36393117 27012687 21184376 21555263 30985886 49665328 67993257
39833F7993257N767813n441591m280226L6400n376864j2750889n776616J0198258
$$ 67993257 73761070 68319479 64039253 64075653 58698789 45947900 40171284 50369542
39825E0369542J2773736k825093j5515774r899528K887111M649030m481183j1092928
$$ 50369542 63143278 60318185 44802411 34902883 37789994 42439024 37957841 26864913
39817B6864913q689754j719348M672218R204780J1115527R166841L980413j545734
$$ 26864913 18175159 16455811 21128029 30332809 41448336 50615177 54595590 53049856
39809E3049856l916511j504183K487569J362289o663730j3737408j1696670l452338
$$ 53049856 49133345 47629162 50116731 51479020 44815290 31077882 19381212 15928874
39801A5928874K236725M377211Q147954J1434911N633689q204434j6550178j1440647
$$ 15928874 18165599 22542810 30690764 42125675 47759364 39554930 23004752 11564105
39793A1564105o32426N521418P037552Q114632Q211574O796884P725116J0776433
$$ 11564105 10931679 16453097 23490649 31605281 39816855 46613739 54338855 65115288
39785F5115288P786760l907129j3277352j1354842o184449r042354j3679005n781141
$$ 65115288 72902048 68994919 55717567 44362725 38178276 29135922 15456917 9675776
39777I675776J1253654J8506734J0124338J716336N021428J0304402L575920j0633599
$$ 9675776 20929430 39436164 49560502 51276838 56298266 66602668 70178588 59544989
39769E9544989j5735215n864666Q722876J6193920J4116013O677008j685986q212342
$$ 59544989 43809774 37945108 46667984 62861904 76977917 83654925 81968939 73756597
39761G3756597j1343794j0401707n706465J80687K256994k157497p977740o534489
$$ 73756597 62412803 52011096 46304631 46485318 48742312 46584815 38607075 32072586
39753C2072586K712079R594946N853710m155141r932651q248366m336632k068645
$$ 32072586 34784665 44379611 50233321 46078180 36145529 27897163 23560531 21491886
39745B1491886L83016M796786Q469362P671361K344024m232872q202802o866450
$$ 21491886 21874902 26671688 35141050 42812411 45156435 40923563 32720761 25854311
39737B5854311n96123N530113N014751k308313p905453l953984N469265P765248
$$ 25854311 25258188 30788301 35803052 33494739 25589286 21635302 27104567 34869815
39729C4869815j598389j1233729q131367L739788P795856j967813j2007480q224194
$$ 34869815 33271426 22037697 13906330 17646118 25441974 23474161 11466681 3242487
39721C242487M652123J0935780N439304k845368n421329k311199L514006R234668
$$ 3242487 7894610 18830390 24269694 21424326 16002997 13691798 17205804 26440472
39713B6440472R107676r95018j3429127j3578659P73365J4342437J4045469M703411
$$ 26440472 35548148 34553130 21124003 7545344 8318709 22661146 36706615 41410026
39705D1410026j759235l836026p400246j1463598q467949K831436J3939042J6494983
$$ 41410026 39650791 35814765 28414519 16950921 8482972 11314408 25253450 41748433
39697D1748433R724910j335835j0132159j2258040r051641n995721m822546j294304
$$ 41748433 51473343 50137508 40005349 27747309 18695668 12699947 7877401 6583097
39689F583097N558533Q280531J814341o169107m749354M219859R328642O544938
$$ 6583097 12141630 20422161 22236502 16067395 11318041 15537900 24866542 31411480
39681C1411480K468985J069687j935385q731976j2605248o748107N158699J1763988
$$ 31411480 33880465 34950152 33014767 24282791 11677543 4929436 10088135 21852123
39673B1852123N830692q371647j8596668j6284022n466025K609617M017889N233686
$$ 21852123 27682815 19311168 714500 -15569522 -21035547 -18425930 -14408041 -9174355
39665i174355R938734J2183197Q172762M284338M399170M57441j1484355j6946168
$$ -9174355 764379 12947576 21120338 25404676 29803846 30261287 18776932 1830764
39657A830764k825466J6916167J7384857K33485r379925k929139J315648o317622
$$ 1830764 -994702 15921465 33306322 33539807 24159882 21230743 22546391 16228769
39649A6228769r287833M203044J7276653J0484165o771867j2207245m893766j841824
$$ 16228769 6940936 11143980 28420633 38904798 32132931 19925686 15031920 13190096
39641A3190096q544413j3609457r303014j71279P585201J2044876J2496473J0751063
$$ 13190096 4645683 -8963774 -18266788 -18438067 -10852866 1192010 13688483 24439546
39633B4439546J1882646J4899221R846938n451836j5541410q451400L034392m39441
$$ 24439546 36322192 51221413 61068351 55616515 40075105 31623705 34658097 34218656
39625C4218656j2967275j1831383N482094J6850202J0539602J066194K183620
$$ 34218656 21251381 9419998 14902092 31752294 42291896 43358090 45541710
39618D5541710N373402j609824j1448197r241124K343340P016516J6502o029659
$$ 45541710 50915112 49305288 37857091 28615967 30959307 37975823 37992325 31962666
39610C1962666j462446O581053O085382j932948n526568M17430P020696N164493
$$ 31962666 30500220 37081273 43166655 41233707 35707139 36124569 43145265 48309758
39602D8309758n78488O23398Q361322J1190380L982747n808029j0885680j1579876
$$ 48309758 47731270 48354668 56715990 67906370 71889117 66081088 55195408 43615532
39594D3615532p969305J672861R608529J995655j7284899k2992909k582484K1633625
$$ 43615532 35646227 37319088 46927617 48923272 31638373 8645464 6062980 27696605
39586B7696605K1848636K741102j0046680p703759j696063J416954L748422R74719
$$ 27696605 49545241 52286343 42239663 34535904 32839841 34256795 38005217 38979936
39578C8979936j0605698j6159715R13734K6007274K6681660J186105j6869509
$$ 38979936 28374238 12214523 13128257 39135531 65817191 67003296 50133787
39571E0133787q706042N535621M376589k827740J155538J0579434R501008j700318
$$ 50133787 41427745 46963366 51339955 48512215 49667753 60247187 69748195 68047877
39563F8047877j1345755j5220938j5268363j1072970m590212j756487q25493O671454
$$ 68047877 56702122 41481184 26212821 15139851 10549639 8793152 7967659 14639113
39555A4639113J6723475J3664625j474333o274485P166783J6319010N094216q419688
$$ 14639113 31362588 45027213 43552880 37278395 44445178 60764188 65858404 57438716
39547E7438716l395817P750776K268741j2684565j3035326J808756J1347869Q144338
$$ 57438716 54042899 61793675 64062416 51377851 38342525 40151281 51499150 59643488
39539E9643488K076289k419012p298033n973316O632740J5573892L994516j5907289
$$ 59643488 61719777 59300765 52002732 46029416 52662156 68236048 72230564 56323275
39531E6323275j7642982j865583N950295k453518q202572K58946J0750151J0602108
$$ 56323275 38680293 36814710 42765005 40311487 32108915 32367861 43118012 53720120
39523E3720120K266001q706618j9057298j8939610j161757J8493871J5183413
$$ 53720120 55986121 47279503 28222205 9282595 8120838 26614709 41798122
39516D1798122p324496j8520441n255077J2487717J5916116R954240K909504q360956
$$ 41798122 34473626 15953185 10698108 23185825 39101941 49056181 51965685 43604729
39508D3604729k0922035j9795915l753756O924787K441794r78470P770413J3973651
$$ 43604729 22682694 2886779 -866977 6057810 8499604 7521134 15291547 29265198
39500B9265198O063474n79897P651561J3394418l695388k7807236k7416501m004638
$$ 29265198 35328672 34748775 42400336 55794754 52099366 24292130 -3124371 -7129009
39492g129009J1053773M180771m950071K174940J7225517K0698060P205264j1548234
$$ -7129009 3924764 8105535 3155464 5330404 22555921 43253981 50459245 38911011
39484C8911011j9999945j2209222K473169Q875456M656809K417414Q659271J2843016
$$ 38911011 18911066 6701844 9175013 18050469 22707278 25124692 33783963 46626979
39476D6626979O612787R3899M483254J0333826J462586j7306173k5126541j3883364
$$ 46626979 53239766 53333665 57816919 68150745 69613331 52307158 27180617 13297253
39468A3297253M529089J6488833J7270021P233213p259971j2369057j464330J1528804
$$ 13297253 17826342 34315175 51585196 58818409 51558438 39189381 37725051 49253855
39460D9253855Q492997o459549j3362967o738522j126692n502010j0666199p043740
$$ 49253855 57746852 51287303 37924336 31185814 30059122 24557112 13890913 6847173
39452F847173P28634M326210N060586Q888809J5580230J8960908J4115309K283656
$$ 6847173 7575807 11902017 16962603 25851412 41431642 60392550 74507859 76791515
39444G6791515q415541r156985j803250N73184q515498j7054473j0898741L902875
$$ 76791515 68375974 59218989 57415739 57988923 49473425 32418952 21520211 25423086
39436B5423086Q993921M64933p648380o025602n99630J754069L124288N182990
$$ 25423086 34417007 34881940 27233560 21207958 20608328 22362397 25486685 30669675
39428C0669675K894880n152112r812539k845697J0279532J5732894P327570o399260
$$ 30669675 33564555 28412443 18599904 15754207 26033739 41766633 49094203 42694943
39420D2694943j0789937q93111J1375868R996046m168661j3064057o194132M904751
$$ 42694943 31905006 31011895 42387763 52383809 48215148 35151091 28956959 33861710
39412C3861710N419435o57006l94811N440386O219461J703546M57806J617090
$$ 33861710 39281145 38624139 38229328 43669714 49889175 51592721 52050527 53667617
39404E3667617k905876r142585l693514J2023178J8984957P642694q353312j2474117
$$ 53667617 50761741 41619156 37925642 49948820 68933777 76576471 68223159 55749042
39396E5749042n822791J4775n18244m793870q033029o030396J792684R399331
$$ 55749042 49926251 49941026 49422782 44628912 36595883 30565487 32358171 41757502
39388D1757502J0091626N261117P02764k765815o495825o722777j155322K773044
$$ 41757502 51849128 57110245 57813009 55047194 48551369 41828592 40673270 43446314
39380D3446314q35614l874943J316265L942806p859428k0091798j0554870J1312879
$$ 43446314 42610700 38735757 40052022 43994828 36135400 16043602 5488732 16801611
39372A6801611J4293333m085496j1947606M378542J8200226Q144425p708739n166765
$$ 16801611 31094944 27009448 15061842 19440384 37640610 45785035 38076296 32909531
39364C2909531P477883R643699L523684K209387K426162l830225p172564K438021
$$ 32909531 40387414 50031113 53554797 55764184 58190346 54360121 47187557 49625578
39356D9625578J1477679L235847j0371698o777682P339570N437568j4283845k4568747
$$ 49625578 61103257 64339104 53967406 47189724 54529294 59966862 45683017 21114270
39348B1114270j0762778J0033650J6353747P652029l163708o510430j904374K014512
$$ 21114270 10351492 20385142 36738889 44390918 41227210 34716780 32812406 34826918
39340C4826918m705207j5937334r891996J8149777L7455433J9797848j5716086
$$ 34826918 30121711 14184377 4292381 22442158 59897591 79695439 63979353
39333F3979353k5784499m650149J1344335J681504j1709710n674516Q960486J1093787
$$ 63979353 38194854 33544705 44889040 46570544 34860834 29186318 38146804 49240591
39325D9240591L239676R21945M992057M492551k553023p311655m300527K575502
$$ 49240591 52480267 53402212 58394269 62886820 60333797 53022142 48721615 51297117
39317E1297117M864056k837450j4651533j4773574K274672J6921324P199472j6497372
$$ 51297117 56161173 53323723 38672190 23898616 26173288 43094612 50294084 33796712
39309C3796712k1887130j721278J5580292R730447l373398j209036J1248322J5050441
$$ 33796712 11909582 10188304 25768596 35499043 32125645 30916609 42164931 57215372
39301E7215372O510627n286261j4851810j7372521m791381J7706155K6385199
$$ 57215372 63725999 58439738 43587928 26215407 21424026 39130181 65515380
39294F5515380Q991362j4030181j7734010p233334j896234j50035J1712663K5885942
$$ 65515380 74506742 60476561 42742551 35509217 33612983 33462948 45175611 71061553
39286G1061553K0195732l571531j8801693j3936199n359987n315509m202889N327868
$$ 71061553 91257285 87685754 68884061 54947862 49587875 44272366 40069477 45397345
39278D5397345J1283847L571106o991351o355906P20341J225370n000351q745454
$$ 45397345 56681192 60252298 53260947 46905041 47625382 48850752 43850401 35104947
39270C5104947p061432k857277L262154R071892O333371p269400j8144695j1790544
$$ 35104947 28043515 25186238 28448392 37520284 43853655 36584255 18439560 6649016
39262F649016O289673J7044324J2492721J879893m978063p692576p688295k923061
$$ 6649016 12938689 29983013 42475734 44355627 39377564 31684988 23996693 21073632
39254B1073632N267418R262995N038453q21403N41993Q282423J2745741P034957
$$ 21073632 26341050 35604045 40642498 39821095 40363088 48645511 61391252 68426209
39246F8426209n044660j2482996q225919K888920R344856P285919M881652Q072406
$$ 68426209 63381549 50898553 42672634 45561554 54906410 62192329 67073981 75146387
39238G5146387Q662449l018819j7921442j6379045J843040J2854433K100220j3967399
$$ 75146387 83808836 80790017 62868575 46489530 48332570 61187003 63287223 49319824
39230D9319824j3666428l124949l093080j2027155q156409J2162532K4639527
$$ 49319824 35653396 32528447 29435367 17408212 9251803 21414335 46053862
39223D6053862J3417419n844495j2136657q655147r269035j1402858l330239J1137863
$$ 46053862 59471281 53626786 41490129 32834982 23565947 12163089 8832850 19970713
39215A9970713J6475409R641551J851324j214510l442643m270614J367644Q518843
$$ 19970713 36446122 46087673 47938997 46724487 43281844 39011230 40378874 48897717
39207D8897717N141712p621601j4130440p079578L260546P044787P477618R695197
$$ 48897717 54039429 46417828 32287388 25207810 28468356 35513143 42990761 52685958
39199E2685958J0670713P360966L671479K845678K624106K276656L896850L791171
$$ 52685958 63356671 70717637 74389116 77234794 79858900 82135556 86032406 89823577
39191H9823577m459301j4953981j2867633J480227Q460198k517647j6716719j6821617
$$ 89823577 85364276 70410295 57542662 59022889 67483087 64965440 48248721 31427104
39183C1427104o498169J246420M526601P019884N286640k472853o303905R23180
$$ 31427104 24928935 26175355 30701956 37721840 43008480 40535627 34231722 35154902
39175C5154902R249642P803728M254992J0468135J9364104J6312837N011881K80885
$$ 35154902 44404544 52208272 56463264 66931399 86295503 102608340 107620221 107901106
39167A07901106J571186l324588j2294035j0921685J24503L568234o062975j4657392
$$ 107901106 109472292 106147704 93853669 82931984 83056487 86624721 80561746 65904354
39159F5904354j3307167r779087r494426n225402O349839J5477241J4873905R081812
$$ 65904354 52597187 42818100 33323674 28098272 34448111 49925352 64799257 73881069
39151G3881069K139639p642391j4757175p392320R939946J4263680k749584j7709321
$$ 73881069 76020708 68378317 53621142 46228822 56168768 70432448 67682864 49973543
39143D9973543p633286J6027236K4048642R247063r375605j5487059j0376049
$$ 49973543 42340257 58367493 82416135 91663198 82287593 66800534 56424485
39136E6424485k407233K523762Q84995n394473o541173L578442J5299305J3198557
$$ 56424485 54017252 56541014 57426009 52031536 45490363 49068805 64368110 77566667
39128G7566667l094496j8637843k2672289j7493050p906860N987794K1344298
$$ 77566667 74472171 55834328 33162039 15668989 7762129 13749923 35094221
39121C5094221K7826374J8227710j05075j1331853q689589j418583j787038q483772
$$ 35094221 62920595 81148305 81043230 69711377 61021788 59603205 57816167 49332395
39113D9332395r057077N99026Q157063L142183m808021R65081J6604080K0009004
$$ 49332395 40275318 40874344 49031407 52173590 47365569 48330650 64934730 84943734
39105H4943734K864989j6322112j8276722p123006J720236M729528P858851J0389234
$$ 84943734 87808723 71486611 53209889 46086883 47807119 52536647 60395498 70784732
39097G0784732O321087k711113r023056j0727324j1010447q550930j56638Q537831
$$ 70784732 77105819 74394706 65371650 54644326 43633879 35082949 34926311 43464142
39089D3464142O704652n758069j5063626r512994O572343J7212507J1153246n720161
$$ 43464142 50168794 44410725 29347099 19834105 26406448 43618955 54772201 49052040
39081D9052040j4268192k520862J7552598K1616790L858265j4119581j1482395
$$ 49052040 34783848 32262986 49815584 71432374 75290639 61171058 49688663
39074D9688663N676924J6342470J3176988N923121K397508M42170k943976o363945
$$ 49688663 55365587 71708057 84885045 90808166 93205674 93647844 90703868 84339923
39066H4339923q071072p194076k519749L513454L905829k797086p555278m038487
$$ 84339923 76268851 69074775 66555026 70068480 73974309 71177223 63621945 59583458
39058E9583458R92907L59192K5743O605331J0793526R38420j3694486j3510793
$$ 59583458 60576365 60935557 60961300 67566631 78360157 79298577 65604091 52093298
39050E2093298P37735Q733413J907772o649473n892393l73036M302621J0378394
$$ 52093298 52831033 61564446 63472218 56822745 50930352 50557316 54859937 65238331
39042F5238331J5998886J2032806j681103j2389884j3041461r463520m277032
$$ 65238331 81237217 93270023 91588920 79199036 66157575 56694055 52417023
39035E2417023P634499K0737461J7081653n392379k2663181j7453980l835168
$$ 52417023 60051522 80788983 97870636 92478257 69815076 52361096 48525928
39028D8525928j979698o219971N7283J2019485J1304670j716421q758000l694814
$$ 48525928 46546230 40326259 40383542 52403027 63707697 61991276 53233276 49538462
39020D9538462J257695o78722k245638N33255K087353K025266P576007J6110144
$$ 49538462 50796157 50117435 47871797 48405052 50492405 52517671 60093678 76203822
39012G6203822J3347113l003291j4455262p492927N841289O204714m970605j0698642
$$ 76203822 89550935 86547644 72092382 64599455 70440744 76645458 71674853 60976211
39004F0976211n219033L59095k011685o075645l230730N023728J1670263J3283764
$$ 60976211 55757178 56116273 54104588 48028943 44798213 49821941 61492204 74775968
38996G4775968Q996699k482186j6841976k0565088m777780J7942248K2984730
$$ 74775968 83772667 81290481 64448505 43883417 39105637 57047885 80032615
38989H0032615M307544j5517553j3836744L412905J3426874R183271M003390N923728
$$ 80032615 84340159 68822606 54985862 58398767 71825641 81008912 85012302 90936030
38981I0936030N790227m464016j6626098j7419805n315745R888094J6263451N988694
$$ 90936030 96726257 92262241 75636143 58216338 52900593 62788687 79052138 85040832
38973H5040832j6453293k9908820j5346972J5799919K9266305J2408240q129228
$$ 85040832 68587539 38678719 23331747 39131666 68397971 80806211 72676983
38966G2676983o283404O709320O193687l999653k423183Q789407P135182q257440
$$ 72676983 66393579 73102899 79296586 75296933 72873750 81663157 88798339 80540899
38958H0540899j1830017M988381J7038898N618629j1396005q703165P620614J2908425
$$ 80540899 68710882 73699263 90738161 96356790 84960785 76257620 83878234 96786659
38950I6786659K341409o403832k860471M785091P254117N624939K278410n463889
$$ 96786659 99128068 92724236 89863765 94648856 101902973 107527912 109806322 104342433
38942A04342433j6514940k0513334r362343R519385J8725756J0334795n072892
$$ 104342433 87827493 67314159 57951816 67471201 86196957 96531752 91458860
38935I1458860j2107675r453853p846899j0363486o840060O261893J3597650K273647
$$ 91458860 79351185 69897332 62050433 51686947 44846887 51108780 64706430 66980077
38927F6980077j4233030j2605329M462967J1361138l89888r590723j074968R791185
$$ 66980077 52747047 40141718 44604685 55965823 55575935 45985212 44910244 54701429
38919E4701429M200663p712694l181269J5947747K5067733J2309869p305242j4236180
$$ 54701429 58902092 51189398 48008129 63955876 89023609 101333478 94028236 79792056
38911G9792056o305797M114700M587383o926312j8964764j5861231K965838J7844937
$$ 79792056 73486259 77600959 82188342 75262030 56297266 40436035 43401873 61246810
38903F1246810J2145811m912747j0770286k41126J0777306J0438844M111267M18289
$$ 61246810 73392621 68479874 57709588 57468462 68245768 78684612 82795879 83214168
38895H3214168j432315n127233r001645j0041125q462013m523038K336862Q841141
$$ 83214168 81781853 76654620 67652975 57611850 49149837 44626799 46963661 55804802
38887E5804802R465478M428058p67370l939892o278346m836619L878731J2681175
$$ 55804802 65270280 69698338 68930968 64991076 58712730 53876111 57754842 70436017
38879G0436017R695043j626682l522242Q784959J6335318L916192j5190055j6992316
$$ 70436017 80131060 78504378 74982136 83767095 100102413 104018605 88828550 71836234
38871G1836234k42152J4527412J4658223P196549J627353l065331r840146j4672304
$$ 71836234 71594082 86121494 100779717 107976266 109603619 106538288 96698142 82025838
38863H2025838j2941472o913895j194677L468355P258928P639834L758117M14672
$$ 82025838 69084366 62170471 60975794 64444149 71703077 79342911 83101028 83515700
38855H3515700K387519P279255Q617952M513728p98048l107957k393446j265038
$$ 83515700 85903219 93182474 101800426 106314154 105516106 102408149 100014703 98749665
38847I8749665k165950n711465r222766p788183j15092P443540P305063J331214
$$ 98749665 96583715 90872250 81649484 73861301 73746209 81189749 88494812 89826026
38839H9826026q78914L352940M000650o623102j9168990j7711767k362058J0228260
$$ 89826026 88947112 92300052 96300702 89677600 70508610 52796843 50434785 60663045
38831F0663045R645910K691887j614789m137537n357389K429549J9350230K6685755
$$ 60663045 70308955 73000842 71386053 67248516 61891127 64320676 83670906 110356661
38823A10356661J0004147j3967645j5319935O446744K0964180J0988687o178598
$$ 110356661 120360808 106393163 91073228 97519972 118484152 129472839 123294241
38816A23294241j0138738o852317j0706104j6405540j0103573L742876Q872700
$$ 123294241 113155503 106303186 95597082 79191542 69087969 72830845 81703545
38809H1703545L617015j72254j27498m042445r074425k124078J5994945K6708260
$$ 81703545 85320560 85148306 85020808 80978363 71903938 69779860 85774805 112483065
38801A12483065K0013871P407604J535821p63599o211390j0700793q254929k816478
$$ 112483065 132496936 139904540 141440361 140676762 134465372 123764579 115509650 112693172
38793A12693172k52918J717441N536334N129015m143745j4943383j7557494j2570995
$$ 112693172 112440254 114157695 119694029 124823044 120679299 105735916 88178422 75607427
38785G5607427m912140N497055J6716253J8808890Q231830j348676J980538P652910
$$ 75607427 70695287 76192342 92908595 111717485 119949315 118600639 120581177 128234087
38777A28234087o68550j5183548j3386540N398347J7326983J0520563L32098Q57278
$$ 128234087 127565537 112381989 98995449 104393796 121720779 132241342 132573440 133430718
38769A33430718L796044k136314j0026083q547838k292743k004262n425693l739131
$$ 133430718 137226762 135090448 125064365 116516527 114223784 112219522 106793829 103054698
38761A03054698J464802L048806L183445Q087223J3389566J0060074J309957j242673
$$ 103054698 104519500 107568306 110751751 118838974 132228540 142288614 143598571 142355898
38753A42355898L912537P494067N640342K873156k83915q109227j6854137j5002759
$$ 142355898 146268435 153762502 159402844 162276000 161992085 153882858 137028721 122025962
38745A22025962J18226J7090928K4610773K1142684R525154o280159j7093065
$$ 122025962 122144188 139235116 163845889 184988573 194513727 188233568 171140503
38738A71140503j3836595j040628O199885K446683k563701k097936j961119n345616
$$ 171140503 157303908 156263280 162463165 164909848 162346147 160248211 158287092 152941476
38730A52941476l089620R829267K0553797J5242726J081734l718225L148010O455279
$$ 152941476 149851856 159681123 180234920 195477646 196559380 192841155 195989165 202444444
38722B02444444k511179j4457845j7018122j0006047j528829L060627L538784
$$ 202444444 199933265 185475420 168457298 158451251 156922422 159983049 163521833
38715A63521833J558852j65602J728137P640638J2861716J2319142P793476O956437
$$ 163521833 165080685 164915083 166643220 174283858 187145574 199464716 207258192 214214629
38707B14214629J2177623J3346071m38814k1267624k5764445n584643J6329488
$$ 214214629 226392252 239738323 239299509 218031885 192267440 186682797 203012285
38700B03012285J3852705o082176j4311335k543722P822018K707536l993652K667832
$$ 203012285 216864990 210782814 196471479 193927757 201749775 204457311 200463659 203131491
38692B03131491J3734421J4140737P158901L388022R73673m503280m971461M651115
$$ 203131491 216865912 231006649 238165550 241553572 242527245 238023965 233052504 237703619
38684B37703619R418934l881819j9593083j3862392O702957J5680046R736203
$$ 237703619 247122553 243240734 223647651 209785259 216488216 232168262 241904465
38677B41904465R048811J6747005J2687211o942702j7996547q370603J381117
$$ 241904465 250953276 267700281 280387492 273444790 255448243 247077640 248458757
38670B48458757n990797j5577722q137424O575244Q208740n250j34670R315304
$$ 248458757 242467960 226890238 218752814 225328058 233536798 233531548 233396878 242712182
38662B42712182J4278660R466407J807468m566813r547939q993396j023779N463981
$$ 242712182 256990842 266457249 268264717 263697904 254149965 245156569 244132790 249596771
38654B49596771K531876l765441n338290o934332j3303934j3066191M162526K3842936
$$ 249596771 252128647 248363206 243024916 236090584 222786650 209720459 213882985 237725921
38646B37725921K3270636O586088j622344N024450Q456596j17461o627690p89349
$$ 237725921 260996557 267582645 265960301 270984751 279441347 279323886 272696196 271906847
38638B71906847P478858P992660O046392P270760N380901k656214o060771J453364
$$ 271906847 279385705 287378365 293424757 300695517 306076418 303420204 297359433 298812797
38630B98812797P767926J763774o583887k488525P793212O424309o757766j3891920
$$ 298812797 306580723 308344497 301760610 299272085 307065297 313489606 306731840 292839920
38622B92839920p065494J020957k054375j0837017j1851018k226055Q291695R879895
$$ 292839920 285774426 286795383 284741008 273903991 262052973 259826918 268118613 277998508
38614B77998508K793508l527803k81185J0578272J7400938J2479084J832067l357830
$$ 277998508 280792016 277264213 276983028 287561300 304962238 317441322 319273389 315915559
38606C15915559k507506n298800j5059130k0784793j1195612P860446J7637474
$$ 315915559 313408053 308109253 293050123 272265330 261069718 268930164 286567638
38599B86567638Q909646n658551o127107R853535K2955306J5398035o658444j9956883
$$ 286567638 295477284 289818733 283691626 293545161 316500467 331898502 325240058 305283175
38591C05283175j1804692O309863J4718385Q463776j175307l621753L85362M645907
$$ 305283175 293478483 299788346 314506731 322970507 321795200 318173447 318558809 323204716
38583C23204716N865535K706166o734421j9453600k3661008j0390607J0803170
$$ 323204716 329070251 331776417 325041996 305588396 281927388 271536781 282339951
38576B82339951J8927746Q843651j61204P413903J7943751Q436475j5205384k2723975
$$ 282339951 301267697 310111348 309950144 317364047 335307798 343744273 328538889 305814914
38568C05814914m326043J3235354O250872j1748859j3289919J821362J1157788
$$ 305814914 301488871 314724225 320975097 309226238 295936319 297757681 308915469
38561C08915469O163530M0733J730239M047802K08583n596546p929944o602798
$$ 308915469 315078999 315119732 316849971 320897773 321106356 315509810 307579866 300977068
38553C00977068j603416N711236O982856l199420j3540163r466730J583107k08208
$$ 300977068 299373652 305084888 312067744 308868324 295328161 285861431 287444538 287236330
38545B87236330j1794053q007037J5875784L0404184J5101788j0246398j7251488
$$ 287236330 275442277 267435240 283311024 313715208 328816996 318570598 301319110
38538C01319110r726595q536747j3505938q998104L377659O956376N00309o05186
$$ 301319110 291592515 283055768 269549830 260551726 263929385 270885761 271386070 270780884
38530B70780884P023087J0038849M123736P52068M002226L118589n292298r117560
$$ 270780884 277803971 287842820 291966556 292718624 296720850 299839439 294547141 285429581
38522B85429581l746326k766935j3431134j9968260p595338J1116270J2501305
$$ 285429581 281683255 278916320 265485186 245516926 237921588 249037858 261539163
38515B61539163m305862j7981534j5137432k975853O865650J1318394J0728795
$$ 261539163 257233301 239251767 224114335 221138482 228004132 239322526 250051321
38508B50051321M580698k771920l041275L434066N299182k717196r045617j739643
$$ 250051321 254632019 251860099 248818824 252252890 257552072 254834876 245789259 244049616
38500B44049616J0781631R356781p018743j7769125j0970255j220968n681832
$$ 244049616 254831247 264188028 257169285 239400160 228429905 227208937 221527105
38493B21527105j5628393j0618337O398182J1694019p59341q320835L663968J7443688
$$ 221527105 205898712 195280375 201678557 213372576 212613235 204292400 207956368 225400056
38485B25400056J1763663l889293o428505K811534L550723o703216r673620m70569
$$ 225400056 237163719 233274426 226845921 229657455 233208178 226504962 216831342 216360773
38477B16360773L057390p794343j6480325r220643K232390J606672n477726m256159
$$ 216360773 219418163 211623820 195143495 185922852 188155242 189761914 184284188 180028029
38469A80028029L406757N646010L401273N894256R122580M56349j6416238k2049423
$$ 180028029 183434786 189080796 192482069 198376325 207498905 207955254 191539016 169489593
38461A69489593r907776M312000P616813O079085P583193N458331o746108j7466815
$$ 169489593 159581817 163893817 171510630 177589715 185172908 190631239 183885131 166418316
38453A66418316j1755267L781571Q859382n36794p908976k774299O042525Q331711
$$ 166418316 154663049 158444620 167304002 166767208 158858232 156083933 162126458 170458169
38445A70458169P264110P794049M899975m805293j1624270o923108P01647r58433
$$ 170458169 177722279 185516328 190416303 185611010 173986740 167063632 167765279 166806846
38437A66806846n712095Q18273J3539433J1941637p108073k1882577j6988008
$$ 166806846 161094751 161913024 175452457 187394094 180286021 158403444 141415436
38430A41415436k883557M312941M800295N805961O241872L766308L752194P884509
$$ 141415436 138531879 142844820 147645115 153451076 159692948 163459256 167211450 175095959
38422A75095959O374219m847254j2293803n693033K826657j446468r756518n490051
$$ 175095959 181470178 176622924 164329121 158636088 161462745 160016277 150259759 144769708
38414A44769708N268594M201748o042217p098502P69413k84900r898892o476861
$$ 144769708 150038302 154240050 148197833 141099331 141868744 141583844 131684952 125208091
38406A25208091J3637694K4858380J2296096m852065n624959J594442j150483
$$ 125208091 138845785 163704165 176000261 171148196 165523237 167117679 165967196
38399A65967196j1285637j5312710j1905149o782245M27706P138262K225972j2088547
$$ 165967196 154681559 139368849 127463700 120681455 121109161 128247423 130473395 118384848
38391A18384848j1144643J6401104M1096253K9206080o589397k4648084j3826140
$$ 118384848 107240205 123641309 164737562 193943642 187354245 162706161 148880021
38384A48880021q00012o83240K048528J5958404K1169411K682393k1191717k4372939
$$ 148880021 148080009 147396769 149445297 165403701 186573112 189255505 168063788 143690849
38376A43690849r232295K251779J009666l781048l934341o65082K387279K754401
$$ 143690849 134458554 136710333 137719999 133938951 130004610 129339528 131726807 134481208
38368A34481208j251789o528741n532140K489624P136610J443998o287559m633107
$$ 134481208 133229419 126700678 121168538 123658162 130794772 132238770 125951211 121318104
38360A21318104L142174M217896m613613j3575913j4146756p336677J764597R362162
$$ 121318104 124460278 128678174 124064561 110488648 96341892 89005215 90769812 100131974
38352A00131974J2266448Q816316J992380l077223n174056o642734p665990n554865
$$ 100131974 112398422 121214738 123207118 120129895 114955839 108313105 100647115 95092250
38344I5092250N7851N213022N413666o30154r792517j4861532r039530N712495
$$ 95092250 95150101 100363123 105776789 105146635 95354118 80492586 71453056 77165551
38336G7165551J7327380J5751349M571050m819528q237580j0319122j2441236
$$ 77165551 94492931 110244280 114815330 109995802 101758222 91439100 78997864
38329G8997864r431655j211043K603428l159828q382764q17114J4472299J9935251
$$ 78997864 69566209 68355166 70958594 67798766 59416002 58598888 73071187 93006438
38321I3006438Q772124p359297j5018351j2784761n328281N142118J4925470J6218715
$$ 93006438 101778562 94419265 79400914 66616153 61287872 66429990 81355460 97574175
38313I7574175P895608J451428N729697J2049995O747008o518849j1555265m328570
$$ 97574175 105469783 106921211 112650908 124700903 131447911 124929062 113373797 109045227
38305A09045227L110100L717224L398796M505293n19651j1429801j3653283j164349
$$ 109045227 112155327 115872551 119271347 123776640 123256989 111827188 98173905 97009556
38297I7009556R592635L299321r894766j0653869j98750N654479M097525N026717
$$ 97009556 106602191 109901512 100006746 89352877 89154127 94808606 98906131 103932848
38289A03932848P147775j779063j8757658k2376783l635603J8506362K2685219
$$ 103932848 111080623 109301560 90543902 68167119 64531516 83037878 105723097
38282A05723097J1685876K343808Q08592O14011k084430l803629j712159K261723
$$ 105723097 117408973 119752781 120561373 121175384 119090954 115287325 113575166 115836889
38274A15836889M491002K414071l635228q664531o469610K713845J1092653J1070995
$$ 115836889 120327891 122741962 119106734 110442203 103972593 106686438 117779091 128850086
38266A28850086J551889j1723550j8082944r187245P601702R978535j1200841
$$ 128850086 130401975 118678425 100595481 91408236 99009938 108988473 97787632
38259I7787632l0606026j6352129K1575765L7179230J0471092k3877111k6620748
$$ 97787632 67181606 50829477 72405242 109584472 120055564 96178453 69557705
38252F9557705o960312O29160p364487n162997J2795476K1237704P277914q361571
$$ 69557705 62597393 63226553 55862066 50699069 63494545 84732249 92010163 83648592
38244H3648592n899090L922719K063832o945817n896757N034873J0155879M417853
$$ 83648592 77749502 81672221 83736053 76790236 70893479 75928352 86084231 90502084
38236I0502084j004617J668382O794397O445644K7215r002292j6518817j6579115
$$ 90502084 89497467 91165849 97960246 104405890 104433105 95430813 78911996 62332881
38228F2332881o132639P304819J1640058O216483K685692O628999Q603788q8336
$$ 62332881 56200242 63505061 75145119 81361602 84047294 90676293 99280081 99191745
38220I9191745j2237156j4896569p751614k92861M297618R721678J3896255J0392856
$$ 99191745 86954589 72058020 64306406 64013545 68311163 78032841 91929096 102321952
38212A02321952L127532L985285J1518943Q249208j1749734k7781030j9228267
$$ 102321952 105449484 109434769 120953712 129202920 117453186 89672156 70443889
38205G0443889M091268J5397224P452316l014710l852840o79836k97779K02086
$$ 70443889 74535157 89932381 97384697 94369987 90517147 89837311 89539532 89741618
38197H9741618K364890N39348n622566o659840P58718N967072J160785n444583
$$ 89741618 92106508 92645856 87023290 80363450 81122168 87089240 88250025 82805442
38189H2805442l125666N023741R804401J0505500J0244027N209894p987437j9894387
$$ 82805442 79679776 84703517 94507918 105013418 115257445 120467339 112479902 92585515
38181I2585515j7003191q11837J3417144J5602446Q672488o97289q748034j2172745
$$ 92585515 75582324 74770487 88187631 103790077 112462565 111765276 103017242 90844497
38173I0844497q414233k69793N614784N360997k89173p723088j0399717k945850
$$ 90844497 82430264 82160471 87775255 93136252 92847079 85123991 74724274 71778424
38165G1778424Q880547R751119n067129j8778184j3954852K352953Q980584J482608
$$ 71778424 80658971 90410090 85342961 66564777 52609925 54962878 63943462 65426070
38157F5426070m658080q09501L387754k67790m291234L10286Q288399Q795182
$$ 65426070 60767990 59958489 63346243 63078453 58787219 59097505 67385904 76181086
38149G6181086J430879n483867o857143l579897J744897N319911K828249m337145
$$ 76181086 77611965 72128098 65270955 61691058 63435955 68755866 71584115 67246970
38141F7246970p406226p17800R192700J0742784J651141q885046j1234249m092441
$$ 67246970 59840744 59122944 68315644 79058428 80709569 71824523 60590274 56497833
38133E6497833P342368J7258624K1252625J5725880M95239j6390551k1558023
$$ 56497833 63840201 81098825 102351450 118077330 118572569 102182018 80623995
38126H0623995j0421167L899060M530161o418749j0544527j255170N714188j531948
$$ 80623995 70202828 74101888 78632049 72213300 61668773 60413603 66127791 64595843
38118F4595843j0122369l327244J0500063J0908328r74819n930784k26237Q61089
$$ 64595843 54473474 51146230 61646293 72554621 71579802 65649018 65422781 66283870
38110F6283870n253942j560080J5170391K1573180L937424j6175924j3080666
$$ 66283870 61029928 59469848 74640239 96213419 100150843 83974919 70894253
38103G0894253M626364J0291387P11990m169877L526244R875562M526665n488167
$$ 70894253 75520617 85812004 86523994 82354117 85880361 95755923 100282588 94794421
38095I4794421j0660820j0691021p230438N27890Q327329P298150k779440j0403687
$$ 94794421 84133601 73442580 66212142 66740032 75067361 82365511 79586071 69182384
38087F9182384p069946L003153J0975912J3077165R211764K13337r305659j2126102
$$ 69182384 62112438 65115591 76091503 89168668 98380432 98593769 89288110 77162008
38079G7162008o775369L7407J858907j363915o631922j1000583r595464J981234
$$ 77162008 70386639 70424046 72282953 70919038 64287116 53286533 43691069 45672303
38071D5672303J9126436K8227913K0581729K780595j0949328j3666724r404103
$$ 45672303 64798739 93026652 113608381 116388976 105439648 91772924 82368821
38064H2368821n550506o420109j2133894j8344166j7388742n270479J0620429
$$ 82368821 76818315 70398206 58264312 39920146 22531404 17260925 27881354
38057B7881354J5719905M760561r115819q423988O215356J6434360J1518811K699676
$$ 27881354 43601259 48361820 39246001 30822013 37037369 53471729 64990540 67690216
38049F7690216L941370R164837L757838p923213p077330P492737J4314111L105402
$$ 67690216 71631586 80796423 84554261 76631048 69553718 77046455 91360566 94465968
38041I4465968q178830k872895P974813O619827j380228r58533K125088q198638
$$ 94465968 86287138 83414243 91389056 98008883 96628655 95670122 97795210 89596572
38033H9596572k4927637k4161834l880494J1194388P125337k834958n587428o329663
$$ 89596572 64668935 40507101 36626607 47820995 54946332 52111374 46523946 40194283
38025D0194283r605373o712056M622227J0185558M116285K515624J4616545K1622113
$$ 40194283 30588910 23876854 28499081 38684639 42800924 45316548 59933093 81555206
38017H1555206O851739j2080859r086547O793948N600631j3788153k2736018j1269947
$$ 81555206 88406945 76326086 67239539 74033487 79634118 65845965 43109947 31840000
38009C1840000k264517r212403j2857393L481553K2594052K0063383K943881l307401
$$ 31840000 29575483 20363080 7505687 10987240 33581292 53644675 56588556 53281155
38001E3281155N238431R462293P56915p811595n587409N52482J331945o3748L006633
$$ 53281155 58519586 67981879 68738794 60927199 55339790 55892272 57224217 57160469 60167102
37992F0167102P173888M214096n478308j2486930r896890l64039P955262R910573
$$ 60167102 67340990 71555086 66076778 53589848 43692958 43328919 51284181 61194754
37984F1194754P571893O396303P511207O282624M12803m445011k346129K526725
$$ 61194754 68766647 75162950 82674157 88956781 89369584 84924573 82578444 85105169
37976H5105169P26984p675731j2006939p055563j237409k893616o057599O24453
$$ 85105169 85832153 78156422 66149483 59093920 57856511 54962895 48905296 49529749
37968D9529749J4330838J8524818N127135j2619956j5698744l291884O497518
$$ 49529749 63860587 82385405 87512540 74892584 59193840 55901956 62399474
37961F2399474K32795j3722342j6886017n418462N763892N096019O05945N891132
$$ 62399474 62632269 48909927 32023910 26605448 32369340 37465359 38071304 43962436
37953D3962436J6914830J6293376l0233j5071897j4849910p008338o220925j2028996
$$ 43962436 60877266 77170642 77140409 62068512 47218602 40210264 33989339 21960343
37945B1960343j3885946j0136701o700511j697789J1277615K5404719K4617624
$$ 21960343 8074397 -2062304 -8762815 -10460604 817011 26221730 50839354
37938E0839354R115447j113334L919767Q268012l456656j8994246j6017871L067538
$$ 50839354 59954801 58841467 62761234 71029246 67572590 48578344 32560473 35628011
37930C5628011J4842416R765692K275098M213237Q296053N241433k4246n02729
$$ 35628011 50470427 60236119 62511217 66724454 75020507 80261940 80237694 79734965
37922G9734965j652937r792393j6078477q435509N980783P644713o410763j7088309
$$ 79734965 78082028 68289635 52211158 43775649 49756432 57401145 50990382 33902073
37914C3902073j0401194M745724J2798080J2050261Q751496K566305p811068j2672940
$$ 33902073 23500879 28246603 41044683 53094944 61846440 64412745 56601677 43928737
37906D3928737k270338J3248904J2974253m203350j6022195q995374L814808O616008
$$ 43928737 41658399 54907303 67881556 63678206 47656011 38660637 42475445 49091453
37898D9091453M815524R814244J4509039M608251j4106973k1893847j4918362
$$ 49091453 53906977 63721221 78230260 82838511 68731538 46837691 31919329
37891C1919329p342661m399237L390716J5523673J5174465k434256j6486023r581223
$$ 31919329 24576668 20177431 23568147 39091820 54266285 51832029 35346006 25764783
37883B5764783O795670J1595051M556915k24209O21192K80064n87258L865663
$$ 25764783 32560453 44155504 48712419 48488210 49109402 49389466 48802208 52667871
37875E2667871R208853N826344k867309m425083J492700K607314m990072j1450482
$$ 52667871 61876724 67703068 64835759 60410676 61903376 64510690 59520618 48070136
37867D8070136j0668490p933894p016046m148654P00860L65014n587366n733585
$$ 48070136 37401646 29467752 22451706 18303052 19003912 19368926 13781560 8047975
37859H047975O429255J9850524J8486051J221847j6761584j9492125m774310J3239875
$$ 8047975 14477230 34327754 52813805 54035652 37274068 17781943 13007633 26247508
37851B6247508J6320039J659320j3276929j1824823N57422O221448J640237j233761
$$ 26247508 42567547 44226867 30949938 19125115 19682537 25903985 27544222 26310461
37843B6310461J955596J622513n703642q567944L83481J0897180J0081536J76862
$$ 26310461 28266057 29888570 24184928 15616984 16000465 26897645 36979181 37156043
37835C7156043p154866n761579K250184J0608763J1326043J983751o857662k641890
$$ 37156043 30001177 24239598 26489782 37098545 48424588 50408339 43550677 40908787
37827D0908787R266518J1287892J505620k967896L864221N282754q201652j9217510
$$ 40908787 50175305 61463197 62968817 60000921 63865142 69147896 60946244 41728734
37819D1728734j1046944M184871N573954l826038p078916l611377m707367p668258
$$ 41728734 30681790 34866661 40440615 36614577 29535661 25924284 21216917 13548659
37811A3548659k81000J3243030J5439050L718199o671054p550882m991758j917694
$$ 13548659 13267659 26510689 41949739 45667938 38996884 31446002 26454244 24536550
37803B4536550N281520J1743497O946116m767407o815753L057597Q999214L974868
$$ 24536550 29818070 41561567 48507683 43740276 36924523 39982120 48981334 52956202
37795E2956202j72154M377665Q716754N321522R675k659202p667245j4455108
$$ 52956202 52784048 57161713 65878467 71199989 71209664 68550462 60883217 46428109
37787D6428109j2251177n86536M290458m860520j2900175p855994m49249j973534
$$ 46428109 34176932 33590396 37880854 33020334 20120159 12264165 11814916 9841382
37779I841382k221302R675130J9565805Q721429j2229545j6796084k802107P800641
$$ 9841382 7620080 17295210 36861015 45582444 33352899 16556815 13754708 21555349
37771B1555349N362014J268175L95498o648263j8073015j5071022O661322K2864937
$$ 21555349 26917363 28185538 28581036 21932773 3859758 -11211264 -4549942 18314995
37763A8314995J4155431n190894j0366939k969632k698275j1199179r326346R064922
$$ 18314995 32470426 27279532 16912593 13942961 11244686 45507 -9280839 -215917
37755b15917K3601732J6500821j679389q755145k696506l18997p981326j1534763
$$ -215917 23385815 39886636 38207247 29452102 26755596 26436599 18455273 6920510
37747F920510n47162J2693264J0848791r74940k015044J1963739K1142402J1365270
$$ 6920510 6373348 19066612 29915403 28940463 26925419 38889158 60031560 71396830
37739G1396830m968684q880041k806900k767270j0335733j1310226j110996P219190
$$ 71396830 66428146 57548105 54741205 51973935 41638202 30327976 29216980 36436170
37731C6436170M904952P34446L641240N886226l371909j7040443j8100402n053291
$$ 36436170 41341122 42075568 45716808 51603034 48231125 31190682 13090280 8036989
37723H036989N792297M417686o30879P51061L337820l100815j4132424j4182548
$$ 8036989 13829286 18246972 17616093 18367154 21704974 18604159 4471735 -9710813
37715i710813J389557J9089115K4935243K0107695J3930681R042732J595491q291407
$$ -9710813 -8321256 10767859 35703102 55810797 69741478 78784210 80379701 72088294
37707G2088294j5470016j8079201j8657357j6599107p896848N176821J2255308
$$ 72088294 56618278 38539077 19881720 3282613 -4614235 562586 12817894
37700A2817894P858204J78872O49553Q688070J3531402R288270J543379j277107
$$ 12817894 20676098 20854970 21504523 30192593 43723995 53012265 54555644 53278537
37692E3278537K177361O461128O052869k9098q370461j4211756j4830232j0930883
$$ 53278537 55455898 61917026 67969895 67940797 59570336 45358580 30528348 19597465
37684A9597465n536315j883909j267544j635316K66758L543907K768384l153635
$$ 19597465 14061150 12177241 10909697 9274381 9541139 13085046 15853430 12699795
37676A2699795n581767K445957J1776663O348857j0840526j5279921O366034L3089092
$$ 12699795 7118028 9563985 21340648 27689505 16848979 1569058 7935092 41024184
37668D1024184L3633658P058121j7310980j8710079o661881n21377l494635o389424
$$ 41024184 74657842 81715963 64404983 45694904 39033023 38511646 35017011 28627587
37660B8627587n731734n563625o365235l810601K199791O172394N706520M666714
$$ 28627587 22895853 17332228 10966993 7156392 9356183 15528577 21235097 25901811
37652B5901811N716984N409386K11860o408117p647557l104716l19880m890842
$$ 25901811 31618795 37028181 37240041 30831924 23184367 20079651 19759771 14868929
37644A4868929j2053896j1546807j68046J3968141K0492921J7100887R364971
$$ 14868929 2815033 -8731774 -8899820 5068321 25561242 42662129 52027100
37637E2027100L233279L65139r50320l011757o122144p561071m907070j028133
$$ 52027100 55260379 55625518 54675198 51663441 45541297 37980226 33073156 32045023
37629C2045023j847093p050923q224953p70466P492014O748080L16298l8354P501610
$$ 32045023 30197930 23147007 14922054 14151588 21643602 28391682 28707980 28669626 36171236
37620C6171236J1816304O220940j570829k139421J488379J45031o389828r380970
$$ 36171236 47987540 54208480 52637651 50498230 51986609 52131640 45741812 36360842
37612C6360842m684221J229781K68114o840829j1636971q172846k26482L506894
$$ 36360842 31676621 32906402 33174516 26333687 14696716 6523870 6297388 9804282
37604I804282J582766K575545J0890717J4901236O77671k2791440k7486586l037793
$$ 9804282 11387048 13962593 24853310 39754546 40432217 17640777 -9845809 -12883602
37596a2883602K4438269K4032374N95793j4329938o762800N860689O265343M00551
$$ -12883602 11554667 35587041 36182834 21852896 15090096 20950785 27216128 27616679
37588B7616679O091J639362k244230o116313k902877j739349j3979868k8143397
$$ 27616679 27622770 29262132 27017902 20901589 17998712 16259363 2279495 -25863902
37580b5863902k1352667N276816K5319148K4699565J8180643J9848140J9748473
$$ -25863902 -47216569 -41939753 -16620605 8078960 26259603 46107743 65856216
37573F5856216N869926r153000n611030R687590J1450979n649093j9490126j4410527
$$ 65856216 71726142 62573142 56962112 66649702 78100681 72451588 52961462 38550935
37565C8550935k309664j561287j0481429j3648339n383604N199076R332142R075614
$$ 38550935 36241271 34679984 24198555 10550216 5166612 10365688 19697830 28773444
37557B8773444J1049523J4532702J0190836o937081k5444723k6571897q563562
$$ 28773444 39822967 54355669 64546505 57609424 32164701 5592804 -2970758
37550b970758P424352L965817r280673j1149612M36054J0105143J1331934J0744694
$$ -2970758 4453594 8419411 -861262 -12010874 -11574820 -1469677 9862257 20606951
37542B0606951Q642959j570452j2658646p249436J1138487J6342533l4981j2454006
$$ 20606951 29249910 27679458 15020812 7771376 18909863 35252396 35217415 22763409
37534B2763409k234501J0999249K222290j6471137j5890737K813442J3113424
$$ 22763409 20528908 31528157 33750447 17279310 1388573 4202015 17315439
37527A7315439P270483K834335P031456O215369n178129j2898560p452575K387428
$$ 17315439 24585922 27420257 34451713 40667082 35488953 22590393 15137818 17525246
37519A7525246P347468Q149385L019657j3012342k9406157k3955377L873519K4638010
$$ 17525246 24872714 33022099 36041756 23029414 -6376743 -30332120 -26458601 -1820591
37511a820591J7025084m146331j1550522j52277J5690459K4364255K1460897O111041
$$ -1820591 15204493 11058162 -492360 -644637 15045822 39410077 60870974 66982015
37503F6982015j2276194j6446466m548697K824833o425158j4220137j285766J7789561
$$ 66982015 54705821 38259355 33710658 36535491 30110333 15890196 14604430 32393991
37495C2393991J4954594n522063j1992128N065885J8674920P966189j1177503
$$ 32393991 47348585 41826522 29834394 34900279 53575199 61541388 50363885
37488E0363885j2932241K49348N619461l829218j1531206m870824O441661O591083
$$ 50363885 37431644 37680992 43300453 39471235 27940029 23069205 29510866 36101949
37480C6101949k596253o123943m31690J146856p900129j2946822j131278J2800421
$$ 36101949 33505696 27381753 26950063 28096919 20196790 7249968 6118690 18919111
37472A8919111M903880j8164962k3945296k814601J5907978R140671n440587j235062
$$ 18919111 23822991 5658029 -18287267 -21101868 -5193890 3946781 -1493806 -2728868
37464b728868J3783667J4159853J838059N10855J1833230J1605831q004136k3489623
$$ -2728868 11054799 25214652 27052711 27563566 39396796 51002627 42998491 19508868
37456A9508868j5950269L360449J4211939J2789511M578976q763133k2128139
$$ 19508868 3558599 6919048 21130987 33920498 38499474 29736341 7608202
37449G608202k2589162o480462J0999915J5043311R064028L223892k030165q712714
$$ 7608202 -14980960 -21461422 -10461507 4581804 13645832 16869724 14839559 6126845
37441F126845r905155o57425Q818553O175650l560629o484884k432037l295492
$$ 6126845 -3778310 -4435735 4382818 10558468 6997839 512955 -1919082 -5214574
37433e214574j1376176j5144877p473676N216602J4094035J6759316J2883993
$$ -5214574 -16590750 -31735627 -39209303 -33992701 -19898666 -3139350 9744643
37426I744643K450716q056364q530669L86189N555960N08437l374246N335265
$$ 9744643 12195359 4138995 -4391674 -4005485 1550475 2058912 -1315334 4019931
37418D019931J7334890J4028584l433131j3463899n816595L002175l329463j3458463
$$ 4019931 21354821 35383405 31950274 18486375 12669780 15671955 12342492 -1115971
37410a115971o081697J3419669J7511426j876125k0040102j5953003l18233O709055
$$ -1115971 -7197668 6222001 23733427 21857302 1817200 -14135803 -14454036 -7744981
37402g744981O498383J0875564J5154957O889787o874614p213567M420690P270855
$$ -7744981 -1246598 9628966 24783923 31673710 24799096 17585529 22006219 29277074
37394B9277074l698118r411572Q4427Q244134k74219j4816747j6690784o605842
$$ 29277074 25578956 16167384 16251811 24495945 24221726 9404979 -7285805 -13891647
37386a3891647J440253K517546K174321L444140N521342R656912J5745482J8056722
$$ -13891647 -12451394 -9933848 -7759527 -4315387 1205955 10862867 26608349 44665071
37378D4665071J2672119L827785l174957q022681r231294k197212R841266J4167418
$$ 44665071 57337190 61164975 57990018 49967337 40736043 38538831 48380097 62547515
37370F2547515O075402l500417o070910p464198j1381305p829104O194403J0907469
$$ 62547515 68622917 65122500 59051590 51587392 40206087 32376983 38571386 49478855
37362D9478855q995542l3314407k9202653N79212K0267373J2618679k95610L939104
$$ 49478855 40483313 7168906 -22033747 -21454535 -1187162 11431517 11135907 15075011
37354A5075011J3803047N511200j7568766k8065993j2565923J0858694J7059251
$$ 15075011 28878058 34389258 16820492 -11245501 -23811424 -12952730 4106521
37347D106521N425493k135633O619906J5443192K912171k2069527k7110084k321453
$$ 4106521 9532014 7396381 14016287 29459479 32371650 10302123 -16807961 -19129414
37339a9129414K1739904J5866632o555135j1538251N275193J6949328Q537027
$$ -19129414 2610490 18477122 11921987 383736 5658929 22608257 31145284
37332C1145284n445209q777365m079331O81363N300066Q845789N408202l840313
$$ 31145284 25700075 16922710 12843379 13524742 18824808 27670597 33078799 29238486
37324B9238486r224026q879539j0859011j4193190o413191J2447485K2670102
$$ 29238486 20014460 11134921 275910 -13917280 -20330471 -7882986 14787116
37317A4787116J2842757k587313o758576m676496q372366j2656529m807223J1251095
$$ 14787116 27629873 25042560 18283984 13607488 5235122 -7421407 -12228630 -977535
37309i77535J9377729J4498713N343807j969244q309162j2478222j1387842p518703
$$ -977535 18400194 32898907 38242714 36273470 27964308 15486086 4098244 -3420459
37301c420459m710096Q38724J3614623K5299681K1315566J634945j6202679j7810024
$$ -3420459 -8130555 -7291831 6322792 31622473 52938039 54572984 38370305 20560281
37293B0560281p686011j100167n539213j3438877j1911041J539535J4900892J6021861
$$ 20560281 12874270 11774103 6234890 -7203987 -19115028 -17575493 -2674601 13347260
37285A3347260P826689J972644O75165k748267o396541k28841J2130599J1778934
$$ 13347260 21173949 23146593 23821758 21073491 14676950 14448109 26578708 38357642
37277C8357642n372285j6144758k772955J8878931K2221416O849469p936132j4282886
$$ 38357642 32985357 16840599 14067644 32946575 55167991 62017460 54081328 39798442
37269C9798442j7602617j6725695o911896L079360J020204n857862j547004R849790
$$ 39798442 22195825 5470130 -1441766 1637594 2657798 -3200064 -4747068 5102722
37261E102722J1704006O795095J1510275J9926733Q812517j6984584k2114179
$$ 5102722 16806728 23601823 35112098 55038831 63851348 46866764 24752585
37254B4752585L419722K3250619J0223453j1801257j0105579L407444k587755
$$ 24752585 28172307 51422926 61646379 49845122 39739543 43146987 40559232
37247D0559232k2172213k2457903Q0635J4773165P130546l549500k175471N11997
$$ 40559232 18387019 -4070884 -3990249 10782916 17913462 14363962 12188491 12700488
37239A2700488n020956p929925J11247O712663N29224p679748l607117N947002
$$ 12700488 7679532 -250393 -139146 6573517 7102741 -577007 -4184124 1762878
37231A762878N722143j513903m20404J0805095J7842377J2411402J838963m738617
$$ 1762878 7485021 5971118 5550714 16355809 34198186 46609588 48448551 43709934
37223D3709934p183351q225019o491439p76102M677473M209381k025598p652595
$$ 43709934 36526583 28301564 21810125 21034023 25711496 29920877 27895279 20242684
37215B0242684o579548N55963O477489M906436k154835p432147q280951q537293
$$ 20242684 13663136 14219099 20696588 25603024 23448189 16016042 7735091 -802202
37207h02202r485750o179096K887997R497642O578313J40485J036955P984519
$$ -802202 -10287952 -16467048 -13579051 -4081409 2496904 2637389 3674344 11658863
37199A1658863R589597K707324k980759j502014j82603o193160j3056287j0157935
$$ 11658863 21248460 23955784 20975025 19473011 19290408 13097248 40961 -10116974
37191a0116974L56774O927894N976867M971315P760933P370596k537065j6585579
$$ -10116974 -9760200 -2832306 3144561 8115876 15876809 23247405 20710340 4124761
37183D124761k3427093j8182487n173067P776402J4036036J1234189M092655J125861
$$ 4124761 -19302332 -37484819 -42657886 -34881484 -20845448 -9611259 -5518604 -4392743
37175d392743M540812O926961K328142l937344l152610K842837M297920j544486
$$ -4392743 148069 7075030 9403172 5465828 2313218 5156055 9453975 7909489
37167G909489p862603j0592217j2376504j1729349q63789J8225944K6964322J2069250
$$ 7909489 46886 -10545331 -22921835 -34651184 -35514973 -17289029 9675293 21744543
37159B1744543j2630789k0846684p727476O222838O260075J735567N962878J2893392
$$ 21744543 9113754 -11732930 -19460406 -13237568 -6977493 -5241926 720952 13614344
37151A3614344Q175158n297369j0064218q60601P303607J845768r707121j2491064
$$ 13614344 21789502 16492133 6427915 5567314 12870921 14716689 5009568 -7481496
37143g481496n437355K80664r32555k811138J761935J0904677J6565221J3422178
$$ -7481496 -12918851 -12638187 -13570742 -16381880 -14619945 -3715268 12849953 26272131
37135B6272131M152023k677999j404259L125097Q47798q668839j3476477o381988
$$ 26272131 30424154 27746155 26341896 29466993 30314791 21645952 8169475 1787487
37127A787487L025687K439275m200060m416768J325490J880659k850078j142092
$$ 1787487 4813174 7252449 3052389 -1364379 -38889 1841770 -1008308 -2150400
37119b150400P191869O694509p007633j5946608p394179N226221M849983j898382
$$ -2150400 5041469 11735978 4728345 -11218263 -18612442 -13386221 -8536238 -10434620
37111a0434620O42000Q971050J0042341Q375774J6613835K5215954J2076450j6891393
$$ -10434620 -9792620 -821570 9220771 17596545 34210380 59426334 71502784 54611391
37103E4611391k8112149r395024J0532036N489558j1229163j2794920m67054M521262
$$ 54611391 26499242 17104218 27636254 33125812 21896649 9101729 8634675 13155937
37095A3155937l054499q723587l894237N503173J2502223J4579129R123521j790488
$$ 13155937 10101438 1377851 -2516386 2986787 15489010 30068139 39191660 37401172
37087C7401172o477254J775716J0248682L112885j2495618j5501545l854878K307905
$$ 37401172 30923918 32699634 42948316 46061201 33565583 18064038 14209160 16517065
37079A6517065o993440j6510254j0695260L624220J0720666R130841Q144918R118396
$$ 16517065 9523625 -6986629 -17681889 -14057669 -3337003 5793838 13938756 23057152
37071B3057152M178657q028041j6440282j0957216L646598J2038487O384932m143381
$$ 23057152 27235809 19207768 2767486 -8189730 -4543132 7495355 13880287 9736906
37063I736906n859830O10664K504411m188084q320368l076139J976500j154012
$$ 9736906 3877076 4487740 6992151 2804067 -5516301 -8592440 -6615940 -7769952
37055g769952k312650R279633K1848536J6337629j518030q001623J222297N609655
$$ -7769952 -10082602 -802969 21045567 37383196 35865166 27863543 29085840 34695495
37047C4695495m616369j2584440m616096O476078L012132r763730j4336311p229535
$$ 34695495 30079126 17494686 12878590 19354668 22366800 12603070 -1733241 -8962776
37039h962776J603828O932046J0321618R875182K128988q363066j2315712p310142
$$ -8962776 -7358948 -426902 9894716 19769898 21898886 13535820 1220108 -6090034
37031f090034R41768O231081N695578L93685l847985j690237K855584N38733q053227
$$ -6090034 -5148266 1082815 6778393 7172078 3324093 1633856 4489440 5028173 -3025054
37022c025054j2168877q380522m933392m382173J709461J3445824J6331512N479518
$$ -3025054 -15193931 -23574453 -28507845 -32890018 -31180557 -17734733 -1403221 4076297
37014D076297k767039K071463N647226l892605r637168O684368K7148722J9747045
$$ 4076297 1309258 3380721 9027947 5135342 -4501826 2182542 29331264 49078309
37006D9078309j0824731k8561616j9964946q148406r423329r702391M289314J9570967
$$ 49078309 38253578 9691962 -10272984 -18421390 -27844719 -37547110 -33257796 -13686829
36998a3686829J9406940R120592K387199q67671o498983j0194699n389211L163038
$$ -13686829 5720111 14840703 17227902 16360231 9861248 -333451 -5722662 -2559624
36990b559624O913444N949619L702770j176647q125652r809577l357230L155214
$$ -2559624 4353820 10303439 14006209 12829562 4703910 -5105667 -8462897 -5307683
36982e307683L780100L648939O752271P017107J081450k886171j67182p9989q574776
$$ -5307683 -1527583 2121356 8873627 15890734 16972184 14086013 13918831 13838842 5264066
36973E264066j3443454k922331J2313334J4033319M741897J551467P201219P383332
$$ 5264066 -8179388 -11101719 1211615 15244934 19986831 21538298 28739517 36122849
36965C6122849m104947j5957850j7312369j0355728k112618M531575Q949211J0971701
$$ 36122849 32017902 16060052 -1252317 -11608045 -13720663 -9189088 -239877 10731824
36957A0731824J2074954J1645567M869589p726296j4182600o009159N945186M508446
$$ 10731824 22806778 34452345 39321934 31595638 17413038 11403879 17349065 21857511
36949B1857511q419580j4876989p621014K247599M877941K759682N3750l372477
$$ 21857511 13437931 -1439058 -9060072 -6812473 -1934532 825150 878900 -2493577
36941b493577l677705N583146J8560137J8565652J518321j5471429j6724588o881066
$$ -2493577 -6171282 -588136 17972001 36537653 38055974 22584545 5859957 -1021109
36933a021109R60122L803235N529942N659421K600829N74937L023543N118998
$$ -1021109 -60987 3742248 9272190 14931611 17532440 18107377 21130920 26249918
36925B6249918J601686l870718n226685l541454k360711n04443K197091j43653
$$ 26249918 27851604 23980886 18754201 15212747 12852036 12347593 14544684 14401031
36917A4401031q825875j2689133l059896R910325R777429j826697q513635m482630
$$ 14401031 5575156 -7113977 -10173873 -263548 9513881 7687184 -826451 -5309081
36909e309081j932n60663K265928J3293508K2059891J8046621O401326j841574
$$ -5309081 -5311013 -5871676 -3605748 9687760 31747651 49794272 56195598 54354024
36901E4354024o418555j3095934j8492218j3067776J833340J1751125O663632
$$ 54354024 47935469 34839535 16347317 3279541 5112881 16864006 23527638
36894B3527638p018206j4816246r042043O323250K0090254K1566553R445371m872237
$$ 23527638 16509432 1693186 -7348857 -1025607 19064647 40631200 50076571 45204334
36886D5204334q218196j676834J076958n997273j1901420n902157M753796N337469
$$ 45204334 36986138 35309304 36386262 30388989 18487569 12585412 17339208 22676677
36878B2676677m069597r853865n763285J220527N486868Q673895R091344R20539
$$ 22676677 18607080 8753215 2989930 4210457 9697325 18371220 27462564 28383103
36870B8383103j1207109j2841027k424828L199917l492249n595629R236509K2049123
$$ 28383103 17175994 4334967 1910139 5110056 1617807 -3977822 5258687 27307810
36862B7307810Q928805j7531984k2052573J532305K1638531J5394993m037778
$$ 27307810 36236615 18704631 -3347942 -1815637 19822894 35217887 31180109
36855C1180109j5014839j6346181j5282172r251396K805244Q572050P67016o418270
$$ 31180109 16165270 -180911 -15463083 -24714479 -21909235 -13337185 -12570169 -18988439
36847a8988439J604523J4003309J0439596n733197j2213605j743282J0030111
$$ -18988439 -17383916 -3380607 7058989 1325792 -10887813 -12631095 -2600984
36840b600984J0736276N642741K473716p33365o159612q193508k702603M882270
$$ -2600984 8135292 13778033 16251749 15518384 9358772 1165264 -1537339 3344931
36832C344931P388633N258443L138045K492712J800006M11749o44822R0875K437514
$$ 3344931 10733564 15992007 19130052 21622764 23422770 23834519 23189697 23280572 25718086
36823B5718086K335596m664063j4267903j3871478Q79911J6013468J5632670L435706
$$ 25718086 28053682 23389619 9121716 -4749762 -3869851 12143617 27776287 31211993
36815C1211993m196444k669752j798279n117120l877158M310318P340741k213446
$$ 31211993 27015549 24345797 22547518 17430398 13553240 17863558 25204299 22990853
36807B2990853j2865507j0044415L151854J2240992J1717835P604715L601971
$$ 22990853 10125346 80931 3232785 15473777 27191612 34796327 38398298
36800C8398298l377412j3420384j9019757j4164428l047389M278770L392688l04044
$$ 38398298 35020886 21600502 2580745 -11583683 -14631072 -10352302 -6959614 -7263658
36792g263658M30902M737825N240829l62528m764929j614328M584262N206094
$$ -7263658 -6832756 -2094931 3145898 2783370 -1981559 -3595887 988375 6194469
36784F194469J96181l351470k466036j89585J584477K800676R29023m917176p829359
$$ 6194469 6390650 3039180 573144 383559 1968036 4768712 5697735 780559 -7048800
36775g048800j405415Q138113J0115221P021200Q977526J2231480K830010j5463948
$$ -7048800 -8454215 -316102 9799119 16820319 25797845 38029325 40859335 25395387
36767B5395387j9304803j295046J3969938M684123j5452478j8760303l880012
$$ 25395387 6090584 4795538 18765476 23449599 7997121 -10763182 -14643194
36760a4643194P888855P692557O555629J0401049J0547650K338934n253992m359379
$$ -14643194 -6754339 938218 7493847 17894896 28442546 30781480 25527488 21168109
36752B1168109J230932N277184P505230Q407203N410571j683756q882724j3326878
$$ 21168109 22399041 27676225 35181455 43588658 48999229 47315473 38432749 25105871
36744B5105871j3561759o119732Q369319J7797525J0369693o492417j3748145
$$ 25105871 11544112 5424380 13793699 31591224 41960917 35468500 21720355
36737B1720355q687473q285069j9583236k5359688j0920141J0534935J5832767
$$ 21720355 13032882 4747813 -14835423 -40195111 -51115252 -40580317 -24747550
36730b4747550N126510q34852P452102J6671204J2456222j472539j1190482j0280489
$$ -24747550 -19621040 -20455892 -13003790 3667414 16123636 14651097 3460615 -6819874
36722f819874l593282J668174L281026L556825M107559K201852n552102j5318015
$$ -6819874 -10413156 -8744982 -5463956 -1907131 2200428 4402280 -1149822 -16467837
36714a6467837j6631509n233562Q610098J1165519K534719m570002k882749J342134
$$ -16467837 -33099346 -38332908 -29722810 -18557291 -16022572 -20592574 -23475323 -22133189
36706b2133189R96793R1128N807842J3855690J1716538l051877j6416799j4267079
$$ -22133189 -21136396 -21045268 -15237426 -1381736 10334802 7282925 -9133874 -23400953
36698b3400953K46741J1613609J0845178K463807n739037j0823889j0529599q65435
$$ -23400953 -23154212 -11540603 -695425 1768382 -3970655 -14794544 -25324143 -26189578
36690b6189578J4796668K1339428P495075j6382525k6957865j5505747K792233
$$ -26189578 -11392910 9946518 17441593 1059068 -25898797 -41404544 -38612311
36683c8612311J0028957O314475L247325M988754N788703K921951J751042O356225
$$ -38612311 -28583354 -22268879 -19021554 -14032800 -8244097 -5322146 -3571104 2785121
36675B785121J2288641J2075778M276942n417204r822858n858517K637729O520389
$$ 2785121 15073762 27149540 31426482 26009278 16186420 10327903 12965632 19486021
36667A9486021l80187j1919273j2882840K877033K0454571J8588415k967846k0680997
$$ 19486021 19105834 7186561 -5696279 -2819246 17635325 36223740 33255894 12574897
36659A2574897j6738816j189790N209324J214935K043776J0269339J0636739j921145
$$ 12574897 -4163919 -5353709 -144385 1070550 3114326 13383665 24020404 22099259
36651B2099259j0002537j159122J0166962N095360r027007j1297552j626117J229807
$$ 22099259 12096722 10937600 21104562 26199922 17172915 5875363 4249246 5479053
36643E479053p305002j1251212l438973K457536k511719n915568M237694J7267942
$$ 5479053 -1825949 -13077161 -16516134 -14058598 -16570317 -22485885 -18248191 -980249
36635i80249J4977923j148654j2606088q295124N205909J4469660J2110751J612725
$$ -980249 13997674 12849020 242932 -8052192 -2846283 11623377 23734128 25346853
36627B5346853n895461l422108J994754j261056r836871q147577O193492J5392282
$$ 25346853 19451392 16029284 18024038 16762982 6926111 -1221466 4972026 20364308
36619B0364308P386352o874858j2208007r814598o821281j099501P838944P986066
$$ 20364308 27750660 20875802 8667795 -1146803 -7968084 -9067585 -1228641 6757425
36611F757425o133850j6983701p970986Q036491Q284531k247610j157695J0206834
$$ 6757425 623575 -16360126 -24331112 -16294621 -8010090 -10257700 -11415395 -1208561
36603a208561Q418410q907439j5064207K457758K0651644J6538621p62342r096141
$$ -1208561 7209849 -1697590 -16761797 -14304039 6347605 22886226 22123884 13027743
36595A3027743m052545N089125J2946591J6146695Q716119o291205j4109460r731765
$$ 13027743 8975198 14064323 27010914 43157609 51873728 45582523 31473063 21741298
36587B1741298p170912j4520709j7060380j951478J6602082J7339492M196616
$$ 21741298 14570386 49677 -17010703 -18962181 -2360099 14979393 19176009
36580A9176009k931339M76419L393804K489464L304656L784959j654384n966204
$$ 19176009 16244670 16721089 20114893 22604357 25909013 29693972 28039588 22073384
36572B2073384J014610J0797194O967670m895791l412132J1596693J5110686l854389
$$ 22073384 23087994 33885188 40852858 35957067 32544935 44141628 59252314 55397925
36564E5397925k4356154k5387592j3289605m337406J97871N999339R081054M333136
$$ 55397925 31041771 5654179 -7635426 -11972832 -11774961 -5775622 3305432 7638568
36556G638568j352299n94228j63522q484470j7263137j2159148M028614J4781846
$$ 7638568 6286269 5692041 5528519 -2955951 -20219088 -32378236 -28349622 -13567776
36548a3567776J3065368O695060K795715O42903n60201R49366L686270M247038
$$ -13567776 -502408 6192652 8988367 9631270 9071069 10020435 13706705 17953743
36540A7953743M013662N594776M817173l031053j0973583p142151N917794J1988599
$$ 17953743 21967405 27562181 32379354 29348301 18374718 11232567 17150361 29138960
36532B9138960L951115o807575q254456k915643J246065L903902P268326O940812
$$ 29138960 33090075 26282500 18028044 15112401 16358466 20262368 27530694 34471506
36524C4471506j131385j0064778r303010K10731P689695P727593M723904K634663
$$ 34471506 33340121 23275343 13972333 14183064 21872759 29600352 34324256 36958919
36516C6958919m49086n999310j1361878j4772925j7103935j6278408p657419N943886
$$ 36958919 36509833 30510523 19148645 4375720 -12728215 -29006623 -36664042 -30720156
36508c0720156J2358491M941788o487975p747517P30095O495308M689715L908890
$$ -30720156 -18361665 -13419877 -19907852 -27655369 -26925274 -20429966 -15740251 -11831361
36500a1831361J0357628J6675523J2859142J237249p116495p057184l216446j172869
$$ -11831361 -1473733 15201790 28060932 29298181 22181686 15124502 11908056 10735187
36492A0735187j591672k856094l616634j918398L352751Q866272Q836775K472221
$$ 10735187 9143515 6287421 2670787 752389 4105140 12971412 21808187 24280408
36484B4280408l840716m154304o77424j229111r234017j8167003j7606126n245097
$$ 24280408 20439692 16285388 15607964 14378853 5144836 -13022167 -30628293 -35873390
36476c5873390R017908J3625363Q740841M402472N242990M149108n000458j5125972
$$ -35873390 -26855482 -13230119 -4489278 -86806 5156184 9305292 4304834 -10821138
36468a0821138j4127718j809291R508050J0489998M004536j349047j141496K126924
$$ -10821138 -24948856 -26758147 -17250097 -6760099 -2755563 -4104610 -5246106 -3119182
36460c119182K216463m139217j0603594n250031J3084728K7450851K1187834N27367
$$ -3119182 -902719 -5041936 -15645530 -20895561 -7810833 19640018 40827852 41355219
36452D1355219j2380057p849682K094799L554866l129400j0350493j3949781j1816355
$$ 41355219 28975162 21125480 23220279 26775145 23645745 13295252 -654529 -12470884
36444a2470884k664000Q224534J1752102P934460N497404N198825k180729j5398370
$$ -12470884 -15134884 -6910350 4841752 12776212 18273616 23472441 21291712 5893342
36436E893342j7631069l052149Q390451q62476j7320403j6082203J495860J2481368
$$ 5893342 -11737727 -14789876 -6399425 -7261901 -24582304 -40664507 -39168647 -26687279
36428b6687279Q365181K323286K212842N01797n472215n291789N111580J3734195
$$ -26687279 -18322098 -15998812 -13785970 -13284173 -18756388 -24048177 -18936597 -5202402
36420e202402J0491748O80618o083865p023738j634919R047241J4151762J657864
$$ -5202402 5289346 5969964 -113901 -7137639 -8772558 274683 14426445 16084309
36412A6084309j8136699j8153376N692480K1786219O722463j8153663j7373341
$$ 16084309 -2052390 -20205766 -14513286 7272933 13995396 -4158267 -21531608
36405b1531608P056854K2912787J7444181Q301781N923881k341354k1578122l1555356
$$ -21531608 -14474754 8438033 25882214 34183995 40107876 37766522 16188400 -15366956
36397a5366956j6950080N276376Q922292m523157j2271301m850867O205819J1254353
$$ -15366956 -32317036 -27040660 -18118368 -22641525 -34912826 -39763693 -33557874 -22303521
36389b2303521J2939147J3168154Q340240J534585K348216Q189555K793291j6272804
$$ -22303521 -9364374 3803780 12144020 13678605 16026821 24216376 27009667 10736863
36381A0736863k5415904o968703J9743086K1420002j848964j7404874q455566
$$ 10736863 -14679041 -21647744 -1904658 19515344 17666380 261506 -8194060
36374h194060M917928J583879r032029p677199K462376N750223K441840L661070
$$ -8194060 -3276132 -1692253 -10724282 -18401481 -15939105 -10188882 -7747042 -4085972
36366d085972P144357K315082n661396k211599P646461K914144j7402175k7878822
$$ -4085972 3058385 5373467 -287929 -2499528 5146933 8061077 -9341098 -37219920
36358c7219920j4578000M425629Q317386K157678J639341P421177J1049524J1843331
$$ -37219920 -51797920 -47372291 -39054905 -36897227 -35257886 -27836709 -16787185 -4943854
36350d943854J1800091O451914l727576n438999P518224J8442931R698433r885170
$$ -4943854 6856237 13308151 9580575 4141576 11659800 30102731 39801164 29915994
36342B9915994j7982981j0116919N22092O020813P066777J275746j1023830j6108122
$$ 29915994 11933013 1816094 2338186 8358999 15425776 16701522 5677692 -10430430
36334a0430430l732944J1291454P789270o616041n430558J3660104K4456795J3895093
$$ -10430430 -14163374 -2871920 4917350 -1698691 -7129249 6530855 30987650 44882743
36326D4882743p04596l612019k641636p351213r683762j540399P946591Q027781
$$ 44882743 44178147 40566128 37924492 30573279 20889517 19349118 27295709 35323490
36318C5323490L143220M52163m166391j3962725j9146961j0825949L970955J2368643
$$ 35323490 38466710 38918873 34752482 20789757 1642796 -9183153 -5212198 7156445
36310G156445J0325873K46088j2107283j3003034P206239K9807365K0508052j9924039
$$ 7156445 17482318 17728406 5621123 -7381911 -175672 29631693 50139745 30215706
36302C0215706m5194220k4621194J1998676J8843183p87713r645325J275213P932158
$$ 30215706 -14978514 -39599708 -27601032 -8757849 -9545562 -19190887 -17915674 -9983516
36294i983516K424967L284800J4588679J5183479k013263j4941357r280194N5489
$$ -9983516 -7558549 -4273749 10314930 25498409 23485146 8543789 -736405 -680916
36286f80916j516476m770818J236503Q105654O100534J550344k63067q170286
$$ -680916 -2197392 -6968210 -5731707 2373947 8474481 10024825 9761758 1591472
36278A591472k3111554k4691441j875706K1596336J7897275l147506j0018198
$$ 1591472 -21520082 -46211523 -48087229 -26490893 -8593618 -11741124 -21759322
36271b1759322L006214J2930984P891171J025428K535258L929086k270036p869202
$$ -21759322 -18753108 -5822124 2069047 3094475 5629733 9558819 7288783 -580419
36263e80419m384805J944003Q96536o229229j0482126p475074K67927P204991
$$ -580419 -4965224 -3021221 -2124685 -8353914 -18836040 -26311114 -26043187 -18838196
36255a8838196P501498N23651m086992M729451K2127285K8199622J2123538j2346917
$$ -18838196 -11336698 -10813047 -14900039 -10170588 11956697 40156319 52279857 39932940
36247C9932940k2949603j4598693q64603N864370N691377L156329j780242r398168
$$ 39932940 16983337 2384644 1520041 7384411 13075788 16232117 14451875 5053707
36239E053707j3211704n928738P951823J3619353M231640q337822q291577K376908
$$ 5053707 -8157997 -14086735 -6134912 7484441 11716081 3378259 -4913318 -2536410
36231b536410P061446j027362r642297o843695K172220N853239L970808L204154
$$ -2536410 4525036 3497674 -6144623 -12988318 -10816098 -4962859 -992051 2212103
$$ [...]
##END NTUPLES=NMR SPECTRUM
##END=
