##TITLE=31Pdec_LR-660-RM1
 CH2Cl2, 124 sc
 13.3.2019
##JCAMPDX= 6.0         $$ Bruker NMR JCAMP-DX V2.0
##DATA TYPE= NMR SPECTRUM
##DATA CLASS= NTUPLES
##ORIGIN= UXNMR, Bruker Analytische Messtechnik GmbH
##OWNER= root
$$ XWIN-NMR		Version 3.5
$$ Wed Mar 13 16:36:33 2019 Russian Standard Time (UT+4h)  she@DPX200
##.OBSERVE FREQUENCY= 81.013821
##.OBSERVE NUCLEUS= ^31P
##.ACQUISITION MODE= SIMULTANEOUS
##.ACQUISITION SCHEME= undefined
##.AVERAGES= 124
##.DIGITISER RES= 17
##SPECTROMETER/DATA SYSTEM= spect
##.PULSE SEQUENCE= zgpg30
##.SOLVENT NAME= D2O
##.SHIFT REFERENCE= (INTERNAL, D2O, 0, 182.463)
##AUDIT TRAIL= $$ (NUMBER, WHEN, WHO, WHERE, WHAT)
$$ ##TITLE= Audit trail, XWIN-NMR		Version 3.5
$$ ##JCAMPDX= 5.01
$$ ##ORIGIN= Bruker BioSpin GmbH
$$ ##OWNER= she
$$ F:/spectra/data/she/nmr/P31/1/pdata/1/auditp.txt
$$ ##AUDIT TRAIL=  $$ (NUMBER, WHEN, WHO, WHERE, WHAT)
(   1,<2019-03-13 16:35:48.06 +0400>,<she>,<DPX200>,
      <continue with go, POWCHK disabled, PULCHK disabled
       configuration hash MD5:
       00 E9 B6 7A A2 85 ED C7 34 08 36 98 17 FE 4E 26
       data hash MD5: 32K
       FF 4B E1 45 9F D7 6B E8 13 F2 92 32 FB 27 CB 07>)
(   2,<2019-03-13 16:35:53.03 +0400>,<she>,<DPX200>,
      <Start of raw data processing
       efp BC_mod = 2 LB = 1 FT_mod = 6 PKNL = 1 PHC0 = -1801.675 PHC1 = 56.79897 SI = 64K 
       data hash MD5: 64K
       ED 07 A2 6F 74 30 B5 42 60 9E 55 83 7C DB E9 8C>)
(   3,<2019-03-13 16:36:09.04 +0400>,<she>,<DPX200>,
      <abs ABSG = 5 
       data hash MD5: 64K
       C2 DF 0C 0A 39 6E 0E 55 B6 32 A6 10 98 5C C2 A8>)
$$ ##END=
$$ 
$$ hash MD5
$$ 14 32 11 ED 24 C8 A8 8D 8D EC 95 65 27 C1 E6 87
##$RELAX= 
##$RELAX= 
##$RELAX= 
##$RELAX= 
##$RELAX= 
##$RELAX= 
##$RELAX= 
##$RELAX= 
$$ Bruker specific parameters
$$ --------------------------
##$DU= <F:/spectra>
##$EXPNO= 1
##$NAME= <P31>
##$PROCNO= 1
##$TYPE= <nmr>
##$USER= <she>
##$AMP= (0..31)
100 100 100 100 100 100 100 100 100 100 100 100 100 100 100 100 100 100 
100 100 100 100 100 100 100 100 100 100 100 100 100 100 
##$AQSEQ= 0
##$AQ_mod= 1
##$AUNM= <au_zg>
##$AUTOPOS= <>
##$BF1= 81.014009
##$BF2= 200.13
##$BF3= 200.13
##$BF4= 200.13
##$BF5= 200.13
##$BF6= 200.13
##$BF7= 200.13
##$BF8= 200.13
##$BYTORDA= 1
##$CFDGTYP= 0
##$CFRGTYP= 5
##$CHEMSTR= <none>
##$CNST= (0..31)
1 1 145 1 1 1 1 1 1 1 1 1 1 1 1 1 1 1 1 1 1 1 1 1 1 1 1 1 1 1 1 1 
##$CPDPRG= <waltz16>
##$CPDPRG1= <>
##$CPDPRG2= <waltz16>
##$CPDPRG3= <>
##$CPDPRG4= <mlev>
##$CPDPRG5= <mlev>
##$CPDPRG6= <mlev>
##$CPDPRG7= <mlev>
##$CPDPRG8= <mlev>
##$CPDPRGB= <>
##$CPDPRGT= <>
##$D= (0..31)
0 1 0 0 0 0 0 0 0 0 0 0.03 2e-05 3e-06 0 0 0 0 0 0 0 0 0 0 0 0 0 0 0 0 
0 0 
##$DATE= 1552480350
##$DBL= (0..7)
120 120 120 11 120 120 24 19 
##$DBP= (0..7)
150 150 150 150 150 150 150 150 
##$DBP07= 0
##$DBPNAM0= <>
##$DBPNAM1= <>
##$DBPNAM2= <>
##$DBPNAM3= <>
##$DBPNAM4= <>
##$DBPNAM5= <>
##$DBPNAM6= <>
##$DBPNAM7= <>
##$DBPOAL= (0..7)
0.5 0.5 0.5 0.5 0.5 0.5 0.5 0.5 
##$DBPOFFS= (0..7)
0 0 0 0 0 0 0 0 
##$DE= 6
$$ [...]
##$SUBNAM3= <"">
##$SUBNAM4= <"">
##$SUBNAM5= <"">
##$SUBNAM6= <"">
##$SUBNAM7= <"">
##$SUBNAM8= <"">
##$SUBNAM9= <"">
##$SW= 369.568048894756
##$SWIBOX= (0..15)
0 1 3 0 0 0 0 0 0 0 0 0 0 0 0 0 
##$SW_h= 29940.119760479
##$TD= 32768
##$TD0= 1
##$TE= 0
##$TE2= 300
##$TE3= 300
##$TEG= 300
##$TL= (0..7)
0 120 53 12 22 120 120 120 
##$TP= (0..7)
150 150 150 150 150 150 150 150 
##$TP07= 0
##$TPNAME0= <>
##$TPNAME1= <>
##$TPNAME2= <>
##$TPNAME3= <>
##$TPNAME4= <>
##$TPNAME5= <>
##$TPNAME6= <>
##$TPNAME7= <>
##$TPOAL= (0..7)
0.5 0.5 0.5 0.5 0.5 0.5 0.5 0.5 
##$TPOFFS= (0..7)
0 0 0 0 0 0 0 0 
##$TUNHIN= 0
##$TUNHOUT= 0
##$TUNXOUT= 0
##$USERA1= <user>
##$USERA2= <user>
##$USERA3= <user>
##$USERA4= <user>
##$USERA5= <user>
##$V9= 5
##$VALIST= <valist>
##$VCLIST= <CCCCCCCCCCCCCCC>
##$VD= 0
##$VDLIST= <DDDDDDDDDDDDDDD>
##$VPLIST= <PPPPPPPPPPPPPPP>
##$VTLIST= <TTTTTTTTTTTTTTT>
##$WBST= 1024
##$WBSW= 4
##$XGAIN= (0..3)
0 0 0 0 
##$XL= 0
##$YL= 0
##$YMAX_a= 63905
##$YMIN_a= -84667
##$ZGOPTNS= <>
##$ZL1= 120
##$ZL2= 120
##$ZL3= 120
##$ZL4= 120
##$ABSF1= 182.463
##$ABSF2= -187.1042
##$ABSG= 5
##$ABSL= 3
##$ALPHA= 0
##$AQORDER= 0
##$ASSFAC= 0
##$ASSFACI= 0
##$ASSFACX= 0
##$ASSWID= 0
##$AUNMP= <proc_1d>
##$AZFE= 0.1
##$AZFW= 0.5
##$BCFW= 0
##$BC_mod= 2
##$BYTORDP= 0
##$COROFFS= 0
##$CY= -3
##$DATMOD= 1
##$DC= 0
##$DFILT= <>
##$DTYPP= 0
##$F1P= 0
##$F2P= 0
##$FCOR= 1
##$FTSIZE= 65536
##$FT_mod= 6
##$GAMMA= 0
##$GB= 0
##$INTBC= 1
##$INTSCL= 5.30512e-09
##$ISEN= 30
##$LB= 1
##$LEV0= 0
##$LPBIN= 0
##$MAXI= 10000
##$MC2= 0
##$MEAN= 0
##$ME_mod= 0
##$MI= 50
##$NCOEF= 0
##$NC_proc= -9
##$NLEV= 6
##$NOISF1= 182.463
##$NOISF2= 159.3651
##$NSP= 0
##$NTH_PI= 0
##$NZP= 0
##$OFFSET= 182.463
##$PC= 4
##$PHC0= -1801.675
##$PHC1= 56.79897
##$PH_mod= 1
##$PKNL= yes
##$PPARMOD= 0
##$PSCAL= 0
##$PSIGN= 0
##$REVERSE= no
##$SF= 81.0140089999434
##$SI= 65536
##$SIGF1= 159.3651
##$SIGF2= -187.1042
##$SINO= 113.3802
##$SIOLD= 16384
##$SREGLST= <1H.CDCl3>
##$SSB= 0
##$STSI= 65536
##$STSR= 0
##$SW_p= 29940.119760479
##$SYMM= 0
##$S_DEV= 0
##$TDeff= 32768
##$TDoff= 0
##$TI= <>
##$TILT= no
##$TM1= 0
##$TM2= 0
##$TOPLEV= 0
##$USERP1= <user>
##$USERP2= <user>
##$USERP3= <user>
##$USERP4= <user>
##$USERP5= <user>
##$WDW= 1
##$XDIM= 65536
##$YMAX_p= 434808916
##$YMIN_p= -173512440
$$ End of Bruker specific parameters
$$ ---------------------------------
##NTUPLES= NMR SPECTRUM
##VAR_NAME=  FREQUENCY,     SPECTRUM/REAL,   SPECTRUM/IMAG
##SYMBOL=    X,             R,               I
##VAR_TYPE=  INDEPENDENT,   DEPENDENT,       DEPENDENT
##VAR_FORM=  AFFN,          ASDF,            ASDF
##VAR_DIM=   65536,         65536,           65536
##UNITS=     HZ,            ARBITRARY UNITS, ARBITRARY UNITS
##FACTOR=    0.456856943014862, 1,           1
##FIRST=     14782.0589164792, 0,            0
##LAST=      -15158.0608439998, 0,           0
##MIN=       -15158.0608439998, -173512440,  0
##MAX=       14782.0589164792, 434808916,    0
$$ Real data points
##PAGE= N=1
##DATA TABLE= (X++(R..R)), XYDATA
$$ [...]
40889f0364689L6379525M9462126L1042847K732885j7340645k6978108k4889281
40882i955340n709638K1466659L0628402J2145431p530961q94282J8713581J6660464
40874G5524316r265569k5506468j3643489N769963P988138l964399j3484211j3936583
40866I481698n715251J0196798K3514479J8506572j284543j1360255k009151M999773
40858D6330120q462465k5686789k0419185K347380J4266326L523448j3180293
40851a281458j4140449M639311K4634287J7496706k3247250n9354364m1986194
40844i3239411K0419134O0208855L7567157m849655p630122J7886993J6269881
40837D6632832j9370978l9553455j9445928Q684298J3777127O991508O303392
$$ plain form
40889 -60364689 -23985164 25476962 56519809 59252694 41912049 14933941 -9955340
40882 -9955340 -15664978 5801681 36430083 48575514 41044553 40150271 58863852 75524316
40874 75524316 66258747 40752279 27108790 32878753 40866891 36902492 23418281 9481698
40866 9481698 3766447 13963245 37477724 55984296 54699753 43339498 41330347 46330120
40858 46330120 37867655 12180866 -8238319 -5890939 8375387 11898835 -1281458
40851 -1281458 -15421907 -10782596 13851691 31348397 8101147 -51253217 -93239411
40844 -93239411 -72820277 -12611422 24955735 20106080 12475958 30362951 46632832
40837 46632832 27261854 -12291601 -31737529 -23053231 -9276104 -2284596 4018796
40830D018796K659086j3771816k6006828j5152194R465232K6275843K8904615
40823A6392734K1089924L996484j4315682j5290704O020465K7565555K6532542
40816G1991318O714528j2008042j7921068j0794613M491081J7149365J6512607
40809G6135176O634786J599369L315396K204988R51677J1879675K6537760J8840062
40801A48098889j1590482l1638975k4261061j2331002j5464644j8898827q808392
40794B5105506k118099j1274027j4706275K180843J1326411j0034908k8199244
40787b7719793j400424M6052694N5623622K3200887m878837j3189941k7782531
40780D9905677m6424534l0260820J9194957M2841743J3130954j8984566m159868
$$ plain form
40830 4018796 6677882 -7093934 -33100762 -48252956 -38787724 -12511881 16392734
40823 16392734 37482658 41479142 27163460 11872756 17893221 45458776 71991318
40816 71991318 78705846 66697804 48776736 37982123 42473204 59622569 76135176
40809 76135176 82769962 84369331 87684727 89889715 90841392 102721067 129258827 148098889
40801 148098889 136508407 104869432 80608371 68277369 52812725 33913898 25105506
40794 25105506 22987407 11713380 -2992895 -812052 10514359 479451 -27719793
40787 -27719793 -29120217 16932477 72556099 95756986 90878149 77688208 49905677
40780 49905677 3481143 -26779677 -7584720 35257023 48387977 29403411 25243543
40773B5243543K9794158K8696672k871529j9826093j1752495n090625n477289
40766C8716342P888333L1640948L0799596o891754m6726273n4236106l9380110
40759c8189024l3209681l8374884k7451893J2362977N3818837O0055101L1960780
40752B0972213Q484712J5834475L3180611K4087165j0298001l3191367k3584992
40745C5484816J35259J1432016N989893o681132j9240032k3929659j4258120O50222
40737a0416737K738843n680896j809342J8935534L0203745J4946881p955004j5097723
40729B5865301j0664119o775538J379361J5563713J5348435j0828546l6919419
40722g030812l2854536p596353J2147932K4248243L6583370L3598337K460250
$$ plain form
40773 25243543 55037701 83734373 80862844 61036751 49284256 44193631 38716342
40766 38716342 46604675 78245623 109045219 102153465 55427192 1191086 -38189024
40759 -38189024 -71398705 -109773589 -137225482 -124862505 -71043668 -10988567 20972213
40752 20972213 29456925 45291400 78472011 102559176 92261175 59069808 35484816
40745 35484816 35620075 47052091 53041984 46360852 27120820 3191161 -11066959 -10416737
40737 -10416737 -7677894 -13358790 -15168132 3767402 33971147 48918028 40963024 25865301
40729 25865301 15201182 8425644 9805005 25368718 40717153 29888607 -7030812
40722 -7030812 -39885348 -47481701 -35333769 -11085526 25497844 59096181 61556431
40715F1556431k5720887j2852955J8949250J4025223k5933198l9661174m362883
40708a4000193K7198848J1864786j9197838j7663769P151468J5557380N381444
40701A6292126M487014J5905966J6069428r85292j5494756j4760540m566606Q644319
40693B5591659K1729005K5321550J3457802k115279q377416j4074674l2368707
40686B9163940m7929840l0851999J5952789N0952176M3151913O530703k2728837
40679D4240845k6960788j6054519p554998p076751m964800R687760L0343670L5053853
40671E6714272J4107622j3584001k4089823j9902340k1003731l0260845k8413715
40664f6432561m940955K4245535L5727858K3059607j699065k0782091k2229685
$$ plain form
40715 61556431 35835544 22982589 41931839 55957062 30023864 -9637310 -14000193
40708 -14000193 13198655 25063441 5865603 -11798166 -4646698 10910682 16292126
40701 16292126 20779140 36685106 52754534 51769242 36274486 21513946 16947340 25591659
40693 25591659 47320664 72642214 86100016 83984737 75607321 61532647 29163940
40686 29163940 -18765900 -49617899 -33665110 17287066 60438979 66969682 44240845
40679 44240845 17280057 1225538 -6329460 -13406211 -18371011 -8683251 21660419 56714272
40671 56714272 70821894 57237893 33148070 13245730 -7758001 -38018846 -66432561
40664 -66432561 -71373516 -47127981 -11400123 11659484 9960419 -10821672 -33051357
40657c3051357p711924Q308070J3002616Q068181L442931L887110R513575K1091128
40649B6550330L2669465K7922887N39032k8683067l4256033k0292477j1247737
40642f797600j3037675r392670L356146P950163L16394K430759K5450098M4921465
40634E5197080L3648498J036323k2208519k4878191j8386625r685572L842594
40627A8565588J5849589J1799517o868252j7651051m989617J7827382K4311112
40620E8844268P265926j2867608j2820949N881130J9533010J1900590o938303
40613G0798064j6884672j4327694j0345877q401486j423271Q778475Q134966p633085
40605B8695420k3446781k4567114j2106933O125908K3333213K6392035K704239
$$ plain form
40657 -33051357 -40763281 -32455211 -19452595 -11384414 -7941483 -4054373 5459202 26550330
40649 26550330 59219795 87142682 87681714 58998647 24742614 4450137 -6797600
40642 -6797600 -19835275 -29227945 -25871799 -17921636 -17605242 -15174483 10275615 55197080
40634 55197080 88845578 89881901 67673382 42795191 24408566 14722994 18565588
40627 18565588 34415177 46214694 39346442 21695391 16705774 34533156 58844268
40620 58844268 66110194 53242586 40421637 46302767 65835777 77736367 70798064
40613 70798064 53913392 39585698 29239821 20838335 19415064 28193539 36328505 28695420
40605 28695420 5248639 -19318475 -31425408 -25299500 -1966287 24425748 27129987
40598B7129987l3393744m3358223j2186976K5665877K9845442O501308p876686
40591g673015q0417J1783684J3877056R027596j132062j5375946j7419224N931229
40583a061099L1718058K2242443j5554714l1074588l210847K6752179J7567843
40576D7379275j2695331k1115245m623240P703758P366799J0368237J8269145
40569E2653398J5899699N993049P269714J4162852k388341m1268226n5383182
40562c061037j4061154M5306631N8402188J3570408l7729671m5782441j4213160
40555B431764J5690585J4730543p523144j8911162k992079K0945618K2541017
40548D6913142K995599m911282J3020081K5550052J360037l7527100m1639775
$$ plain form
40598 27129987 -6263757 -49621980 -61808956 -36143079 -6297637 203671 -7673015
40591 -7673015 -7753432 4030252 17907308 26934904 25802842 10426896 -6992328 -1061099
40583 -1061099 30656959 52899402 37344688 6270100 3059253 29811432 47379275
40576 47379275 34683944 13568699 8945459 16649217 24016016 34384253 52653398
40569 52653398 68553097 74546146 81815860 95978712 93590371 52322145 -3061037
40562 -3061037 -17122191 28184440 86586628 100157036 62427365 16644924 2431764
40555 2431764 18122349 32852892 25329748 6418586 3426507 24372125 46913142
40548 46913142 49908741 44997459 58017540 83567592 84927629 47400529 5760754
40541E760754n953202K3076364J6908771J326636O564934J8294650Q115981j4923208
40533E9171680k0525328q289899l718933j0760743p733041Q446709J2047886p819360
40525B0818971k6074882j9007158L265580J6937446J5228367M908435p265829
40518H810930j1329464J822145K0097242J6599767r697228k5686322j3856997
40511a3239927k82128q244264j5919713L727493K8837672K0713870q772977j3602528
40503f782502J1507692K6595408J6310560Q419985J4052760O907552j8022173
40496E8989282k1054972J4295523L9690170J1189663l9739308n3525672k9906965
40489b0062279j3447423j2752310M891627M3051676O0138550L5323015O36777
$$ plain form
40541 5760754 -192448 22883916 39792687 41119323 47684257 65978907 74094888 59171680
40533 59171680 38646352 30356453 26637520 15876777 8143736 16590445 28638331 20818971
40525 20818971 -5255911 -24263069 -20997489 -4060043 11168324 16076759 8810930
40518 8810930 -2518534 -696389 19400853 36000620 26303392 617070 -13239927
40511 -13239927 -13522055 -21766319 -37686032 -33958539 -5120867 15593003 6820026 -6782502
40503 -6782502 4725190 31320598 47631158 56051143 70103903 77011455 58989282
40496 58989282 37934310 52229833 91920003 103109666 63370358 9844686 -20062279
40489 -20062279 -33509702 -46262012 -41370385 1681291 61819841 97142856 97779633
40482I7779633j2246703j5860928l2165365m7498177l4834423j421006J7826828
40475b8420141P667018j1454469j3849713L005118K2833226L1270852K7667128
40468C8719019K0498223J3709554O08189k3330847m4287516l9020864m742666
40461c7846908K9939390L2338059q5417l7439703m5937084j7322730K4509420
40454e1844973M4907322L2142926Q968518L155922J1022025N961971j7627692
40447C6686019l1925530j6890403Q120882J2947648N23453k616889R366793J5090068
40439C1302041L654385q756257p900890k738461m001212k406885J2296407K5985840
40431D7434968J7731525n466378j6698665r985615p054229j8335642k3258246
$$ plain form
40482 97779633 85532930 69672002 37506637 -9991540 -44825963 -46246969 -28420141
40475 -28420141 -20753123 -32207592 -46057305 -43052187 -20218961 11051891 38719019
40468 38719019 59217242 72926796 73534985 50204138 5916622 -33104242 -37846908
40461 -37846908 -7907518 24430541 24345124 -13094579 -59031663 -76354393 -51844973
40454 -51844973 -6937651 25205275 34173793 37329715 48351740 54313711 36686019
40447 36686019 4760489 -12129914 -4009032 8938616 9462069 6845180 16211973 31302041
40439 31302041 34956426 26200169 18299279 15560818 11559606 9152721 21449128 47434968
40431 47434968 65166493 59700115 43001450 33015835 25961606 7625964 -15632282
40424a5632282l793799K3209627K8500897J3144663N607351J9607113L6006760
40417A06650330L0495432M171509k0031446k3410714r834514j229633j3052721
40410G3758243l1943191k7284615P003366L6069303K7054716l531132j1663883
40403F9462807J0358408K4283910M934822k4428943l1508239k1189023j8694544
40396A3219198k6916717k7850049j5431388r66729R829228K2476354L5944839
40389A0304736L7917071K2916829L781518j130965J0693714J9910096M566673
40382A08959672l0463149n1467507l6198082o611503J380702p918083j304381
40375b3622331K0366024J8845664r740491j5009772K5012936N5317226K6242007
$$ plain form
40424 -15632282 -19426081 3783546 32284443 45429106 51036457 70643570 106650330
40417 106650330 137145762 141317271 121285825 97875111 88040597 86810964 73758243
40410 73758243 41815052 14530437 21533803 57603106 84657822 81126690 69462807
40403 69462807 79821215 104105125 109039947 84611004 53102765 31913742 13219198
40396 13219198 -13697519 -41547568 -56978956 -57945685 -48116457 -25640103 10304736
40389 10304736 48221807 71138636 74920154 73789189 84482903 104392999 108959672
40382 108959672 78496523 27029016 -9169066 -15780569 -14399867 -22317950 -23622331
40375 -23622331 -3256307 15589357 5848866 -9160906 15852030 71169256 97411263
40368I7411263k2727210k4543147O879404N918917k8988385l4726408L470799
40361B695233K5876670K654146j7538727L740363L0094365J8389273j0104631
40354E5806692j6695638j1465072j9064790k2807856L7673K3854637J5048516
40347B4714162l070337J2126737M2958383L5188497j0888628l9064581k5407830
40340C6556403n221487m720904m501906J2466877K7386058K2350280R629593K745138
40332I6690052o098034j9057212j6922423O360657K3049616J0902524j1179733
40325H3745447j2804719K125754O165727q084600k0843589j6286011o99171R802386
40317D3121224P194105k622920o227767K367866J2488534R685756l820792j3551654
$$ plain form
40368 97411263 74684053 50140906 57020310 62939227 33950842 -775566 2695233
40361 2695233 28571903 31226049 13687322 17427685 47522050 65911323 55806692
40354 55806692 39111054 27645982 8581192 -14226664 -14188991 9665646 24714162
40347 24714162 21643825 33770562 76728945 111917442 101028814 61964233 36556403
40340 36556403 31334916 26614012 22112106 34578983 61965041 84315321 93944914 96690052
40332 96690052 90592018 71534806 54612383 60973040 84022656 94925180 83745447
40325 83745447 70940728 73066482 79232209 71147609 50304020 34018009 33318838 43121224
40317 43121224 50315329 47692409 41464642 43832508 56321042 66006798 62186006 48634352
40309D8634352j5539731j7945920k0495080j3549952j097607j027176j4354914
40302c5376028j8062757q50782J7323379J7358786J0027621J2628141J7681423
40295B0729783J0516756R75512P235316J9128916J1120537j2088719j8366933
40288C9251168j222659N609037j7405795l7799284j5398084L5194837N9882472
40281F8111692L6849303J00963j3632309r981873j1678871j4027238M103103L5696016
40273I5540786M5819610K0902340j0315006j7316201o571706k555959q128892
40266A17374972o536465O621367J6176788J0273216o899467k4773336l5236257
40259G7000818l3684160k3697201j7326982j8491006j2265719J3476533M1921234
$$ plain form
40309 48634352 33094621 15148701 -5346379 -18896331 -19993938 -21021114 -35376028
40302 -35376028 -53438785 -54289567 -36966188 -19607402 -9579781 3048360 20729783
40295 20729783 31246539 32222051 39457367 58586283 69706820 57618101 39251168
40288 39251168 38028509 43637546 26231751 -11567533 -26965617 8229220 68111692
40281 68111692 104960995 105061958 91429649 81447776 69768905 55741667 59844770 95540786
40273 95540786 141360396 162262736 151947730 134631529 128059823 125503864 117374972
40266 117374972 110838507 117459874 133636662 143909878 137010411 112237075 77000818
40259 77000818 43316658 19619457 2292475 -16198531 -28464250 -14987717 26933517
40252B6933517M3268372J5331560j2555515j8155681q990403j929403O34481N177077
40244D9714005J1598210J3475036P250575l189645p580779J391017J3754049P564942
40236I3977410j9015786l4900349j6421348J2917212J2860429j2525748k1215917
40229A5675903J136753K3356486K3574742J8937021K3875927K0047959n639004
40222A20965787k8041073k1349404k550150l057164j8253140k1148235j0655889
40215A5910732q704929j7045848j3204262R664216K8837119K3951207K214950
40208D1623185j3513466q406862J3700578L3563143L3146324J5950668K970114
40201A19033684L114791K807222o994480j4674271j2592630j3680236k3731975
$$ plain form
40252 26933517 70201889 85533449 72977934 54822253 45831850 43902447 44536928 49714005
40244 49714005 61312215 74787251 82037826 78848181 71267402 72658419 86412468 93977410
40236 93977410 74961624 40061275 23639927 36557139 49417568 36891820 15675903
40229 15675903 16812656 40169142 63743884 82680905 106556832 126604791 120965787
40222 120965787 92924714 71575310 69025160 65967996 47714856 26566621 15910732
40215 15910732 7205803 -9840045 -23044307 -13380091 15457028 39408235 41623185
40208 41623185 28109719 19702857 33403435 66966578 100112902 116063570 119033684
40201 119033684 122148475 124955697 117961217 103286946 90694316 77014080 53282105
40194E3282105k2780920l09601J6798047M881605j2246465q07585K1969256J4292431
40186G5078873j5709096j8931005J2044374K8087628L531899k4277207j8056856
40179D1768610N675109J5548454J5650431K1540959K1136033j53816k1019284
40172A00146496j2816052J0462167J1601519j0770763k2950083j2808541n713286
40165E7151457j7024424k4101099k802757L2308463M5072993K2987330j1902000
40158A01689963l1618853k7786695j0654690M589218P446124k546740j3744304
40151B7374023j1572938K830434Q955087o378673k3449667j0511303K7351791
40144A4598754M5325958J8357945k1163647k8888455j0387699m463720j8958263
$$ plain form
40194 53282105 30501185 30191584 46989631 51871236 39624771 38817186 60786442 75078873
40186 75078873 59369777 40438772 52483146 80570774 84102673 59825466 41768610
40179 41768610 47443719 62992173 78642604 100183563 121319596 121165780 100146496
40172 100146496 87330444 97792611 109394130 98623367 75673284 62864743 57151457
40165 57151457 40127033 16025934 13223177 45531640 90604633 113591963 101689963
40158 101689963 70071110 42284415 31629725 36218943 43665067 41118327 27374023
40151 27374023 15801085 18631519 27586606 21207933 -2241734 -12753037 14598754
40144 14598754 59924712 78282657 57119010 28230555 17842856 13379136 -5579127
40137e579127k3797247m775297J7252935K6162646K9886477L0046366J2349720
40130H1546473j6602074k2524291L679836K3390546Q580299j3200993p049382
40123E7820414R579313j9032k4534430k2545651N581240J7235235k574674k1511827
40115A9030588j6878768n171590j072704Q902750L0117195L6064192J0369720
40108H1361383j7450840j1996907J2928236J5193366j0630097k5811354o147424
40101C7446363K4195480K9621838J1284398k2901J1320416K6613510J9335606
40094A59794710j1836878m2662789m9487081k9023718L406986K6157364K3771815
40087H0120409p24858k3588327k2174531k955024N872639m737676j0370133O696239
$$ plain form
40137 -5579127 -29376374 -34151671 -16898736 9263910 39150387 69196753 81546473
40130 81546473 64944399 42420108 46099944 69490490 78070789 64869796 57820414
40123 57820414 67399727 67380695 42846265 20300614 25881854 43117089 40542415 19030588
40115 19030588 2151820 -3019770 -4092474 4810276 34927471 70991663 81361383
40108 81361383 63910543 51913636 64841872 80035238 69405141 43593787 37446363
40101 37446363 61641843 91263681 102548079 102525178 113845594 140459104 159794710
40094 159794710 147957832 105295043 55807962 26784244 30191230 56348594 80120409
40087 80120409 79395551 55807224 33632693 30677669 36550308 31812632 21442499 28138738
40079B8138738K4017253J1288247j8427407k3848370J640129J8925817L265633
40072D5000040j8713774j1318151J6863788K7714353P812027j6591204j5009891
40065C5757188J3604574M2008184M1008574Q085863k6806650l2566864j5085236
40058F6005633p835236k1311634k7022003m825889K1523484K0842354L216939
40051E0593648n79573Q440880M390094j2872391j6601185l129286N72907j1495092
40043A9320002q758620K0705349M0182206J9557560j2715954j0604917J9511108
40036H7196734L1108865P781190j9305195k1891266o664079O870406J0636926
40029I5733581M351240p755974j2242537m75699J1983882M244520j3186050j1034000
$$ plain form
40079 28138738 52155991 63444238 45016831 21168461 22808590 41734407 45000040
40072 45000040 26286266 14968115 31831903 59546256 67358283 50767079 35757188
40065 35757188 49361762 91369946 132378520 140464383 113657733 81090869 66005633
40058 66005633 58170397 36858763 9836760 5010871 26534355 47376709 50593648
40051 50593648 50014075 58454955 62845049 49972658 33371473 30242187 30815094 19320002
40043 19320002 10561382 31266731 71448937 91006497 78290543 67685626 87196734
40036 87196734 118305599 126086789 106781594 84890328 78226249 85096655 95733581
40029 95733581 100084821 92328847 80086310 79610611 91594493 95839013 82652963 71618963
40021G1618963Q244230R838899j4431705k7123263n201925J9627008J0957557
40014G3529764j4759580j9070551n393305p423047k6272789k5070628J2383243
40007a2076893N5558565O7715370M4680624P064948k2428460k9169921j5455218
40000I5889015k967029q789895k1177664j9179419r058696j2484107k3360389
39993a128184j2770656J9494087L6221680J7626383r485325j4193305k506348
39986C3258332L845654K719778L306149L773896j693683r702539j6341360k1237102
39978b070875j3534378J9657249N8657999N9057122J5074068k0577184r441415
39971A06822586J5699777N751891k5430053k7926879M5092J3294843k410591j2281129
$$ plain form
40021 71618963 79863193 89702092 75270387 48147124 42945199 62572207 73529764
40014 73529764 58770184 39699633 34306328 26883281 610492 -24460136 -12076893
40007 -12076893 43481672 111197042 155877666 162942614 140514154 111344233 95889015
40000 95889015 92921986 84132091 62954427 43775008 34716312 22232205 -1128184
39993 -1128184 -13898840 5595247 41816927 59443310 49957985 35764680 33258332
39986 33258332 37103986 39823764 43129913 46903809 45210126 35507587 19166227 -2070875
39978 -2070875 -15605253 4051996 62709995 121767117 136841185 116264001 106822586
39971 106822586 122522363 128274254 102844201 74917322 74962414 88257257 85846666 73565537
39963G3565537J651504J1036586m830564k1481547j1616112R352782R367942j0319485
39955E6726643j8622335J420933L0915576L5218676L95668m6046213n5724736
39948D284212j3452169L7348261M4023366J1462269r292964N087344K4234866
39941A03695185J7731828k482472r743383k485637M327236O049932P520879J0100928
39933A34714496J2125307R691806o169715l4080722m5869625j6005215L0616486
39926H5022818L9253155L074164k3824997r123538J1069337j91889j5437298N788010
39918I5629762L8333546K5822062k6220122n4643826l2467436n66645K222284
39911D8109625r980968o360290J2672510K4961614J8224138l467176k5672944
$$ plain form
39963 73565537 75217041 86253627 81423063 59941516 48325404 57678186 67046128 56726643
39955 56726643 38104308 39525241 70440817 105659493 106055161 60008948 4284212
39948 4284212 -9167957 28180304 72203670 83665939 74372975 79460319 103695185
39941 103695185 121427013 118944541 109201158 106715521 111042757 117092689 124613568 134714496
39933 134714496 146839803 156531609 150361894 116281172 70411547 54406332 85022818
39926 85022818 124275973 127350137 103525140 94401602 105470939 105279050 89841752 95629762
39918 95629762 133963308 159785370 133565248 78921422 46453986 45887341 48109625
39911 48109625 38128657 31768367 44440877 69402491 87626629 84159453 58486509
39904E8486509k8285338m049416K3846573K4719427K634968r901749k223276J785754
39896F7013452j1052016j8435338l85422K5003651K5854275j03923k5600939k6970481
39888C5323259m178670K3462258L3273105J9201850j102989q416692o768716j0121140
39880H0672265j2711012M35367J8762495J6853760O4569r42947J2874429M855072
39872A20863998k8668274l8017791K75294L3812954J0794652l4908955l2936834
39865C1215044J7060860N1079513L8382762R660306q908481k5799718l9797432
39858G2892854k6104324J3205229L7115276K8811930K3393008M2977124M9833347
39851B42124444N466004n8118441p4400689l1817824J6344174K3743499m265383
$$ plain form
39904 58486509 30201171 26151755 49998328 74717755 77352723 67450974 65227698 67013452
39896 67013452 55961436 37526098 37140676 62144327 87998602 87894679 62293740 35323259
39888 35323259 31144589 54606847 87879952 107081802 105978813 97562121 90793405 80672265
39880 80672265 67961253 68396620 87159115 104012875 104077444 103134497 116008926 120863998
39872 120863998 92195724 54177933 54453227 88266181 99060833 64151878 31215044
39865 31215044 48275904 99355417 137738179 147398485 138490004 112690286 72892854
39858 72892854 46788530 59993759 97109035 125920965 149313973 192291097 242124444
39851 242124444 247590448 189472007 115071318 83253494 99597668 123341167 119075784
39844A19075784l4701261m3374520k5051751P426104K9833148K8743322J6477181
39837I8428007J1460024J2074894O725140j236815j385157j24919j0437146k3324966
39829I2179062j8078537J018026Q826146K097913M923557K2971350K6716494j109902
39821A39544109l1232920k7602901K00132J4909328Q205901N647985J8495099
39814A28166733K4693488P072297j6820500k0583836o977225P04612m200789o217884
39806A05836896R09686P99694j6718616l1796059j9644297R914931K2220827O800430
39798G8323492r188377n167880J199897j3380194l3639062k3767592J7457725
39791A1838009M9053925L9085501J304664k5925478k0727221P760568L2055491
$$ plain form
39844 119075784 84374523 41000003 15948252 23374356 53207504 81950826 98428007
39837 98428007 109888031 121962925 128688065 127451250 126066093 125941174 115504028 92179062
39829 92179062 74100525 75118551 83944697 86042610 90966167 113937517 140654011 139544109
39821 139544109 108311189 80708288 80908420 95817748 104023649 109671634 128166733
39814 128166733 152860221 159932518 143112018 122528182 115550957 116255569 112054780 105836896
39806 105836896 106746582 107546276 90827660 59031601 39387304 49302235 71523062 78323492
39798 78323492 69135115 63967235 65167132 51786938 18147876 -5619716 11838009
39791 11838009 60891934 99977435 101282099 75356621 54629400 62389968 94445459
39784I4445459K9365962L527485j5511580n958044J6547154K1077278O285031
39777A49778745k450812K377573J529789j0570156j2921269O23521L389515j7490915
39769A14265991k9998038n085047L1031877L1371168j896242k3231703j2559458
39762A03898548J813706p493902k8516743l1477216o366937K9908163M9585602
39755A11351221L5104369k512951k8633825k2286643k037451J800491r640022
39748H3145189j1726190J408616J1497469R659244N592480K926895n305646j3904284
39740H3293773p360871J0777036J8990358J3636189J3764060K2919793J8800235
39733A74820573o141661k5442648j7760944K696165J3968604J7595017K0275819
$$ plain form
39784 94445459 123811421 127338906 111827326 105869282 122416436 143493714 149778745
39777 149778745 147327933 149705506 151235295 140665139 127743870 128367391 131756906 114265991
39769 114265991 84267953 79182906 110214783 141585951 139689709 116458006 103898548
39762 103898548 105712254 98218352 69701609 38224393 31857456 61765619 111351221
39755 111351221 146455590 143942639 115308814 93022171 90984720 92785211 83145189
39748 83145189 71418999 72827615 84325084 93984328 99576808 102503703 97198057 83293773
39740 83293773 75932902 86709938 105700296 119336485 133100545 156020338 174820573
39733 174820573 168678912 143236264 125475320 128171485 142140089 159735106 180010925
39726A80010925J0972316j5288783l1798444j1565693K6686183L5775683J382846
39719A96175033l9663408m5780641j7065200J0443076P364579j6958238k5195550
39712F9319651K647371M0451664M6236335J7209891q095588n004329P891826N414715
39704A76071536o460525r202623m892012o917552j3724319j4408511q455386j146560
39696A10864048Q492275J8826225J9171977Q368464L129682J0826862J3200442
39689A92879975k789349j8539875j2412946M883693J0602727P061812Q429549
39682A90115586P792106q309623k5591563j8578274O412184J9373811J1726608
39675A82940835k31065j0771688k7022630l8144229k0749047J9368948M4345463
$$ plain form
39726 180010925 190983241 175694458 143896014 132330321 159016504 194792187 196175033
39719 196175033 156511625 110730984 93665784 104108860 111473439 94515201 69319651
39712 69319651 71967022 112418686 158655021 175864912 167769324 162764995 170656821 176071536
39704 176071536 169611011 160408388 155516376 148598824 134874505 120465994 112010608 110864048
39696 110864048 119356323 138182548 157354525 165722989 168852671 179679533 192879975
39689 192879975 190090626 171550751 159137805 164021498 174624225 181686037 190115586
39682 190115586 197907692 189598069 164006506 145428232 151840416 171214227 182940835
39675 182940835 182709770 171938082 144915452 106771223 86022176 105391124 149736587
39668A49736587L2183353J656525j7129559j4535769l19932Q666858l29760j8430061
39660A41498242j5854139J7326724M3899662K4622037k0879843l7628186j3219863
39653A39764634J1771725J1163248M085697R816345J5957874P882217o146560
39646A94295180j5161963k0723828k1094016r893152K539161j720414j3766798
39639A14474170q348264R529315J0943757j579039M310857K6451416K3387590
39632A79169802r840470k3116729M409758K3520722l270932l7328604k8947675
39625A04595872M257062J7082966J0847355J1823152J3599357j251594j4115333
39618A46838837k025964J3051856L064846q692740J0103369L1316720Q316300
$$ plain form
39668 149736587 181919940 183576465 166446906 151911137 151591205 160258063 159928303 141498242
39660 141498242 125644103 142970827 186870489 211492526 190612683 152984497 139764634
39653 139764634 151536359 162699607 166785304 176601649 192559523 200441740 194295180
39646 194295180 179133217 158409389 137315373 127422221 129961382 128240968 114474170
39639 114474170 106125906 115655221 126598978 125019939 129330796 155782212 179169802
39632 179169802 169329332 146212603 150622361 174143083 170872151 133543547 104595872
39625 104595872 108852934 125935900 136783255 148606407 162205764 160954170 146838837
39618 146838837 144812873 157864729 160929575 152236835 162340204 193656924 201973224
39611B01973224l6530955m1045036m322491J8174066J1487522J2919832K7644463
39604A90300625J5837704k4161389m0104831j4511105N752954n197136j0571754
39597A17345068J1831254K2155549o888142l1565551o590974L8988826N0748645
39590A96024675L0316138J2347551j094879k3511590l2811184j655820L9851861
39583B19466752L4855540j4375586m8445134l7214725j0500724J836711Q170459
39576A53793293J8802482J7081878p915512l1233217k2412965J0703469L1502885
39569A70322313K0601077m257785j3189265Q54036J6065818J0191179j0014199
39562A90573174j7674245m656580N228365p655062k5918904j8450254J2332091
$$ plain form
39611 201973224 165442269 124397233 120074742 138248808 149736330 162656162 190300625
39604 190300625 206138329 181976940 141872109 127361004 133113958 127916822 117345068
39597 117345068 129176322 151331871 144443729 112878178 106287204 145276030 196024675
39590 196024675 226340813 238688364 237593485 214081895 181270711 179614891 219466752
39583 219466752 254322292 239946706 191501572 154286847 143786123 145622834 153793293
39576 153793293 172595775 189677653 181762141 150528924 128115959 138819428 170322313
39569 170322313 190923390 186665605 173476340 174330376 190396194 200587373 190573174
39562 190573174 172898929 168242349 173470714 165815652 139896748 121446494 133778585
39555A33778585L0320905J4450398j2196037j1447198K1977091N2265665M2239086
39548B71388495m388025m6309924n1035699k8955162j2933430j4064827j5057231
39541I8644197k376767J7062172L1900851L7145500K6880189j30812k3897479
39534A85227851j8842049P363201J8798741L345024j2267304j0600460q752486
39527A64272518j6269268r037478K3822699M4810476K0055152k3714030l7354268
39520A66585801j8614387J382287J4516663K6655230J7277517k7995319o0713776
39513A19094016j9952774O1550437Q1048433J2240071n1131353l3126233J7853779
39506A87576376J6671107k5480600l1395553J3041920M1442349J3931766k9016329
$$ plain form
39555 133778585 164099490 178549888 166353851 154906653 176883744 229149409 271388495
39548 271388495 267000470 220690546 169654847 140699685 127766255 113701428 98644197
39541 98644197 96267430 113329602 145230453 182375953 209256142 209125330 185227851
39534 185227851 166385802 173749003 192547744 195892768 183625464 173025004 164272518
39527 164272518 148003250 138965772 162788471 207598947 227654099 203940069 166585801
39520 166585801 147971414 149353701 163870364 190525594 207803111 179807792 119094016
39513 119094016 99141242 160691679 241740112 253980183 202848830 169722597 187576376
39506 187576376 204247483 178766883 147371330 160413250 201855599 215787365 186771036
39499A86771036l4815241p246467J7080165K2447142J7194309Q074776k086310
39492B07419410m319103P137332K1365018K2572926J1729342K991233N70780o245478
39484B63221460k0939437k6181571n521569K6824957L5203777O068189l2851729
39477B45824077m6574776l1887694q366169J4050285L5051204M2682837K4010704
39470B74790468m274766r734995N340593K594514k9963078n1623709l0183466
39463A56945561M672880O225588j6077007j4082112J9900189M0575998K0911475
39456B19072572q344158p778598J5614792K6096652R888650j5867061l2156173
39449B06526676l4561934k6469535j3024377r48872O094868J0618423J3864437
$$ plain form
39499 186771036 151955795 144709328 161789493 184236635 201430944 209505720 207419410
39492 207419410 203100307 210237639 231602657 254175583 265904925 268896158 269466938 263221460
39484 263221460 242282023 216100452 210578883 237403840 272607617 278675806 245824077
39477 245824077 199249301 167361607 158995438 173045723 208096927 250779764 274790468
39470 274790468 270515702 260780707 266121300 268715814 238752736 187129027 156945561
39463 156945561 161618441 167844029 151767022 137684910 157585099 198161097 219072572
39456 219072572 210728414 202949816 218564608 244661260 254549910 238682849 206526676
39449 206526676 171964742 145495207 132470830 131521958 137616826 148235249 162099686
39442A62099686J0601691j224007j1424755p820739P369273K0157497K2111404
39435B01870050J6831235J0018576K091753p009518j3046929j2187031o189155
39428A92378981J474527J0833068K0715031K1871305M982677k1962320l5083813
39421A95209456k1977174L27913O820222k036845m802970N224773J0302557l1872
39413A89036060r877055l865549N939186N98323j2397793j1344469K528224Q009703
39405A68626630K067805N256538K2730971K8886667O823413j9617312j5745574
39398A99029138J4918656L4878156K2360093l586229j1715603J842140J2007690
39391B69734041j307882k6392222l2995721j1219217J3940882J5532937J420406
$$ plain form
39442 162099686 172701377 171477370 160052615 152231876 159601149 179758646 201870050
39435 201870050 218701285 228719861 230811614 223802096 210755167 198568136 192378981
39428 192378981 193853508 204686576 225401607 247272912 252255589 230293269 195209456
39421 195209456 173232282 173560195 180380417 178343572 173540602 178765375 189067932 189036060
39413 189036060 179159005 175293456 181232642 181830965 169433172 158088703 160616927 168626630
39405 168626630 170694435 175950973 198681944 227568611 234392024 214774712 199029138
39398 199029138 213947794 248825950 271186043 267599814 255884211 257726351 269734041
39391 269734041 268426159 242033937 209038216 197818999 211759881 227292818 228713224
39384B28713224N0521J5078343J9494453j147493k6128600l1886372k2248107
39377A81925969r835693P883408L0188738L3831943M890736k6459813k1499571
39370B00925717N649321N642320k6597214l7882241K053855M9546696M7165720
39363B46504174K576504k9149728k2009657j61168Q422256L851007j336406j670976
39355B07026006L353866J1685385J5116354Q110612m5483K358142O923769n755578
39347B48773073l3488924m9228298l6192333r256014O501645N511507K273762
39340A34894418J1166068L0826170M3412976L1185917R43046j6122225k693933
39333B33612437J7068021R987689j6055047k5581381j3535897r319440j8523478
$$ plain form
39384 228713224 228763745 243842088 263336541 262189048 236060448 204174076 181925969
39377 181925969 172090276 179973684 210162422 243994365 248885101 222425288 200925717
39370 200925717 206575038 212217358 185620144 147737903 149791758 199338454 246504174
39363 246504174 249080678 219930950 197921293 197760125 206182381 210033388 208696982 207026006
39355 207026006 210379872 222065257 237181611 245292223 245246740 247604882 254528651 248773073
39347 248773073 215284149 166055851 129863518 120607504 127109149 132620656 134894418
39340 134894418 146060486 176886656 220299632 251485549 252428595 236306370 233612437
39333 233612437 250680458 260668147 244613100 219031719 205495822 196176382 177652904
39326A77652904p977130L1487836N3904320K4257244k2789724l3542805j4057901
39319B08934744q100775j9433314j4702482O541937P630957j5069097j8924702
39312A46877268J1063871L1734963J2705190j2743188m799378J7453983J3242323
39305B15535032q963024q776601J5830424K6642563Q654575j0058023n764883
39298B33100063J1167745K1360844K0272183Q898088j2525744l3083979l6403804
39291B12785396k4016686j2245457k801084J7309816M1157314L8670702L113999
39284B73974000k7950223k0958665O317025J2151385r779496k7531860k0372401
39277A85849765k170336O870757P296233R452987J1885729M302713j3418227k5759196
$$ plain form
39326 177652904 169675774 201163610 255067930 279325174 256535450 222992645 208934744
39319 208934744 200833969 181400655 166698173 173240110 180871067 165801970 146877268
39312 146877268 157941139 189676102 202381292 189638104 184838726 202292709 215535032
39305 215535032 206572008 197795407 213625831 240268394 248922969 238864946 233100063
39298 233100063 244267808 265628652 285900835 294798923 282273179 249189200 212785396
39291 212785396 188768710 176523253 173722169 191031985 232189299 270860001 273974000
39284 273974000 246023777 225065112 231382137 243533522 233754026 206222166 185849765
39277 185849765 183679429 190550186 197846419 207299406 219185135 223487848 210069621 184310425
39269A84310425j7819078N264857J9348042O837647j9800528k9086071q339111
39262A40716183J9901315K6985707J3786428M535081J1092689J9091713J0408640
39255B46517756j3751859l6435623m2184734k6354683M404706L4162844M4956243
39248B11314650K9837169r9515k4552585l1061489k2985360j1268491r70114J0422295
39240A60636560K1510137K1759321N849408j1549929r046553J1626475K3633436
39233B24418855J0422703j0444265j1754156N224447J4321624K255954j5184753
39226B19260409j7648828o385194J551437k665816q896612m79011K4191337M3812224
39218B52739946L3719917m048204l8870432m5627115k9822304r904319R604515
$$ plain form
39269 184310425 166491347 171756204 191104246 197941893 178141365 149055294 140716183
39262 140716183 160617498 187603205 201389633 205924714 217017403 236109116 246517756
39255 246517756 232765897 196330274 154145540 127790857 132195563 166358407 211314650
39248 211314650 241151819 241052304 216499719 185438230 162452870 151184379 150214265 160636560
39240 160636560 182146697 203906018 209755426 198205497 189158944 200785419 224418855
39233 224418855 234841558 224397293 212643137 217867584 232189208 234445162 219260409
39226 219260409 201611581 195226387 196777824 194112008 185215396 184736385 208927722 252739946
39218 252739946 286459863 282411659 243541227 197914112 168091808 158187489 167792004
39211A67792004K9089444L3391268J0079405j8170475j3713695K0606283M0369568
39204B69443802K2710005n028101j4870639j8074350k9263527k8125574K901640
39197A99693256L1182759J4153423k8672295l7772334l361882K2788710J2218085
39190B10229722j083002J1985594K3657617K536340k4555825j3083652K4455888
39183B34142682L6498142J1199870j3739097j6263749j5038692k2567132k0174882
39176A94057142K056938J9068951R427842q866624p642138Q654526J6323948J0887189
39168B43967774M066159m430556k2010437l7288909k9479584l084139J4452146
39161A66192454J2353983P325898R813020P728556m743118r930571K180601R329078
$$ plain form
39211 167792004 196881448 230272716 240352121 222181646 208467951 229074234 269443802
39204 269443802 292153807 287125706 272255067 254180717 224917190 196791616 199693256
39197 199693256 230876015 245029438 216357143 178584809 175222927 198011637 210229722
39190 210229722 209146720 221132314 244789931 247326271 222770446 209686794 234142682
39183 234142682 270640824 281840694 268101597 251837848 236799156 214232024 194057142
39176 194057142 196114080 215183031 224610873 215744249 208102111 216756637 233080585 243967774
39168 243967774 248033933 243603377 221592940 184304031 154824447 151740308 166192454
39161 166192454 178546437 185872335 195685355 203413911 198670793 188740222 190920823 200249901
39153B00249901r531047l3113402k3478376J4105453L3388035J4218064q086540
39146A87752088K053256K5950768K0993410j2581956l1862209j5663710P154508
39139A83796155N258921r406630o417706J2641718J9037219N425367k727042R270752
39131B16878754J9249957L947499k0009833j7546753J1521128K9599279J4004069
39124B57644100j4184669k4761404j8900988j6667735k0934888j7893970n533375
39117A38767071L438483O355200J4620391K8540186L0321018J2073225p613790
39110B26501784q042694O604449J7360801J5258246L433175j2846871k3623438
39103B24645452j4276959J3778619L2778303J9527359j1030949k4977056j5609929
$$ plain form
39153 200249901 190718854 157605452 134127076 148232529 181620564 195838628 187752088
39146 187752088 189805344 215756112 236749522 224167566 192305357 176641647 183796155
39139 183796155 189055076 179648446 173230740 185872458 204909677 210335044 207608002 216878754
39131 216878754 236128711 240076210 220066377 202519624 214040752 243640031 257644100
39124 257644100 243459431 218698027 199797039 183129304 162194416 144300446 138767071
39117 138767071 142205554 148560754 163181145 191721331 222042349 234115574 226501784
39110 226501784 218459090 225063539 242424340 257682586 261115761 248268890 224645452
39103 224645452 210368493 224147112 256925415 276452774 265421825 240444769 224834840
39096B24834840n279564m811754j121660J0703990J3165415l862277k4044489
39089B09584501k9364270k2484455j1035014P273171K7198945K7810349M464685
39082B13447912j2719524L01472K1136116J3964285j2172990j7225300M567033
39075B11299004J6351640k29757j8161321j3984011m991536j3207761k3534849
39068A53541409r755123J8075321K6237442P552403j2266901j5223859r543185
39061A58617507n893582j319997O081106Q840488P211219J5723910L8010957M9591505
39053B76863113K5219899k2403318n0854335l8079554r356383n293275l1376733
39046A44719414n1397325l1177212K0530816O0642330N8046149K5001712K05854
$$ plain form
39096 224834840 219555276 214743522 213621862 224325852 237491267 233628990 209584501
39089 209584501 180220231 157735776 146700762 153973933 181172878 208983227 213447912
39082 213447912 200728388 201029860 222165976 236130261 223957271 206731971 211299004
39075 211299004 227650644 227420887 209259566 195275555 190284019 177076258 153541409
39068 153541409 143786286 161861607 188099049 195651452 183384551 168160692 158617507
39061 158617507 152723925 151403928 157485034 166325522 173536741 189260651 227271608 276863113
39053 276863113 302083012 279679694 228825359 190745805 181389422 176096147 144719414
39046 144719414 93322089 62144877 82675693 143318023 201364172 226365884 226571738
39039B26571738M280220J8495460J1267093j9078028l9340269k3902950R497987
39032A87791251K1452258L326213j3200246l671424J5567973J7660135Q897376
39025B37823536J4478531L1076824K7729343l063959k8221626k1840709k170688
39018B55811252J24842j1585125j2284315L98478N139451m834906j2425362p854305
39010B12490010j724841J43425Q514453K4205592K4237765m108983l3324518k7099440
39002B03333463O847695K4874002R053608r347453J51938K0742397J6230265j0801971
38994B61083944k1246636N00800K0839911O343432k5042683k8169681M353680
38987B18662767L0979513J9034761j2247388k2245406n315446O434965p809228
$$ plain form
39039 226571738 230851958 249347418 260614511 241536483 202196214 178293264 187791251
39032 187791251 209243509 212569722 199369476 195698052 211266025 228926160 237823536
39025 237823536 252302067 283378891 311108234 308044275 279822649 257981940 255811252
39018 255811252 255936094 244350969 232066654 232465132 237604583 232769677 220344315 212490010
39010 212490010 210765169 210908594 219423047 243628639 267866404 263757421 230432903 203333463
39002 203333463 210181158 235055160 244108768 234761315 234913253 255655650 271885915 261083944
38994 261083944 239837308 240338108 261178019 267521451 242478768 214309087 218662767
38987 218662767 249642280 268677041 256429653 234184247 228868801 235303766 227494538
38980B27494538k8890488k5452198N596969L8993640N2416023M3577873K0332019
38973C34068376r218538l2929286l6335774j9192464j247499K99581p509868p155357
38965B20779171M77208m27462r850018p581074J2932498K8011441J6152433r576006
38957B50918191k0440386j1402539p12151J489777R39945p54923r544522k0513224
38949A89980168j9245358p467034n288143j8014904k1668341K469407L4773865
38942A55539660L9174967J1092543j5795949j1131475J8349343M1185763L7783852
38935B76198704J6951477j168147r699483j6333439k4214709k4090295j0314088
38928B07330020O868994J4558401J2996421P447343l623292j6726823j3182408
$$ plain form
38980 227494538 198604050 173151852 178748821 217742461 270158484 313736357 334068376
38973 334068376 324849838 291920552 255584778 236392314 235144815 235444396 227934528 220779171
38965 220779171 221256379 220828917 210978899 203397825 216330323 244341764 260494197 250918191
38957 250918191 230477805 219075266 218363115 219852892 220792837 220037914 210493392 189980168
38949 189980168 170734810 163267776 157979633 139964729 118296388 120765795 155539660
38942 155539660 194714627 205807170 190011221 178879746 197229089 238414852 276198704
38935 276198704 293150181 291982034 282282551 265949112 241734403 217644108 207330020
38928 207330020 214199014 228757415 241753836 249201179 245577887 228851064 215668656
38921B15668656J5607988M2340742L2600429m269448k4903740j3366763J568722
38914B65246586l251807j4421248j4579855r957375o378419P345639K7933865
38907B51937386K4011406j4557729m4795938k6552308J4630776K3896157j799575
38900B26770175j6409774P6102J7954718J2100785l585408p133367M73072Q541195
38892B38787498J4778824J8439170J5291297P167230Q64187l416105o801919j357340
38884B83752842J3966770J7629267m865253k6204026j0718273K3439604K2668176
38877C19669107j8013443m1297811j4676172J9708138J2507464j8697483k3184499
38870B36015301N109516K7313459K0856125J321244j0274491j0045710l333527
$$ plain form
38921 215668656 231276644 273617386 306217815 301948367 277044627 263677864 265246586
38914 265246586 261994779 247573531 232993676 223036301 216657882 224003521 251937386
38907 251937386 275948792 261391063 216595125 190042817 204673593 228569750 226770175
38900 226770175 210360401 210436503 228391221 240492006 236906598 229773231 230246303 238787498
38892 238787498 253566322 272005492 287296789 294464019 295328206 291912101 285110182 283752842
38884 283752842 297719612 315348879 310483626 284279600 273561327 297000931 319669107
38877 319669107 301655664 260357853 245681681 265389819 277897283 259199800 236015301
38870 236015301 241124817 268438276 289294401 290615645 280341154 270295444 266961917
38863B66961917J859589l725359j7747107k1431772m317278J6115757J8160785
38856B55876532Q272326P863118J6786360J5108995j868313j4761460r604851
38849B77672707K538264K025445j4199911k9010013k2807132M476284K8072526
38842B48768170K2300991p868279l0177476k3842568j022968J5686784J9610279
38835B43454933J4876203M181176n136388p53741J4513101K0259325J0297491
38828C01692100M750268J2326677P125940k8712153o3125443n2229615n093898
38821A76733876K9376368L1771638K7096774L2415521L2466965J5896669j701561
38814C44056250n673774m301153q989910j7016327k5576410l8364607m6292500
$$ plain form
38863 266961917 268821506 265096147 247349040 225917268 221599990 237715747 255876532
38856 255876532 264148858 272011976 288798336 303907331 302039018 287277558 277672707
38849 277672707 280210971 282236416 268036505 239026492 216219360 220695644 248768170
38842 248768170 271069161 263200882 233023406 209180838 208157870 223844654 243454933
38835 243454933 258331136 262512312 257375924 256622183 271135284 291394609 301692100
38828 301692100 306442368 318769045 325894985 297182832 234057389 181827774 176733876
38821 176733876 206110244 237881882 264978656 297394177 329861142 345757811 344056250
38814 344056250 338382476 334081323 325091413 308075086 282498676 244134069 197841569
38807A97841569k7792168J5571399M8004004M3518765K0204788R232359R330644
38800C15911360p65308j8509536j8930170K081516J6416836M506037j5742270
38793B84968465j5725815L025060J3143073Q80293j6647579j6191419L572652
38786B57024730K5195522L2927461K1929268k539972k3712477k1176456M042200
38779B93690276K1232786P251276j6371769j1651848J5452364K0889165n977264
38772C24514986k1417202J573647K5361731O846528l1685868l7654142r057124
38765B58482556J1772885J0536534J1976758K2589819J8085205m412520j3192452
38758C15838785L396484J5003306K399641r169241M442614K3439368J7428644
$$ plain form
38807 197841569 170049401 185620800 233624804 277143569 297348357 306580716 315911360
38800 315911360 315146052 296636516 277706346 279787862 296204698 300710735 284968465
38793 284968465 269242650 272267710 285410783 286291076 269643497 253452078 257024730
38786 257024730 282220252 315147713 337076981 334537009 310824532 289648076 293690276
38779 293690276 314923062 322174338 305802569 294150721 309603085 330492250 324514986
38772 324514986 303097784 304671431 330033162 336879690 305193822 267539680 258482556
38765 258482556 270255441 280791975 292768733 315358552 333443757 329031237 315838785
38758 315838785 319235269 334238575 336638216 327468975 331911589 355350957 372779601
38751C72779601o067322j8060873j3432017r999091j4874909j7372332q823142
38744B84149915P916794K2571000K2111420L162632j5030508r096444J1475435
38737C27260244J2334237j1173017k1064274K554273K4169433Q138243k0795282
38730C21423857j5817664J4643757J8766485j6229801m4378281l1385829l8863
38723B46983661J3177958J0835135J6986636L0346049K6006499l790942l6026722
38716C04518274m5795743l1402381o032788K0802249M2475502M5455529J9038286
38709C49058928k1980857m1772196k3297313Q391610J8901382R677641P562477
38702C06541672J6741833J3130241r438858k1512856l092284K1492527J7521311
$$ plain form
38751 372779601 366712279 348651406 335219389 325220298 310345389 292973057 284149915
38744 284149915 292066709 314637709 336749129 339911761 324881253 315784809 327260244
38737 327260244 339594481 328421464 307357190 309911463 334080896 342219139 321423857
38730 321423857 305606193 320249950 339016435 322786634 278408353 247022524 246983661
38723 246983661 260161619 270996754 287983390 318329439 344335938 340544996 304518274
38716 304518274 258722531 227320150 221287362 242089611 284565113 330020642 349058928
38709 349058928 327078071 285305875 262008562 270400172 289301554 298979195 306541672
38702 306541672 323283505 336413746 326974888 305462032 302369748 323862275 341383586
38695C41383586j0679946k9564468k2972451m265955J0570433J8310219J8704641
38688C21486059R427997n281860j2740946k922686K1299279M3305595M3141431
38681D17714869J7094047j3636154k5024108j8646400j2490418q698022M154307
38674C60468121J8557670J1699229j2517479k2040354q945883l079884j6370096
38667C27771324j8856138L055594J3262979r561565k2628014J1216053M6907018
38660C51167251K0274338m1481605n2885926k351817L2774938J0022001k1672769
38653B95846411j3873085P496451P46581j8992346j4893815O806009J6310638
38646B79446844J4347172K0657084K9373234J8842207n847616j7191331p356098
$$ plain form
38695 341383586 330703640 301139172 278166721 273900766 284471199 302781418 321486059
38688 321486059 330914056 325632196 312891250 309968564 331267843 374573438 417714869
38681 417714869 434808916 421172762 396148654 377502254 365011836 356313814 360468121
38674 360468121 379025791 390725020 378207541 356167187 347221304 344141420 327771324
38667 327771324 308915186 311970780 325233759 315672194 293044180 304260233 351167251
38660 351167251 371441589 329959984 277074058 274722241 307497179 317519180 295846411
38653 295846411 281973326 289469777 290216358 271224012 256330197 263136206 279446844
38646 279446844 293794016 314451100 343824334 362666541 356818925 339627594 332271496
38639C32271496K539519n891583k6075722l4697529j4238317K4803417M3578831
38632C22290112J6439113k6069051k6570696J8929859M8567301K0961074k6525917
38625C48021795l6422808j0773378Q655203R604640J0249624J0804156l693487
38618C36445745k0615258j0270198K0175357K9618766N877010j7536548j7737976
38611C25956898j3524835k2719715k7221525p326557J8125712J7399901m972448
38604B85717431j4410291M621918K9688670L1176004O269756k0698919k4088042
38597B98276527k267747K0344999J9447508j322424j6529823j2425986j005837
38590C04517217L041415L455853J0285890K0034176K1780823J3750047j17813
$$ plain form
38639 332271496 334811015 328919432 302843710 268146181 253907864 278711281 322290112
38632 322290112 338729225 312660174 286089478 305019337 353586638 374547712 348021795
38625 348021795 311598987 300825609 309480812 319085452 329335076 340139232 336445745
38618 336445745 315830487 305560289 325735646 355354412 361231422 343694874 325956898
38611 325956898 312432063 289712348 262490823 255164266 273289978 290689879 285717431
38604 285717431 271307140 275929058 305617728 336793732 343063488 322364569 298276527
38597 298276527 296008780 316353779 335801287 334478863 317949040 305523054 304517217
38590 304517217 307558632 311014485 321300375 341334551 363115374 376865421 376747608
38583C76747608k0916524m4921190n0818297k0432520K7374089M8308047K7036497
38576C42377710k109824l485785J1434607P540421j6498795k6433343o550919
38569C06274072J7034995J7587920M665810K107477J0749946J5580365J4510412
38562C88510997J4559939R006610j3839596m1089156m1631740q155439K8178303
38555C35539918L4001334R774093j7749174k6086785j2902558P492076J5839740
38548C45908644L621246j7685325k8115513k0770452n551153O277123J1446362
38541B95130932J0549809N940632L122585M002787J115844j0688866k1513612
38534B87660111j8821869p573427k494016n137677n424626o49479N145166J3987153
$$ plain form
38583 376747608 355831084 310909894 260091597 239659077 267033166 315341213 342377710
38576 342377710 340267886 336782101 348216708 355757129 339258334 312824991 306274072
38569 306274072 323309067 340896987 345562797 347670274 358420220 374000585 388510997
38562 388510997 403070936 412077546 398237950 357148794 315517054 307361615 335539918
38555 335539918 369541252 379315345 361566171 335479386 322576828 330068904 345908644
38548 345908644 349529890 331844565 303729052 282958600 277407447 283684570 295130932
38541 295130932 305680741 311621373 314743958 318746745 319862589 309173723 287660111
38534 287660111 268838242 261264815 258770799 253633122 248208496 247559017 252704183 266691336
38526B66691336K5913131K6951940R416614o149790R51335J2791287k25969k3224025
38518C13115859j5399926J7814986K6707728o10174j7805605j515883Q730484
38511C31037469j5131981l4523098j0541472K4643402J9356597j3178937k2694256
38504B78967724n576122K170218l506850N455500K5865012K2086247q381113k3060467
38496B94020149O01718L2503690L4731888N446568l0658129m8165823l4301605
38489B54178456j349678J6855886L823351j4791209j0186214N732780R177724
38482B63441096J1801265L2350604M4581239J3038657l4249109l5655923P063260
38475C02371089L1317645J4430333j855175K906831m337642l4410439m4247004
$$ plain form
38526 266691336 292604467 319556407 328973021 322823231 323774566 336565853 336339884 313115859
38518 313115859 297715933 315530919 342238647 341628473 323822868 322306985 331037469
38511 331037469 315905488 281382390 270840918 295484320 314840917 301661980 278967724
38504 278967724 273391602 275561820 272054970 277510470 303375482 325461729 317080616 294020149
38496 294020149 294621867 327125557 361857445 367304013 336645884 288480061 254178456
38489 254178456 252828778 269684664 273508015 258716806 248530592 254263372 263441096
38482 263441096 275242361 307592965 352174204 365212861 330963752 295307829 302371089
38475 302371089 333688734 348119067 346263892 349170723 344833081 310422642 266175638
38468B66175638j4055523J4189280J2412585J0811101K4674705J1475517m2414701
38461B83268602o5631865p991228N9286269L9976205l5616125n5794833Q91837
38454B18388862M4494190K2653512j2058758o848742R661549o065674l3083643
38447B37141296k6141171Q974458K9918568K0801317J31105j5940415k4340124
38440B30545034k1188920n512732R440172Q833714m435607j5956821j8054128
38433A83670712j1549332J242584J4431056J7966499R642736R59590K102458P354538
38425B25820841M286048p306814j5016170j1613588n387422q344747j7199692
38418A65238456j4582882O139972K6521474K6632815J6014250J9628813L4884354
$$ plain form
38468 266175638 252120115 266309395 278721980 289533081 314207786 325683303 283268602
38461 283268602 217636737 209645509 268931778 308907983 273291858 217497025 218388862
38454 218388862 262883052 285536564 273477806 266629064 276290613 270224939 237141296
38447 237141296 211000125 219974583 249893151 270694468 270825573 254885158 230545034
38440 230545034 209356114 203843382 213283554 222117268 217681661 201724840 183670712
38433 183670712 172121380 173363964 187795020 205761519 215404255 216363845 218466303 225820841
38425 225820841 230106889 222800075 207783905 196170317 190782895 182438148 165238456
38418 165238456 150655574 156795546 183317020 209949835 225964085 245592898 280477252
38411B80477252L2147318N484753j1465327K23129R190366j5013281m4700068
38404B56344142l2731967R631669K4877226m764180l4366484k6982530J24758
38397A92132634J6966701K5802092L7693836L7751212Q427323l1278834m3356169
38390B44138795k1332276K923031L239437j0016819r586936R455371K1270086
38383B40090689L215439k8360809l1807431M068767L6773060K2536924k2222309
38376B24294330m1064326j3576005K1846569K4732764l51739k3822588k8781942
38369A63277063j4029963J4250853L6158387K6897854q141237k7964159p414410
38362A83034388K4857331K4993528m866711k3172130q779146J5740612K1588147
$$ plain form
38411 280477252 312624570 318109323 306643996 306867125 316057491 301044210 256344142
38404 256344142 223612175 233243844 258121070 253356890 218990406 192007876 192132634
38397 192132634 209099335 234901427 272595263 310346475 318773798 287494964 244138795
38390 244138795 222806519 225729550 228968987 218952168 209365232 218820603 240090689
38383 240090689 243306128 214945319 183137888 187206655 223979715 246516639 224294330
38376 224294330 183230004 169653999 191500568 216233332 215881593 192059005 163277063
38369 163277063 149247100 163497953 199656340 226554194 218412957 190448798 183034388
38362 183034388 207891719 232885247 228018536 204846406 196067260 211807872 233396019
38355B33396019Q818310l818070n834735j152542K728665K139850l056362j1150850
38347B22070285j7944835j5260475L948048L1279149L8646755N360123m6960796
38340B21138254o5981780k8308174K7573617M5865363K0223496n832267m78276
38333B14200233J9938800K2702684N428009o764448j859061J683465j5884044
38326B39445638m2152071m3830464j1343854K3792856K7056210N127459o396678
38319A91699096M858251J2592925m088639k4879065j6854753J4664961K9685572
38312B07678348P633065k4629078k7852096J410930L0390312L0351344M167314
38305B29150139k4530970l7266221l2051990j8546787r274464j0149192j3013859
$$ plain form
38355 233396019 242214329 238396259 232561524 231408982 234137647 236277497 233221135 222070285
38347 222070285 204125450 188864975 192813023 224092172 262738927 268099050 221138254
38340 221138254 155156474 126848300 154421917 200287280 220510776 214678509 214200233
38333 214200233 234139033 256841717 262269726 255505278 253646217 255329682 239445638
38326 239445638 197293567 153463103 142119249 165912105 192968315 198095774 191699096
38319 191699096 196557347 209150272 205061633 180182568 163327815 177992776 207678348
38312 207678348 215311413 190682335 162830239 164241169 194631481 224982825 229150139
38305 229150139 204619169 167352948 135300958 116754171 107479707 97330515 84316656
38298H4316656l321339J7377835K5773214P612931j4699003q227419J9947654
38291A28780529K8273203L002889j8769392o135365J8486124J8532479J740210
38284A73910677M46839J3107441J1346398l649853q16642K2348529K8850441K475755
38276B48019585k3698031j9001087O91722M551970o769598j2423574p267663j549151
38268A82554173J89069l73328m279472j0544589j3671293j3278881j1447731L55468
38260A29503416K7225434M3779832J7935799l0830985m1841468o68225L1883004
38253A76986807R683182k7794209k0724135J6274798K4772615O05458o676776
38246A73127740J6922289K8403149L246048k6056201k5190144n366609N877303
$$ plain form
38298 84316656 80995317 98373152 124146366 131759297 117060294 108832875 128780529
38291 128780529 157053732 160056621 141287229 135151864 153637988 172170467 173910677
38284 173910677 174357516 187464957 198811355 195161502 194344860 216693389 245543830 248019585
38276 248019585 224321554 205320467 206012189 210564159 203794561 191370987 184103324 182554173
38268 182554173 182743242 182369914 178090442 167545853 153874560 140595679 129147948 129503416
38260 129503416 156728850 200508682 218444481 187613496 145772028 145103803 176986807
38253 176986807 186669989 158875780 138151645 154426443 179199058 179804516 173127740
38246 173127740 190050029 218453178 221699226 195643025 170452881 165086272 170963575
38239A70963575M315470j683860j1382783k1314340j9449098o490691l28805m853635
38231A09775833J754895L0628932N6144215M6888085P667363k7965671l6554250
38224A88339402k1322979L63835J2221037Q353029j730351k143680Q796760J3877613
38216B06754666m49074k3327397k9465740q316455K1494399K9401664O499253
38209B02591316k1194885k2089076k0870J1193118k111267j3377495l66741J6546911
38201A71171011P144966j8373079k5589452r230072N166207N207565J663293q59475
38193A36300964o987433o457731J5437743M2166801L9057649O496677j7895500
38186B08119170j6066967q917394j0650375o516938Q944504J3242799l640134
$$ plain form
38239 170963575 175279045 173595185 162212402 140898062 121448964 114958273 114629468 109775833
38231 109775833 111530728 142159660 198303875 245191960 252859323 224893652 188339402
38224 188339402 167016423 167380258 179601295 187954324 186223973 184080293 192877053 206754666
38216 206754666 206305592 182978195 153512455 145196000 166690399 196092063 202591316
38209 202591316 181396431 159307355 159286485 170479603 168368336 154990841 154624100 171171011
38201 171171011 178315977 159942898 134353446 125123374 130289581 135497146 137160439 136300964
38193 136300964 129313531 122855800 138293543 180460344 219517993 226014670 208119170
38186 208119170 192052203 183134809 172484434 165967496 174912000 188154799 184514665
38179A84514665j7678527j2107025m765461j0572615j2385000L394183J6288454
38172A46688674P574464m965964r05934M808573n737086j2182246R908196L6996605
38164A82185282K7831206q293762k2257238P27907K3642995J7147334m929747
38157B16053977j8767241k3896326k8818841k9618487j9387145l216409Q738583
38150A01088111J4154122J7340130K0331853J8173950L277630k0272912k9310653
38143A24782231n227856L2353071L9836630Q114053k0910770j4430500M489329
38136A69006188j502929k3144731k3728604r03231J2842173L205068j1658429
38129A24115505j6801863j5095478p549259Q432912K2316544K2069091J8506020
$$ plain form
38179 184514665 166836138 154729113 149963652 139391037 127006037 130400220 146688674
38172 146688674 154263138 149297174 148391240 153199813 147462727 135280481 145188677 182185282
38164 182185282 210016488 201722726 179465488 180193395 203836390 220983724 216053977
38157 216053977 197286736 173390410 144571569 114953082 95565937 92349528 101088111
38150 101088111 115242233 132582363 152914216 171088166 174365796 154092884 124782231
38143 124782231 119554375 151907446 191744076 199858129 178947359 164516859 169006188
38136 169006188 167503259 144358528 120629924 119726693 132568866 135773934 124115505
38129 124115505 107313642 92218164 84668905 93101817 115418361 137487452 155993472
38122A55993472K6472028K8756902k250130m9457072o1381263k3996366J8821875
38115I2959446K7668472J2024085j245638o052924m835676Q375878K9933267L7756835
38107A96583745K1273699j781281j4571401k3158128l3246830l1355605r854139
38100A03890060J2684595J8360505J6455456K0841438K1157044K233451k3658618
38093A71963931l1222626j8964323o814198l320110J894683J5322880K8604487
38086A57464724L1355100K1851893M829223j2165549k1474526k0819624j4092767
38079A46948474m635257O092623J2419006P532803m624016j1496077q777402m195488
38071A39264666l322851m039696m755887l910298N759680K4113640K9836300N300170
$$ plain form
38122 155993472 182465500 211222402 208972272 159515200 98133937 74137571 92959446
38115 92959446 120627918 132652003 131406365 125353441 120517765 128893643 158826910 196583745
38107 196583745 217857444 216076163 201504762 178346634 145099804 113744199 103890060
38100 103890060 116574655 134935160 151390616 172232054 193389098 195622549 171963931
38093 171963931 140741305 121776982 114962784 111642674 113537357 128860237 157464724
38086 157464724 188819824 210671717 215500940 203335391 181860865 161041241 146948474
38079 146948474 142313217 148405840 160824846 168357649 163733633 152237556 143460154 139264666
38071 139264666 135941815 131902119 127146232 123235934 128995614 153109254 182945554 188245724
38063A88245724k8023724l1331657o947972K890303j6659345k9635612j0338492
38056F8199225J5867578J9988000J6292736K5413885K7467604j970442l6480216
38049A34778370l0844535P182181K7936973J5419287K318318Q989104J5090164
38042A80869862K415295j4415770j6455031r308797p179113j0335301j1680552
38035A13910593q464113J198358J7684708L0715248K7171503J1416978R83615
38028A94616890j79938n851659k1929664l5244520l3055534j8093158q0827J3891267
38020I4072857J8289141J1612679J003044o449711j3258626k0703740j7944292
38013F6621352K21856J4998795O287355j4467539k0034314q416981J260232O862290
$$ plain form
38063 188245724 160222000 128890343 121942371 124832674 108173329 78537717 68199225
38056 68199225 84066803 104054803 120347539 145761424 173229028 171258586 134778370
38049 134778370 103933835 111116016 139052989 154472276 156790594 165779698 180869862
38042 180869862 183285157 168869387 152414356 143105559 135926446 125591145 113910593
38035 113910593 105446480 106644838 124329546 155044794 182216297 193633275 194616890
38028 194616890 194436952 188585293 166655629 131411109 98355575 80262417 80181590 94072857
38020 94072857 112361998 123974677 124977721 118528010 105269384 84565644 66621352
38013 66621352 66843208 81842003 88129358 73661819 53627505 45210524 46470756 53333046
38005E3333046K1855781L8176675L0075104J82428j7165707q262383K441351n31954
37997A20104341Q40640J6753109K3334567M213958j6173603j1387523M084274
37990A41769763K709881j0917155j6250329j5236985j9247440j7988067K18337
37983F5058005J4149464k257864k9200974k3559467J2048500K9515523R499817
37976G5253004j0488188J947934K4564080J9163637r140306k2523894n613697
37969G3162570J8248990K2306257O972452p612605p278572K908824P526299J87690
37961A16421905q868401p128786L446893J1441209J2631982J0184277J896032
37954A40025111j7239078l8840764m3773364k6783820n174956M508732O873612
$$ plain form
38005 53333046 75188827 113365502 143440606 143623034 126457327 118194944 120636295 120104341
37997 120104341 120944981 137698090 161032657 165246615 149073012 137685489 141769763
37990 141769763 144479644 133562489 117312160 102075175 82827735 64839668 65058005
37983 65058005 79207469 76949605 47748631 24189164 36237664 65753187 75253004
37976 75253004 64764816 66712750 91276830 110440467 101300161 78776267 73162570
37969 73162570 91411560 113717817 120690269 113077664 105799092 108707916 116234215 116421905
37961 116421905 107553504 100424718 103871611 115312820 127944802 138129079 140025111
37954 140025111 122786033 83945269 40171905 13388085 8213129 12721861 19595473
37947A9595473J5605760L0212787L6013735K3436755j418466k3909904l2419419
37940F7116721k4117244n199190J2626506J8611580J0154647l380970o584457
37933F9227593M888472J3205826l460043l6423417m6309828j2583561L0662199
37926A9207241L3071833m015659k8209736q850267K2712179K2441382l679937
37919E2677036j4258794N272026K7292371K7192134J4264466Q011096O153731
37912A26604066o436145k8280117l9131255k6190441R03311K4083415L5059762
37905H6612596L3499420J7389285j0707831l1122717k0017206J6966211M0580339
37898A33200097K3745282j0437936j8237142M604541K0691238R172745p756604
$$ plain form
37947 19595473 35201233 65414020 101427755 124864510 123446044 99536140 67116721
37940 67116721 42999477 37800287 50426793 69038373 79193020 75812050 69227593
37933 69227593 74116065 87321891 83861848 47438431 1128603 -11454958 19207241
37926 19207241 52279074 48263415 20053679 11203412 33915591 56356973 52677036
37919 52677036 38418242 43690268 70982639 98174773 112439239 120450335 126604066
37912 126604066 120167921 91887804 52756549 26566108 27469419 51552834 86612596
37905 86612596 120112016 137501301 126793470 95670753 75653547 92619758 133200097
37898 133200097 156945379 146507443 128270301 132874842 153566080 162738825 154982221
37891A54982221q966994j0392082l0130508m5759825k5612589J2605011J9177307
37884F5902541j2533382l2423855p106866L1884847L5813935M901198k1219953
37877F5218465j9672987k391748J1181425J3916896Q274183L248039R819717K4571319
37869A14165309K5718611R42971l0745624m2095795l1105613j2286995J0359955
37862C4952819L4675753L9135965P675165l0004598k5030666J9355785M5371358
37855A26131581K2002025j3474274j7066358q66806q39790j4050342j0771161
37848I1064875Q907653J4578533k919900j7482759r217888R420768J5788646M076241
37840A14216169j5128949k6459069j9346093M19331J1167533J258110j1885377
$$ plain form
37891 154982221 146015227 135623145 105492637 59732812 34120223 46725234 65902541
37884 65902541 53369159 20945304 13838438 45723285 81537220 86438418 65218465
37877 65218465 45545478 43153730 54335155 68252051 76526234 79774273 89593990 114165309
37869 114165309 139883920 140826891 110081267 67985472 36879859 24592864 34952819
37862 34952819 69628572 108764537 116439702 86435104 61404438 80760223 126131581
37855 126131581 148133606 134659332 117592974 116726168 115886378 101836036 91064875
37848 91064875 99972528 114551061 111631161 94148402 84930514 94351282 110139928 114216169
37840 114216169 99087220 72628151 53282058 53701389 64868922 66127032 54241655
37833E4241655o078439J0032372Q716579j3153221k7193884j2642726J8816050
37826C2738386M1132529L9551818J6560711j1470784k3317091j3712866k348683
37819G9134020o640137j3504654J24067K6706522L5656272J7940085n254477j6829120
37811A17332578j8198344j1626377N34174J058682k2049229m1283244j6954589
37804H813651L6649606N7946221K2763496k3348729l4315898j8492934k708931
37797D7306482J0134565J8007948J970884l1387376l4580428J0204365M7268364
37790F8924804K4438688k4593093l2986475k862762J1627358k60537m68425J7655534
37782F1475092J7929139n445854j2400430J0194654K1732379l870735l5272115
$$ plain form
37833 54241655 48163216 58195588 66912167 53758946 26565062 13922336 32738386
37826 32738386 73870915 113422733 129983444 118512660 95195569 81482703 79134020
37819 79134020 72493883 58989229 59113296 85819818 121476090 139416175 134161698 117332578
37811 117332578 99134234 87507857 88042031 89100713 67051484 25768240 8813651
37804 8813651 45463257 103409478 126172974 102824245 68508347 50015413 47306482
37797 47306482 57441047 75448995 77419879 46032503 11452075 21656440 68924804
37790 68924804 93363492 68770399 35783924 32921162 44548520 44287983 43819558 61475092
37782 61475092 79404231 73958377 61557947 71752601 93484980 89614245 54342130
37775E4342130l4292024o774177J9988745L3313295K9329196O918783j5669117
37768H7156831j3393652L150048k699397k8935637k7124272J9425418N8948573
37761I6527912M4367447o78977k5779709k4524953k0045632j4033414L222092
37754E9054766J6665638O607977j1718008j0373434L834644L644778r875800j2683227
37746D5157334k581547M899r142712j3446641o329567L792438J4147832K5543231
37738E7145267K8566497J9579304J6737737K8538619K5050577j7767991o2460371
37731I5389639n2506394k226313J7117946j4374703l6143907o610725L2244626
37724C2890169K7874066M55963K71898J9986189J1911716k4045217l3083296P679182
$$ plain form
37775 54342130 20050106 13275929 33264674 66577969 95907165 102825948 87156831
37768 87156831 73763179 76913227 74213830 45278193 18153921 37579339 96527912
37761 96527912 140895359 140216382 114436673 89911720 69866088 55832674 59054766
37754 59054766 75720404 82328381 70610373 60236939 64071583 67716361 57840561 45157334
37746 45157334 42575787 42580686 33437974 19991333 13661766 17454204 31602036 57145267
37738 57145267 85711764 105291068 122028805 150567424 175618001 157850010 95389639
37731 95389639 42883245 40656932 57774878 43400175 7256268 645543 32890169
37724 32890169 60764235 61220198 61492096 81478285 93390001 69344784 36261488 43940670
37716D3940670M7706361L1723528k4223152n5222714l0192470J6416208L4690029
37709F4838460J7581213l069602n264632M08461j374662l056121R118988K6548667
37701A05730772K9897254K0490146J3693175O274625j7456769m5748016m3017920
37694F9863267n480069K3432475J4243988o031884j217491J5664724J0060444
37687A20535454j2123367j7020719m608657p461136k8066786k7980482P542641
37680C0816948L8982746K9444497l406777j9291200j1515331k139861j573855
37673F1317167k828687l130611m846783l916761J109848p76417j3381258j7717977
37665A5828521P2455K0122555J6819496J075479J76949Q021373j779131j9989505
$$ plain form
37716 43940670 91647031 123370559 99147407 43924693 13732223 30148431 64838460
37709 64838460 82419673 79350071 74085439 74493900 73119238 70063117 79182105 105730772
37701 105730772 135628026 156118172 169811347 176085972 158629203 112881187 69863267
37694 69863267 64383198 87815673 102059661 96027777 94810286 110475010 120535454
37687 120535454 108412087 91391368 86782711 79321575 51254789 23274307 30816948
37680 30816948 69799694 99244191 95837414 76546214 65030883 62891022 61317167
37673 61317167 58488480 55357869 50511086 46594325 47704173 46927756 33546498 15828521
37665 15828521 15900976 36023531 52843027 53918506 54095455 62116828 60337697 40348192
37657D0348192j0301436K1882551K5239479j4588288m3504462k2207303J0967673
37650G836406N318975j9287449j2336342J8467530K5749830J0464624J7832466
37643E4046040M7745039M3808386j1642518n8435533m4518812L171730K8423172
37636F2597504K0763690L536883j3465606k8325774k5129016J282779K3032820
37629D4293280J8099912O259033J0095409J0234095j5381367l6396675j1481203
37622B5722484L4229879L8020340j82357j5061814J7958891M2666179J4467106
37615A57820708k8560087k9125253J698131J1939673n893009j2115869P971247
37608A03735541K0264793k496127l8960669m9547459k6610995K500463J2188958
$$ plain form
37657 40348192 30046756 51929307 77168786 62580498 19076036 -3131267 7836406
37650 7836406 13155381 -6132068 -18468410 -880 25748950 36213574 54046040
37643 54046040 101791079 145599465 133956947 75521414 31002602 34174332 62597504
37636 62597504 83361194 86898077 73432471 45106697 19977681 21260460 44293280
37629 44293280 62393192 68652225 78747634 88981729 73600362 37203687 25722484
37622 25722484 59952363 97972703 97790346 82728532 100687423 143353602 157820708
37615 157820708 129260621 100135368 101833499 113773172 107880163 95764294 103735541
37608 103735541 124000334 121504207 82543538 32996079 6385084 8885547 21074505
37601B1074505M332425j971481K417978P213680J722542o074360j299469J1801239
37593C9217059J3504478K755q787244o43801R716090O696280R00728R726182K3859585
37584I4192112J8561362n807371k0240516q559861R570570Q216222q558038j5966639
37576G1407841n469856N603868J919766q311887q111912K069131N944011l705171
37568F1345791j5235228j6261058r781890n354491l757423j72424L995998L661286
37560A8440561J021019L115319R269469J0583101L052106o101343p173460R62305
37552C3169077R360247P621516l751179j0535768r93476J5903966J9685507O813765
37544G7273655n451906p421377r541893j7675367j8158757l413603Q892078L071787
$$ plain form
37601 21074505 25406930 23435449 25853427 33067107 34789649 28715289 27415820 39217059
37593 39217059 52721537 52724292 43937048 43293247 53009337 59705617 60606345 70332527 94192112
37584 94192112 112753474 106946103 86705587 78145726 87716296 95932518 87374480 71407841
37576 71407841 65937985 71541853 73461619 65149732 57037820 59106951 65050962 61345791
37568 61345791 46110563 29849505 20067615 14713124 10955701 10783277 14779275 18440561
37560 18440561 19461580 22576899 31846368 42429469 45481575 39380232 32206772 33169077
37552 33169077 42529324 50150840 46399661 35863893 34870417 50774383 70459890 77273655
37544 77273655 71821749 64400372 54858479 37183112 19024355 15610752 24502830 27574617
37536B7574617p760771n884310n01997o848960j2539450J280374K0772536J9559092
37528C5651131N833558P621673J9967726J2935430j1657507k0731271q446947
37521D1173793k804977p848847N256119L5277869L6496300p554205m8757221m4516825
37513F722006j5417960J315580Q460459J8276674J1251591k4155760m7992506
37506d1539916k0887617K7766157L9774165J5377215L386429J8266928K6038491
37499F8181852R608548o936383n208557K409821L388331K930270L525717j304750
37491G6594849q019274o300885j544145n651958r439098L105212J7427026L357726
37483F9529453l1939531m5508249k0173536J1908184J8500056P899058N940051
$$ plain form
37536 27574617 19813846 13929536 13427539 6578579 -5960871 -4680497 16092039 35651131
37528 35651131 41484689 49106362 69074088 82009518 70352011 49620740 41173793
37521 41173793 38368816 30519969 35776088 71053957 107550257 99996052 51238831 6722006
37513 6722006 -8695954 -7380374 1080085 19356759 30608350 6452590 -41539916
37506 -41539916 -62427533 -34661376 5112789 20490004 23876433 42143361 68181852
37499 68181852 77790400 70854017 65645460 68055281 71443612 74373882 77899599 76594849
37491 76594849 68575575 62274690 60730545 55078587 45639489 48744701 66171727 69529453
37483 69529453 37589922 -7918327 -28091863 -16183679 2316377 10215435 16155486
37476A6155486J8016372K9153446K5610651P416918r871058o904559J4418360
37469I3995616K7169024J6113428J255141K140780J591339k0635337m0832405
37462H0797586k4215635J1822056K0708794K890153J49002J7081660J3573279
37455A22806895j6131894k4462012P205530K9813779L317067m0372468m8989511
37448C3187386k2241314M812322J5717077J4588301L157618j2319426j4772690
37441B2129274q22573J1697573J5135645J9911152K0782416j891184l2591101
37434E4351202k4366082K3631910M7592728J1882487l4623004l6889383j3754164
37427B7825694q294979j0056474J0704899L3760674K2437452n212490o803217
$$ plain form
37476 16155486 34171858 63325304 88935955 96352873 86481815 79577256 93995616
37469 93995616 121164640 137278068 138533209 140673989 142265328 121629991 80797586
37462 80797586 56581951 68404007 89112801 92002954 92151956 109233616 122806895
37455 122806895 106675001 82212989 89418519 119232298 122549365 82176897 33187386
37448 33187386 10946072 15758394 31475471 46063772 49221390 36901964 22129274
37441 22129274 21306701 33004274 48139919 68051071 88833487 86942303 54351202
37434 54351202 29985120 53617030 101209758 113092245 78469241 41579858 27825694
37427 27825694 19530715 9474241 20179140 53939814 76377266 71164776 64361559
37420F4361559Q097908j69950k4079682k2620994K532557J2869988M681713P688268
37412E3361367J9878697J1791159q238901k058798K4942383K7395720L25781j4072961
37404A13324447o951033j6532125m6658333m6801430P9596L9142880K7155737
37397F2759739o718492j9328683j5832231j5218143o779952J6352404K6556741
37390D1791383P781819q379023N969254K6008558J7764561n800442j4061336r807367
37382F1267407r140378l558011J4864109K2716615M296776j0669393M016546J7040124
37374A00833795j0139520m7944361l8323111Q329047K5520976m188578k5816860
37367H271388m605562K1786532R632768k2840294k9466595o275413R038411n305508
$$ plain form
37420 64361559 72459467 72289517 48209835 25588841 28121398 40991386 45673099 53361367
37412 53361367 73240064 85031223 76792322 74733524 99675907 127071627 127397408 113324447
37404 113324447 106373414 89841289 43182956 -3618474 -3538878 35604002 62759739
37397 62759739 56041247 36712564 20880333 5662190 -1117762 15234642 41791383
37390 41791383 49573202 41194179 47163433 73171991 90936552 85136110 71074774 61267407
37382 61267407 52127029 48569018 63433127 86149742 90446518 79777125 83793671 100833795
37374 100833795 90694275 42749914 4426803 12755850 38276826 34088248 8271388
37367 8271388 3665826 25452358 35085126 12244832 -17221763 -23497176 -14458765 -19764273
37359a9764273k7183338k2173426J1189639L7152958K6785670j971676p017626
37352b982072J5868381K4822444j722312k7843452j7979822M109556k189280k1710837
37344b9627394q915199L0052466M1871792J1171510j7884995j3664790M057024
37337A7060414J1556824J5095389J7583105K245011k3585267j7002641L2357786
37330E5310621O5766827L1835966l3309266n3045051j7011718J3007923j069930
37323F1485372k4057866p741938L7362823N6232038J9809111l9912326o5530663
37316C7646551l6093747J2186979K8781326N846411j9538379j7319266J946198
37309A3456073J2736113J2233259J4472463K0710240J7046475k171817k4379586
$$ plain form
37359 -19764273 -46947611 -69121037 -57931398 -20778440 6007230 4035554 -2982072
37352 -2982072 12886309 37708753 35986441 8142989 -9836833 -5727277 -7916557 -29627394
37344 -29627394 -38542593 -8490127 33381665 44553175 26668180 13003390 17060414
37337 17060414 28617238 43712627 61295732 63540743 39955476 22952835 55310621
37330 55310621 121077448 152913414 119604148 66559097 49547379 62555302 61485372
37323 61485372 37427506 29685568 67048391 123280429 143089540 103177214 37646551
37316 37646551 1552804 13739783 42521109 48367520 28829141 11509875 13456073
37309 13456073 26192186 38425445 52897908 73608148 90654623 88482806 64103220
37302F4103220l2079463j8094861Q386575K5230216J5052606j3157815k9360039
37295B0080439j7038950Q326249K3470634K5975349K6121574K3880503J1848726
37288A22664524o687589j9109955j8474273n556450J6239087L5802916L4659561
37281A59537821Q653046j9220190k4852132j4036466q991726j2232724p589731
37274H1267898N922871P513758j2552666l4886384l5819773j6312381L178192
37267a688485P726579J182807m68689J3128512L2195037L4374405J2940504j1396123
37259H7994547j8091783j4792520j9392068k4957028j0139307J8865591K9044371
37252D8531803R935429q454412j388620J4242454J0012197r321172j6570612l986386
$$ plain form
37302 64103220 32023757 13928896 22315471 47545687 62598293 49440478 20080439
37295 20080439 3041489 11367738 34838372 60813721 86935295 110815798 122664524
37288 122664524 115976935 96866980 78392707 72836257 89075344 124878260 159537821
37281 159537821 168190867 148970677 124118545 110082079 101090353 88857629 81267898
37274 81267898 87190769 94704527 82151861 47265477 11445704 -4866677 -1688485
37267 -1688485 6038094 7220901 6752212 19880724 52075761 86450166 99390670 87994547
37259 87994547 69902764 55110244 35718176 10761148 621841 19487432 48531803
37252 48531803 58467232 50012820 48624200 62866654 72878851 63557679 46987067 43000681
37244D3000681J0916981J3958352N826840j0124838k8884435l4212697j1681051
37237a1200167K4167390L6925187J2935556j7345298j6583727J1186181K6333327
37230F6418449N389328k9315123l8497482j3275365J9246070L3890143L3874356
37223G7730376L2992452K7950745O812787k2359112l4260327k0883890l310139
37216F4672892j172864q284674r680589n733506l626168O77819J2295925J9678153
37208F8826988R150935q484688r132697P935202J8099481R448938q40251K510601
37200I7514509P442380l518259k1818289k4308109q873292K402971l429441j1791736
37192C3620734l495043J5719177K0816130k9793k8926248l7856872j9390950P319013
$$ plain form
37244 43000681 53917662 67876014 73702854 63578016 34693581 480884 -11200167
37237 -11200167 12967223 49892410 62827966 45482668 28898941 40085122 66418449
37230 66418449 71807777 42492654 3995172 -9280193 9965877 43856020 77730376
37223 77730376 110722828 138673573 145486360 123127248 88866921 67983031 64672892
37216 64672892 63500028 55215354 45534765 39801259 36175091 36852910 49148835 68826988
37208 68826988 77977923 69493235 60360538 68295740 86395221 95844159 95003908 97514509
37200 97514509 104956889 101438630 79620341 55312232 46438940 48841911 45412470 33620734
37192 33620734 30125691 45844868 66660998 66631205 37704957 -151915 -19542865 -12223852
37184a2223852J9138727J2104051J407181K573826J4637728K0667480O328794
37177F4633935j9682465k9048145o403759K5635545K8758428k764113l3293711
37170B7835715l1200286m570094J9114082K9105876K9176655J7159024p591975
37163G9028997k6926523k1682433k078138N557839j340625k669182N710799O448334
37155D2049068k856466j343333J6818623K7375605J3640495r303328k3110253
37148F3270411k9640076k8921819o564703L1798265M5412591J1722835l0713072
37141E6364432l1108672J323393J5996992j463434j5645560j835561K3154926
37134D6786516L4658907K7301328L192645l1848857n3829748l7077343N588001
$$ plain form
37184 -12223852 6914875 19018926 20426107 22999933 37637661 58305141 64633935
37177 64633935 44951470 15903325 9499566 35135111 63893539 61129426 27835715
37170 27835715 -3364571 -7934665 11179417 40285293 69461948 86620972 79028997
37163 79028997 52102474 30420041 28341903 33899742 32559117 29889935 35600734 42049068
37155 42049068 39192602 37849269 54667892 82043497 95683992 86380664 63270411
37148 63270411 33630335 4708516 -1856187 29942078 75354669 87077504 56364432
37141 56364432 25255760 26579153 42576145 41112711 25467151 23631590 46786516
37134 46786516 81445423 108746751 111939396 80090539 26260791 -10816552 -5228551
37127e228551L1372903K4456762J0618636O868155k647445k3445421k6444184
37120A5550855L117863K8427123J1009059k7497191l4209961J28035L4752679
37113C1278462L8624185J8973901o433910k8954236l7324461j8974374J6642517
37106A3832084L9848148L5260566J5853024k473915j8427495k9265590k0954262
37099C3672560Q153895L0078111J5719637k4604015m8603689l2491089J023991
37092a7050599J3322510j852978j5124254m849363J4073016J5424107J620603
37085E563042k150874J1371216K1489149J4492364M254326O176862J2150102Q230753
37077H1576940j056375o035186j3359952l0036928l8350474j5550763K5735553
$$ plain form
37127 -5228551 26144352 50601114 61219750 68087905 65440460 41995039 15550855
37120 15550855 18668718 47095841 58104900 30607709 -3602252 -3474217 31278462
37113 31278462 69902647 88876548 82442638 53488402 16163941 -2810433 13832084
37106 13832084 53680232 88940798 104793822 102319907 83892412 54626822 33672560
37099 33672560 41826455 71904566 87624203 63020188 14416499 -18074590 -17050599
37092 -17050599 -3728089 -5581067 -20705321 -25554684 -11481668 3942439 5563042
37085 5563042 3412168 14783384 36272533 50764897 55019223 61196085 73346187 81576940
37077 81576940 80520565 74485379 61125427 31088499 -7261975 -22812738 2922815
37070B922815M5034822K4844930r354799k4844194j7133235l128589L572049J727410
37062B3641209j401084L327411J5940927K2331340J0556842r702480j7836358
37055D6857807j1008673n700094j0316538j4674118j0121185j697526N570811
37048a089516J4612807K2661997J7242469k668588j6150999n284768J8748854
37041D8072256K7964450J1196887j4721293k4785812j0278138J4390375K5691650
37034G7530375J3990884p302398j8880436j7933751j5627895j6809050j4709378
37027B58351m705762Q709095J8139030J6263623k235529k7526053l1199414J896617
37019b0400042M2496089M4401898M388583l3399953l6899992j8627638n10122
$$ plain form
37070 2922815 47957637 72802567 63447768 38603574 21470339 18341750 21913799 23641209
37062 23641209 22240125 25567536 41508463 63839803 74396645 64694165 46857807
37055 46857807 35849134 30149040 19832502 5158384 -4962801 -6660327 -1089516
37048 -1089516 13523291 36185288 53427757 50759169 34608170 29323402 48072256
37041 48072256 76036706 87233593 72512300 47726488 37448350 51838725 77530375
37034 77530375 91521259 84218861 65338425 47404674 31776779 14967729 258351
37027 258351 -4447411 4261684 22400714 38664337 36428808 8902755 -22296659 -20400042
37019 -20400042 22096047 66497945 70886528 37486575 586583 -18041055 -18551177
37012a8551177J7372487L4083906K9223339l081220k8961932j8333456O751147
37005A8503094M918635j8038515j8237630J4562186L7956368J9688637j6516407
36998D2836368k7121673o398949J4408764J2740418j753086q213295m179013n655949
36990A6663585j9806324k8216785r465071K4889056L6865088J2101408j7347316
36983A5683641j6197054O620277J6490927M754805o554390m382543J019744J706911
36975A9142318M101327R912012Q753911j867002q218315n77403J2729997J7891827
36967F1868672J0614728l792974j4144573r224767O831380J1255594o972607k2388674
36959C4046779n532307K6479367K7598965p476886l1809033j6484066Q132303
$$ plain form
37012 -18551177 -1178690 32905216 62128555 59047335 30085403 11751947 18503094
37005 18503094 23421729 5383214 -12854416 1707770 39664138 59352775 42836368
36998 42836368 15714695 9315746 23724510 36464928 34711842 26498547 22319534 16663585
36990 16663585 -3142739 -31359524 -40824595 -15935539 20929549 33030957 15683641
36983 15683641 -513413 6106864 22597791 27352596 20798206 16415663 17435407 19142318
36975 19142318 23243645 33155657 41909568 40042566 31824251 31246848 43976845 61868672
36967 61868672 72483400 68690426 54545853 45321086 52152466 63408060 56435453 34046779
36959 34046779 28514472 54993839 82592804 75115918 43306885 26822819 34955122
36952C4955122M228489j6283535j8135435P78896J4675021J3891643R282789M230724
36944D7623714n699312j2929328p294722M66594p603142k4460014k6542985j0156222
36936d6595417P333094J7974634K6575554K7991145J2810714n921537n795427
36929C4372760M137070o688390l4244589l6462412o44200K9556870K0482307Q31808
36921A1341224J0697763L2680742K1959936j6342577l3101617j2013028J0358905
36914B5581348N723102j1046729j9637787k3879317k4974261m684247L7465426
36907a5452465O2135477L8409348q000307k8107035j5134623k595775q180565
36900B3074055j6588747j5768461j3738293j2824454N07988K6505008L8503991
$$ plain form
36952 34955122 39183611 22900076 4764641 5543537 20218558 34110201 43392990 47623714
36944 47623714 41924402 28995074 21700352 22166946 14563804 -9896210 -36439195 -46595417
36936 -46595417 -39262323 -21287689 5287865 33279010 46089724 40168187 34372760
36929 34372760 38509830 31821440 -2423149 -38885561 -39529761 -9972891 10509416 11341224
36921 11341224 22038987 54719729 76679665 60337088 27235471 15222443 25581348
36914 25581348 31304450 20257721 619934 -23259383 -48233644 -52917891 -15452465
36907 -15452465 46683012 85092360 77092053 48985018 33850395 31254620 23074055
36900 23074055 6485308 -9283153 -23021446 -35845900 -35337912 -8832904 29671087
36893B9671087J6612300k1507182m0325220k6550031L244177K5834717K9992738
36886A6972586J8655544L970106j937587K645928R291157J0059097K604990j2003995
36878E0257826k5730933k1563580P822314L9586958L9700579O949734k3410773
36871G3612125k6687171j5268532p852919q28390R918608O609226k0538463m1384753
36863b2420269k0441814K6517165M6951124K0994468j7132142l0595882k1706664
36856a7834014j3010035j2755034j3284884p573266M265363J6583515K2768927
36849b0839428K4413213L0005704L5200032J9913322j5310909l0398883J808830
36842D4791881M0197304K1591702m1632028o8171355k4424863K5858228J8776199
$$ plain form
36893 29671087 46283387 24776205 -15549015 -42099046 -38854869 -13020152 16972586
36886 16972586 35628130 39598236 37660649 40306577 49597734 59656831 62261821 50257826
36878 50257826 24526893 2963313 10785627 50372585 90073164 97022898 73612125
36871 73612125 46924954 31656422 23803503 22975113 32893721 39502947 18964484 -22420269
36863 -22420269 -42862083 -16344918 30606206 51600674 34468532 3872650 -17834014
36856 -17834014 -30844049 -43599083 -56883967 -64457233 -60191870 -43608355 -20839428
36849 -20839428 3573785 33579489 68779521 88692843 73381934 42983051 44791881
36842 44791881 84989185 106580887 64948859 -3222496 -27647359 -1789131 16987068
36835A6987068j8926451k3998551K399264R220193j3467349k2624840K865356
36828d7545310L2435479L6929111K5099400J4594116N289460l661379l008810
36821F0132067M842182J456700j5733226k4030676j2844204k699128q076953r171198
36813f124436J2315824L2037311J3120620l3058923n3466640k4125011J7607924
36806d1693331K4901041J818970r403531J0545630L4101993K6602700q416763
36799C8456709l5681345l1518208o842129J2423736J4609930O107202m140001
36792f584106j2914834j8072196j5456915l618704J1979397K1517803J7891467
36785e258088L302493j0740263j3464304n744194K995384Q198759J3017292J6922187
$$ plain form
36835 16987068 -1939383 -25937934 -23538670 -14318477 -27785826 -50410666 -47545310
36828 -47545310 -15109831 21819280 46918680 61512796 66802256 63140877 60132067
36821 60132067 64974249 66430949 50697723 26667047 13822843 11123715 3046762 -6124436
36813 -6124436 6191388 38228699 51349319 18290396 -35176244 -59301255 -41693331
36806 -41693331 -16792290 -14973320 -24376851 -13831221 20270772 46873472 38456709
36799 38456709 2775364 -28742844 -35584973 -23161237 -8551307 -2444105 -6584106
36792 -6584106 -19498940 -37571136 -53028051 -56646755 -44667358 -23149555 -5258088
36785 -5258088 -1955595 -12695858 -26160162 -31904356 -28908972 -20710213 -7692921 9229266
36777I229266J2255105k411967j5172292j4898729m986593M330269R400055J0559803
36769H304917M588465r157775k0743680j8698616l956442J2824183K3106715K3409577
36761A9677344J4270241M072466M627102J3645034J2376843p648065k7565895
36754C3455070k6433618j2371908q878435j8051666j9820612n164050J1363890
36747d5901329J4136969M505437n694775n410470J0132537L2490685M1269339
36740D5528393K5132417k760456k2237719k9911514l0729736j9873811L782463
36733c1069963J9019562P034634j3504121r134343J6214662K8213887J8486795
36726C5261113J2018447J5282236M154485k3244917k9729066M09853K7230457
$$ plain form
36777 9229266 21484371 19072404 3900112 -10998617 -15985210 -11654941 -2254886 8304917
36769 8304917 12893382 3735607 -17008073 -35706689 -39663131 -26838948 -3732233 19677344
36761 19677344 33947585 38020051 42647153 56292187 68669030 61020965 33455070
36754 33455070 7021452 -5350456 -14228891 -32280557 -52101169 -57265219 -45901329
36747 -45901329 -31764360 -27258923 -32953698 -38364168 -28231631 4259054 45528393
36740 45528393 70660810 67900354 45662635 15751121 -14978615 -34852426 -31069963
36733 -31069963 -12050401 -5015767 -18519888 -27654231 -11439569 16774318 35261113
36726 35261113 47279560 62561796 66716281 43471364 13742298 14152151 41382608
36719D1382608J3930396j6800728k2178917l902202Q061820J0839663K1071701
36712E2404341K8188218N226032l6619038m9868908j4854874L3224178N0985807
36705F8685756L2769210J441953k1473997k6078332j4573783k014805k930560
36698C5825442j1809138r972791N995990J8049753J2133108n070040j9143096
36691B6009228k4224985k1309724j1788429J305761J2525785J7790109J5353045
36684A5660790N423682o010804q392713O78429R586105P616363r35316n526055
36676A8100481l355761M175226J7528123L0559067K9089957J1265689m771090
36669A02591692q090366j2241124k6684534l2316444j3172361P028666l652035
$$ plain form
36719 41382608 55313004 38512276 16333359 12431157 20492977 31332640 52404341
36712 52404341 80592559 85818591 49199553 -669355 -15524229 17699949 68685756
36705 68685756 101454966 102896919 81422922 55344590 40770807 38756002 35825442
36698 35825442 24016304 14043513 20039503 38089256 50222364 45152324 26009228
36691 26009228 1784243 -19525481 -31313910 -30008149 -17482364 307745 15660790
36684 15660790 21084472 15073668 6680955 7359384 16945489 24561852 23626536 18100481
36676 18100481 14744720 18919946 36448069 67007136 96097093 107362782 102591692
36669 102591692 94501326 82260202 55575668 23259224 10086863 17115529 13463494
36662A3463494l0629228l0908367j83282K1994414J5983162O306148J1610339
36655G636680J3021283p426462l1196403l0472274p092745J6436392K6241948
36648a2851581K1887837R348574N84734K857084L175073j4143031l2889317k0583843
36640d2614470J5913543L1069244J0508241n240787R509426K0336981m777807
36633C4704371l1870070j2463361L3072810M3515899J0621704j5968814j1905562
36626D9706977n981858j8467054k7489079j4707094J675286K484633o05571P440641
36618e943119J5891613J0442311J88023n2255N590404O718840N462256M696043
36610D2994116l370742j8457987k2155095p737356K61970j7170888l4815508j4787839
$$ plain form
36662 13463494 -17165734 -48074101 -48257383 -26262969 -10279807 -3973659 7636680
36655 7636680 20657963 13231501 -17964902 -48437176 -55529921 -39093529 -12851581
36648 -12851581 9036256 18384830 18969564 21826648 25001721 10858690 -22030627 -42614470
36640 -42614470 -26700927 4368317 14876558 9635771 19145197 39482178 34704371
36633 34704371 2834301 -9629060 23443750 66959649 77581353 61612539 49706977
36626 49706977 43725119 25258065 -2231014 -16938108 -15262822 -12778189 -13383760 -5943119
36618 -5943119 9948494 20390805 20578828 20526573 26116977 32835817 38298073 42994116
36610 42994116 39623374 21165387 -989708 -8727064 -8465094 -25635982 -60451490 -75239329
36602g5239329L2327471N4457848K8042316j2474279k5024863j0554744L409707
36595e055873N947246N951622O757164L513451N39071O855906J4227321M051716
36587D2787624j7927982j9495762J0090605L3437990J2420276l3568262n0576770
36580b2832281k5243344J984012L496439R41850J4855625K0624654o399316l3616532
36572d6188893j1552414M2886744O0664684K0363502k2344515k0841358N21738
36565B3509488Q11050r336225L34792J4603123l780563m1969155m6518867n534804
36557f7881161L1713015K8869559Q442260L551112P368705J252742k660097J3205702
36549B3861837K8318365J0384585k6662704l5963499p874391J6479773R860045
$$ plain form
36602 -75239329 -42911858 11545990 39588306 27114027 2089164 -8465580 -5055873
36595 -5055873 891373 6842995 13600159 17113610 17652681 24508587 38735908 42787624
36587 42787624 24859642 5363880 15454485 48892475 61312751 27744489 -22832281
36580 -22832281 -48075625 -46091613 -42595174 -41653324 -26797699 -6173045 -12572361 -46188893
36572 -46188893 -57741307 -14854563 45810121 66173623 43829108 22987750 23509488
36565 23509488 24320538 14984313 15319105 29922228 26141665 -15827490 -62346357 -67881161
36557 -67881161 -36168146 -7298587 1143673 4694785 12063490 13316232 10656135 23861837
36549 23861837 52180202 62564787 35902083 -61416 -7935807 8543966 18404011
36542A8404011m130760L182152J9271723J7495095K780245k657921n02844p865870
36534D5975831j8731896j1291227Q821159J0461998j1476039k2377018r13125
36527D69683K5602333K1484265o041641k3078311j9664794j3962072j4599952
36520b9790489j0099572L256812J0845330N254372J006448J2151334L0261567
36513B2885802L6467532K4609634K286185k0897991l4626893k6742089L520730
36506G502910L4431183L9366208J7515628n531802j1208615q779729j5196206
36499E8099577k6996764k6881531j1517472M334911J0551311J1801391J2773097
36492C2164520J0723597Q277347J4663676K4216134J4323570j8166310l8596227
$$ plain form
36542 18404011 14273251 17455403 36727126 54222221 57002466 54344545 53841701 45975831
36534 45975831 27243935 15952708 24773867 35235865 23759826 1382808 469683
36527 469683 26072016 47556281 41514640 18436329 -1228465 -15190537 -29790489
36520 -29790489 -39890061 -36633249 -25787919 -20533547 -19527099 -7375765 22885802
36513 22885802 59353334 83962968 86249153 65351162 30724269 3982180 7502910
36506 7502910 41934093 81300301 98815929 93284127 82075512 73295783 58099577
36499 58099577 31102813 4221282 -7296190 -2961279 7590032 19391423 32164520
36492 32164520 42888117 51165464 65829140 90045274 104368844 86202534 47606307
36485D7606307j8282138J8056519K0874122j4498968m1389918k7472165O272112
36478h834129K1857579J0921330q069012j5975812l987775K1480851L5961778
36471E3354810J9980024r356067j5393475M750941J6904998P436657K458526J3245766
36463I3382180J0333740j8272739l1333859p04301K9518193O449809m2035439
36456D7337584m5955962n14960L3587786K7216173J0457798L412732r576979k5166046
$$ plain form
36485 47606307 29324169 47380688 68254810 53755842 12365924 -15106241 -8834129
36478 -8834129 13023450 23944780 15875768 -100044 -4087819 17393032 53354810
36471 53354810 73334834 63978767 48585292 53336233 70241231 77677888 80136414 93382180
36463 93382180 103715920 85443181 54109322 53405021 82923214 89373023 47337584
36456 47337584 1381622 866662 34454448 61670621 72128419 75541151 65964172 40798126
$$ [...]
##END NTUPLES=NMR SPECTRUM
##END=
