##TITLE=31Pdec_LR-659-RM4
 CH2Cl2, 124 sc
 11.3.2019
##JCAMPDX= 6.0         $$ Bruker NMR JCAMP-DX V2.0
##DATA TYPE= NMR SPECTRUM
##DATA CLASS= NTUPLES
##ORIGIN= UXNMR, Bruker Analytische Messtechnik GmbH
##OWNER= root
$$ XWIN-NMR		Version 3.5
$$ Mon Mar 11 15:49:28 2019 Russian Standard Time (UT+4h)  she@DPX200
##.OBSERVE FREQUENCY= 81.013821
##.OBSERVE NUCLEUS= ^31P
##.ACQUISITION MODE= SIMULTANEOUS
##.ACQUISITION SCHEME= undefined
##.AVERAGES= 124
##.DIGITISER RES= 17
##SPECTROMETER/DATA SYSTEM= spect
##.PULSE SEQUENCE= zgpg30
##.SOLVENT NAME= THF
##.SHIFT REFERENCE= (INTERNAL, THF, 0, 182.463)
##AUDIT TRAIL= $$ (NUMBER, WHEN, WHO, WHERE, WHAT)
$$ ##TITLE= Audit trail, XWIN-NMR		Version 3.5
$$ ##JCAMPDX= 5.01
$$ ##ORIGIN= Bruker BioSpin GmbH
$$ ##OWNER= she
$$ F:/spectra/data/she/nmr/P31/1/pdata/1/auditp.txt
$$ ##AUDIT TRAIL=  $$ (NUMBER, WHEN, WHO, WHERE, WHAT)
(   1,<2019-03-11 15:48:34.71 +0400>,<she>,<DPX200>,
      <continue with go, POWCHK disabled, PULCHK disabled
       configuration hash MD5:
       00 E9 B6 7A A2 85 ED C7 34 08 36 98 17 FE 4E 26
       data hash MD5: 32K
       87 8F B8 E6 7F 16 B0 44 6C F4 F3 E1 5D D9 CF 6C>)
(   2,<2019-03-11 15:48:40.32 +0400>,<she>,<DPX200>,
      <Start of raw data processing
       efp BC_mod = 2 LB = 1 FT_mod = 6 PKNL = 1 PHC0 = -1931.571 PHC1 = 465.999 SI = 64K 
       data hash MD5: 64K
       78 BC 6E 06 04 2F 71 1A BA 2E F8 17 48 CE FF 4F>)
(   3,<2019-03-11 15:49:00.40 +0400>,<she>,<DPX200>,
      <pk PHC0 = -4.992161 PHC1 = 52.6 
       data hash MD5: 64K
       1A 58 C9 2E FC AD D7 89 04 D6 F3 C4 9D D8 A6 13>)
(   4,<2019-03-11 15:49:03.51 +0400>,<she>,<DPX200>,
      <abs ABSG = 5 
       data hash MD5: 64K
       D4 9B 4D 73 69 20 63 27 32 10 91 06 66 22 FC D9>)
$$ ##END=
$$ 
$$ hash MD5
$$ E0 66 AD 55 F9 5E E3 2E 03 66 FD 54 00 09 D4 24
##$RELAX= 
##$RELAX= 
##$RELAX= 
##$RELAX= 
##$RELAX= 
##$RELAX= 
##$RELAX= 
##$RELAX= 
$$ Bruker specific parameters
$$ --------------------------
##$DU= <F:/spectra>
##$EXPNO= 1
##$NAME= <P31>
##$PROCNO= 1
##$TYPE= <nmr>
##$USER= <she>
##$AMP= (0..31)
100 100 100 100 100 100 100 100 100 100 100 100 100 100 100 100 100 100 
100 100 100 100 100 100 100 100 100 100 100 100 100 100 
##$AQSEQ= 0
##$AQ_mod= 1
##$AUNM= <au_zg>
##$AUTOPOS= <>
##$BF1= 81.014009
##$BF2= 200.13
##$BF3= 200.13
##$BF4= 200.13
##$BF5= 200.13
##$BF6= 200.13
##$BF7= 200.13
##$BF8= 200.13
##$BYTORDA= 1
##$CFDGTYP= 0
##$CFRGTYP= 5
##$CHEMSTR= <none>
##$CNST= (0..31)
1 1 145 1 1 1 1 1 1 1 1 1 1 1 1 1 1 1 1 1 1 1 1 1 1 1 1 1 1 1 1 1 
##$CPDPRG= <waltz16>
##$CPDPRG1= <>
##$CPDPRG2= <waltz16>
##$CPDPRG3= <>
##$CPDPRG4= <mlev>
##$CPDPRG5= <mlev>
##$CPDPRG6= <mlev>
##$CPDPRG7= <mlev>
##$CPDPRG8= <mlev>
##$CPDPRGB= <>
##$CPDPRGT= <>
##$D= (0..31)
0 1 0 0 0 0 0 0 0 0 0 0.03 2e-05 3e-06 0 0 0 0 0 0 0 0 0 0 0 0 0 0 0 0 
0 0 
##$DATE= 1552304702
##$DBL= (0..7)
120 120 120 11 120 120 24 19 
##$DBP= (0..7)
150 150 150 150 150 150 150 150 
##$DBP07= 0
##$DBPNAM0= <>
##$DBPNAM1= <>
##$DBPNAM2= <>
$$ [...]
##$SUBNAM3= <"">
##$SUBNAM4= <"">
##$SUBNAM5= <"">
##$SUBNAM6= <"">
##$SUBNAM7= <"">
##$SUBNAM8= <"">
##$SUBNAM9= <"">
##$SW= 369.568048894756
##$SWIBOX= (0..15)
0 1 3 0 0 0 0 0 0 0 0 0 0 0 0 0 
##$SW_h= 29940.119760479
##$TD= 32768
##$TD0= 1
##$TE= 0
##$TE2= 300
##$TE3= 300
##$TEG= 300
##$TL= (0..7)
0 120 53 12 22 120 120 120 
##$TP= (0..7)
150 150 150 150 150 150 150 150 
##$TP07= 0
##$TPNAME0= <>
##$TPNAME1= <>
##$TPNAME2= <>
##$TPNAME3= <>
##$TPNAME4= <>
##$TPNAME5= <>
##$TPNAME6= <>
##$TPNAME7= <>
##$TPOAL= (0..7)
0.5 0.5 0.5 0.5 0.5 0.5 0.5 0.5 
##$TPOFFS= (0..7)
0 0 0 0 0 0 0 0 
##$TUNHIN= 0
##$TUNHOUT= 0
##$TUNXOUT= 0
##$USERA1= <user>
##$USERA2= <user>
##$USERA3= <user>
##$USERA4= <user>
##$USERA5= <user>
##$V9= 5
##$VALIST= <valist>
##$VCLIST= <CCCCCCCCCCCCCCC>
##$VD= 0
##$VDLIST= <DDDDDDDDDDDDDDD>
##$VPLIST= <PPPPPPPPPPPPPPP>
##$VTLIST= <TTTTTTTTTTTTTTT>
##$WBST= 1024
##$WBSW= 4
##$XGAIN= (0..3)
0 0 0 0 
##$XL= 0
##$YL= 0
##$YMAX_a= 52587
##$YMIN_a= -79011
##$ZGOPTNS= <>
##$ZL1= 120
##$ZL2= 120
##$ZL3= 120
##$ZL4= 120
##$ABSF1= 182.463
##$ABSF2= -187.1042
##$ABSG= 5
##$ABSL= 3
##$ALPHA= 0
##$AQORDER= 0
##$ASSFAC= 0
##$ASSFACI= 0
##$ASSFACX= 0
##$ASSWID= 0
##$AUNMP= <proc_1d>
##$AZFE= 0.1
##$AZFW= 0.5
##$BCFW= 0
##$BC_mod= 2
##$BYTORDP= 0
##$COROFFS= 0
##$CY= -3
##$DATMOD= 1
##$DC= 0
##$DFILT= <>
##$DTYPP= 0
##$F1P= 0
##$F2P= 0
##$FCOR= 1
##$FTSIZE= 65536
##$FT_mod= 6
##$GAMMA= 0
##$GB= 0
##$INTBC= 1
##$INTSCL= 5.30512e-09
##$ISEN= 30
##$LB= 1
##$LEV0= 0
##$LPBIN= 0
##$MAXI= 10000
##$MC2= 0
##$MEAN= 0
##$ME_mod= 0
##$MI= 50
##$NCOEF= 0
##$NC_proc= -8
##$NLEV= 6
##$NOISF1= 182.463
##$NOISF2= 159.3651
##$NSP= 0
##$NTH_PI= 0
##$NZP= 0
##$OFFSET= 182.463
##$PC= 4
##$PHC0= -1936.563
##$PHC1= 518.599
##$PH_mod= 1
##$PKNL= yes
##$PPARMOD= 0
##$PSCAL= 0
##$PSIGN= 0
##$REVERSE= no
##$SF= 81.0140089999434
##$SI= 65536
##$SIGF1= 159.3651
##$SIGF2= -187.1042
##$SINO= 113.3802
##$SIOLD= 16384
##$SREGLST= <1H.CDCl3>
##$SSB= 0
##$STSI= 65536
##$STSR= 0
##$SW_p= 29940.119760479
##$SYMM= 0
##$S_DEV= 0
##$TDeff= 32768
##$TDoff= 0
##$TI= <>
##$TILT= no
##$TM1= 0
##$TM2= 0
##$TOPLEV= 0
##$USERP1= <user>
##$USERP2= <user>
##$USERP3= <user>
##$USERP4= <user>
##$USERP5= <user>
##$WDW= 1
##$XDIM= 65536
##$YMAX_p= 262971200
##$YMIN_p= -107712752
$$ End of Bruker specific parameters
$$ ---------------------------------
##NTUPLES= NMR SPECTRUM
##VAR_NAME=  FREQUENCY,     SPECTRUM/REAL,   SPECTRUM/IMAG
##SYMBOL=    X,             R,               I
##VAR_TYPE=  INDEPENDENT,   DEPENDENT,       DEPENDENT
##VAR_FORM=  AFFN,          ASDF,            ASDF
##VAR_DIM=   65536,         65536,           65536
##UNITS=     HZ,            ARBITRARY UNITS, ARBITRARY UNITS
##FACTOR=    0.456856943014862, 1,           1
##FIRST=     14782.0589164792, 0,            0
##LAST=      -15158.0608439998, 0,           0
##MIN=       -15158.0608439998, -107712752,  0
##MAX=       14782.0589164792, 262971200,    0
$$ Real data points
##PAGE= N=1
##DATA TABLE= (X++(R..R)), XYDATA
$$ [...]
49503 -13514039 -4581467 11652891 22942458 17511956 2112861 -7621737 -11690574 -22684572
49495 -22684572 -38053891 -36958917 -12136281 15360640 25566044 26001876 33133534 43206499
49487 43206499 41436343 29328444 21332631 20122854 15566421 5409805 -2140158 -5544194
49479 -5544194 -11598325 -19309359 -18987333 -9586357 -1893769 -2076853 -5780588 -10154934
49471 -10154934 -17628556 -25773045 -27693775 -25236141 -28036861 -36617955 -40115769 -33667149
49463 -33667149 -24068959 -15292102 -3547658 8897641 10446090 -2742670 -19349566
49456 -19349566 -27888272 -26695814 -16249216 2559088 18491393 16705590 2259886
49449 2259886 -1925224 10876259 19346822 7739365 -9993144 -15831917 -17215585 -29824697
49441 -29824697 -47165744 -51152938 -41491704 -30825586 -19599013 -151078 20078204
49434 20078204 24125971 12400815 2001015 177529 -734647 -2767516 1757836 12166298
49426 12166298 17108684 12762104 5891257 -1344013 -10887057 -14611099 -3383902 9726965
49418 9726965 2031665 -19175700 -19540022 9686040 32799329 21352524 -3817354 -7343374
49410 -7343374 7289805 10019894 -5661987 -18139094 -16120899 -9790952 -4715261 5389720
49402 5389720 16132632 10687862 -10770467 -24171700 -15916863 -3299246 -6348777 -17222566
49394 -17222566 -15183889 961646 14369347 16361776 13000661 9163932 2756071 -5544446
49386 -5544446 -11068085 -14870666 -22164006 -29388760 -25285245 -8346932 8432648 15270659
49378 15270659 17044649 20306785 19767783 8421078 -6343470 -9386603 2244701 16989074
49370 16989074 24874888 25124781 18004949 1409005 -20401080 -34777611 -33980154 -24236686
49362 -24236686 -16436885 -13896852 -14698117 -19572061 -29401682 -38553811 -38854540 -29514300
49354 -29514300 -17613084 -9767358 -7635875 -9481042 -11501306 -10317795 -9154506 -17546851
49346 -17546851 -37546230 -53887342 -48338966 -23391306 -643373 6751022 9094701
49339 9094701 22128107 43571869 56558015 51129437 33556093 16790994 9279800
49332 9279800 11997985 19564124 24048730 22982823 23146230 30904176 39777759 35435311
49324 35435311 14593719 -9208472 -22777886 -28374636 -34852989 -40947324 -38770024 -30964501
49316 -30964501 -30540063 -40593188 -46761288 -37272215 -20552027 -12892197 -16240027 -20374876
49308 -20374876 -21507177 -23314611 -20842252 -1125049 33963953 59840872 55099422 27535040
49300 27535040 4744709 3494537 15995528 22609771 11489228 -11363208 -26765046
49293 -26765046 -20694369 -975524 10493198 4977578 -3485553 -1374893 3908323 -1604778
49285 -1604778 -14446539 -19951356 -15899800 -12665234 -12909302 -8873864 122409 5107112
49277 5107112 5162422 10651183 23075522 27664641 14997597 -2960811 -8887733 -2265253
49269 -2265253 5197616 8802866 14220459 25059810 36020379 37614092 23562064 -3292129
49261 -3292129 -29156381 -38417246 -28978188 -14199861 -6450302 -4613216 -1767565 1804290
49253 1804290 -161928 -10130102 -23905595 -34588057 -36255913 -28339945 -19045323 -18221910
49245 -18221910 -23653878 -22193884 -9175340 2238294 -1428030 -15130391 -23774244 -23617083
49237 -23617083 -24036767 -30609431 -37152269 -35252792 -24106524 -9852485 -230086 221654
49229 221654 -6161639 -11943643 -12785873 -11379227 -10769954 -8842235 -4085651 -1422798 -5489477
49220 -5489477 -12092588 -13558548 -9653699 -6239521 -5568267 -4636338 -905763 6573028
49212 6573028 18680088 31987036 36609750 26919346 11855467 5029331 6001347 1975723
49204 1975723 -11668818 -24357418 -27365623 -26486581 -30046885 -33017560 -24394913 -7095658
49196 -7095658 1803521 -6428463 -19549088 -21819902 -16984051 -21168288 -34321822 -35217012
49188 -35217012 -12919529 11359989 9855719 -12966581 -26860071 -17837031 -2166839
49181 -2166839 3256517 1085567 -3527427 -16290904 -35293287 -39951193 -18874791 6473125
49173 6473125 8463804 -7102773 -11292725 5307476 24091957 29256506 23845145 14916729
49165 14916729 4329343 -3126440 -1528602 3246860 -411234 -9390056 -9622588 -1395094
49157 -1395094 -113594 -8480325 -10404304 377810 8279065 3229052 -1579389 5962359
49149 5962359 13964384 6370199 -9034096 -12588431 -3143382 3138170 -804115 -5474298
49141 -5474298 -2479778 4542268 7646300 4027385 -2394913 -3754393 4096799 12881667
49133 12881667 7859215 -12310090 -30494070 -32626117 -24298116 -17506106 -12437791 -4553377
49125 -4553377 779310 -3827712 -12290438 -12900617 -6715211 -3428319 -3679364 -1287124
49117 -1287124 453131 -7944868 -23128483 -30084934 -24427319 -18163830 -19806924 -23014157
49109 -23014157 -20049436 -13884108 -10495635 -9037776 -5752455 -271219 5726142 9022847
49101 9022847 2979510 -14726462 -30686519 -24974759 2528404 26970632 27883601 13509403
49093 13509403 6065912 11554029 16701800 11262627 502689 -4748919 -1053814 6490629
49085 6490629 10096212 5295046 -4584738 -10381438 -7771580 -4515397 -11510956 -27522659
49077 -27522659 -39470717 -38777623 -30837554 -25740524 -25541281 -24572885 -17387666 -1920348
49069 -1920348 20066772 39264283 40527255 18667042 -8585244 -15123909 2865470
49062 2865470 21498048 19685030 3819440 -6628724 -6664223 -4700689 -2396765 5536154
49054 5536154 13832825 9106870 -6893505 -15068161 -6876132 2696589 -231834 -6989668
49046 -6989668 -3039210 7016103 7329922 -4686380 -17369523 -22887058 -22403584 -17598904
49038 -17598904 -9907343 -4441614 -3349901 -324251 7188687 8104761 -5637226 -20719370
49030 -20719370 -19317084 -8481523 -10850759 -27853975 -35614365 -20597613 3315145
49023 3315145 19969716 31516607 43475753 48454263 38598537 20222212 3396659
49016 3396659 -10961337 -22687399 -24408965 -14746277 -6968322 -10263408 -13700434 -4170489
49008 -4170489 10582898 14883001 12203809 18335789 31941540 34208041 19059867 3079941
49000 3079941 -125362 2611027 747949 -1260655 5531102 15522328 14152446 -805959
48992 -805959 -14872813 -14429822 -1407038 10984860 12227555 2352390 -10633607 -18151802
48984 -18151802 -16961191 -10829544 -7708461 -13115238 -23527420 -27723889 -18954621 -5586137
48976 -5586137 -4122668 -20054212 -41476554 -54400651 -57376667 -55849275 -49788789 -36681118
48968 -36681118 -22352032 -16808963 -18887038 -15628474 -194099 17982811 25239051 19162498
48960 19162498 7278452 -3810669 -11807813 -15340335 -14491314 -13930157 -19569438 -30795502
48952 -30795502 -39356545 -36904057 -21867068 43678 18721917 24035479 13081206
48945 13081206 -4725566 -14601488 -11965920 -6837690 -8278136 -9929501 -5237 17322901
48937 17322901 23559477 12035786 -474286 2999395 14958598 14857516 -441890 -12184764
48929 -12184764 -5408504 13551854 27712473 27486337 15105520 -406736 -9579842 -10576703
48921 -10576703 -12094778 -21316210 -30734006 -27944011 -17285064 -16298137 -28082255 -34855122
48913 -34855122 -26393216 -16745653 -20036607 -26428042 -20141400 -8275809 -9323114 -20160494
48905 -20160494 -18718783 607451 16814284 12989682 -1528253 -8342421 -4960463 -2428875
48897 -2428875 -7818279 -18481652 -27525863 -28000116 -16797716 223843 11665185 12927365
48889 12927365 10019168 8378776 5057004 -3382592 -12021400 -13243418 -7237664 -1208541
48881 -1208541 -454025 -3856465 -5826960 -762427 10678627 18333833 11354572 -6710341
48873 -6710341 -17691736 -8289614 14976823 34468248 39646635 31602242 15783461 -1210066
48865 -1210066 -10799959 -7819743 2283874 7580077 1725886 -11888493 -25866604 -32335703
48857 -32335703 -22929907 4433114 35903718 48520025 33921166 9403132 -2157243
48850 -2157243 1674460 6433897 6251482 11465639 28110706 44193220 45992091 38208838
48842 38208838 35819525 42079953 47770790 48515854 48196085 45948000 35318782 18845460
48834 18845460 8248060 5506451 -705085 -12947527 -16332917 -3273865 9166858
48827 9166858 2932937 -12616267 -14947865 -2177326 7563002 4914299 -3459474 -13380756
48819 -13380756 -26887057 -37002807 -31268465 -15149044 -10641724 -23486452 -31607339
48812 -31607339 -17905922 2806044 5172830 -10684980 -21703009 -14686503 -1220967
48805 -1220967 361157 -12130432 -22893616 -16324115 4253982 18964741 15821998 6659946
48797 6659946 9181361 19750392 20556108 10629936 7987497 17994851 23018438 12443481
48789 12443481 449368 565682 3555719 -2323119 -8078344 -1210336 10241048 13099401
48781 13099401 14006637 24332233 32667824 20733901 -1253915 -5338026 10950268 22194975
48773 22194975 17024042 12254361 19276809 25450387 20153565 13789622 16622811 20578317
48765 20578317 17765154 17682951 28304738 36401338 26312906 6330952 -3168123 525441
48757 525441 3288668 -1069614 -5217104 -4862185 -3855081 -2406845 4702442 15327033
48749 15327033 17969220 7699594 -4612014 -4558577 8920284 22705494 23017557 7737109
48741 7737109 -12996315 -26659084 -28252357 -20715409 -8992890 1885402 5435608 -1511829
48733 -1511829 -12048427 -15408731 -11725409 -11685892 -18886619 -23216650 -17118071 -7538895
48725 -7538895 -3781291 -3594184 -1287076 -245901 -4863964 -7542920 1482089 15515405
48717 15515405 17882270 6142354 -4733833 -5080715 -2773074 -8008156 -16967798 -17832445
48709 -17832445 -6854734 7418677 13321301 7555853 84087 5984151 27263119 45453280
48701 45453280 40798864 17652540 431284 3248950 14840003 17404448 9035018 120974
48693 120974 -3250695 -2422641 1826182 10517365 21608861 31201924 38200577 42120642
48685 42120642 39010177 26608871 11737057 4449743 4575709 1910338 -8277346 -17499859
48677 -17499859 -15903171 -5598066 3829064 8790244 13067720 17071256 13999235 -289341
48669 -289341 -18901375 -29657485 -26907127 -15054461 -3052655 1776313 -2454006 -10251568
48661 -10251568 -12304885 -4956100 5259751 9838481 8270408 5342901 2589241 -98810
48653 -98810 2143293 13315906 24891095 22670106 7845958 -1924687 2241652 8006779
48645 8006779 3534273 -2168907 5389582 21388751 29806149 29666774 33881804 44152814
48637 44152814 46954459 37135370 27322144 28053250 34472728 39872608 47177866 57356248
48629 57356248 60273715 49565353 36027552 33038590 36994325 35932835 30684605 31749844
48621 31749844 38597442 38514351 27031556 14664284 9408819 5839145 -1358741 -4223950
48613 -4223950 6966674 24624591 28626865 11556355 -9761844 -13443377 923296
48606 923296 11911751 2926485 -17475848 -27074269 -17687107 -3013691 1565593 -1801853
48598 -1801853 538677 14188638 29672550 33103100 19702220 -1759643 -15562476
48591 -15562476 -12918704 -1453418 3225635 -2574273 -5818992 3895877 18475248 23378647
48583 23378647 18701990 16214820 18803064 16629809 4955610 -6779559 -8205532 -944949
48575 -944949 6515575 9083033 5590520 -3472484 -13279460 -15925319 -10044273 -4334390
48567 -4334390 -6925930 -16467587 -27795885 -39104607 -46968283 -42058096 -20554603 4298049
48559 4298049 13755114 6258557 -1664692 2100703 12105707 17170418 14956075 9137581
48551 9137581 867955 -8714951 -13373900 -8573065 -772386 -1163387 -10802221 -19914289
48543 -19914289 -22001402 -20082328 -17220760 -10172422 2500637 13749814 16634330 14104132
48535 14104132 12661784 11160622 5147004 -1227211 934896 9892905 13276121 5519305
48527 5519305 -5640694 -13202727 -19532588 -25357158 -22622537 -7993011 7015018 11465671
48519 11465671 12126321 21173627 33250236 31359560 13366176 -3956497 -8312968 -3864400
48511 -3864400 2795103 13129583 27473542 38904750 43405981 44951863 44508538 36306885
48503 36306885 22346748 17209805 27584938 38480179 32633980 14655948 2713264
48496 2713264 3989107 12240540 22713289 33633997 37268713 26078828 6758517 -6297492
48488 -6297492 -10417084 -13409976 -15379669 -9705211 -2721112 -11819186 -37321093 -55168997
48480 -55168997 -48491928 -30411546 -22024260 -21674702 -13462188 2990073 11181156 4012475
48472 4012475 -6445597 -8553877 -6549311 -10487396 -20373230 -27248679 -24816693 -14391398
48464 -14391398 -1363913 8625658 11317862 5562439 -5288715 -14693356 -17237737 -13346082
48456 -13346082 -9735004 -13143450 -22819073 -31010664 -31281686 -23937118 -13196140 -2884152
48448 -2884152 4060742 6401017 7394437 12963375 24589334 37407102 46738167 51629560
48440 51629560 50476529 40357640 24491959 12662757 8387268 3185210 -8936318
48433 -8936318 -19083781 -15729001 -2652538 7931717 15073026 26716240 40002394
48426 40002394 41587284 30203302 21514620 23696419 24242370 11497944 -5043016 -10419752
48418 -10419752 -9266028 -17268517 -32854119 -36527699 -20064150 -147397 3057278 -10776292
48410 -10776292 -27047851 -35219435 -34799496 -28699965 -19709606 -11662699 -7309908 -4937183
48402 -4937183 -1049953 4083872 6753945 5066369 1183154 -1211015 285677 5470328
48394 5470328 10943490 12038862 7674883 2287638 644241 1827839 999380 -3798314
48386 -3798314 -9609495 -12825298 -12238520 -7809408 184708 9605626 16368066 16824870
48378 16824870 8987968 -7222793 -27175903 -39973801 -36200390 -19640403 -5523881
48371 -5523881 -3125823 -5434087 -1539149 6152128 5910807 -4576248 -13789910 -12330828
48363 -12330828 -4393232 449175 -432779 -3596456 -6690852 -8660584 -7033739 -1379724
48355 -1379724 3093954 1249799 -4380590 -7075882 -5736113 -6008718 -12215739 -22627394
48347 -22627394 -31927169 -34108691 -24667886 -5794961 11279789 15625689 9155916 4082269
48339 4082269 7095978 12765073 14625669 15172008 19611245 25394594 25083349 17417723
48331 17417723 9274111 6477269 6794382 2967185 -8829304 -23098714 -27538697 -14906320
48323 -14906320 6179578 17535979 12584121 5616248 12770579 28683582 33511099 22171733
48315 22171733 12358826 17827879 26809505 18984966 -4389850 -22839848 -26600753 -27337290
48307 -27337290 -35008959 -39847601 -28366484 -7153171 3124268 -6330802 -24516942
48300 -24516942 -37323300 -40921622 -37918631 -31094486 -24465129 -22260735 -23111596 -21677791
48292 -21677791 -17995012 -17482086 -19873112 -18302157 -13616399 -18162511 -36901147 -54415701
48284 -54415701 -52272983 -33537569 -18449104 -18763878 -26808787 -28448259 -17922251 -747640
48276 -747640 11151463 9533730 1064367 3132553 20843968 36187067 31993739 18214853
48268 18214853 16908641 26781669 25072056 5236984 -11004458 -6219082 9995845 21996013
48260 21996013 31898105 46738835 57952611 52689879 35606086 21633194 14309243
48253 14309243 7950996 4867033 12102261 23968323 25687613 15271262 6792435 9957404
48245 9957404 19346306 26125472 28453778 27091351 21020501 11267783 1552574 -6741572
48237 -6741572 -13446092 -14101177 -4628488 8503652 13065118 7792953 4537615 10803309
48229 10803309 19223866 18562219 7907502 -4364756 -10555535 -9385723 -5424481 -3996497
48221 -3996497 -4293724 -284563 7548453 7744282 -6060006 -21047468 -20671382 -10238640
48213 -10238640 -10710123 -27527148 -43389815 -45088854 -39396975 -35577637 -29481021 -15771262
48205 -15771262 -2035035 1390859 -4496545 -13522334 -24545379 -35931886 -40314610 -35202978
48197 -35202978 -28796993 -25366699 -16713683 -81679 8748166 -3095814 -21775325 -23703051
48189 -23703051 -9022176 1938917 718506 -2235565 -909709 -1766685 -5463042 -1401504
48181 -1401504 12485501 21905227 16534230 3828780 -5439545 -11782099 -18099420 -18918832
48173 -18918832 -9815141 1659887 5462405 2985311 2350730 5677631 9446817 12135695
48165 12135695 13511710 11289505 5988989 4115160 8880394 12778980 7939572 -175644
48157 -175644 1202945 14164962 26539146 26258169 13211307 -2732662 -10219927 -3539223
48149 -3539223 13858937 32395125 44436250 47398930 39200588 18305369 -7794884
48142 -7794884 -23048464 -20156541 -10795945 -9164659 -11774670 -5553988 9320510 20030135
48134 20030135 22677339 26195724 32397246 29723473 14267023 1030951 2330677 7331863
48126 7331863 -2381734 -25175410 -42707206 -45808651 -40883263 -32230452 -15170831 9304997
48118 9304997 27478690 28227966 16335034 4209303 -1957329 -2420328 1234342 4403100
48110 4403100 98081 -10799677 -16351595 -8991810 2157730 4064092 -1352745 -3398492
48102 -3398492 -2671869 -9067498 -20387956 -20484634 -4081168 11819920 10361672 -3325710
48094 -3325710 -13086577 -14414493 -13696157 -12120569 -4733089 6763547 12919415 9140007
48086 9140007 470165 -6443441 -8635540 -4989310 2799618 7957645 5283994 -306898
48078 -306898 321161 6800920 9846757 5046115 -3009886 -10247190 -16912025 -21391686
48070 -21391686 -21006099 -20412964 -27381896 -37032778 -32972613 -10208282 14591474 23425234
48062 23425234 17494544 9287387 4119131 -322253 -4262486 -6652177 -9449759 -11090321
48054 -11090321 -2607926 17967480 33363891 23393372 -8343050 -36480419 -42391927
48047 -42391927 -30539244 -17375409 -14180877 -20764181 -27291573 -22929818 -9783416 -4086783
48039 -4086783 -14279303 -24569285 -14676029 9478104 23505064 20849018 19358316 28718971
48031 28718971 35091983 27762108 18809942 20856969 23728946 12653204 -4025175 -6767850
48023 -6767850 4258447 11860515 10660808 11677916 18763612 21349255 14573928 8493509
48015 8493509 10284359 12112170 5635030 -2613484 -430684 11774403 20409503 14202242
48007 14202242 -3857196 -18422421 -15261877 3951995 21958146 25629635 21114798
48000 21114798 21086884 22718710 13194211 -4793384 -11949124 -1295995 10377923 9403360
47992 9403360 6242551 15349349 28446167 26803222 11656235 2322367 6813786 12824871
47984 12824871 8965393 -1241087 -9789826 -14595396 -14816478 -7821750 3427688 9568635
47976 9568635 6818335 1733293 -68518 -1132949 -3592399 -2995092 2674701 6582511
47968 6582511 3836222 1170761 6295262 13585436 11575177 1407583 -3931875 1446060
47960 1446060 9227625 11001993 9507156 11069302 15048511 17803729 21556005 30565379
47952 30565379 40278849 39119540 23510542 4828531 -2940123 1289197 7154542 7094243
47944 7094243 3284348 1234661 3168330 9321730 19441969 29603670 33193389 29522665
47936 29522665 26118425 27083017 25167040 13330783 -1175256 -5030803 2006387 8479523
47928 8479523 10527765 15487805 24354332 26524343 18638742 13607774 20144334 26297203
47920 26297203 17510293 1217874 -2984032 8502451 22051540 30062461 36850477 41415361
47912 41415361 34253846 17000404 7161799 13086104 19035818 8522548 -8796063 -9765962
47904 -9765962 8856514 26876542 30078325 26860614 30368913 37520741 36292684 26285596
47896 26285596 19161280 19333901 16303736 1674964 -14987026 -17351920 -5592826 3924144
47888 3924144 3708402 6213160 21464037 35557270 27204906 767909 -15351362 -5512094
47880 -5512094 14599875 22927233 19304686 17092772 18626634 15361931 6872616 2586916
47872 2586916 4294812 2097602 -8136755 -16355210 -14536614 -10633489 -15803570 -24390156
47864 -24390156 -19449057 2574670 24565183 30023640 22291554 15252340 11477040 865639
47856 865639 -19496808 -35688698 -32899010 -13659807 7201294 20722756 28200393 31017068
47848 31017068 27874036 23461142 28149641 42791556 52395950 43542751 23005761 9929381
47840 9929381 11950201 18682111 19516261 18094862 23388289 32586497 32296155 17705535
47832 17705535 2660252 4066511 19618075 30278557 26217038 19289753 22195287 25630716
47824 25630716 11522059 -15344165 -28334600 -15537122 3188774 6021918 41450
47817 41450 6135618 23840928 31172840 16626365 -6803957 -21343552 -23171978 -17842891
47809 -17842891 -10032863 -3311250 8852 3899940 14666493 27731816 28259836 11171650
47801 11171650 -8508267 -13196163 -3307596 8355140 16383673 25875194 38222921 44980881
47793 44980881 38566120 22325585 6667668 -1222526 -1485864 2145470 7485413 14935890
47785 14935890 24330367 32786422 37713445 40696172 45125917 50637554 53915991 54443786
47777 54443786 54143198 51575842 43784533 35108672 34899121 42127915 42103615 26645470
47769 26645470 8866104 6106417 14106497 13047854 -1981525 -12658954 -4085750 14202837
47761 14202837 22818571 17996069 11197918 9128328 6499914 -1730742 -10710570 -10793540
47753 -10793540 3097305 27981086 53763245 67755626 64284628 51209034 42026503
47746 42026503 40721898 39738757 33225940 24657833 18846150 14932906 12814876 18624415
47738 18624415 35258711 52787757 58079513 51368335 44172670 42823949 43834817 44475718
47730 44475718 46947880 50863792 52040131 51020385 52761823 55552176 51445729 41217817
47722 41217817 36460554 41245044 44973767 41723216 42875406 58091159 75595994 76984735
47714 76984735 63492878 51952420 51222543 58315781 71203806 87230957 93723560 80656490
47706 80656490 60864749 56711514 66681055 67780392 53603869 44764298 53328543 61974648
47698 61974648 52982954 36591102 32458660 40122763 47538329 54875392 68205692 79547011
47690 79547011 75651659 61496215 54456584 57744711 58654714 52215035 48217289 53014155
47682 53014155 60284893 62994245 61576480 57808204 51905045 47258199 47852395 50991160
47674 50991160 52499758 56502434 67380029 75107160 65046300 42215888 28168531
47667 28168531 31034429 36616086 34458832 34064480 45223805 58341471 57797231 44029836
47659 44029836 29892618 23496916 26008385 38750626 60191371 80317765 88392448
47652 88392448 83787873 72686320 59409711 48076783 46075797 56110317 69036031
47645 69036031 73595634 69922965 65518968 62010874 54938336 43763309 33140950 25816474
47637 25816474 21772464 22336040 27651304 32372384 31902577 31078969 37982726 49573379
47629 49573379 52100684 37617563 14121139 -2212371 -1169160 13957226 28242951
47622 28242951 26449837 8371582 -8373788 -6659239 10449940 24188381 22203562
47615 22203562 8944894 -4317210 -10758301 -8601491 470462 10214049 14023635 13889011
47607 13889011 19638101 35496674 51987396 55661967 44711220 31610805 30631908 43439547
47599 43439547 56589375 54688650 37525833 21114804 18642590 24927638 26072628 20173452
47591 20173452 18044834 24049991 28102349 20997854 8173747 1497354 3730847 8138150
47583 8138150 9476458 8710016 8630576 9934498 11070039 9310054 3724570 -898040 3754601
47574 3754601 20099169 39611666 50074933 46111149 30986571 11757556 -3893095
47567 -3893095 -9296909 -2651309 10599083 21824125 25587473 21382601 11558910 -156431
47559 -156431 -9683230 -14212068 -12217232 -2454706 13467744 27259965 28432227 16076277
47551 16076277 2049762 -1351639 6620525 18813460 30747036 41420996 46995726
47544 46995726 41789589 26577868 10701311 3931007 8063349 16240344 19099171 13375104
47536 13375104 5961444 6274754 12900981 13495939 1974829 -11291006 -14015210 -10050496
47528 -10050496 -11519534 -17227382 -13618226 2323180 16254061 17351615 12529597 12291476
47520 12291476 14367010 11630035 6682088 6324332 7829606 3130278 -7047069 -14679546
47512 -14679546 -17162799 -17267398 -13225478 -1771995 9957647 9715380 -862541 -6388953
47504 -6388953 -560066 5248221 2353520 -874542 4484030 9783735 1921494 -13542492
47496 -13542492 -18461444 -7759779 6208843 13967665 18357358 21434878 16684865 1273618
47488 1273618 -14327336 -17074902 -5580330 12188555 29349782 41983901 45496690
47481 45496690 36388580 16852754 -5367968 -20108022 -18461316 -454368 18730089
47474 18730089 19210393 -618855 -19006820 -16511429 156177 9765437 5742753 99514
47466 99514 736625 872175 -4984231 -8642333 -800861 13100788 19735259 15635531 8824483
47457 8824483 5615924 5051646 6106930 11577739 21916212 31313269 33732577 28989496
47449 28989496 19535868 5214525 -13321424 -28022860 -28016992 -13818030 -1033789 -3224353
47441 -3224353 -13464134 -11192340 11398231 38632561 52204267 54448297 60356405 70957249
47433 70957249 69461865 47273436 20469855 10532006 16604668 18911297 6632088 -10049070
47425 -10049070 -17162630 -14874859 -12316608 -12476342 -10849654 -5935841 -2694306 -4811756
47417 -4811756 -9482315 -12007056 -11648747 -10776201 -11416284 -15053643 -22719311 -31600858 -33814948
47408 -33814948 -23834279 -7486251 1439449 -3948179 -15744772 -21460859 -19170674 -17729293
47400 -17729293 -23192964 -30841997 -32236287 -25402460 -14958585 -5819614 -867783 -2072438
47392 -2072438 -8341149 -12922492 -8692277 2845697 12930334 17339814 20543970 24843782
47384 24843782 23223640 10976184 -1770621 -1399888 7436981 6006679 -9937887 -21575594
47376 -21575594 -15263333 -3954213 -5684130 -13220908 -6317590 12163465 17819189 4570567
47368 4570567 -2914439 12311394 30933040 25224782 -423657 -17470222 -11571780 7868542
47360 7868542 29377727 47691232 52624807 33904994 2217009 -14851686 -6450930
47353 -6450930 7716354 5366861 -11617629 -28009850 -38247438 -45487965 -48471718 -43772308
47345 -43772308 -35116780 -28607596 -23641355 -18520558 -18732475 -28210297 -37838139 -35161814
47337 -35161814 -21956755 -10291267 -4860332 -2382398 -5436917 -20737986 -42163995
47330 -42163995 -50989999 -38682771 -17893208 -5166720 -2919788 -4306060 -5803821 -6964496
47322 -6964496 -5301202 -48912 3666325 1446448 -3203823 -3782753 926307 8013882
47314 8013882 14996215 18234381 12684474 163690 -7271062 -683502 12523940 17828432
47306 17828432 13711595 12289433 19702707 26770313 23378461 13682178 10239114 17424923
47298 17424923 26943505 28342300 19625430 7662021 423565 -1269053 -4462413 -14685303
47290 -14685303 -26289103 -26872620 -13416922 1127350 2202493 -8900781 -18040892 -16689450
47282 -16689450 -9990122 -5953499 -4771047 -3046892 -2101796 -4890119 -7701588 -2810286
47274 -2810286 10163533 21988783 24946945 20950625 15697857 9813154 894272 -8823433
47266 -8823433 -13472048 -12243165 -11209512 -14241362 -16574352 -11113033 1584923 13967632
47258 13967632 20964150 23991692 24948773 21509624 11898990 608061 -5927127 -7719445
47250 -7719445 -9637893 -12192237 -11214263 -7948281 -10153045 -17677324 -16388684 2455042
47242 2455042 22819037 19027224 -9551822 -34070579 -31443709 -10515768 5148594
47235 5148594 8062280 7778602 10162867 11572566 10299373 8600882 3292491 -11508908
47227 -11508908 -29806781 -35356958 -23114715 -7533206 -2788650 -5054208 -2905427 3680088
47219 3680088 5900035 2264576 221123 2882174 4338346 -331698 -7792067 -11242793
47211 -11242793 -7390489 2527298 14159714 21525072 21049580 14852851 6831204 -3464580
47203 -3464580 -17758234 -30239490 -29341320 -11798268 10682929 23614729 24689639 21410666
47195 21410666 17357700 8694187 -5364746 -16542279 -16662676 -8441464 -1507136 362627
47187 362627 2010368 6930887 11264625 11087358 10325338 15358614 24153681 27617156 22394519
47178 22394519 16344643 18442290 27261115 33127809 29790508 20959589 16002351 20919486
47170 20919486 32861041 42412273 42026437 32760299 22031886 15673971 14563491 17902910
47162 17902910 24935783 32184046 33959279 28973618 23201680 22822399 26646673 28293164
47154 28293164 23573147 13517689 3060691 -1246328 3388354 9782171 5433704 -11415022
47146 -11415022 -25881198 -23863082 -10269358 -222077 3656750 11768694 25855891
47139 25855891 32499116 23927338 11459247 8460231 11091192 8616394 4095501 8378372
47131 8378372 17106662 12097390 -10675533 -30164666 -25821136 -3161179 15950588 20547775
47123 20547775 17145437 14223627 12381981 9471755 5208686 -1173508 -9791794 -14502675
47115 -14502675 -6156050 14765468 34796002 40869664 32318574 16346041 -2134564
47108 -2134564 -20181933 -31415873 -29619890 -17415611 -4836928 1952610 6188206 13769452
47100 13769452 24547200 31909587 29549907 18245480 6204489 1016468 960995 -1678531
47092 -1678531 -7154647 -4874115 10715872 26932585 25315472 5173282 -14823957 -18157114
47084 -18157114 -4636589 16060037 33674411 38671710 27110083 10045887 7179793
47077 7179793 23260534 39645234 37608415 21538250 8996273 5528669 2367767 -5178536
47069 -5178536 -11308430 -12030812 -11745055 -14256012 -15779582 -10535545 1918892 16345855
47061 16345855 24437975 18941559 1439807 -15031541 -18252996 -10907173 -5034694 -4484308
47053 -4484308 -3624409 -3428748 -14943721 -40850459 -65155530 -70632938 -59171637 -45572251
47045 -45572251 -36851692 -28057647 -15735921 -4783759 -719630 -3199212 -9720449 -19407093
47037 -19407093 -29238375 -31068764 -18259476 4821878 23998077 28048630 18686871 6367724
47029 6367724 -1355447 -3761072 -1738796 3917546 7860574 2771498 -8097471 -9509742
47021 -9509742 5566856 21383923 17486345 -2801767 -16635709 -13440135 -6084781 -7105601
47013 -7105601 -10799589 -7945280 -4269581 -11265098 -26866614 -37274962 -33314674 -16435794
47005 -16435794 5590749 20606972 17058721 -2241288 -17002276 -10994398 8069432
46998 8069432 20565608 20678213 16882284 12026025 89675 -16959207 -25452409 -18030828
46990 -18030828 -3486704 6172486 9041066 9967799 12361018 16338402 18078347 11222398
46982 11222398 -2290500 -5822613 12888438 37175192 35766073 6716253 -14630750
46975 -14630750 -3626085 18438201 16247828 -9258506 -28248204 -29641177 -31100955
46968 -31100955 -41359188 -42999558 -23874934 -1354921 2219530 -8448744 -13632892
46961 -13632892 -11232117 -15296527 -26244168 -25527368 -4713849 18564532 23654096 13107288
46953 13107288 4102051 2415056 -1124054 -11569644 -21158004 -21812700 -15779816 -9430746
46945 -9430746 -4126942 1924003 8574938 15068490 21300546 23773033 16711446 2905292
46937 2905292 -3457611 6567193 22331446 25939137 15114295 2192802 -6806964 -17132645
46929 -17132645 -28216723 -28517950 -14938135 -3124040 -6905755 -17790799 -17764460 -5106652
46921 -5106652 5957114 6036665 -3041888 -18838878 -39262761 -53235149 -47488885 -27543287
46913 -27543287 -16852186 -26808687 -40168562 -35115199 -15643258 -4027678 -8777661
46906 -8777661 -15973991 -13196599 -7579014 -13026118 -28494857 -38720490 -34093186 -21608150
46898 -21608150 -14307379 -15430936 -17538979 -15040849 -11468082 -12174332 -14848329 -12958615
46890 -12958615 -6753678 -4109352 -9351862 -17310756 -21154097 -20609942 -18526609 -14584072
46882 -14584072 -8269305 -4228766 -7458666 -14639734 -16859667 -10392752 1352594 15593330
46874 15593330 31743390 44181031 42803828 26222295 7971857 2833323 10378194
46867 10378194 17729372 15733032 6691668 -1454322 -2154748 7251567 23090415 34612879
46859 34612879 31603903 14763885 -5173726 -18939187 -24715993 -22999736 -13089320 1824374
46851 1824374 12558741 13036159 8256374 7792501 13544819 19259014 20735680 20544129
46843 20544129 21947132 23336199 21395582 17126635 15877892 21420279 30865811 36102266
46835 36102266 31328804 19225486 7743764 393904 -6840301 -16702532 -22799390 -16085322
46827 -16085322 1518459 15419068 12573340 -4781521 -21205087 -23241309 -12328357
46820 -12328357 -2713073 -5601835 -15736125 -16660681 20935 24833065 41702286 43843681
46812 43843681 34991594 21261339 8698226 3818219 7185303 8731278 -1102799 -16594637
46804 -16594637 -22862806 -16628721 -9922333 -10965788 -12744795 -6004456 5875483 12395969
46796 12395969 10186415 5134630 4201070 9333766 15572306 13098594 -2902916 -22646362
46788 -22646362 -29740685 -20903194 -8232440 399721 9866643 21023788 21524850 5810249
46780 5810249 -9472725 -6810367 5323927 5683990 -6537335 -12445640 -4595736 4174357
46772 4174357 4917366 5002663 10351944 13259741 6934426 -2010677 -5151587 -5149344 -8207572
46763 -8207572 -13004307 -15105343 -14404127 -11949222 -7742729 -6676902 -16234497 -32038173
46755 -32038173 -36907331 -22402495 -854604 12304717 16656279 17420069 11156568 -4190648
46747 -4190648 -15221110 -7448061 10926754 17023425 3758571 -13185918 -18972078 -15595482
46739 -15595482 -12461843 -14231521 -21329436 -31329732 -36295422 -28455533 -11779963 778103
46731 778103 3925304 4939417 9737810 14019900 12410649 7596016 5386914 7703794
46723 7703794 14420404 25216786 36036165 41045730 41723677 45907534 53559579 52906319
46715 52906319 37845980 20604613 17070864 25150860 28831830 21434895 13572652 16351573
46707 16351573 25982695 30110008 24165993 15405985 11765791 11964479 9500436 3871394
46699 3871394 2271664 8426943 15254789 13979645 6800476 3168901 5546791 7640977
46691 7640977 6343905 5147178 3998872 -2356465 -10647266 -6007196 16909627 38851224
46683 38851224 35651300 8898568 -16293445 -22789896 -17263667 -12734951 -8987857 1868593
46675 1868593 18942172 31405184 31479067 22142991 12475493 9407466 13888377 22324301
46667 22324301 30827497 37676271 40599497 33955529 14357705 -9824609 -21559922 -13173978
46659 -13173978 2966905 8059357 -1843071 -15309728 -23582414 -28457552 -31084657 -25705715
46651 -25705715 -11937812 -2393618 -5785318 -9793211 3285713 26561100 32867306 12715712
46643 12715712 -10471817 -12536593 449695 7551849 5219288 4676596 6072364 -1737687
46635 -1737687 -17402773 -25402753 -21283744 -17975245 -20807407 -16557001 1820164 17643618
46627 17643618 12847751 -5427717 -16907166 -17210143 -17924420 -23785533 -26821837 -21795556
46619 -21795556 -13569865 -8587091 -8982305 -14230182 -20164662 -19218937 -10346370 -4327075
46611 -4327075 -9262383 -16359964 -12773856 -3384164 -3974452 -15331412 -21864267 -17178459
46603 -17178459 -13383184 -20184392 -30393249 -32921752 -26885822 -16183398 -2876304 6810328
46595 6810328 2758116 -13517229 -24513354 -17521972 -372862 12317852 18241243 22254618
46587 22254618 22322815 14145012 3261993 -760316 1820287 4496357 7779036 16673341
46579 16673341 27629478 30455650 23144044 14738088 13277002 18733704 26314510 29072487
46571 29072487 20656744 4668962 -2934748 7684120 23009475 21108242 1521158
46564 1521158 -15619057 -20048410 -22217083 -29309643 -30417131 -17284222 -3797724 -8466215
46556 -8466215 -26860369 -37494327 -29859377 -11904564 6943461 24843909 39381734
46549 39381734 44879027 42453930 42058754 48453385 52531637 42989846 22402705 6128997
46541 6128997 6477799 20468919 32072329 26178194 3183338 -19666214 -24570143 -11417360
46533 -11417360 3337518 5627434 -3308275 -13142614 -16496904 -11531660 439532 13319883
46525 13319883 16739082 6332999 -7789917 -10297506 1222737 13868635 16065691
46518 16065691 9641512 2888275 -981476 -3051231 -2244519 2618057 7140486 5874106
46510 5874106 2246574 6191075 19916911 32787659 33943648 24743021 14517502 8732061
46502 8732061 6840858 8167627 12532077 15686835 11197250 -1058242 -13126786 -18213990
46494 -18213990 -18154104 -19343563 -24343669 -30155173 -32294852 -27919333 -17377558 -5917296
46486 -5917296 -1577338 -6781395 -12594361 -6084090 15314488 40177937 55104186 56952598
46478 56952598 51303133 42801141 31693834 18610435 7703868 3026778 3678963 4023922
46470 4023922 -1360517 -12199665 -20943902 -18179661 -2199306 17329981 27623286 24181499
46462 24181499 12017807 -1937476 -12739051 -15600753 -8284529 2628092 5523420
46455 5523420 -1752837 -7733903 -3008511 6810332 11501688 13110987 21010920 33489796
46447 33489796 37976485 31030791 24810385 28015237 31749928 23609753 8185557 1986168
46439 1986168 9899320 16874559 5979214 -20498069 -41647876 -38913593 -15068193 8837736
46431 8837736 15837031 9553231 5170332 7577597 6590985 -5884227 -23201979 -32791757
46423 -32791757 -30752227 -22419006 -13472474 -5593415 2573396 13643916 27239370 36482071
46415 36482071 35106368 28920778 30265437 38093879 36450652 19738162 5164668 7774591
46407 7774591 16542909 12941834 2852729 7332716 25947688 34086478 19839625 870610
46399 870610 -3365194 3458606 8447309 11432636 18584649 26105441 25802202 20320536
46391 20320536 19614615 26163779 34239108 40477815 45953928 50510761 52832372 53448804
46383 53448804 51441723 42225210 24962443 7368871 -3716380 -11035153 -18298634 -19179701
46375 -19179701 -5949391 14814730 27730818 29569940 33074156 47209827 63143776
46368 63143776 64869180 48367219 25962562 14051056 18507341 31053720 39808891
46361 39808891 42921580 48036015 57731124 63274023 58013611 49005101 46036155 45132492
46353 45132492 35079470 17356223 6001887 6866945 10182711 7831852 6253166 15026917
46345 15026917 31170174 43299136 46893760 48213972 55109265 68911295 84004122
46338 84004122 92130231 88720885 77283952 65788945 57647344 49444978 38853284 29966618
46330 29966618 26881523 25424974 17055553 1352936 -9650040 -2865424 20228166 41913964
46322 41913964 44869509 29987797 14268725 10917878 16899979 22210526 24101606 25734995
46314 25734995 26755353 24719045 22868602 26115782 29938897 23908322 7948673 -4931389
46306 -4931389 -5555402 807294 5182119 7581194 12441468 18238008 19894148 18354369
46298 18354369 20461482 29584156 40820363 45988412 41728898 33010601 28397429 30218977
46290 30218977 31076351 23558547 10940199 2376745 -198345 -2030371 -3494068 1361310
46282 1361310 12468424 20525871 19885823 15139399 11184211 7174409 4886965 11116614
46274 11116614 24463819 31378118 24598392 14498552 11575565 9414370 -925465 -10240876
46266 -10240876 -2982696 16713903 29893986 30804173 30921042 35042400 32981912 19544723
46258 19544723 5489524 1287249 3633948 5427028 7220678 11195197 13952117 12713644
46250 12713644 10447475 9490775 8717895 10765257 20896945 34005169 35922025 24711684
46242 24711684 16516989 20413645 22408222 8836106 -7807052 -5621625 12939473 25294102
46234 25294102 22713463 18495735 21738885 24120207 18186260 10315371 6917088 3021770
46226 3021770 -5170017 -8961090 28768 15013326 23429144 24203817 24799072 26797160
46218 26797160 25718255 21452912 17929218 14403573 7222810 -824564 -2807661 645115
46210 645115 1467502 -2883266 -5839187 -3434240 -521903 -1208420 -1419963 3055924 8122890
46201 8122890 8650154 9169251 17985975 32358617 39101747 31836641 19636909 14157208
46193 14157208 14444999 11477792 4413973 3100418 12405273 22158375 19591524 7850848
46185 7850848 3102020 12382555 23130238 20013018 5701347 -3531971 -159756 6300515
46177 6300515 4798853 -2083979 -3492530 4817336 17096450 26214106 29777083 28755335
46169 28755335 25451025 23496045 25773089 30866885 34073034 32940999 29910004 28914664
46161 28914664 31445959 36783926 44094145 52489815 59447155 60417173 51141931 31859112
46153 31859112 10027122 -2744957 773737 16996786 34279605 42364902 39300870
46146 39300870 30791556 24626525 24927506 29295470 30941345 25325952 15748329 11387519
46138 11387519 18537919 33811422 47045519 51607896 50789274 52034027 55762466 54990413
46130 54990413 48486944 47626682 61700076 79955755 80693876 60240761 40050882 38467010
46122 38467010 47829887 50986016 49739892 59429880 79650312 90099052 78961555 58900621
46114 58900621 47628824 45998281 44825775 42549484 43659145 45177940 36867574 14989492
46106 14989492 -11046345 -26284156 -22112930 -3572997 13022617 14798411 7379778
46099 7379778 8633608 23876700 36546367 30831067 14645037 9185662 21860510 41726505
46091 41726505 57621489 67481903 71214087 68150743 63530244 65673744 73479695 76729891
46083 76729891 71772747 66781169 67671377 69161829 65433975 60135476 58477325 57418552
46075 57418552 52238038 46631298 46778423 49186149 44043198 29615597 15161270 9095840
46067 9095840 10734446 14567269 17016398 17480777 17488874 20884138 31032537 45255527
46059 45255527 54705089 52865424 43394435 37218955 41657693 53844061 65246657 70998866
46051 70998866 72920747 74035072 73273176 67489685 56906462 46130695 40476671 43012713
46043 43012713 53909330 69924447 84856560 93205740 94407435 93004563 95105909 104329622
46035 104329622 118487958 129531937 130666804 125361638 124555955 132173621 139693930 139906128
46027 139906128 138367926 142712417 147965529 145146765 139330678 142823391 151462875 146615235
46019 146615235 125761387 112731583 126482541 154176961 169390798 166509820 161260324
46012 161260324 163940136 169460761 172694860 177981757 189748161 204224876 214227966
46005 214227966 215135249 204654084 184107739 161963329 149270519 148655826 152411545 152943731
45997 152943731 150462319 149077934 150129029 151860535 152904509 154011469 156776049 160383822
45989 160383822 160470869 155193487 152378461 162428179 179973109 182498865 157171268 121680834
45981 121680834 105334119 113560781 125638141 125845285 120122542 118849220 119814173 116904345
45973 116904345 113116401 114119324 117037835 115911096 112887242 114650548 120976832 124629172
45965 124629172 120937342 112372861 105948522 109451418 125835353 147183824 159004019
45958 159004019 155059439 143359317 133995581 128083089 123793412 124359473 130796554 133703030
45950 133703030 123776056 106243647 93218006 84640458 69722449 47235323 31385554
45943 31385554 33724862 48863808 62484591 66398622 62263348 56670810 55806046 60440152
45935 60440152 64994428 65791091 68274680 78589926 90206152 89803165 76489900 62932879
45927 62932879 55677807 48294072 38350165 35649579 44651913 52597820 46740630 31625414
45919 31625414 17203250 2572101 -12978917 -15635069 4718186 30261659 33994489
45912 33994489 19888277 18539639 40830031 62542522 62738455 51545417 46481844 44874978
45904 44874978 38637021 36899933 50797995 68990912 72029550 62374808 57251418 58518526
45896 58518526 54053327 45348217 47357042 59037212 59505981 40321055 19132062 12044203
45888 12044203 13008201 12077251 14573226 26727940 38314073 37553256 32044671 36749672
45880 36749672 48795861 52029105 42549615 33421081 35246183 45653008 57532054 65994941
45872 65994941 67838227 64849191 66469354 78284206 89131666 81790484 57224168 36514778
45864 36514778 36188063 51719190 68296120 78073891 82295682 84385111 86598228 89142441
45856 89142441 89368809 85232208 80252991 80409383 85851340 90753559 91107032 87163946
45848 87163946 79341720 68761889 61035400 61327300 65646566 65679741 62500033 65409611
45840 65409611 75682090 83048907 82818085 85085700 98972864 116428347 121377743 109828384
45832 109828384 91961670 77581672 68277051 63126194 63937777 71634707 81030640 83106285
45824 83106285 74331662 63352480 64434945 80688801 97324017 97538700 82297523 66793116
45816 66793116 60277379 60145525 64418940 75383770 87371474 86053172 68537017 52206108
45808 52206108 53195447 65626629 72889792 70549481 65674959 61311160 56611376 57751404
45800 57751404 72348138 93011126 101260506 91248050 78021108 77910830 89904608
45793 89904608 100660558 99860245 85828153 62926896 39545781 24956532 23053216
45786 23053216 30154929 40445379 51038844 60471265 65599620 62920895 52164221 37165019
45778 37165019 22846394 10921585 -609303 -11487928 -14458891 -2964149 15503362
45771 15503362 22981418 13720228 4666902 13812405 34682264 44700441 35508867 21350745
45763 21350745 17361521 23407323 33182767 46606589 65109340 82324345 87971536 78860540
45755 78860540 62428017 51397130 54669298 68189543 75190407 62976751 39956961
45748 39956961 27149948 31692829 40017502 40686588 40368658 48456668 58220262 56897530
45740 56897530 46693276 40542394 40878164 38272373 30865325 29218627 37511776 43942439
45732 43942439 38062875 27126047 24785980 30501154 32028066 25726367 22485501 31386202
45724 31386202 46887577 57229817 59196379 58034638 56238876 50324008 39763509 32565205
45716 32565205 36838756 48802602 54493530 45234817 28266273 18674711 22107056 29956355
45708 29956355 32428565 30750010 31953938 36381074 38903329 41170332 51604805 69648594
45700 69648594 80897829 75903529 64667335 61414434 62917107 57169313 48310999 52541318
45692 52541318 67626674 68547972 43681456 16940613 18452421 46144820 73287291
45685 73287291 84363278 84781132 81331077 73739799 65280222 63244744 65898900 64154616
45677 64154616 58844622 61024478 71208268 74154153 61390647 44913670 39611511 44240828
45669 44240828 49871333 56169662 66772064 76245206 75386847 66460216 61479646 65654950
45661 65654950 71422775 69660936 60406607 51433000 50127155 56793421 63568963 61352684
45653 61352684 49832583 38444228 35669389 40129096 43503010 38998896 26727531 15283112
45645 15283112 17100492 34790735 52448276 51000358 33995119 25435758 37053242
45638 37053242 51939922 50087304 36344404 28869262 31110382 33244368 34280487 42395890
45630 42395890 55226864 60193588 57146321 61408107 77240571 85591465 70062340 42583677
45622 42583677 29105981 36595793 48108646 48515330 42445352 43527986 54082212 61721707
45614 61721707 54800960 37503514 27160244 35951270 57407558 74027787 77042881
45607 77042881 74027866 76387350 84454123 88219655 80042919 63250788 48600241 43729068
45599 43729068 46267300 47860457 45109585 43577036 48500001 55594531 57217594 55308467
45591 55308467 59467442 71013536 78078720 71523871 58616400 53570639 58660800 62853249
45583 62853249 58048024 48918711 44905818 48557089 55473399 61801699 66693453 68401507
45575 68401507 63225274 50824404 37726464 31785832 33622210 37043572 38319192 40507420
45567 40507420 45827793 48363034 41057696 29086604 28362366 46666191 71309428 81763506
45559 81763506 72715285 57949181 50815872 48621496 41684371 31890313 32052134 46747612
45551 46747612 64142172 71933505 73063687 77196058 82778120 79705368 68596273 64348736
45543 64348736 75864107 92016206 95141832 82674622 67902337 61954272 61572038 55128751
45535 55128751 37764525 19734934 18492836 39719553 68054750 82393483 79397065
45528 79397065 74025458 76898604 82068798 80892258 76624031 77402557 83178194 88089856
45520 88089856 89346700 86215745 77052561 65338202 61498533 69619402 79195191 79851601
45512 79851601 77116447 82067409 91900471 94232123 86124738 75212662 65756223 57924025
45504 57924025 57592046 70282172 85561630 83950637 62203585 37855152 26149290
45497 26149290 25926003 30563427 37992144 45216141 46544990 42888364 41144755 40639640
45489 40639640 33560921 22995324 24680999 43085146 60992307 63616074 59711244 65749304
45481 65749304 79724834 85277223 75605919 59995097 49594548 47089531 48584689 48119935
45473 48119935 42226473 34941159 34928948 44277154 55446611 61963912 64604894 64074561
45465 64074561 57260296 45260165 35048014 28613926 22102642 20231743 35553565 64183608
45457 64183608 79411010 64579834 38458447 30500162 42310163 52712614 51483128
45450 51483128 46439042 42835849 38254699 36544296 45751243 60680627 66224645 60466555
45442 60466555 57273382 63382874 70057044 71017061 71407857 73482702 69777650 57814767
45434 57814767 47043782 43407640 40675028 35530761 37612577 53298263 70547706 72889579
45426 72889579 61823640 53559210 57324502 66707715 70399981 63768259 50726930 39429808
45418 39429808 35357334 35971073 34118807 27632016 21572748 20421415 23859011 31321872
45410 31321872 43255765 55314576 59799635 58119534 64379104 88740541 120856640
45403 120856640 137081963 124060999 91713387 63245226 53964679 59388797 63783081
45396 63783081 59385328 52577922 49454439 44336852 31249393 18959053 20916442 34649030
45388 34649030 47017857 57510811 76941384 101482346 110501105 98919538 90494759
45381 90494759 104215498 124974243 126099356 107806786 92449771 90333494 92427328
45374 92427328 92989356 96630307 101150292 94512181 76303375 65578862 76618062 97823199
45366 97823199 105906990 94914923 80852093 79495411 88143660 91568454 81730716 67356941
45358 67356941 62806813 70219524 77943714 77697910 76805097 88088194 111741431 133734396
45350 133734396 140522140 130234296 111364467 95784944 91221721 94995726 96423339
45343 96423339 90287628 85592131 94615023 114819942 129014077 124439184 106357544 91707940
45335 91707940 93062040 108548228 123892547 125220623 113061283 101519548 100440727
45328 100440727 103475684 100255098 94580558 98922359 112525228 118631667 107832010 93288582
45320 93288582 94945297 115014246 137262769 147738787 148617830 150663059 157270247 160329020
45312 160329020 152103501 137380710 128637342 129345308 129640610 122669201 116921643 122762732
45304 122762732 132331422 126606561 102693972 80546781 77652047 88071378 94030156
45297 94030156 89822662 84885316 88136146 98892780 111857040 122848042 128622999 127328953
45289 127328953 121790541 118590821 120897152 124023368 121219045 113651234 110840472 118436588
45281 118436588 128882383 130580246 125341560 126964771 138782706 144046963 129104749
45274 129104749 107294475 104082099 122087193 138805718 140378689 138232429 144517449
45267 144517449 149583523 139117552 121251652 117944816 134127365 152199207 156618292
45260 156618292 149506327 140259994 132892351 128253962 128596244 133882702 139818382 143764895
45252 143764895 147422700 150937446 150442298 144989385 140281866 141390460 146517702 152009642
45244 152009642 158758532 168525426 177544077 179540487 173714677 165640562 161555064 164683663
45236 164683663 174628807 186503574 193062433 192147744 190137080 193697518 200787103 205608564
45228 205608564 209634063 218783541 229635027 229004534 212065239 192539153 187585292 197949366
45220 197949366 210460534 215757419 215070774 212588932 211139367 215020557 226971085 240215999
45212 240215999 242759203 233366748 225241729 229400998 242088455 253583764 260692727 262971200
45204 262971200 255530619 237569029 222452484 224938635 239358537 244591245 232970617
45197 232970617 220438837 222161020 230908915 230005351 218542952 210358579 211684462 213549889
45189 213549889 208355001 202698712 207015398 218218232 220425729 203250709 175179152
45182 175179152 156391553 158655683 173673626 182348495 174706756 158144529 145789443
45175 145789443 141019211 137282077 130548572 125573644 128036174 135000481 137333574 130598057
45167 130598057 120468974 116907724 124504435 138365885 147448140 141935989 120974481
45160 120974481 95912807 83327741 90163032 106159006 115404961 114798274 114327051 118101401
45152 118101401 115513920 98668056 79405401 75430870 83457393 82564916 66353458 54953029
45144 54953029 66673700 91844134 107350383 106226828 97502784 85294540 67964142
45137 67964142 55155786 63198894 88325445 104289554 96699277 82865509 84371943
45130 84371943 95097521 94237156 79634543 66620151 59965215 50670462 39945851 41749290
45122 41749290 56056876 63168213 55084439 50560668 63755360 78176730 72656890 56829416
45114 56829416 55188169 67073203 71598916 66984367 72732569 89931021 92019349 67062323
45106 67062323 40853913 39848794 53999709 58013724 51354399 52176410 63272016 69914363
45098 69914363 66736658 63892596 67600018 73663496 79655165 86206461 87275842 76595483
45090 76595483 63250017 63063821 74260276 79922388 75379470 72943284 76341575 72525267
45082 72525267 56879969 45822285 52248485 65723529 70391380 67465200 65491664 61826379
45074 61826379 50416729 37944468 35230016 39141522 38538016 33195552 32223767 37320736
45066 37320736 41246871 40360278 36396066 28686191 17120942 10547403 19248453 39301431
45058 39301431 55437400 58861357 52174249 39039649 21661122 7962270 7505621 17446055
45050 17446055 24030963 21326399 17884999 21074264 25201359 21141427 10148943 2233823
45042 2233823 5663990 21367318 42310794 55664120 51780624 35270925 22989607
45035 22989607 27535872 45170034 60919444 62350575 48765535 31483311 24633290
45028 24633290 30947668 38328404 36105415 30719641 35314714 46660109 46875101 30220879
45020 30220879 13176456 11221026 19020112 23285252 23370013 26120837 29298479 25957912
45012 25957912 21012126 26841224 41585261 46894396 32411985 10785449 1276168 7478131
45004 7478131 19707254 32330729 47224862 61947776 66146167 54078823 34138913
44997 34138913 20777767 20114003 27134074 33828241 35610714 32334145 28590654 31849096
44989 31849096 44345956 56965757 57526379 45975227 34498610 30802578 29384354 23371940
44981 23371940 16351403 15034602 17053298 15475190 11086780 10376437 14089999 17918189
44973 17918189 22959778 34361516 48712054 53906702 45476643 34255329 32784280 40647457
44965 40647457 48205977 49642194 47082801 44888097 44297118 43086853 39234442 35536345
44957 35536345 38613706 50002670 60859211 61223510 52762587 45677067 44575553 45489548
44949 45489548 46005585 48707912 53456522 55831463 55551305 57297356 60739095 59620597
44941 59620597 54183095 53954675 62945918 72065236 72445993 66479624 58439100 44577682
44933 44577682 22760366 3572307 -130725 10059231 22018867 29139606 32546324
44926 32546324 32415398 29199354 30579332 44025573 62055973 67278627 55429021 42970794
44918 42970794 46065398 59425128 63522302 49884669 32103467 29424129 42858687
44911 42858687 53243260 45417502 28670012 24857486 38554780 51217902 47886661
44904 47886661 36524102 32776676 37329149 40691501 41799152 47017228 55202307 58394966
44896 58394966 55349706 50677487 42354573 25701880 10338869 15254504 40327368 58469046
44888 58469046 47931803 22215807 14289496 35493980 62874003 68208835 49876676
44881 49876676 30854428 29778024 41093938 45975110 37640510 27927546 28592494 36250259
44873 36250259 42075243 47169518 56826684 65338002 61116087 46018725 35225846 35908062
44865 35908062 39896707 41396936 47107621 60555432 69666859 62309538 45511733 36145103
44857 36145103 37749642 39631723 36575842 36297667 45371120 58044385 63418512 57574175
44849 57574175 45017565 32528023 24752358 22795792 24060173 24535943 22679946 20192885
44841 20192885 18476624 15717825 8896125 -1167624 -7849008 -4038725 9101880 20743242
44833 20743242 21058457 12298655 5184027 5003411 7192731 7794737 11022056 21495442
44825 21495442 34242040 39484246 35548698 30594560 31379756 35938773 39351194 42307832
44817 42307832 49568622 60652693 66386238 58325595 41223493 31831381 42000719 65069499
44809 65069499 82976990 85731520 79415947 75720753 79350731 86790554 91721677 89107764
44801 89107764 78784134 67902369 65319374 70449257 72304257 63377416 49702634 42025745
44793 42025745 41352637 40365892 36977467 38224431 49040297 63287694 69691928 63913678
44785 63913678 51620168 40752437 33716802 28192187 23602031 23106419 27699235 32013148
44777 32013148 30747826 27564225 31147563 41784335 48856982 44609919 33716462 24507927
44769 24507927 17217410 7998967 -744189 -3734467 -3993975 -9609592 -18342910 -16823510
44761 -16823510 -369668 16270688 17553332 10317179 15603391 37858231 55954877
44754 55954877 51201806 33166619 25610383 32869132 36183030 24459952 11914252 16073161
44746 16073161 31336843 38810540 34939345 33786752 43008839 54375109 60624259 65929001
44738 65929001 73207774 74759201 64967579 51870897 45820341 44829087 41481068 36881035
44730 36881035 35980015 34901946 26066994 12787031 5796075 6662002 7635372 8017209
44722 8017209 16673732 34897142 49867083 51681814 46548741 45725117 50234895 54820218
44714 54820218 59047540 63965317 63119778 48918225 26552891 10732832 7776799 10700011
44706 10700011 13640022 20018752 30854390 35295576 23360541 2868499 -7763970
44699 -7763970 -2447893 7388391 11251235 12006760 15600592 18906570 16317296 11698034
44691 11698034 14158137 25103034 37563641 45764699 47676679 41056801 26204811 11367919
44683 11367919 6172160 9763431 13717395 15598285 19853141 26002013 27682216 24808913
44675 24808913 24808520 29217036 31111560 28917142 29433827 32813854 29588130 19556983 17376497
44666 17376497 28665037 36643394 27316011 13463888 15021983 27159444 29482034 19369019
44658 19369019 12684727 14460430 13154700 6188109 8045194 25646019 44733068 50361717
44650 50361717 45957583 42448139 41217366 37945249 33343297 30338948 27762960 24343758
44642 24343758 22677046 23764869 24329075 23707390 25560582 28869691 26297396 15993648
44634 15993648 5568987 -327544 -5802555 -11548209 -8946042 5108697 18556974 20027343
44626 20027343 15397349 17396428 26289873 32545947 32638366 30586560 28449965 25972489
44618 25972489 25140504 25042048 18045219 2731066 -5734582 6898218 30231796 40262154
44610 40262154 33438831 30911823 44761487 58964727 54378441 37059664 26289351
44603 26289351 24504517 17943533 4594205 2013070 20894839 45836476 54796515 48827768
44595 48827768 46593654 51916981 45828922 18203471 -9367713 -8278082 18825018 43205468
44587 43205468 49324246 47646568 46872304 37916457 16917554 2555612 10622163 25501691
44579 25501691 20283519 -1600544 -9102079 11646696 37614324 40866446 22928831
44572 22928831 7073100 8227543 21340210 32734853 33739678 26068711 19242289 20572206
44564 20572206 25991588 25245046 16770816 10097440 11285138 14703102 14084559 13391865
44556 13391865 19153010 28131454 31635475 29081733 28477329 33493006 37295917 31572365
44548 31572365 17842033 7723601 12989674 34688310 60133650 71602120 60969984
44541 60969984 36727325 15898050 9335774 14951152 23024369 25863780 23156352 20295692
44533 20295692 22105621 27390372 29660946 24091979 14000789 9532977 18383986 36968411
44525 36968411 52119616 53913064 46544568 43539147 51767233 63964522 68442995 61513995
44517 61513995 47195086 29864779 13435728 4681677 9485131 24989509 40797300
44510 40797300 48931832 48968076 44084359 37163777 30984232 27204377 24300090 20693641
44502 20693641 19859257 27084637 40573199 51359804 53613326 49909459 44639846 37651441
44494 37651441 27194436 14638965 3350284 -3485841 -2129132 9647265 26711198
44487 26711198 37578831 35622972 26196736 19097286 17341397 17347548 16657532 15861149 14645438
44478 14645438 11995136 10868806 17540501 33582356 51029450 58503397 52176898 39280889
44470 39280889 30349690 29057395 30888454 30926401 29963312 31712769 36910229 43015659
44462 43015659 47904914 50596721 49459663 43161028 33304676 23748014 17631407 16405238
44454 16405238 19925153 25849633 31798181 39720335 52983139 65976081 64381086 43536966
44446 43536966 19702529 11902204 17438627 19046214 13212779 13760726 25060730 30631671
44438 30631671 17685531 -2351934 -10956926 -9173762 -12291003 -24264379 -32586233 -27363954
44430 -27363954 -13325772 -1678534 1324525 -3482215 -11149640 -17013942 -21806319 -30231479
44422 -30231479 -40891287 -42996922 -30063226 -11903299 -3669547 -6269023 -8133024 -4506165
44414 -4506165 -2702272 -6834601 -9809175 -6059998 -2277917 -7099589 -16124127 -16385641
44406 -16385641 -4138199 9432133 11801260 3789645 -2079824 3692007 16616316 22299586
44398 22299586 11215017 -10099232 -22115596 -8282148 28554040 64993950 76793874
44391 76793874 62900731 45883784 44699544 53304343 54029831 45039982 39957444 42830158
44383 42830158 41838787 31611779 23250675 23512871 21798463 10706963 2770371 9322952
44375 9322952 17413498 9733171 -3673424 386407 18687068 25327644 15140272 12834016
44367 12834016 30824716 46836452 39264832 21194665 18467984 30870665 37967842
44360 37967842 33070838 28223838 28962730 24801317 7638549 -14205985 -24300861 -13552346
44352 -13552346 12076019 33756011 33989875 15578817 674722 2993234 9262680 242179
44344 242179 -18336529 -23438123 -9395241 5211122 7411548 7125420 16992718 31184911
44336 31184911 35907534 30103441 23776336 22656300 25077154 28670865 29857667 20992786
44328 20992786 -394405 -20615098 -19623737 4898138 31505851 37861646 24000263
44321 24000263 7217302 -1845268 -9037860 -21397768 -31079343 -23404913 1411341 24923162
44313 24923162 32431112 29622723 29893796 32114135 23233266 1619028 -15412782 -12247326
44305 -12247326 6040817 21727681 25106133 20651682 17400828 20139817 27528983 33081989
44297 33081989 29772305 18419014 9388666 11397473 21179126 29316602 33271043 37686372
44289 37686372 43422356 44532640 37633622 27812158 22714794 25208699 33356958 42984274
44281 42984274 48541665 46068012 37795033 30463714 27526872 26457601 24496900 22415190
44273 22415190 21346023 21106239 23386084 30825633 40540074 44873001 41656583 36688572
44265 36688572 32273074 22337895 5647787 -6012095 -4043134 563915 -8167306 -24827758
44257 -24827758 -28250073 -13459276 277382 -1705184 -9843778 -8882094 -833244 4046688
44249 4046688 7829711 19991582 37539026 45994117 39378424 26568761 17477464 13661209
44241 13661209 13091312 14105174 13451871 9350704 7118396 12779276 21069820 20453203
44233 20453203 11308569 7186316 14312936 21986849 19815794 13390388 13815144 20552867
44225 20552867 24970271 24227627 20957201 14553429 4508978 -1291342 5374195 17589712
44217 17589712 19107781 7574260 -1153985 2900080 7907354 -1891426 -21526352 -31687914
44209 -31687914 -26203422 -19305042 -23163241 -29978723 -23915524 -4089798 13655389 16635544
44201 16635544 9213275 4606676 7978320 12100410 8665819 -99622 -3720110 3139140
44193 3139140 13070493 15220283 10313920 9615713 17039448 20733171 9853420 -6834128
44185 -6834128 -10634870 1648422 15487212 22156450 28509190 37733342 37308879 19018372
44177 19018372 -2066342 -5658856 4699566 9061720 3127866 2886462 16817578 33148988
44169 33148988 39768261 39422618 37958448 33564962 27050564 27773247 37240345 39701160
44161 39701160 23302408 274272 -9608682 -7570009 -10291080 -20734502 -23937648 -12645953
44153 -12645953 1047924 5103542 3489962 4420425 4644341 -3191893 -14435301 -15713511
44145 -15713511 -3111561 12165332 17901612 14212402 10010298 10991807 15747234 21331977
44137 21331977 26559307 28963699 24962086 17213059 16020933 25838215 34250698 24992802
44129 24992802 1524707 -14291169 -10406379 256223 -313080 -10517543 -14288299 -3804103
44121 -3804103 13594818 26967888 30577176 24163946 13197445 6438645 5861094 2693096
44113 2693096 -8634635 -17591839 -9025943 15896595 41119681 55065294 56604470 44732860
44105 44732860 18409357 -10907900 -22321107 -9304464 9488562 11203054 -5871570
44098 -5871570 -23870499 -26365270 -12092085 7472423 18412606 14745829 2649829
44091 2649829 -6469634 -7869163 -6306644 -7764431 -12209671 -14377119 -8455607 6543912
44083 6543912 22686105 27745334 18750293 6418960 233657 -4087922 -13161888 -20193151
44075 -20193151 -14998315 -3737687 -638771 -2780262 6376400 26981404 37841055 27176390
44067 27176390 8052395 -4903704 -14007389 -22890268 -22383249 -7401021 8323011 10897332
44059 10897332 6432458 7221188 11425806 12929534 17211274 28097612 31901085 17035030
44051 17035030 -1599848 -2420769 7274959 2477778 -18259872 -31838359 -29695029 -27309011
44043 -27309011 -30647160 -24086071 -2465681 12961709 6312521 -8753685 -14383759 -17187703
44035 -17187703 -30451342 -44293826 -37670490 -10768400 16484981 32190950 38679839
44028 38679839 36087003 21706688 5826953 7511569 29147066 50955770 57431828
44021 57431828 56492259 64737382 83610724 99011510 99144211 85818265 70914681 65712127
44013 65712127 70932867 75113212 66603474 48757494 37654781 41761450 50463962 49081289
44005 49081289 40113997 39852704 54283984 68568496 65621553 48325486 35372404 38007748
43997 38007748 49611086 58473224 61565887 61727103 59689333 56433838 57529425 65532478
43989 65532478 71047704 61736390 40214570 23389084 22509804 32781122 44437445 53655265
43981 53655265 58125748 52597755 37512480 25090072 27475917 42310623 57061644
43974 57061644 63806477 62742334 55284280 42544533 29070575 20395818 17331470 18151173
43966 18151173 23865885 34497063 42924047 41233563 32239631 25867042 24115631 18901227
43958 18901227 6260488 -6604320 -11590130 -8740350 -1378918 9675806 22118068
43951 22118068 29787692 30364530 29394795 30766361 29593357 21901501 15104339 18801015
43943 18801015 28987543 32721685 27365973 23367984 26149615 27160559 18501950 6377903
43935 6377903 1466954 2884654 1663019 -3734999 -5832152 -1179994 4793431 7308239
43927 7308239 7846162 7669524 4252193 -1552850 -3031841 1267761 1488561 -9258314
43919 -9258314 -20199599 -14379250 7121717 25099966 27702608 23045547 21581340 19062728
43911 19062728 7601264 -5759132 -5760263 9074067 24508210 30951793 33606360 39319916
43903 39319916 44321529 41240277 30885688 20679200 16257577 19149977 27122998 32049810
43895 32049810 24264617 6086777 -5398302 1508242 15157551 14533709 -1131005 -10299215
43887 -10299215 1658515 24613642 40207145 43804693 41508985 35941640 26907296 19548946
43879 19548946 19161372 21163801 17814341 12331135 13988560 20692798 20791681 13715394
43871 13715394 13409595 25727437 37316004 36364693 30885257 32989332 35859112 23821271
43863 23821271 -154627 -15598068 -12876731 -3151660 2505855 6630030 11755875 10610150
43855 10610150 1898615 1705963 22279294 48187685 52948931 36443042 25562707 34681533
43847 34681533 45541080 36473607 14701075 3258779 6599541 8856141 2289924 -3081324
43839 -3081324 -687329 1286852 -1927201 855229 17786068 35134246 34025762 18459242
43831 18459242 9276493 14051855 20758564 20780142 19872862 22761536 23958221 20349481
43823 20349481 17785643 17780004 12636029 2705670 2527041 16838494 25372957 9116483
43815 9116483 -19004615 -29120803 -13637727 7595960 17063445 14899288 6256213 -6003440
43807 -6003440 -13524074 -6512968 8722988 12519910 -1196615 -14932818 -11675787 3953792
43799 3953792 16188519 18317069 14587439 11713162 15645211 28209005 41319851 43287996
43791 43287996 34808944 27901502 25483033 16565703 -1474309 -12171574 -3590346 11050617
43783 11050617 11240441 -2670692 -14715017 -18545613 -20650141 -23054284 -19655881 -9653637
43775 -9653637 -1205380 -142033 -4500515 -10496196 -15763340 -16986059 -11529252 -1539412
43767 -1539412 7833606 12421765 9323196 -723659 -8715168 -4538359 6924081 8678716
43759 8678716 -3200203 -12080548 -8060893 -5193173 -15945405 -26343887 -19085636 -6657595
43751 -6657595 -13031546 -31379275 -31803420 -9164313 8855125 5588436 -2918654 1186400
43743 1186400 12511331 20348922 26904334 33070563 27905918 8796787 -6396112 -4172195
43735 -4172195 3708083 655852 -8668246 -10454230 -6411194 -7171827 -11335801 -9831410
43727 -9831410 -3479523 910546 4987294 13048544 18538490 12939390 2506999 -110609
43719 -110609 4014576 4247333 -324763 -2276022 -2026563 -5066547 -6331624 3684303
43711 3684303 17970493 17578727 166 -14525115 -10078488 6402377 19123243 22743130
43703 22743130 21433650 19633016 20131201 23366603 24553810 18812650 10953420 11640989
43695 11640989 22385018 33250115 36255201 31396859 19589628 1832918 -13376727
43688 -13376727 -15380208 -7647660 -5781833 -14926219 -22270733 -17379987 -6439134 635200
43680 635200 3620096 3876586 -3306370 -16313653 -18957637 802293 31341707 49963151
43672 49963151 49528637 40804156 34219472 32036531 33944534 37276309 34781112 24680952
43664 24680952 19837940 33318526 56581396 66612643 55645242 39877276 36014849
43657 36014849 42463609 48326649 48690048 44187570 35287259 24659488 18333575 18370792
43649 18370792 20264786 21708824 26126749 32370667 29958894 13020514 -7577329 -15154312
43641 -15154312 -6125733 9678135 23042886 31312606 34448995 34937738 39536161 51534873
43633 51534873 61857138 56721120 34713735 9167488 -5781266 -4557882 11219102
43626 11219102 32484176 42565954 31301826 12156726 11520466 35145823 58135566
43619 58135566 56165215 34026637 12765477 1151634 -4971435 -4866769 5855940 19154128
43611 19154128 18697823 2581795 -13022395 -15903350 -10004119 -2763741 5071705 11572946
43603 11572946 9825392 368160 -4485180 2012333 9971471 8923094 4398783 6304651
43595 6304651 9969863 4080625 -7757795 -9623168 3275851 18145497 23398758 21424971
43587 21424971 19266769 17609137 14422777 11501483 11820232 15540461 22018312 30548892
43579 30548892 36571597 33423176 21719883 11451835 10280384 14394014 15558332 12669911
43571 12669911 10271089 8778527 3807549 -4566053 -8946487 -4806141 653772 -4322621
43563 -4322621 -19984577 -31504163 -25099182 -4981975 10918867 11971007 6143873 8024201
43555 8024201 19920446 29133892 22669740 1864960 -17457914 -19386703 -4361611 9955656
43547 9955656 8590109 -1492108 -50215 17935453 33740048 30400710 15319775 6902603
43539 6902603 7713431 5397291 -4196873 -10756190 -7118226 664729 4383747 3645915
43531 3645915 708735 -4659241 -9960222 -7996316 3795811 17750686 24486022 22365609
43523 22365609 15471946 7906226 3678749 6629298 16053714 26294498 33404357 37866351
43515 37866351 39143915 34155630 24571237 18829079 21426452 25242634 20372174 7167564
43507 7167564 -4783056 -7969070 -2284334 8864957 22522224 36081422 46468133
43500 46468133 50524798 46095210 33767948 17751670 3790787 -3679372 -2148468 7722548
43492 7722548 18593705 18773345 4659308 -11469671 -13332440 601953 16713198 22723504
43484 22723504 16994999 3784847 -10673329 -18229093 -16134548 -14670415 -25422401 -40702526
43476 -40702526 -38778453 -13986670 12631841 20103047 11822029 3849964 1321951 -1042402
43468 -1042402 -4121958 -4092869 -2286312 -3308186 -5518974 -2448959 8334374 24232180
43460 24232180 41370959 52974488 49793806 30670567 8401755 -3144284 -4417357
43453 -4417357 -5938793 -13148589 -22782918 -30089762 -32246086 -28046920 -20174629 -13707935
43445 -13707935 -8035514 2951658 17827292 24503454 17822153 10095253 13980825 24550593
43437 24550593 30085347 31065150 34435883 37447861 32988067 24656430 20796754 19326621
43429 19326621 14751039 14315239 28739189 51059876 64029535 65688952 67340840 68307143
43421 68307143 55948826 32492164 17891999 19841250 22886690 15684890 8320618 11805822
43413 11805822 19267411 20277870 17718041 17145964 13758204 3804568 -3299400 1825248
43405 1825248 13216208 19747069 20744032 19913508 14638962 4443280 -464577 5723682
43397 5723682 9343363 -6330669 -34926559 -52698710 -47387355 -28106535 -9520048
43390 -9520048 873491 1932681 -2091219 -2283918 5581506 14711394 18676212 22949093
43382 22949093 32881272 36703878 18184261 -15093592 -34830298 -27691708 -11749477
43375 -11749477 -9914189 -20677945 -25812470 -17372373 -4345060 3652656 7719965 13287210
43367 13287210 19646319 19830108 9510418 -5657868 -12588172 -2499802 18982613 35128788
43359 35128788 33557479 18438077 5882253 6484757 14067859 14675350 6290888 3727579
43351 3727579 19709962 46233289 62761943 60811643 50980443 45189378 42300295 35296722
43343 35296722 23923327 13993105 9602539 10995369 15990531 20382588 21154698 20589863
43335 20589863 21936302 22031930 17049328 14197556 24269054 41147701 45039047 31100874
43327 31100874 17150125 14799398 12813729 2319372 -2435062 11130081 26731890
43320 26731890 23335664 12975961 23215871 48741389 54896720 31328125 8436977
43313 8436977 10521443 22386341 18460797 917635 -10418075 -8137040 2118030 17281189
43305 17281189 34156435 41505331 33138627 21380786 20799071 25564834 20581430 9535034
43297 9535034 11655698 30551566 45250852 37655657 14796907 -2989771 -5660994 1451121
43289 1451121 8046821 7128734 -2281280 -14659794 -22686532 -25612228 -29347277 -35248196
43281 -35248196 -34008182 -16960145 9256844 26977485 27255087 18345264 11312691 4439500
43273 4439500 -9951385 -27290590 -31737399 -18340615 -3026914 -2180921 -10045108 -7767759
43265 -7767759 8789827 23009200 20451062 6990175 -123585 8233563 26519999 41444514
43257 41444514 41870154 27410812 10905292 7575777 18290137 28013586 24067939 11306762
43249 11306762 5105187 12717247 25745329 29633908 18358148 647275 -8331406 -3094485
43241 -3094485 6453163 8837117 6438389 9908975 21016886 32199458 41597103 53960258
43233 53960258 63949282 55057960 24345528 -5578994 -12337846 -1719035 4296580 -355666
43225 -355666 -2575532 4363951 10222604 6122884 -1042453 589049 12062746 25027659
43217 25027659 32257380 31563725 25222195 20755994 27013860 43610442 58174634 59809289
43209 59809289 51805125 44550630 39141459 27605395 9888652 -288071 7043356 22495782
43201 22495782 28898644 24298838 22088327 29340652 38339468 42694918 47268933 53454537
43193 53454537 48497745 24377819 -2435077 -8788600 2300128 6863707 -2565224 -7142360
43185 -7142360 4950918 17468508 11313742 -6605166 -16292425 -14129848 -11581114 -12444925
43177 -12444925 -9826221 -2652404 1534733 651769 1404723 7244349 14059667 18733453
43169 18733453 21852730 21521219 14849918 6495957 5230220 10208200 10950087 3572057
43161 3572057 -3471620 -4011772 -4149981 -10795042 -18592034 -17199845 -6828680 2199426
43153 2199426 3405302 29667 -2685689 -3822240 -3364094 1226872 9967481 15473850
43145 15473850 10232970 -980879 -3391004 9121029 24176287 26637238 18545198 12704564
43137 12704564 9730008 -3411915 -28851763 -46871689 -38951494 -11581445 13123043
43130 13123043 22698814 19827544 9924809 -3628574 -14905209 -18037825 -14378542 -8996465
43122 -8996465 -1851652 9690845 22222409 28877381 28865623 26981545 26335078 28742905
43114 28742905 37601465 51059370 57151578 46988014 29046426 18356933 14997035
43107 14997035 7004142 -7779419 -18313468 -18955542 -15816011 -12282485 -3658604 9133518
43099 9133518 14864073 7933530 -2336738 -5027480 -974832 2547556 1949045 -2176793
43091 -2176793 -6725176 -5726930 3359540 12730772 14135302 14379825 26140152 43435465
43083 43435465 45525896 29603814 18743247 27931296 42072561 40848085 27265651
43076 27265651 15598480 7312639 -2177260 -6085736 3790454 18923499 25295477 24989332
43068 24989332 27742355 29134775 18497349 2690808 -839681 7930721 13383436 13391550
43060 13391550 22541003 42757731 54582154 46222590 30753915 23610793 21013950 13747181
43052 13747181 6920045 10184583 18665614 19622086 12601255 9033598 14135498 20794581
43044 20794581 21425768 17149593 13799184 14391229 17149983 18347016 16259515 12598373
43036 12598373 9637594 7784360 8342172 15124656 27829151 37202557 34787636 25050014
43028 25050014 18317243 13847327 2122026 -16365509 -28905191 -29648931 -26179648 -22698859
43020 -22698859 -12698469 4268667 15406089 15718337 20078873 38652425 54557266
43013 54557266 46232380 22175881 10499294 18310583 24778481 15302349 519650 -3938178
43005 -3938178 2192472 10881830 17296107 16737886 4918424 -10410146 -12038665 3240813
42997 3240813 16987992 14920604 6758490 8011666 15611061 18099441 18896883 29165092
42989 29165092 43672259 45169922 31867011 20637615 20882864 24110580 23901583 27387812
42981 27387812 38373790 45624727 39677834 28600867 24840496 26956609 27107189 27359907
42973 27359907 34069976 42548490 42526197 35600334 33057215 37917366 42673766 44402881
42965 44402881 48340053 54846407 56182857 50112847 44903599 45764492 46944154 43426249
42957 43426249 40909225 46456630 56429633 61611906 59256850 52910880 44248865 32048548
42949 32048548 17306548 4260354 -2540622 63488 11768712 26287369 35546321
42942 35546321 39207739 44746893 54698604 60115794 52158471 34963624 20625036 15106682
42934 15106682 15211509 16447952 17668919 19390711 22208991 25844653 27411445 23543420
42926 23543420 15959958 10013891 5855547 -1688180 -11256430 -12675503 -2979012 5631042
42918 5631042 3920966 2091122 14100699 32407513 35399272 18063765 -1434396 -7013114
42910 -7013114 -670949 10080860 24544767 40675807 48003180 40151289 26677454 21935515
42902 21935515 26620665 29357632 24201134 18697614 24144565 42248852 62426486 71527113
42894 71527113 66913809 58630717 55812465 53787728 41183470 18316411 -335357 -3104757
42886 -3104757 8009591 24990691 42163527 53035641 49448743 31585305 11714516
42879 11714516 1065684 -826689 1715053 9884357 22849584 29114731 18369514 -1611089
42871 -1611089 -12309200 -7829036 111913 575926 -4391773 -7926440 -7790683 -3026513
42863 -3026513 9408200 27448294 39726492 36885469 24344155 16378499 18105162 20224039
42855 20224039 13481038 2541860 593692 12436432 28560836 37343739 38740431 42020989
42847 42020989 51843287 61254950 59496612 44040285 23823675 11870446 14130440 23449934
42839 23449934 25783196 15759358 4712943 8138619 25772925 41082089 42069716 34910508
42831 34910508 32741048 38165258 43889713 45578560 45279713 44007618 39581502 32806744
42823 32806744 28828809 29858603 31624323 29996504 27460161 29622662 37255414 44964323
42815 44964323 47388286 44388898 39388609 33991900 26061611 13495412 -1595551 -13775685
42807 -13775685 -18404543 -13816165 -1502435 13175489 22425867 22487496 18081840 16423061
42799 16423061 18101954 19586819 23503460 37365893 59429812 74825199 72048847 57062114
42791 57062114 44310237 39029838 36133533 32315061 29740726 29012584 27724978 27320038
42783 27320038 33379507 45685266 53860814 47818854 30228715 14939712 13618884 26261928
42775 26261928 44787233 63022149 79568987 90790544 87298497 64505338 34500830
42768 34500830 17730162 20034037 26368226 21992562 11337921 8147964 14348159 19794153
42760 19794153 19259179 17799582 19488247 21826631 23597361 28601426 37328121 42621128
42752 42621128 39263282 32782670 33035050 41753797 51175168 53714342 49353774 43814983
42744 43814983 42175507 44985954 49342567 52328582 52549859 49129847 41833097 33209755
42736 33209755 27999185 28222821 30653316 31086829 29253635 27750396 28652339 33528906
42728 33528906 44017225 58838544 71578529 74465185 64747645 47759898 35236643
42721 35236643 37922894 54081127 67059601 62946660 50188083 49865999 64817278 74272610
42713 74272610 66170053 56775237 63488847 74194024 65523562 41475063 28212897 33758003
42705 33758003 39203830 32651775 25995415 29368494 32442888 25067137 17494922 23070089
42697 23070089 34798640 37392075 33330875 38506455 56117339 71389624 72251405 62756996
42689 62756996 54572593 54196701 60115824 66249164 66935825 61801594 55148732 49669049
42681 49669049 44954949 43218763 48866471 58831664 61819427 52832943 40395779 33209025
42673 33209025 28807330 23422468 23147444 33919784 48381767 55522734 57308331 62567799
42665 62567799 69931187 71835714 71629839 79645631 92357565 92416652 73206341 48900337
42657 48900337 34893885 30943603 29677318 29661257 31674682 31591745 26436799 21281178
42649 21281178 21664676 23684300 19446367 9617012 3731226 8887598 22510851 35546345
42641 35546345 40394940 37426869 35161468 41167779 51561812 53693827 41493111 23925067
42633 23925067 15324473 21139396 35914281 50588401 57351175 51422840 34503007 15597263
42625 15597263 3460492 -1883596 -6442808 -11467829 -10132475 2870134 21800293 34021218
42617 34021218 33407692 26124575 21892862 23315663 27262870 32812862 40296227 43691144
42609 43691144 34598629 17810207 12522885 29208056 52786726 59895319 47778636
42602 47778636 33468238 27783844 25817201 24042372 29513947 44262819 54358712 46513387
42594 46513387 27790995 17486802 23798517 38270541 50143934 56402910 58304052
42587 58304052 56608794 52381923 47823395 44818221 44316138 45676311 45171942 39137696
42579 39137696 31454072 32216185 43346531 51206040 42453734 24184353 17663359 31243197
42571 31243197 49300568 52021696 38818619 26468855 28303776 41090523 51404799
42564 51404799 50549197 41867483 34916839 34485695 37232723 38781987 40073767 43857065
42556 43857065 48524166 50518170 50802298 53072630 56578935 57422008 57161133 62386347
42548 62386347 73151965 79237870 72710959 58268145 45420291 35940255 26852028 21697741
42540 21697741 27886216 41992057 48039759 35921581 15105914 3748168 8334612
42533 8334612 20797237 32775286 43888154 55128304 63054961 65803527 68739297 76697372
42525 76697372 83756703 79468044 65432421 56553166 61617273 70099507 65440079 46730244
42517 46730244 28592407 21922359 24913439 33696948 49760443 70248779 80933552
42510 80933552 70705096 49032707 36719066 39224389 41047703 29886766 14651704
42503 14651704 11693273 22220232 34310287 41869307 48808744 55648543 55316326 46112719
42495 46112719 38136404 40211725 47745144 50259970 45144039 36975546 28452875 20279840
42487 20279840 16311240 19409926 23745380 20810860 13429967 14053042 26531284 38776399
42479 38776399 38509741 28758945 21313097 20632033 21609942 19257946 12795611 2607057
42471 2607057 -8692906 -13008785 -3069649 16620853 32694198 39250904 43904585 53596989
42463 53596989 62206484 59933595 49733927 44206290 47112741 48129453 38683968 24320413
42455 24320413 15812003 14403264 13126504 8839366 4696910 1885067 -2639652 -8471016
42447 -8471016 -9141432 -1012207 10745917 19937851 28875698 43621404 61246854 68973767
42439 68973767 58601548 37653157 22414743 21190458 27613931 30585255 27401047 24346470
42431 24346470 26214962 30238017 32010615 32822464 36645021 42429781 44903418 42285958
42423 42285958 37883271 34215079 31654346 33653064 45802909 65693615 79743175 76244325
42415 76244325 58988592 43415001 41034719 50593196 61649414 63293678 52089111
42408 52089111 35309368 24557668 23812324 26787091 28071664 31475781 42668904 58031023
42400 58031023 66624921 60835468 41498306 16791547 -252083 140819 12385998 18162865
42392 18162865 9192504 355208 9368592 30143851 41004245 35742380 29542395 33453594
42384 33453594 40270368 40534844 36670066 33225288 26714612 15438338 8613135 14137611
42376 14137611 24564806 25929380 15115991 -757606 -16253330 -28266730 -29472671
42369 -29472671 -13638825 12635885 33404819 40169582 38501342 37931377 42457526 51635050
42361 51635050 63087219 70521900 65475020 46801310 26223353 19054590 28125382 40051356
42353 40051356 40119237 29129746 21258706 25492704 35589063 41209709 41404745 40319793
42345 40319793 36793833 29098156 24810557 31685042 40506614 33465997 11939857 -1014463
42337 -1014463 7848418 24139803 28791303 23399719 19829213 18188738 11773058 4279068
42329 4279068 3882413 5713689 -1539165 -13739341 -13864595 2022117 17341792 18069849
42321 18069849 10400177 9452847 20048184 34926214 45248097 47053762 41402480 32836066
42313 32836066 26558642 25366375 29038674 34550157 35982632 28811106 17015732 10530290
42305 10530290 12160885 13944019 11083055 10538988 18346219 27811513 30496549 30149586
42297 30149586 33760314 37369994 35026695 33852202 43146906 54505687 51727216 36932499
42289 36932499 26936004 25313716 19322800 5751469 -2002825 2703737 9644579 11462293
42281 11462293 14794815 24221221 32215918 32212544 25356242 9341869 -19742136 -48255426
42273 -48255426 -50830801 -25801385 -1413650 6065584 14204953 35780752 46293418
42266 46293418 19837745 -23207644 -39766487 -24090404 -8737798 -10738683 -13169320
42259 -13169320 -3118409 6744495 5561393 4761124 15811315 28836670 29593795 22540629
42251 22540629 22346411 33178675 47646032 56862525 53177551 33558840 8550965 -2981158
42243 -2981158 3679106 12927572 12940751 12347080 21680387 32262422 30011680 20084698
42235 20084698 18591226 25108109 23270675 8261514 -5153827 -5959895 -1925312 -4291119
42227 -4291119 -10673128 -12229098 -7861362 -1544979 6883925 17811266 24182386 19480694
42219 19480694 11492421 16573733 38124460 59626988 62628029 45403076 21356301
42212 21356301 5925760 8528968 29255655 55830598 68725484 58139486 34956111
42205 34956111 18705477 16313201 19175269 19212327 18893667 23812982 32799856 39112123
42197 39112123 37788461 30386100 25261377 31770652 49422146 64936931 66596305 58887829
42189 58887829 54309722 53923854 49095710 41884669 46803734 66661972 82407896 77107443
42181 77107443 57818118 42969544 39253665 42887232 52582613 65724033 69424407 52471478
42173 52471478 23262953 1588924 -5213720 -5240272 -4714931 -2243100 1325018 2089927
42165 2089927 2664518 9225936 18279919 19283945 11537938 5678535 6897709 9445007
42157 9445007 9592619 10829354 13368675 11664117 6175183 5085877 10348886 14484251
42149 14484251 15167092 19423469 28031737 29885045 19486167 7220815 3762561 6034406
42141 6034406 7077213 7700081 8836900 4784864 -4491554 -6216818 6467263 19101225
42133 19101225 14728913 -210899 -5841728 892562 4172587 -4009987 -12636949 -9661252
42125 -9661252 3197364 17725951 29403585 35399653 32135046 20988462 10683897
42118 10683897 9508157 18151401 30947463 40108263 39587084 30511330 22255942 22036621
42110 22036621 24264884 17358736 784641 -12931164 -14700484 -9688932 -8773289 -15356026
42102 -15356026 -23624574 -24881183 -13339091 9153530 31377523 40234130 32977281 19019597
42094 19019597 8592385 4000893 3126539 5453395 10924848 17256711 22407549 26596349
42086 26596349 28829759 25609178 17799339 15166500 26954450 48037786 61082272 55310379
42078 55310379 38597679 26980635 25468877 25116879 18277846 9397655 7108885 11283470
42070 11283470 14335246 12593412 9226445 6531140 2830355 -1432861 -1386766 5479312
42062 5479312 15688737 25422729 33511297 35672993 23926860 -1033640 -22918026 -25048834
42054 -25048834 -10680118 614855 -2797202 -11800572 -10572277 2712010 14320624
42047 14320624 12192370 -75012 -8569822 -6011859 1703362 7246812 13050481 23339436
42039 23339436 30321101 21284923 -195192 -14151999 -10159921 -116913 2518960 2658575
42031 2658575 10495636 19929171 16356603 -468418 -17621442 -29042754 -37973809 -41663333
42023 -41663333 -31661400 -11509660 2125141 645134 -7547422 -13137045 -16706993 -18040979
42015 -18040979 -9502906 10371757 28305363 32072572 26597997 24726836 29544212 35712632
42007 35712632 41497551 48253161 52354358 48782064 40929613 37321207 39255254 39773488
41999 39773488 34512217 26251059 18768530 13092820 10234481 10928012 11470088 6413651
41991 6413651 -1846804 -2006533 12637564 32674626 40500594 30314938 15515576 13114102
41983 13114102 23957080 33779083 32883245 26966825 25176255 25675989 21575266 16007234
41975 16007234 19640398 33392677 44622514 43407786 33513967 23583124 16315931 11652147
41967 11652147 12437241 19208450 24563228 20537370 9346550 1166998 2802044 12184711
41959 12184711 21689989 23802488 16529140 6332206 3038723 9913060 21995235 34270428
41951 34270428 44913903 49545803 42217779 27293526 21002383 33031310 53508160
41944 53508160 66384250 68738434 67324334 63233588 53347922 43548561 45895940 61036496
41936 61036496 74880061 75877522 66867272 57242206 51438525 48078366 43551015 33820033
41928 33820033 18943679 7587123 10028078 24306486 36494235 37782321 33974523
41921 33974523 33890435 35876159 32403743 22554275 12273235 5247362 902912 88312
41913 88312 5328501 14402998 19984128 18846530 17311239 23268680 34623097 40507803
41905 40507803 34978519 25272028 22724486 27797749 29839762 22346535 12045988 8599328
41897 8599328 10443572 8242719 469620 -3176654 3884406 14755183 18221198 13384387
41889 13384387 8358240 6630807 2878668 -5953373 -13105959 -11445197 -5644022 -6425864
41881 -6425864 -13713881 -15273190 -5420720 4160782 -174358 -14299094 -21675758 -14829578
41873 -14829578 -992385 11922899 23004291 30496689 28122942 14276807 -3816779
41866 -3816779 -19551940 -32271509 -39432870 -33877667 -15792229 1573872 6153860 -33126
41858 -33126 -8589191 -16199844 -20370016 -14170993 2950200 17562036 18681482 14752417
41850 14752417 19826895 29239740 26434137 10923591 751527 5781554 15730931 18782007
41842 18782007 16935333 17289568 20838691 25497147 29070345 24889507 6565566 -17849871
41834 -17849871 -29028414 -20403472 -7093285 -2983322 -948704 13141056 36149057
41827 36149057 50508153 47123962 34618619 26996391 29359792 35064546 32806998 18135159
41819 18135159 -407702 -10158718 -9160006 -5384408 -1821786 6449095 17959298 21377365
41811 21377365 13662078 9297550 20915497 40325604 50185849 46848888 39899448 35174440
41803 35174440 30492942 24658476 19976618 17985756 20270181 29082026 39803203 39601203
41795 39601203 23144732 2832796 -7310011 -10347556 -16046499 -19790999 -9733463
41788 -9733463 8855352 16236219 6670416 -4123451 -4581041 -3224739 -10815147 -21063667
41780 -21063667 -20798575 -10436529 -2952860 -6647937 -17398043 -25695460 -25163232 -15471927
41772 -15471927 -1656321 8927653 10800044 3015903 -9560305 -16688996 -9983511 5635763
41764 5635763 13380088 4722754 -7168360 -3273459 16932870 37899428 49649338 52892834
41756 52892834 46519558 28433544 9707733 8514210 24348662 35795278 30995067
41749 30995067 22382096 21503027 18625782 3402716 -10772493 -4742488 13881742 19142623
41741 19142623 4275487 -10747691 -10302839 -1916718 1250433 -427193 -420658 196536
41733 196536 -2631064 -5394379 -1841809 5379987 7153269 1177946 -4475786 -2429314
41725 -2429314 4590526 8313591 6226434 4599380 9905651 19964785 25754796 20998598
41717 20998598 8000044 -5247051 -11917921 -11753094 -11908851 -19999904 -32817868 -35807312
41709 -35807312 -20413858 1262207 8731408 -1144280 -12034557 -12296928 -7215224 -2821417
41701 -2821417 6739066 25236175 40898201 41241815 32475880 29143095 30976085 26209840
41693 26209840 14151398 7536637 12486373 21481236 27962277 33659756 38424921 36269025
41685 36269025 26195723 15559103 8412235 1631777 -3391528 2254401 19852257 36455613
41677 36455613 41604457 40783807 43591814 47764917 45191299 36456105 28486672 22799251
41669 22799251 16207856 8933822 2107954 -8712898 -26468183 -41550135 -39885664 -22832357
41661 -22832357 -8555452 -10960089 -25416050 -37799409 -39794933 -31747986 -17544421
41654 -17544421 -2198851 9311737 15237390 17195170 15436012 7586455 -5402890 -15803745
41646 -15803745 -15625598 -5093931 8145215 16996671 19757533 18321316 14462700 8384573
41638 8384573 -4300 -8351576 -10789579 -1978235 16002637 32310222 35618819 24372386
41630 24372386 7886761 -2754693 -4267323 -2139665 -3229187 -7804987 -9299210 -3050292
41622 -3050292 5102435 2679597 -13827035 -30330049 -28863348 -10268835 4833258 1964006
41614 1964006 -8453804 -7323356 4180538 6321319 -8332994 -22038407 -17651391 -3418961
41606 -3418961 1453766 -3593161 -3042410 5915640 6888614 -8688138 -24766672 -21509420
41598 -21509420 -2157190 12871438 12831779 5978321 3845188 6208364 3891914 -8554852
41590 -8554852 -24837416 -30492649 -16668595 7833141 22452574 16584297 1332566
41583 1332566 -4899318 2359579 13467282 20912709 25486940 27400266 22775475 12868689
41575 12868689 7654653 13432436 22542805 23124935 16278540 15164824 26279882 39283093
41567 39283093 39940661 28176206 16514297 12490497 10727878 4315827 -4150888 -8768859
41559 -8768859 -11297755 -17320961 -24833349 -26363804 -21613312 -18227004 -19244782 -19424223
41551 -19424223 -15451639 -9403847 4979 17128845 35788634 39819415 25595822 10892879
41543 10892879 10260539 14366688 8101428 -3005621 -3469493 3865191 2503127 -8669512
41535 -8669512 -14256886 -10414722 -10356452 -17566323 -17221656 -3317140 7860772 4431731
41527 4431731 -663461 7731976 20929583 22116544 14404658 11407892 9649616 -5238151
41519 -5238151 -28477992 -36656814 -21112028 -256130 7463448 5578486 6377599 10228945
41511 10228945 9274863 2800082 -1869926 -161326 4809149 5894974 -2558335 -19561677
41503 -19561677 -36147691 -42988788 -39631278 -31630334 -20717065 -6263869 5050315
41496 5050315 3612579 -6507187 -8664436 2200709 9306711 -1855382 -20105048 -23281489
41488 -23281489 -9589731 1548635 -1819547 -10086527 -9958278 -4006110 -5343544 -19215675
41480 -19215675 -35631900 -38001911 -18065940 13978972 34929899 30324126 10671579
41473 10671579 -1150647 1902909 5978321 958074 -4387163 -438885 3700308 -5537301
41465 -5537301 -20230337 -18636156 1988364 19569052 19208832 12928650 17125713 26170779
41457 26170779 24600840 14800480 12341419 17541497 12935251 -7195166 -23638000 -18143635
41449 -18143635 1525225 14483165 14530954 11205043 9252011 2730358 -10369258 -21189352
41441 -21189352 -22400087 -18745877 -19660063 -26423202 -31429779 -27685436 -16001101 -4144762
41433 -4144762 85431 -3424668 -6580817 -2820918 3751135 3414715 -5330747 -12897765
41425 -12897765 -11392703 -4438584 -259363 472392 4023295 12618263 20121385 20106488
41417 20106488 14240543 9676929 9761355 10876472 9428310 8582714 13756222 22054016
41409 22054016 22300691 9311589 -6308665 -8878965 3357653 16310454 17371357 8389980
41401 8389980 -462737 -3613042 -2731034 -678582 2024016 6005597 11755476 18646948
41393 18646948 23115350 19820565 7853757 -5373309 -9953236 -3461148 7169904 13679758
41385 13679758 13827047 10147294 4416882 -3433946 -11233625 -13185481 -5877231 5382976
41377 5382976 10366893 5309424 -3066034 -6871679 -6169954 -4902200 -2066659 6007893
41369 6007893 16207705 19446742 12509864 2843564 -682084 3403746 11256641 18568113
41361 18568113 20623181 13967735 2754340 -1599165 7538964 23759396 35698567 39076712
41353 39076712 35675794 25808164 10577816 -777577 3790604 23659480 42383586
41346 42383586 44343075 31004935 17447153 15152591 21085187 22759299 12166285 -5491175
41338 -5491175 -16908649 -14835091 -5914564 -2666382 -8692424 -14858466 -10903064 1488527
41330 1488527 9495447 3574952 -10142907 -14851040 -2566970 14536648 18141303 7914821
41322 7914821 2583394 13834711 29437065 31187400 21498578 18287102 26624257 32083545
41314 32083545 25667016 18850097 23285064 28502996 16725427 -5596282 -10585055 12744290
41306 12744290 39397595 38399499 11322786 -12864742 -15943298 -7529370 -3683579 -5277371
41298 -5277371 -5701358 -6474457 -11203227 -11769737 2766071 24920864 32911140 19826105
41290 19826105 4257062 4688092 16033865 22116434 20966532 23509249 32862327 40557678
41282 40557678 43004875 47460085 57671073 64711801 58582982 41949726 25983312 16688851
41274 16688851 10993580 4581745 -839913 1180144 14131987 32221196 43393889 40766312
41266 40766312 29372687 18895991 12514404 7553508 4066994 4878161 7171194 2438353
41258 2438353 -11905008 -26743378 -30913770 -22951967 -10745683 -2983649 -2674562 -5229061
41250 -5229061 -1314673 13983518 32672423 38930869 25649958 2584584 -14199914
41243 -14199914 -17407460 -11153314 -3399946 236848 -1656675 -6029706 -7348449 -1877054
41235 -1877054 9849837 23371662 30638110 23115239 1619091 -17767718 -17284718 -73428
41227 -73428 10357758 -881074 -20701349 -26692408 -17378023 -10678876 -15405775 -19683469
41219 -19683469 -11463047 2670171 8421002 5386241 5825624 14035902 19078371 11959899
41211 11959899 480898 -1542925 5474412 8482855 2924668 -20067 8035297 18103940
41203 18103940 17050228 7231480 1209670 2258557 3495158 3456264 7491606 13489578
41195 13489578 12091707 4549297 4513955 15656940 23039244 16169446 5791321 4984429
41187 4984429 7063942 -1092985 -14038209 -15723003 -6977132 -4515314 -13084862 -18194420
41179 -18194420 -10176983 2054173 7862413 10227540 14983091 17032881 8990421 -4046169
41171 -4046169 -9977874 -6539370 -2914116 -5410105 -9519764 -7882794 -939377 3603720
41163 3603720 560256 -6195023 -8689808 -5316553 -2473652 -4584741 -7721382 -7103393
41155 -7103393 -5340401 -6239265 -5236549 3751611 13792809 9181354 -13084639 -35947897
41147 -35947897 -41345325 -29820204 -16729877 -14389952 -21876468 -28052854 -21657915 -2327954
41139 -2327954 16629476 20664776 9789998 -3078264 -8631238 -8070077 -3889749 4886811
41131 4886811 14877941 17379163 11952343 10797874 21021989 31727734 29551396 19635954
41123 19635954 17952078 26613240 30842590 20926110 4664201 -5586545 -8063407 -7899430
41115 -7899430 -5546774 3070963 16762047 26020347 22351800 8816365 -1455186 1388948
41107 1388948 13446016 22485962 22864700 20506016 22133642 24813289 19673589 2816821
41099 2816821 -20230875 -37995701 -39649698 -23654568 -3065007 4006114 -5252431 -12979869
41091 -12979869 -2640162 18398849 27500731 15620196 -2779921 -9804870 -4795021
41084 -4795021 -724213 -6570857 -19258974 -30476899 -35971659 -36868842 -34497216 -27578326
41076 -27578326 -16772697 -9674788 -15357117 -32091506 -45847131 -44813723 -31314643
41069 -31314643 -15702505 -3712821 4631538 8996431 9953710 13072281 22711453 32782908
41061 32782908 32556964 22057581 13221602 14208291 20472319 23797615 22562642 19406510
41053 19406510 15540402 12362463 13692564 20986626 29110178 31042491 24904496 13612596
41045 13612596 184921 -13275900 -23656112 -27321195 -22920018 -12936432 -2774603
41038 -2774603 2427575 2009038 399413 1500655 3645044 3225170 1894722 5424565
41030 5424565 15361509 26293086 31883835 29652286 20062879 6078970 -5906888 -10230730
41022 -10230730 -8282079 -5684316 -2943184 4072509 12895851 12614885 -1620245 -19626272
41014 -19626272 -28686129 -29328642 -30505253 -33371989 -30264371 -19392102 -10150903 -9752718
41006 -9752718 -12070050 -6367175 6641091 14825901 10621538 84097 -7027910 -10041951
40998 -10041951 -13377831 -13732728 -2466762 17265582 27614825 18200550 2075225 -1633895
40990 -1633895 5665265 6975258 -2245085 -7962259 -1256031 8754275 11956009 11988391
40982 11988391 14419049 13598067 4231778 -3753846 3502380 23030820 38523700 40865895
40974 40865895 33545660 21561325 7817372 -1507213 -972201 4552076 5257589 894405
40966 894405 -1050980 -441695 -4531691 -12197352 -12493561 -2849322 4586178 556283 -9130310
40957 -9130310 -15340544 -17954651 -18797874 -13556617 -907259 9394178 8683578 2732570
40949 2732570 2037092 4931791 2170618 -6326302 -11936664 -12298710 -13780203 -19393037
40941 -19393037 -24823421 -26578745 -24603581 -17538616 -5588431 2787286 -1072571 -10955127
40933 -10955127 -11802285 -2533253 1979258 -3848154 -5676308 6754130 20921992 21632075
40925 21632075 17138381 26043498 45588602 54415767 45500966 35164246 35561167 37980300
40917 37980300 31825356 22928191 20767162 20871361 14010567 3024032 -3969689 -9119362
40909 -9119362 -17914153 -23104000 -13932148 1112162 902397 -16236019 -26693528 -15420646
40901 -15420646 2428567 5913294 -1022894 -496199 7744149 6265351 -10350512 -24648843
$$ [...]
##END NTUPLES=NMR SPECTRUM
##END=
