##TITLE=31Pdec_LR-659-RM1
 THF, 124 sc
 5.3.2019
##JCAMPDX= 6.0         $$ Bruker NMR JCAMP-DX V2.0
##DATA TYPE= NMR SPECTRUM
##DATA CLASS= NTUPLES
##ORIGIN= UXNMR, Bruker Analytische Messtechnik GmbH
##OWNER= root
$$ XWIN-NMR		Version 3.5
$$ Tue Mar  5 15:24:48 2019 Russian Standard Time (UT+4h)  she@DPX200
##.OBSERVE FREQUENCY= 81.013821
##.OBSERVE NUCLEUS= ^31P
##.ACQUISITION MODE= SIMULTANEOUS
##.ACQUISITION SCHEME= undefined
##.AVERAGES= 124
##.DIGITISER RES= 17
##SPECTROMETER/DATA SYSTEM= spect
##.PULSE SEQUENCE= zgpg30
##.SOLVENT NAME= CDCl3
##.SHIFT REFERENCE= (INTERNAL, CDCl3, 0, 182.463)
##AUDIT TRAIL= $$ (NUMBER, WHEN, WHO, WHERE, WHAT)
$$ ##TITLE= Audit trail, XWIN-NMR		Version 3.5
$$ ##JCAMPDX= 5.01
$$ ##ORIGIN= Bruker BioSpin GmbH
$$ ##OWNER= she
$$ F:/spectra/data/she/nmr/P31/1/pdata/1/auditp.txt
$$ ##AUDIT TRAIL=  $$ (NUMBER, WHEN, WHO, WHERE, WHAT)
(   1,<2019-03-05 15:23:26.04 +0400>,<she>,<DPX200>,
      <continue with go, POWCHK disabled, PULCHK disabled
       configuration hash MD5:
       00 E9 B6 7A A2 85 ED C7 34 08 36 98 17 FE 4E 26
       data hash MD5: 32K
       04 67 59 1B 9E A8 84 32 23 53 EB 22 D7 B8 30 5F>)
(   2,<2019-03-05 15:23:36.42 +0400>,<she>,<DPX200>,
      <Start of raw data processing
       efp BC_mod = 2 LB = 1 FT_mod = 6 PKNL = 1 PHC0 = -1419.698 PHC1 = -31.40108 SI = 64K 
       data hash MD5: 64K
       DC BB 27 52 D5 8A 3A E8 45 CC F9 BC 0D B3 36 88>)
(   3,<2019-03-05 15:23:57.17 +0400>,<she>,<DPX200>,
      <pk PHC0 = -43.72776 PHC1 = 108.4 
       data hash MD5: 64K
       86 33 60 18 28 2F 06 54 F9 2B A3 BF B1 3E 71 6F>)
(   4,<2019-03-05 15:24:00.67 +0400>,<she>,<DPX200>,
      <abs ABSG = 5 
       data hash MD5: 64K
       2C 20 14 B2 50 1F C0 F2 73 94 4D 9C D1 64 B5 00>)
$$ ##END=
$$ 
$$ hash MD5
$$ 33 24 3C B4 7F 68 7E 20 4F E3 2D E8 26 E4 78 37
##$RELAX= 
##$RELAX= 
##$RELAX= 
##$RELAX= 
##$RELAX= 
##$RELAX= 
##$RELAX= 
##$RELAX= 
$$ Bruker specific parameters
$$ --------------------------
##$DU= <F:/spectra>
##$EXPNO= 1
##$NAME= <P31>
##$PROCNO= 1
##$TYPE= <nmr>
##$USER= <she>
##$AMP= (0..31)
100 100 100 100 100 100 100 100 100 100 100 100 100 100 100 100 100 100 
100 100 100 100 100 100 100 100 100 100 100 100 100 100 
##$AQSEQ= 0
##$AQ_mod= 1
##$AUNM= <au_zg>
##$AUTOPOS= <>
##$BF1= 81.014009
##$BF2= 200.13
##$BF3= 200.13
##$BF4= 200.13
##$BF5= 200.13
##$BF6= 200.13
##$BF7= 200.13
##$BF8= 200.13
##$BYTORDA= 1
##$CFDGTYP= 0
##$CFRGTYP= 5
##$CHEMSTR= <none>
##$CNST= (0..31)
1 1 145 1 1 1 1 1 1 1 1 1 1 1 1 1 1 1 1 1 1 1 1 1 1 1 1 1 1 1 1 1 
##$CPDPRG= <waltz16>
##$CPDPRG1= <>
##$CPDPRG2= <waltz16>
##$CPDPRG3= <>
##$CPDPRG4= <mlev>
##$CPDPRG5= <mlev>
##$CPDPRG6= <mlev>
##$CPDPRG7= <mlev>
##$CPDPRG8= <mlev>
##$CPDPRGB= <>
##$CPDPRGT= <>
##$D= (0..31)
0 1 0 0 0 0 0 0 0 0 0 0.03 2e-05 3e-06 0 0 0 0 0 0 0 0 0 0 0 0 0 0 0 0 
0 0 
##$DATE= 1551784821
##$DBL= (0..7)
120 120 120 11 120 120 24 19 
##$DBP= (0..7)
150 150 150 150 150 150 150 150 
##$DBP07= 0
##$DBPNAM0= <>
##$DBPNAM1= <>
$$ [...]
##$SUBNAM3= <"">
##$SUBNAM4= <"">
##$SUBNAM5= <"">
##$SUBNAM6= <"">
##$SUBNAM7= <"">
##$SUBNAM8= <"">
##$SUBNAM9= <"">
##$SW= 369.568048894756
##$SWIBOX= (0..15)
0 1 3 0 0 0 0 0 0 0 0 0 0 0 0 0 
##$SW_h= 29940.119760479
##$TD= 32768
##$TD0= 1
##$TE= 0
##$TE2= 300
##$TE3= 300
##$TEG= 300
##$TL= (0..7)
0 120 53 12 22 120 120 120 
##$TP= (0..7)
150 150 150 150 150 150 150 150 
##$TP07= 0
##$TPNAME0= <>
##$TPNAME1= <>
##$TPNAME2= <>
##$TPNAME3= <>
##$TPNAME4= <>
##$TPNAME5= <>
##$TPNAME6= <>
##$TPNAME7= <>
##$TPOAL= (0..7)
0.5 0.5 0.5 0.5 0.5 0.5 0.5 0.5 
##$TPOFFS= (0..7)
0 0 0 0 0 0 0 0 
##$TUNHIN= 0
##$TUNHOUT= 0
##$TUNXOUT= 0
##$USERA1= <user>
##$USERA2= <user>
##$USERA3= <user>
##$USERA4= <user>
##$USERA5= <user>
##$V9= 5
##$VALIST= <valist>
##$VCLIST= <CCCCCCCCCCCCCCC>
##$VD= 0
##$VDLIST= <DDDDDDDDDDDDDDD>
##$VPLIST= <PPPPPPPPPPPPPPP>
##$VTLIST= <TTTTTTTTTTTTTTT>
##$WBST= 1024
##$WBSW= 4
##$XGAIN= (0..3)
0 0 0 0 
##$XL= 0
##$YL= 0
##$YMAX_a= 33512
##$YMIN_a= -64531
##$ZGOPTNS= <>
##$ZL1= 120
##$ZL2= 120
##$ZL3= 120
##$ZL4= 120
##$ABSF1= 182.463
##$ABSF2= -187.1042
##$ABSG= 5
##$ABSL= 3
##$ALPHA= 0
##$AQORDER= 0
##$ASSFAC= 0
##$ASSFACI= 0
##$ASSFACX= 0
##$ASSWID= 0
##$AUNMP= <proc_1d>
##$AZFE= 0.1
##$AZFW= 0.5
##$BCFW= 0
##$BC_mod= 2
##$BYTORDP= 0
##$COROFFS= 0
##$CY= -3
##$DATMOD= 1
##$DC= 0
##$DFILT= <>
##$DTYPP= 0
##$F1P= 0
##$F2P= 0
##$FCOR= 1
##$FTSIZE= 65536
##$FT_mod= 6
##$GAMMA= 0
##$GB= 0
##$INTBC= 1
##$INTSCL= 5.30512e-09
##$ISEN= 30
##$LB= 1
##$LEV0= 0
##$LPBIN= 0
##$MAXI= 10000
##$MC2= 0
##$MEAN= 0
##$ME_mod= 0
##$MI= 50
##$NCOEF= 0
##$NC_proc= -8
##$NLEV= 6
##$NOISF1= 182.463
##$NOISF2= 159.3651
##$NSP= 0
##$NTH_PI= 0
##$NZP= 0
##$OFFSET= 182.463
##$PC= 4
##$PHC0= -1463.426
##$PHC1= 76.99892
##$PH_mod= 1
##$PKNL= yes
##$PPARMOD= 0
##$PSCAL= 0
##$PSIGN= 0
##$REVERSE= no
##$SF= 81.0140089999434
##$SI= 65536
##$SIGF1= 159.3651
##$SIGF2= -187.1042
##$SINO= 113.3802
##$SIOLD= 16384
##$SREGLST= <1H.CDCl3>
##$SSB= 0
##$STSI= 65536
##$STSR= 0
##$SW_p= 29940.119760479
##$SYMM= 0
##$S_DEV= 0
##$TDeff= 32768
##$TDoff= 0
##$TI= <>
##$TILT= no
##$TM1= 0
##$TM2= 0
##$TOPLEV= 0
##$USERP1= <user>
##$USERP2= <user>
##$USERP3= <user>
##$USERP4= <user>
##$USERP5= <user>
##$WDW= 1
##$XDIM= 65536
##$YMAX_p= 421089811
##$YMIN_p= -105383929
$$ End of Bruker specific parameters
$$ ---------------------------------
##NTUPLES= NMR SPECTRUM
##VAR_NAME=  FREQUENCY,     SPECTRUM/REAL,   SPECTRUM/IMAG
##SYMBOL=    X,             R,               I
##VAR_TYPE=  INDEPENDENT,   DEPENDENT,       DEPENDENT
##VAR_FORM=  AFFN,          ASDF,            ASDF
##VAR_DIM=   65536,         65536,           65536
##UNITS=     HZ,            ARBITRARY UNITS, ARBITRARY UNITS
##FACTOR=    0.456856943014862, 1,           1
##FIRST=     14782.0589164792, 0,            0
##LAST=      -15158.0608439998, 0,           0
##MIN=       -15158.0608439998, -105383929,  0
##MAX=       14782.0589164792, 421089811,    0
$$ Real data points
##PAGE= N=1
##DATA TABLE= (X++(R..R)), XYDATA
$$ [...]
42670 -4094539 -3555462 2088374 18714203 35268870 36259217 27621103 29551962 44575286
42662 44575286 54234342 49593142 42614044 40897577 33415457 13526237 -2671079 2131646
42654 2131646 18743486 22593997 6134827 -14957094 -24520393 -21163607 -11221197 1556553
42646 1556553 15846361 29240194 38309518 39512335 30140834 11927829 -6529507 -15175762
42638 -15175762 -12000643 -4973840 -3119251 -7080674 -10210425 -8246622 -4905582 -5949573
42630 -5949573 -10092786 -9972650 -1671464 11340073 23973017 33757479 38469430 36553526
42622 36553526 32656938 35170638 43651419 46254174 35968992 22202422 18405209 24679957
42614 24679957 31504433 34470043 34639650 29321397 15268366 -490665 -4949410 4545538
42606 4545538 16789836 19866180 11130337 -3802786 -14543320 -11566719 3056268 14140035
42598 14140035 11768026 6210174 12831758 27298841 31172268 19919009 8531461 8099512
42590 8099512 12805818 13325351 8266780 -1558006 -15665116 -25995779 -21060560 -4248839
42582 -4248839 5616760 -917152 -11569461 -12555838 -8255244 -10661260 -20095286 -27736425
42574 -27736425 -29725146 -28410941 -24872123 -18404462 -9227943 3462831 20271319 34331952
42566 34331952 33481755 15644395 -5256128 -14660670 -12287933 -7436147 -7018858 -12705422
42558 -12705422 -22015311 -27733074 -23706409 -14207019 -9160277 -9129275 -6671691 -3188288
42550 -3188288 -7986580 -16707738 -10075705 16325492 38891657 35250634 11645978 -11096747
42542 -11096747 -23297631 -24619423 -13348018 5149101 13663959 5315962 -2377686 6210726
42534 6210726 18747923 16218544 5812452 7014453 16739454 17284920 10708238 13642894
42526 13642894 21815752 13541655 -9168954 -16337690 4809399 30195394 35942160 28330994
42518 28330994 23234954 20463554 15333317 14723652 22996275 28213530 19939952 7265331
42510 7265331 3374586 5378999 5081870 6361661 14330008 19240539 10925238 417070
42502 417070 6488965 25546945 34926578 24599467 7041403 -5339651 -14717123 -24881158
42494 -24881158 -28896808 -19062861 -988222 11164784 11133414 7059734 11590966 27623925
42486 27623925 44980031 51530546 45713479 35384400 27047754 22319427 22945164 29657465
42478 29657465 35235372 29725353 16212194 10515704 19952437 33469927 39674292 42914511
42470 42914511 51806742 62668480 66679632 64989812 63386123 58532975 43652964 23878422
42462 23878422 12435990 13534770 20395226 27507248 33339468 33782521 25413610 13989970
42454 13989970 8430809 8195242 7641872 9261215 18705606 29384903 28371666 17665787
42446 17665787 12613943 17067794 17883099 8819668 1440275 3820052 6359441 1350398
42438 1350398 568846 16166058 35532616 35407083 16217572 2848615 10319670 25303486
42430 25303486 26635977 11658665 -4789225 -9689679 -3425216 4094311 4565912 224722
42422 224722 2231061 17161804 36278496 43831932 35778260 23348424 17175996 16371248
42414 16371248 16956179 22126077 35975802 52520986 60608657 58085366 52772769 50148501
42406 50148501 48763034 48456900 53287717 62442832 67008170 61844796 53440667 48728017
42398 48728017 42910774 28181583 9597795 262344 2329742 5097645 2674143 785532
42390 785532 2772244 2023858 -4648773 -7880122 -5515 10848169 12856353 9846600
42382 9846600 14796094 27386665 32794107 24118620 12848388 12092717 19369116 22637541
42374 22637541 16844473 7880830 4219013 10642998 27629129 50416173 68228494 69861787
42366 69861787 54080143 33377967 23721346 29168640 39288799 43423765 42926885 44314705
42358 44314705 45396019 38452102 25639919 18337408 18697956 15841738 6644218 5538039
42350 5538039 22353636 43549496 50734880 47441614 49546215 56959000 55813336 45214735
42342 45214735 39473249 42370645 40403145 26377238 10506825 1793019 -3262437 -5796055
42334 -5796055 2927862 23325244 38337432 35393934 24057611 19304667 20049251 17516200
42326 17516200 12849847 11851478 12606668 12931078 20252652 38715963 55597229 56864574
42318 56864574 48011945 42373689 37050495 20539135 -1491653 -10409598 -3406959 3139615
42310 3139615 478474 -2602971 -46826 1171396 -2517971 -2421548 5895752 11824118
42302 11824118 5110272 -8995352 -18001119 -16144765 -4464295 12495534 24421482
42295 24421482 21097531 7398483 1750575 12618671 27044244 29793855 22791561 16719101
42287 16719101 13936823 10564082 7416470 8122770 12095092 17837646 27029323 37745959
42279 37745959 41033728 32618316 21016346 16143538 17669041 22221537 31677502 43828239
42271 43828239 45866636 31297651 14228865 10934591 15031478 9312481 -3506446 -3371186
42263 -3371186 14554131 31724265 35020980 33921844 40466343 48835741 46793920 35933761
42255 35933761 28137312 28358359 31033835 30026304 25016694 20500631 22456176 32632942
42247 32632942 43830999 45715296 37328639 28071981 24479162 23065715 18954338 14021924
42239 14021924 12432927 14532741 18922101 24576133 28023920 25078021 17861864 12582666
42231 12582666 8386391 -1558274 -14385282 -14941394 4021874 29907423 47195442 55991856
42223 55991856 63395837 66716208 59413096 47001496 41733899 44010783 42346221 30632173
42215 30632173 13986898 -807743 -9067305 -4396612 15603024 39456020 50157748
42208 50157748 44895033 35290755 27988910 18939606 9286826 10877524 27655180 43794296
42200 43794296 41128417 21555737 3498308 818989 11588732 23431087 25176803
42193 25176803 17285472 13168946 24364225 43410394 50842858 41580966 32170034 36202950
42185 36202950 45962044 48192096 45414211 47715854 53050568 52010018 46532136 47401909
42177 47401909 55419555 59984201 55478676 45334454 30924332 11170447 -6321075
42170 -6321075 -8747232 4692571 22282561 37875302 54571420 68291212 65839596
42163 65839596 46427310 28239581 23660095 23329279 16447169 11517294 21068160 38045801
42155 38045801 45670013 42286965 37741026 31555765 15793632 -2288211 -2185425 20842673
42147 20842673 46190013 53776809 45493199 34498487 26514676 20487593 17316403 17681973
42139 17681973 17047956 11045820 2789648 116011 8296876 26759552 47911484 59105606
42131 59105606 53775169 41909060 40377271 50903248 58018251 51634249 39156116 29849085
42123 29849085 20976045 9050498 2449360 9547649 22749948 28056605 25070229 24740274
42115 24740274 31306656 38641524 41593986 39864134 33440723 24698421 21629049 28134162
42107 28134162 34908436 31580581 23483749 22779250 27199413 24360158 15482758 15938399
42099 15938399 29648524 41345119 40421969 36198257 41422810 54493205 66302963 72084610
42091 72084610 68662691 53535921 36308371 37376607 62424484 89065800 92479488
42084 92479488 75786094 61605843 61258797 66912715 68530062 63408393 51842418 37480136
42076 37480136 30819993 39426222 54513315 58593167 47262414 33844758 32015561 42305220
42068 42305220 55515107 61594355 56303934 46736660 47704680 64346833 82327818 85752504
42060 85752504 80414980 85562513 104798891 120756337 119922461 107943259 97218175 93216552
42052 93216552 96850876 106335739 111639290 101331950 81728347 75188452 90783450 110328012
42044 110328012 114202567 107485040 106155804 109120350 102952387 88800673 84532730 98502628
42036 98502628 117191639 123935041 118499878 112594129 114367357 122759645 131189978 132021823
42028 132021823 121690534 105683903 95775410 99065670 111134766 121524245 124232113
42021 124232113 121619424 119740221 121523183 124429476 124300952 120607239 116314377 113021036
42013 113021036 109426639 105498656 104405773 108217424 115201061 123612951 133657267 142119694
42005 142119694 140369661 124450581 104388369 96159107 104798475 121246412 134868319
41998 134868319 141979056 141960369 134072676 122623769 118318065 127139020 140854177 145606516
41990 145606516 139257836 133235713 135628764 139834675 135727341 126839053 126675487 137938445
41982 137938445 145985505 138547477 123700907 118995023 127552032 136059171 135087247 129437254
41974 129437254 125950064 122540860 115767143 110972162 116783539 133676313 153976867 169872716
41966 169872716 177078722 175009220 168448987 165431148 168971525 174414973 177903023 181249809
41958 181249809 183875489 177916838 159968346 141900230 139659335 153943894 171207287
41951 171207287 181889825 188424608 196004629 204485544 210441482 210612317 203406956 192678719
41943 192678719 187676795 191961410 195596622 188248366 177536754 181467756 201752539 218372579
41935 218372579 215544309 201136961 193163254 196988464 204745542 209639519 210729386 207915065
41927 207915065 201787941 197051722 198798650 205883875 213165946 219022190 225627202 232963917
41919 232963917 237608159 237253564 232686574 226013240 220500568 220905402 229319096 240597625
41911 240597625 246094902 242910027 236349460 232739681 233516927 237827007 246654934 260165444
41903 260165444 273132770 278722296 277929121 280205473 291214668 303827216 306877462 301122458
41895 301122458 299746359 311930141 331706497 345274095 344461869 331049286 313479593
41888 313479593 302203084 302150464 305342416 296112364 268209007 231949995 200898866 178418114
41880 178418114 162348458 154038185 153646517 153337334 145505104 133081737 122711246 113903004
41872 113903004 105197830 103541964 113921291 125978932 126432393 119431873 117379016 116961280
41864 116961280 105641993 88924758 85770711 95032754 93716871 75643969 63747660
41857 63747660 71295622 78709979 67958785 54615785 60898266 77987311 84380954 85137542
41849 85137542 99177403 117537245 111263156 80336257 59296201 66949610 81861533
41842 81861533 79821183 67399715 61106144 57002834 43291179 26872043 23919535 33170992
41834 33170992 40251335 43400816 53650231 69960544 74946346 61378473 46415623
41827 46415623 48910254 63331686 68764756 58468264 47054807 47621898 54089403 52941528
41819 52941528 44054997 39190339 42836927 46292323 42688238 37132463 36248217 36399908
41811 36399908 30757278 22415129 21043190 28650651 36646649 36734295 29457420 23026456
41803 23026456 27173063 44478348 63520756 66322092 49279522 30913200 30245476 42903700
41795 42903700 49067241 40512474 27464656 21318071 23681921 31809471 41931320 46855000
41787 46855000 43030825 40650202 53145623 75298465 86854383 81156735 73814256 76469792
41779 76469792 78671267 66920102 47907030 38706846 42890985 49761769 50983778 45874520
41771 45874520 35436170 23005175 17325725 24354105 38594813 51276035 62908144
41764 62908144 77862546 90786644 90497026 75943135 57042517 40123905 23896587
41757 23896587 10763260 10008339 24862666 45278775 59340911 65737355 69798465 72633055
41749 72633055 70822411 64518695 59558786 60381406 64004116 62922964 53473213 40318814
41741 40318814 32260813 34225143 44296027 57624829 70606864 80970510 87019535
41734 87019535 88869347 88815263 88969549 89350899 88247640 82969968 71606183 57500351
41726 57500351 50821098 60265365 82128762 101779437 106625576 94292984 70486230
41719 70486230 46204084 35616490 45841063 66129245 76930599 73067863 67817751
41712 67817751 70493396 73172234 67283437 59655266 59379217 59745889 49359590 34363268
41704 34363268 32184831 45560760 59251617 63359755 65083211 74152629 88965618 101365217
41696 101365217 105592262 99520219 86120703 76278036 80955804 97333713 110705229
41689 110705229 112443340 107860388 104521758 102492950 99583223 97048051 95800259 94919726
41681 94919726 97018963 105742772 114314002 108041148 85511196 66851442 70426420 88450263
41673 88450263 97123119 86905208 71320321 66545637 72602749 77542990 73543449 64684476
41665 64684476 61116446 68339087 82790267 97254085 107829563 113206562 110992762 101551042
41657 101551042 93525110 96235418 105792021 108669939 101170176 93747271 91744694 85768160
41649 85768160 70586475 60127755 68479101 85055760 86653386 70130676 54856103
41642 54856103 52980744 55717823 53145421 50208874 54329206 60857322 62057703 61148944
41634 61148944 66053710 75193365 79732222 75957398 66726186 54372323 41017045 33268853
41626 33268853 37781825 52810489 70488507 85235783 93621085 90551259 75811367
41619 75811367 61444104 59810993 64148539 55056038 29793669 9888680 10945120 19163452
41611 19163452 12557502 -4500853 -7402290 10607296 26979750 22443619 8055268
41604 8055268 7371746 22166852 31711004 24166027 14075429 22427879 47294411 64030465
41596 64030465 55240903 32931261 24004036 36266865 49366163 43984672 29200766
41589 29200766 28202008 42806800 50230381 37400063 20440834 20503940 34520843 43486252
41581 43486252 39838550 31602539 25838461 23487438 26826771 36411137 42382397 34557317
41573 34557317 20880933 19429094 30821354 36763946 30235539 26941708 36831284 43957579
41565 43957579 31804889 14074625 18626510 47515218 73956884 77705450 64699774
41558 64699774 50035543 39448499 33439160 34338488 39851311 39984181 29827513 18515545
41550 18515545 17531406 25701447 33051751 34588677 32828226 30609618 29123271 30746112
41542 30746112 36668713 42730839 43464473 39258090 34474887 30464633 26342533 24543224
41534 24543224 28226634 34335815 37480995 40313245 50126381 63698785 67261246 56871193
41526 56871193 47338445 51858070 62771732 64663453 58121384 54522944 52534542 39951597
41518 39951597 19998034 14496509 32420028 53754719 57689299 51183014 52197903 56871372
41510 56871372 46035564 19859265 2495102 8559018 24162791 28592751 19509151
41503 19509151 7538293 -1733990 -9511190 -15822018 -19871940 -23068757 -24033833 -15902880
41495 -15902880 3963017 26085018 37567563 35128701 24582543 12896060 6590509
41488 6590509 11528409 26001136 38463263 39835673 33787171 27669135 19705104 5773063
41480 5773063 -6461759 -4271794 10172742 20244941 17411616 10924225 10983600 14157543
41472 14157543 12798132 9705012 13870611 26053807 36545941 35789313 22709752 4793092
41464 4793092 -6780203 -5524219 3137715 6753535 1728985 -387590 11906637 32998553
41456 32998553 46190859 44750976 38106861 36230192 36505708 30414281 17142664 4498501
41448 4498501 -1039397 70528 3746824 6603582 6603976 3247181 -981210 -1166330 6010415
41439 6010415 18521960 29667641 33394128 30430355 28752929 34763071 42971838 39375212
41431 39375212 19425733 -2069482 -6990565 2588740 7743494 670862 -3612746 9494693
41423 9494693 30904224 40020008 32734685 22578727 17274430 10401025 -1658625 -9791615
41415 -9791615 -5930480 4582384 12418562 17647685 25569618 35563293 42260505 43769920
41407 43769920 42110892 38916227 36013097 36223233 38287262 35218995 23326969 9097874
41399 9097874 1827052 3196441 8950082 15998423 21893241 22027287 14624377 5617518
41391 5617518 2525118 6202549 13125891 21065813 27231150 26866853 20768838 18273813
41383 18273813 24610333 31020688 26714116 15325791 9378842 13211483 21921858 31991084
41375 31991084 40871925 41318273 30761170 22788627 33091517 55242534 67048180 61154844
41367 61154844 51839335 49506976 47460968 39540087 32530272 32340737 33858690 33946393
41359 33946393 39233089 50597820 55213150 46636484 38484539 43440397 51695122 47133409
41351 47133409 33709187 26517948 25229017 17924829 7114842 9629213 29436287 50112629
41343 50112629 57892036 54828056 44949745 25897874 3214089 -3574649 16468437 46164279
41335 46164279 56952905 41010588 15779185 -546094 -6510544 -9380355 -10141522 -3436012
41327 -3436012 11236062 25329982 30054832 25468404 17740478 10576199 4889794 4971701
41319 4971701 15845342 32134848 39152856 31220268 20584104 20111547 25577908 26480757
41311 26480757 26729904 38320135 57563019 66154888 58480752 50191176 52953031 57197039
41303 57197039 50991117 42114731 45990939 59995858 66028946 55813072 39668165 30279708
41295 30279708 29540402 32646723 35007704 33025032 26684687 23294488 30301752 42237867
41287 42237867 43600169 28613894 10348334 5231936 14843741 27891153 34100223 30723754
41279 30723754 21213736 14062167 18242177 32998320 46078398 48291465 44788296 44666954
41271 44666954 46117426 43129978 41153671 50025184 62470202 57965251 33073328 11207366
41263 11207366 12937884 30482465 42708215 42751130 37135462 28653489 17362094 11897988
41255 11897988 21905118 41590476 56223130 62847559 69455534 76325869 75886573 70835239
41247 70835239 73592591 85074307 92367657 91605797 93833340 101265982 97658239 73838266
41239 73838266 45909205 34608137 40263446 50768309 60550138 67827912 66467567 56252255
41231 56252255 49768360 53757169 55715752 45733580 38237115 50555075 70857267 72789435
41223 72789435 55902024 45043172 51132383 59038571 57586326 56823352 68082279 87362313
41215 87362313 106383986 122276423 129213249 118322427 94542688 77509098 76911969
41208 76911969 81578292 80548538 78858069 82865851 85785692 80055830 71385138 68734024
41200 68734024 71275207 75377943 82548955 89668331 84064821 61809350 40660085 40844315
41192 40844315 60468987 81718912 93045989 93051852 81152736 59026371 36260585 21995139
41184 21995139 14773385 10048167 11153943 22266518 37180962 46288054 48848904 48485149
41176 48485149 44009659 35362670 30204104 32786740 34928489 30244207 27077994 33049725
41168 33049725 38398935 32780636 27452515 38338699 55485956 55125093 37808454 27221501
41160 27221501 31316562 33038318 24379017 21607547 36380309 56348697 67660207 75310513
41152 75310513 86259287 91428385 81971532 68664113 67112982 74028956 74299565 63484146
41144 63484146 48868894 35206955 22920129 15078897 14534216 18535142 24669432 35511355
41136 35511355 49415137 55668345 48668544 38208035 35337544 37043480 35882811 34767643
41128 34767643 39031350 43301292 41087002 38806046 44034302 47714993 36556516 17496660
41120 17496660 10330657 19536226 33257274 47556818 69264308 93895396 104303241
41113 104303241 96990364 88207272 86027299 77323268 53246969 27480577 14677086
41106 14677086 8638149 -646909 -4047607 10863756 31671451 33089217 13649089 -1949148
41098 -1949148 1881642 14278585 19856083 18796309 16773898 11215909 -74094 -7978102
41090 -7978102 -3576903 5820437 5537327 -4139835 -6856846 7600630 30156005 44654300
41082 44654300 45291930 37373273 26803276 15047889 1970279 -11594349 -23648566
41075 -23648566 -30533535 -28239495 -17495820 -5534515 1787241 8165198 21241738 39110839
41067 39110839 50014368 48062356 41382370 38848124 35750621 22252731 2423116 -6918261
41059 -6918261 2310748 19435123 30383854 33734151 34951667 32979030 23191235 9960986
41051 9960986 4534240 9221877 13689586 10722818 6779982 10109457 15426625 10759174
41043 10759174 -2973933 -10770952 -4581749 4528960 1885507 -10381635 -17602269 -13252938
41035 -13252938 -4663261 1619907 8890865 20576005 30888838 32758808 29598080 31219374
41027 31219374 40448680 50296636 53060049 47076423 36319281 28484663 31115680 43330054
41019 43330054 53254989 50897466 42396342 42876498 54522569 61648231 52077618 35233074
41011 35233074 31338232 46587854 66370925 72430869 61293452 44744862 35653039
41004 35653039 35731155 36983451 33335387 27717016 25954045 26969620 24177471 16181469
40996 16181469 10900754 17238367 35528909 57116599 71151752 72290405 64570019 56879595
40988 56879595 52161921 44211723 29448984 17035036 19079105 34014048 49443929
40981 49443929 58702046 62497687 56676939 35644976 10706003 6098337 27852925 52926462
40973 52926462 60451823 57854125 61553476 67611959 61989765 48645874 43560103 46175528
40965 46175528 40957475 26611848 19990096 27351487 34070862 30036488 24663147 26196354
40957 26196354 24593543 9448536 -8781198 -11541186 1814874 14927069 16773411
40950 16773411 11666169 9875934 17317510 32448185 46980695 52265789 49224132 47627370
40942 47627370 52330728 57099273 56203030 53415208 53102661 51177974 43396797 35065206
40934 35065206 32926885 33399310 28468348 18478355 10066470 5638906 3079704 1438779
40926 1438779 -628059 -6529421 -14098783 -13218370 -334464 12079075 11691363 4823743
40918 4823743 5873020 14531761 18340694 13555118 7958947 5601418 4216412 5853259
40910 5853259 14033540 21555968 17988049 8731604 8241729 13814196 7566029 -11033302
40902 -11033302 -17595078 1655157 27033630 32652248 20494387 11530193 15828971 28158682
40894 28158682 43324944 58776517 68266625 68076606 64720205 63626232 56666540 35412836
40886 35412836 10802728 2660544 12057018 20442716 16129810 6206623 725334 179711
40878 179711 2697200 10261188 21551078 28544360 26037553 17095730 5719136 -7226251
40870 -7226251 -17353289 -16432899 -5317213 1726341 -5515961 -17472214 -16373173 -586312
40862 -586312 12892300 11480741 3898318 8492382 28566384 46371194 43724794 24248170
40854 24248170 9767416 15051300 31992900 41712306 37313872 28871712 27972307 33846244
40846 33846244 36475676 29686853 18345760 12726772 16982257 25428638 31592681 36643510
40838 36643510 42630908 41212112 21655631 -8114516 -23331158 -13672000 630025
40831 630025 -3000042 -16587190 -14720378 6948149 27806552 35243756 38877343 47381806
40823 47381806 52726248 47864702 42102492 44769991 47346681 37723616 22226570 16161579
40815 16161579 18418228 13539120 -1982960 -12548030 -6488407 7248217 12361328 6117114
40807 6117114 -559136 1336257 10405904 20174357 27232704 32792478 38272024 41111839
40799 41111839 36219473 22045072 3734509 -10997689 -17403933 -13755428 531831
40792 531831 22027126 40207783 43948731 33569591 22042409 20761253 27050759 29775006
40784 29775006 24940318 19559273 19551310 20990569 18112401 14212742 15925472 19047663
40776 19047663 11353769 -7774483 -21778647 -18446752 -7902861 -8200879 -19213115 -24593152
40768 -24593152 -17635613 -10009263 -11355262 -13587126 -3314709 18800902 39215186 46585540
40760 46585540 39133076 21866053 3642482 -5586703 -908208 14003147 31281642
40753 31281642 44598955 49995504 46515573 39017500 35346941 37158690 38108289 34234830
40745 34234830 30438347 32355452 37421896 39180431 35334963 26267768 11437206 -5655141
40737 -5655141 -13957948 -5039577 15738711 35707615 49803206 60716283 66626494 59971215
40729 59971215 40988794 23278187 19666270 26745401 29123826 18173013 2363953
40722 2363953 -2767638 6964009 19683141 22570908 17359096 15126365 18244886 16624914
40714 16624914 3810976 -11889561 -17197005 -8537708 7275315 20686791 23745816
40707 23745816 14773611 4638260 10229623 33561267 54413799 53065283 34436828
40700 34436828 19920577 20813032 30756220 39659376 42522631 37049471 25278910 17300402
40692 17300402 22205557 35366240 44532620 46850587 48477114 49490943 43699775 33907269
40684 33907269 31440824 36428797 34017992 17564584 1806983 2960118 16821410 28073291
40676 28073291 32506689 36827618 41767425 39772252 29523279 20545594 19402043 19926752
40668 19926752 13352547 3069447 1165873 10208519 16413336 6533718 -13228997 -23779421
40660 -23779421 -17003067 -2729880 8741712 17391129 21648671 12124034 -10009171 -22299961
40652 -22299961 -7239897 20063634 31216202 25036863 24556653 35813562 37476228 17696893
40644 17696893 -4535685 -7372968 4957979 15133340 17679048 16360230 10966346 1729804
40636 1729804 -4137497 -3234226 -2827631 -6289627 -4705115 5258067 10116277 1086609
40628 1086609 -8070168 -2525722 8419349 8530002 4312525 12545154 26986896 25430098
40620 25430098 7199913 -3894155 3602335 14202130 13340988 6897107 4204782 1298133
40612 1298133 -7890050 -18386491 -22163567 -18038476 -7418464 7537647 16505693 6527701
40604 6527701 -17411739 -31300553 -20765537 1436146 15413278 18640411 19460684 18519340
40596 18519340 11458616 2401946 -185627 2235542 604489 -6475298 -10064884 -3687199
40588 -3687199 8620081 17306301 15569805 4132200 -7607071 -7206028 9002055 30427124
40580 30427124 41795398 37347621 24128972 13718765 12175463 15293779 12832703 605337
40572 605337 -11994780 -11618338 1826325 13748391 11655683 -2357517 -15939164 -16715375
40564 -16715375 548757 27361770 41957516 28146290 -3249638 -23080150 -17757909
40557 -17757909 -2618694 3095318 418424 989042 6259833 9378544 9772881 13396798
40549 13396798 22764778 35464538 47494810 51364892 38923157 14697905 -1842044
40542 -1842044 2546595 18518569 28262883 27680431 24123442 21468393 20623340 26695676
40534 26695676 40835118 51189088 46514294 32783083 21867121 11725293 -4197798
40527 -4197798 -15632580 -6788225 13773240 19375732 3911645 -9206238 -2550547 13268212
40519 13268212 21784084 23676265 25377101 23304216 14561215 8957790 14674126 22595458
40511 22595458 19528235 8599859 3082417 6827696 12991624 16197886 15213664 9497274
40503 9497274 2761001 3410354 12431408 18710579 15553003 11908361 16026501 19639149
40495 19639149 13828357 9524379 21479031 38635673 34560303 7473571 -13225338
40488 -13225338 -5947712 17163533 31197883 28288468 16636614 4668585 -1525660
40481 -1525660 3770614 16976466 21466957 5462613 -19950104 -31031741 -17583117
40474 -17583117 8872200 30191507 36779864 29889091 17761989 10593887 13200969 20863894
40466 20863894 25212879 23361357 18133307 11740354 4689721 -10175 2025429 9268647
40458 9268647 12780484 5772862 -6636834 -10186391 4740326 32197529 54380323 57329656
40450 57329656 43129142 26158422 18395673 19853409 21717330 15535574 67615 -17033202
40442 -17033202 -24586316 -19176217 -10520038 -9719112 -12394444 -2500612 23492814 45772094
40434 45772094 42999074 18972639 -2490971 -6393494 99382 2949335 -526142 -2295572
40426 -2295572 5045310 22273542 43804044 59315751 58713811 40655080 15706554 -1490189
40418 -1490189 -3167045 8069704 23486612 34466664 37654981 37008291 39729710 48068188
40410 48068188 55635142 53300323 38857737 20651961 11525662 17653508 31752863 38820899
40402 38820899 31227632 17067638 10755742 17210367 29911406 42905920 57118410
40395 57118410 72671259 82072541 76699509 57335734 34504212 19967668 19130835 27935598
40387 27935598 35153531 32376939 24794897 27139505 44969926 65179031 70376953 57844236
40379 57844236 38113763 20240604 7473149 3708188 12510630 28633558 40031748
40372 40031748 41115753 37201425 34458060 32928561 31169206 29631502 26691302 19695121
40364 19695121 13809796 20972479 43619919 66572871 72599686 61138139 45184621
40357 45184621 35165537 33478830 39570199 50068904 55736646 47981671 29333957 10935717
40349 10935717 64027 -3534254 -676108 8959260 20757127 25986488 21779798 14194389
40341 14194389 9068137 5708273 1709318 -2219911 -4913360 -6291026 -3766598 6028480
40333 6028480 18456895 21669728 12356008 3820035 9955521 26070009 35402802 31800464
40325 31800464 24616691 20926611 15395828 3231856 -7336469 -5562190 4410417 8084184
40317 8084184 1730061 -2118443 6411969 19744371 23886029 17275688 9305582 4262345
40309 4262345 -1570064 -6805685 -1576181 17305349 37579597 45874071 43824134 41289297
40301 41289297 39440942 31454989 17164403 5725460 3433360 8417669 18079448 32043629
40293 32043629 45631387 49893992 42249948 29961173 19898859 11986565 5639807 4615989
40285 4615989 11015492 21154487 31122251 39812036 44091026 39923156 31497425 28395755
40277 28395755 28952324 19456350 -2278655 -17306534 -12479245 -3134654 -10506036 -26996891
40269 -26996891 -27020024 -7742810 6344269 1807740 -5429115 1039109 12311322 11264220
40261 11264220 -465545 -8859939 -10701498 -14386666 -23037092 -30743718 -33189754 -30842571
40253 -30842571 -23145720 -9060535 7418884 20088905 28173524 35056629 41207770 44314095
40245 44314095 44076517 40563357 30293863 11185269 -9840985 -21236416 -19320951 -11871250
40237 -11871250 -9617026 -17053517 -28872134 -32151711 -17204263 8130040 21055011
40230 21055011 9515829 -9557771 -8980477 14528973 37920936 43159396 36011136 29408767
40222 29408767 23379177 12222074 886908 -361150 6031101 5653217 -7567696 -22082830
40214 -22082830 -24003821 -14457046 -5484181 -2334406 2732983 17657461 36945491 45710133
40206 45710133 36526220 17903151 4317338 1008120 1675364 -772378 -5583306 -7098403
40198 -7098403 -3360044 721060 -896162 -7460294 -11237778 -6918885 527003 1247952
40190 1247952 -6657134 -14845710 -16513484 -14708333 -15700481 -19303592 -20220848 -14974784
40182 -14974784 -3607053 10978623 21615212 21024438 12722213 10803060 21678417 33616468
40174 33616468 33951984 28412874 29661040 33493682 24896852 5859504 -3240565 5926402
40166 5926402 16571893 12120589 -1678129 -10323183 -12008022 -12602100 -10263773 261811
40158 261811 14149290 20224996 14996550 3564146 -9419553 -20929704 -25869752 -20975727
40150 -20975727 -9792542 2249972 13468564 21985699 23427649 18474071 14093706 10796676
40142 10796676 40652 -16760532 -21076808 -4053539 12907581 4730779 -19754574
40135 -19754574 -30176163 -18609333 -5303004 -2224570 560091 7327869 4288257 -12781859
40127 -12781859 -23018174 -9953949 12081183 19428783 12122211 6302194 5737191 2177047
40119 2177047 -3110419 36959 9767266 10937555 -2352094 -17654753 -22062716 -18079446
40111 -18079446 -16393538 -20409202 -23448823 -18203063 -5644702 5691650 9732199 10230305
40103 10230305 13215282 14398535 5221115 -7136028 -1669243 25571591 47875935 40340411
40095 40340411 13850987 -2358799 -2917164 -7475184 -22924670 -30676306 -17319589 4422736
40087 4422736 15554419 13747222 5314547 -9211616 -26991292 -33333521 -17261442 10408186
40079 10408186 29291281 34461429 35422880 35119470 26540114 10242886 -366261 3730175
40071 3730175 15350360 21901396 20263491 16064031 14144210 14420880 13196480 5522962
40063 5522962 -9805405 -25454080 -30505523 -23053692 -13373690 -11604739 -17049412 -23196630
40055 -23196630 -27754343 -31730963 -32827330 -27579956 -18734664 -13191059 -12382314 -11241529
40047 -11241529 -7517165 -5299630 -7133283 -9224457 -8112765 -6340166 -7016834 -7916692
40039 -7916692 -6270414 -4775500 -6497958 -7597652 -2485310 6083935 9452349 4352268
40031 4352268 -4836749 -13129040 -16654995 -9792093 9064243 28778139 33438727 21580076
40023 21580076 7871145 3320152 4270766 4003859 2738985 113912 -9574944 -25316513
40015 -25316513 -33498205 -25122749 -9969300 -2307671 -1319510 1302621 2666291 -6215806
40007 -6215806 -21506184 -29419261 -26435866 -21622608 -19837960 -17730819 -16252369 -21210586
39999 -21210586 -29302500 -28851750 -18204885 -9710739 -11612956 -19031000 -26026179 -32346665
39991 -32346665 -34378824 -25158724 -9502689 -3491533 -11120575 -16831162 -10178906 -1733528
39983 -1733528 -2837642 -5683877 1332313 12654563 17476567 20304521 29629585 35840403
39975 35840403 23379696 -28999 -9907930 -594675 8113837 3059065 -5358859 -6003080
39967 -6003080 -6784317 -18397621 -32359424 -31115309 -13790493 1434020 -715577 -17107123
39959 -17107123 -32543430 -35484636 -26296332 -12906696 -461056 12555017 26726696
39952 26726696 34757599 28466645 11073087 -4744233 -11257342 -11534363 -10810656 -9815068
39944 -9815068 -8511294 -9103196 -12044552 -14546398 -15336277 -15398653 -12441178 -1745601 14118272
39935 14118272 23284154 17550054 2727751 -8810323 -12145732 -11577172 -11569490 -11685215
39927 -11685215 -9873336 -5998213 -527739 7693051 19416372 30255810 31100929 17603673
39919 17603673 -1499987 -11751460 -10075837 -6833467 -7135718 -286648 22711475 49327044
39911 49327044 56821193 40150678 15744442 -627738 -6603691 -5031945 2079323 9441549
39903 9441549 11900417 14459003 25579217 38676342 36378903 17601555 3006668 5885868
39895 5885868 14993002 16812955 17104592 25042818 31505817 22844504 6094478 333553
39887 333553 8968925 19249366 24509917 27796514 26420321 13327954 -5231733 -12742029
39879 -12742029 -7222545 -6037080 -20086123 -38115461 -44051820 -37427246 -28394963 -22347684
39871 -22347684 -17835026 -13104776 -8140176 -4349468 -4687627 -8854582 -8918991 1656710
39863 1656710 15428599 19059146 14130259 15134307 24155535 25420853 12711090 3635956
39855 3635956 12844609 27074399 25567872 13597321 13391675 27577254 35543560 27239719
39847 27239719 18058819 22744024 32884961 31649447 17805198 3061163 -4992308 -5100102
39839 -5100102 5245124 25913489 45544916 49775660 38958663 27501033 24123447
39832 24123447 23035419 18136113 15081082 20906666 29335897 27957709 17392301 11524431
39824 11524431 17318769 25497542 25762015 20681738 16231285 7871868 -10833745 -30711730
39816 -30711730 -34158360 -20972248 -11321356 -16974072 -24107778 -15310003 3845351 15675959
39808 15675959 19392349 29408976 46121898 49754432 30817108 9091307 8638702 25092543
39800 25092543 33436281 22553937 6045513 -337178 3284279 8881072 13428792 16983279
39792 16983279 17359582 14796494 15500205 22835064 29872100 27982569 18343805 7454245
39784 7454245 -3541131 -14929499 -18031445 -2689814 23677709 38120156 29018289
39777 29018289 10468327 2846812 8038980 12707140 8769882 -489053 -11151004 -24234198
39769 -24234198 -39559672 -51484118 -52745729 -39731869 -15927864 6598022 13954305
39762 13954305 4945518 -5390053 -3809420 4785476 8504132 10091469 22512114 44219889
39754 44219889 55842833 46432858 28504328 19161909 18541677 16742711 11860213 8968655
39746 8968655 7531940 2060488 -7059817 -12899808 -11059154 -2854190 8087761 16401018
39738 16401018 15783137 6242610 -2365561 -756710 8309006 14340188 11056885 -912001
39730 -912001 -16802418 -26441641 -18728202 2122383 13253331 319103 -19089871 -16920357
39722 -16920357 5285882 19512268 13767047 6168823 10281300 12820196 1228435 -9393009
39714 -9393009 328765 19511770 22423678 10263548 9551909 28759531 43279784 31893315
39706 31893315 6658153 -6896897 -4265368 -960904 -5457423 -8995632 -1418103 14454077
39698 14454077 27343621 30441929 26489664 21844778 18081058 11549195 1594010 -5063863
39690 -5063863 -2688676 3988005 5511694 1044594 -2163542 -1429820 -633780 786200
39682 786200 8621619 20327409 23565470 14672863 5761497 4373505 -577892 -18871013
39674 -18871013 -36647814 -32732138 -10770400 5409975 6701446 7650640 17549627 24215792
39666 24215792 16339302 4220417 3941099 12540176 13933858 3188187 -8260113 -8668960
39658 -8668960 2582265 17481536 26316916 25242007 21855385 27379550 38449758 36549344
39650 36549344 14389535 -8168813 -8438800 7801882 16812436 12470050 10171585 16386670
39642 16386670 17719612 6395829 -4834268 -4947980 -4173238 -15645112 -30142086 -27098296
39634 -27098296 -4851100 16482743 21014402 13098216 6976466 10608724 21201416 29505482
39626 29505482 27545977 17135154 10206908 16601834 33415602 49669989 56869046 50608253
39618 50608253 29508577 1848230 -13009143 -2740242 19982816 29454172 16985485
39611 16985485 -1683006 -9017881 -3649507 6409523 15740290 20764514 17167430 5776379
39603 5776379 -5418313 -11129541 -14910982 -20473894 -23537615 -18713213 -8931782 -1140865
39595 -1140865 3068137 5991946 7045952 4585872 1480843 1597029 2670969 -117414
39587 -117414 -4605662 -3332978 4457249 9480068 3786796 -9495233 -20904731 -25476746
39579 -25476746 -25359416 -24108059 -22790007 -21798169 -22414049 -23704012 -20099778 -7086383
39571 -7086383 9621786 15935888 5159098 -11250823 -14876200 -1315758 16119440
39564 16119440 23299377 18880445 10249223 3952482 3531897 9698222 17681653 19894581
39556 19894581 16008963 15250473 23878249 35760136 40896842 38010675 32390572 26435372
39548 26435372 19761329 14241403 10825252 5156849 -4974728 -11269822 -3822239 13870463
39540 13870463 29133849 37939877 47262438 59872217 69562907 74356149 81924226 95881899
39532 95881899 107050016 105807307 95108304 83918406 74996528 67230792 63666874 67582083
39524 67582083 74229271 75610462 71818324 69904312 72555881 75094513 73468270 68803546
39516 68803546 63794942 60404550 61728206 70437663 83413144 92137570 91064773 83869886
39508 83869886 80211777 86996133 102181144 116035039 119789253 114204508 107564747 104616048
39500 104616048 102072999 97392824 95414793 100053807 105062391 102414694 96580576 99085169
39492 99085169 109221436 112975791 104929295 98687333 107138188 122230773 126148706 116808181
39484 116808181 108968595 111363282 115972168 113030938 105092216 99449311 95165761 86842411
39476 86842411 76787701 73828406 80640596 90155353 95530958 96810223 95574629 89782599
39468 89782599 78802442 69380090 70757359 84703784 104104695 120771683 131754059
39461 131754059 138890596 145352992 152472008 157484779 154764973 141756985 123642087 110031374
39453 110031374 106675864 110987478 114525092 109407989 95137491 80668343 76213180 80844384
39445 80844384 83102782 77370092 72864555 79435073 91266585 95763671 93916372 97458744
39437 97458744 106838413 108345490 96835123 85388607 84897902 88724515 88218727 89999674
39429 89999674 103152838 118959814 120237448 106136994 91909087 86039228 82303757
39422 82303757 74522823 65563473 59552501 56149788 54496677 53488396 47625446 32492449
39414 32492449 14720688 6153744 7587044 8918738 5664238 3466247 5637245 9765972
39406 9765972 18533739 38456899 63135425 73847794 65334450 56537199 64808528 81959270
39398 81959270 88470797 80858949 70636531 63876436 56929765 48353128 41233673 35018405
39390 35018405 26189476 16362638 10933539 11082666 14362300 20057710 26459773 27100978
39382 27100978 18487362 7897196 5053067 10318520 19532268 34155037 55209938 72896571
39374 72896571 76103231 68769297 62747856 57705007 44430037 26521316 19373225 23971961
39366 23971961 20810171 -1107260 -24823971 -27256467 -9945795 4556957 960275
39359 960275 -15080675 -28266079 -29126654 -18238964 -1442005 16097423 30725786 36270465
39351 36270465 25400662 1114654 -18812247 -19947389 -11063098 -12688368 -26350966
39344 -26350966 -30915827 -13198107 13457296 28508337 28530293 23323512 19674207 19012087
39336 19012087 21458494 22720377 15780585 3805742 1190459 13216612 26263634 28102356
39328 28102356 24671511 24036867 18332579 -221283 -17650098 -14888463 1770195 10568022
39320 10568022 9758573 17260041 35449385 44408616 36660691 31681730 42809138 53024989
39312 53024989 42205785 21087146 16509668 33223765 51732125 59174733 61838256
39305 61838256 66470490 67411193 58387206 44764333 36693628 37392223 44159762 55419762
39297 55419762 70341870 84426938 92050144 94290487 100067255 116577010 139656359
39290 139656359 156248610 156849675 143312461 123675163 102791136 81041040 59226882
39283 59226882 39662092 23307276 10495183 4076056 7058472 17110265 28318057
39276 28318057 38724058 50780442 63497632 70521479 69434825 68393935 79013658
39269 79013658 104144069 135116647 160058209 173872585 181072198 188982886 197873947
39262 197873947 200266826 191705465 177625029 164785239 150809248 130380319 108417155
39255 108417155 96059717 93340896 86989620 68671997 45946725 31039146 27425769
39248 27425769 32230815 43273826 57135124 66996928 69724808 71071187 78502077 92671801
39240 92671801 110068656 129312095 149969959 168693834 180539592 182092098 173172523
39233 173172523 160125439 155522544 165418824 177524927 174189740 157826893 147531402
39226 147531402 146808579 135164314 102884032 73331121 71217540 85078081 86001244 72826410
39218 72826410 70331618 86460186 101274951 102336207 102873460 114066286 123489354 117226246
39210 117226246 105347354 107051099 122431182 136932365 146046573 157875277 174418101
39203 174418101 186469587 188153103 183917436 177976945 166274097 143779414 114616751
39196 114616751 90567817 80697057 83571834 88753084 85896334 73129679 56706467
39189 56706467 43900498 38270748 39903379 45737379 50116473 49910617 49209505 54249282
39181 54249282 64268143 73044505 78553119 84011683 90280487 96074913 105135499 121694225
39173 121694225 137392613 136303349 117763874 100117840 93723992 84507437 56788869
39166 56788869 20344823 -1434193 -2541801 3372219 6778873 10397970 14757026 13687507
39158 13687507 7882414 7920687 17864010 27785728 29188266 27864794 33696813 44685418
39150 44685418 49031556 39912225 22901907 10141115 9208489 16089195 19383825 13652300
39142 13652300 5480810 2015815 -616626 -8073644 -12295669 143872 24948638 41348306
39134 41348306 39417910 30273677 24076846 15733581 2183500 -4172306 4729617 13935467
39126 13935467 6643830 -5957940 1088824 27000630 44143621 38216037 26572737
39119 26572737 29098036 40939914 46283785 43733825 43311243 48314516 54657175 62075054
39111 62075054 72525944 80637887 77785063 65048515 52810056 47604045 46600049 44040453
39103 44040453 36226816 21796157 4623543 -4800220 1125060 16534769 28356329
39096 28356329 32137578 33121648 32585968 24790487 10398891 1152392 4097848 10086587
39088 10086587 6668139 -4067293 -10020455 -6863308 -736123 4825198 13283622 24468049
39080 24468049 29603528 22663763 10632131 6235137 13344139 24544890 31178706 30820853
39072 30820853 25669626 19017700 15084014 18186522 28219498 38046521 38767541 28557112
39064 28557112 14778826 6569978 6206419 8196666 6086968 -45010 -2275638 7865306
39056 7865306 28431781 44616483 42293663 25179079 12521177 16024398 25443534 24061439
39048 24061439 12799628 7611805 14392006 19823326 11791208 -1854740 -3032180 14200292
39040 14200292 38289576 53226400 51061017 35148776 16775756 6290045 3853990
39033 3853990 1864847 -2287288 -3139812 262714 -729809 -9442661 -14500427 -6888758
39025 -6888758 2788859 -1072863 -14034525 -18539982 -11729595 -6443773 -4922739 6053231
39017 6053231 27679659 38227928 22383914 -4291178 -14869337 -4287220 10258000
39010 10258000 13164265 1533622 -19945891 -41406225 -49846150 -40956835 -25395927
39003 -25395927 -13917468 -2828573 14363238 28714367 25475812 8038519 -4883198
38996 -4883198 -5519427 -3913953 -6989823 -7957273 -2228837 1680986 -3404901 -9473435
38988 -9473435 -4502147 9969743 22202057 26266551 25918524 25252245 23130791 16697932
38980 16697932 5969178 -5117227 -10806957 -8589671 -2770981 374440 1377032 6469229
38972 6469229 16435343 22781190 18732977 9240844 5316015 10873355 18799857 18956309
38964 18956309 8476710 -4691265 -8697590 -334136 10895404 14575007 12040933 11128246
38956 11128246 11879927 7697491 -67776 -906421 8475197 18177157 20713500 21560235
38948 21560235 26706216 29727963 21387074 5349255 -5857958 -6588673 -1508675 3092105
38940 3092105 4128690 1421616 -946467 3279556 13731818 21889805 23255002 23176997
38932 23176997 23886584 16162409 -4672942 -23780006 -23028819 -6301053 7294127 10958442
38924 10958442 13139868 15269017 7166185 -11904648 -26483657 -26054070 -17041770 -6830890
38916 -6830890 7675121 25861695 34003479 24256844 10741205 10600719 17647740 12186721
38908 12186721 -7221746 -19431900 -9600325 11681068 23091905 17427472 6256442
38901 6256442 4066389 11886359 16918725 8949464 -4470509 -5416526 10284556 25104112
38893 25104112 21635539 3767331 -12336088 -20128040 -23999897 -25350550 -21854644 -17618968
38885 -17618968 -19015777 -20719722 -11121144 6362877 13193047 2528488 -8527022 -2541206
38877 -2541206 14394134 23665960 20118379 14415630 14405079 16497104 14765151 9021214
38869 9021214 2866915 70203 3238230 11335370 18955295 21798588 21326895 20816417
38861 20816417 20368246 20320182 24721410 34032693 38425649 28544361 11870270 7064448
38853 7064448 19309464 31698329 27135487 10577110 1030360 6492109 16831396 20712579
38845 20712579 19716607 21658547 26636332 26770923 18064276 6161706 -956410 -1144247
38837 -1144247 3579782 12099410 22360974 27548946 21734355 9886846 4964088 12073910
38829 12073910 21639538 22157242 13816004 4334772 -2677238 -7590866 -7602547 457390
38821 457390 11364033 14841726 8545457 -64410 -5395444 -8682499 -9714011 -3452387
38813 -3452387 10320085 22384183 25637741 24761874 27351084 31149246 28732667 21167178
38805 21167178 17202293 19247009 19025167 9528513 -5182704 -15306612 -16006197 -9784576
38797 -9784576 -1697357 4116949 5126010 2085236 1067104 10522638 32294919 55189943
38789 55189943 61928469 46753602 24157916 14667907 22061083 30533451 25504872 10355143
38781 10355143 -886957 -940972 6207137 13342907 16286282 15046850 13871162 17202597
38773 17202597 21575533 16888577 1802660 -8714907 -1222890 15503332 20419395 9627682
38765 9627682 1782971 10884942 26694482 29800354 17130811 3452051 2080047 11821466
38757 11821466 21767747 24398070 23652434 30069834 46272844 60549724 60881606 51732511
38749 51732511 46675338 46837473 41551293 31485722 32074972 45763419 50151598 29584289
38741 29584289 3164433 471467 19467809 32233372 27720398 22639986 27474659 27988029
38733 27988029 11881114 -7078898 -8373187 5056336 13747345 12188216 15097247 32983765
38725 32983765 54592929 59198227 40889673 15368108 1912937 1321603 -2127833 -14155699
38717 -14155699 -16170383 9558557 46785978 57996854 32959863 3398920 -105699
38710 -105699 14700439 23240782 24077441 33801165 52669013 61440377 50719602 31436878
38702 31436878 15320105 4723067 3251011 15854405 33582931 37478285 24707435
38695 24707435 13806092 16967852 24715076 26621486 28492434 36221072 39691838 29072597
38687 29072597 13758102 8075933 9251762 6940771 4295509 10024548 17828486 15570585
38679 15570585 9963241 18742049 38772422 45512709 28985183 9401423 8846225 24454255
38671 24454255 38532370 40602636 30385108 12471141 -1839508 1032488 20231938
38664 20231938 37389208 38982584 32323960 31093317 36188629 41611477 48475235 59547084
38656 59547084 68148405 67190573 63557894 68793981 79442992 81733944 73880236 68288718
38648 68288718 70799438 72741038 67581840 62263013 65241454 73109228 76689700 73690612
38640 73690612 67974713 60827361 50568376 39732897 36390290 45864595 63346307 77746211
38632 77746211 83731187 86831560 92818998 95394700 83485498 61177997 48291421 55253276
38624 55253276 69388864 76160288 81862237 98898750 117298376 113308563 86213638
38617 86213638 64441091 67982539 83222881 86105475 75193141 67013723 68567271 71279507
38609 71279507 69262299 68659909 76080825 87491852 93413090 90674959 85323939 85199822
38601 85199822 91621476 98776771 100673907 96925168 90884384 85098826 81475020 82757287
38593 82757287 89212937 96276735 100265578 103329056 107222893 106739522 97401729 85285072
38585 85285072 79037094 76183953 69620101 63742684 68242392 77673611 76372192 65835024
38577 65835024 66345717 84607830 100757987 99085230 92178241 98729617 113651174 118842583
38569 118842583 111385717 101950447 94714063 88134708 88180672 100734375 115037824 113572902
38561 113572902 96637585 81116958 77506528 83334429 94773059 107276260 108908180
38554 108908180 93036088 75678907 79278837 99407349 109649966 101155744 92975581
38547 92975581 97470040 101235384 92628648 84857108 93568727 108989194 110861576 99861999
38539 99861999 94313556 102154066 113966833 120311852 120115369 113315376 99559160 85251509
38531 85251509 80207613 84831617 88950556 84929144 74689836 62411550 47722410 30069688
38523 30069688 15424254 13496182 27637606 49530597 66062443 71588896 70562936
38516 70562936 67428867 60154612 48523686 41484277 46033389 53419367 49325942 35870300
38508 35870300 28863401 32552553 33324775 22845154 11227928 9388261 13067882 14535423
38500 14535423 17139135 26462375 37882995 45004374 50903365 59015974 62292669 54485734
38492 54485734 43525829 39751239 39155725 33919508 31932314 46919068 72743625 87226799
38484 87226799 82451124 73322962 72426488 73187086 65448507 54313737 52730417 62058690
38476 62058690 69457044 63649078 48668479 40454803 48961806 64910553 70394012 63990989
38468 63990989 64756205 84324834 107081600 111655009 102608952 102278528 116060724 127177338
38460 127177338 126905808 128391379 142897211 160303773 164731121 157060107 150161373 150193933
38452 150193933 153443294 156356523 159482458 163905321 169494236 174957730 177951289 179220639
38444 179220639 186445137 206381755 232268173 248401478 249909944 248324931 254105064
38437 254105064 264417033 273587064 284288392 299676539 313525532 318213361 316176205
38430 316176205 314199751 311855511 305061444 296943362 295631799 303196843 314176974 323180226
38422 323180226 328027660 328648901 329471624 339520940 362509083 388912482 405219305 409659720
38414 409659720 411748590 417243154 421089811 416139692 402192714 383629697 362385130
38407 362385130 337035642 308312182 283353634 271929903 276355306 287066119 292700211
38400 292700211 293698678 299756540 313684053 325996729 327987779 321327765 310134106 292937421
38392 292937421 270273964 252134849 247334536 249966000 246135918 230990155 210360914
38385 210360914 189513687 170716447 159154166 159105618 163875509 160622519 147181866 134479520
38377 134479520 130568610 132824861 138912831 153132584 174002787 185631073 173626981
38370 173626981 145645424 124393119 119623692 116788785 97449654 64079674 37924357
38363 37924357 34416838 47141721 57723389 56747181 50502875 49230127 54827566 61994896
38355 61994896 66641161 68708672 68574528 64999064 56983361 45237990 31604671 18586444
38347 18586444 9191145 5765826 8909375 17727976 29876257 40924799 45902682 43005065
38339 43005065 34444337 23147921 11034770 1055430 -3040466 -1310051 1375700 1705288
38331 1705288 2136512 5617463 9453893 8782892 3961707 -12448 -359245 1142193 2160930
38322 2160930 2952759 5479575 11050127 18033489 21344457 16844783 7313876 347153
38314 347153 -1332339 -2900252 -8521318 -15123858 -18703735 -20399792 -20835510 -15167586
38306 -15167586 -1749142 9965397 10145046 3434852 2156801 6810585 5507031 -6566113
38298 -6566113 -19333796 -23039180 -20621359 -19521656 -19858973 -17272072 -11187894 -4140931
38290 -4140931 2196099 5179605 640296 -10151164 -17922091 -16503060 -12446747 -15713561
38282 -15713561 -23284147 -21415235 -5266943 12466126 17086318 9764636 3033280 1874648
38274 1874648 -1464503 -12209198 -21859229 -19672860 -9885586 -6935886 -14400552 -20051729
38266 -20051729 -14911127 -5821338 -2144225 -377445 7240082 16819260 19243783 17994671
38258 17994671 25154639 39808208 45462175 32571817 10932109 -5076004 -11960074
38251 -11960074 -12429137 -7148219 616547 1958428 -6416020 -14978937 -14204321 -7950823
38243 -7950823 -5067163 -4348730 1363596 11138931 17818591 20977307 25966662 30937782
38235 30937782 26998754 13157675 456621 -2221040 2248705 7172015 10978514 13483375
38227 13483375 10982046 1815633 -8069848 -11566551 -9429029 -7492708 -7271576 -4505089
38219 -4505089 4243205 17828709 32148103 41551428 40215882 27465279 12111633 6374287
38211 6374287 12837734 20426428 16364845 895679 -12733052 -13258961 -4164670 666780
38203 666780 -6127411 -15775082 -13790886 1099489 13705821 10637751 -2662860 -8553800
38195 -8553800 1360968 17985317 27800763 26729510 18235471 4903549 -11567061 -25697283
38187 -25697283 -30454566 -23672748 -8371205 11168030 29049778 36483854 28162246 9945540
38179 9945540 -5763534 -12566589 -12838064 -9238920 -1182628 9300897 15784222 14172741
38171 14172741 5836470 -6401706 -18423266 -21337071 -8278619 12799286 23969586
38164 23969586 19192572 10350826 6794826 2821023 -5538152 -6093326 11784591 35460510
38156 35460510 42690111 30827457 15211360 3422621 -9363064 -20916032 -19025242
38149 -19025242 -2561742 12445931 14809530 11261159 9915858 5036637 -10654267 -28792195
38141 -28792195 -32968202 -19301163 -698099 7518129 1643825 -8201460 -7548276 7642807
38133 7642807 25445744 31260597 24317738 14359860 6236373 -823825 -1812180 10328190
38125 10328190 28171119 33052849 19400988 1418376 -8917768 -14740360 -19330093
38118 -19330093 -15987074 -3036388 7134477 6671294 5942003 15010004 24152009 18284817
38110 18284817 995440 -10906002 -9128391 2822738 19504341 33392292 33721322
38103 33721322 19526515 5776212 3293878 2344150 -9162378 -22452633 -21374650 -9528667
38095 -9528667 -3233146 -4595093 -3176069 1117233 -306794 -3769051 2140257 12209760
38087 12209760 8935798 -7654489 -18622986 -17598924 -18984969 -28785406 -31872377 -18353370
38079 -18353370 -630556 7888867 11728709 18171376 20914505 13389919 3875133 2898289
38071 2898289 7034305 7592378 4789963 2657149 1013020 2233479 13227648 29953202
38063 29953202 33675165 15637294 -7232462 -15251749 -12492905 -14992556 -23822792 -27746159
38055 -27746159 -24532903 -21544457 -20459813 -18394277 -19983308 -31245500 -43333742 -38678626
38047 -38678626 -14311749 13586859 28890625 28763440 19076988 7866130 3073920 6940452
38039 6940452 12571669 13094903 11195179 12385463 14748554 15061355 18337498 28906282
38031 28906282 38214150 36023231 28691459 29958021 37062166 34413715 20460947 11694649
38023 11694649 16851258 25183980 25830336 22198091 20000334 16496169 10541736 9481616
38015 9481616 15749935 18757395 11559730 5006641 11950631 24985740 24600695 6631478
38007 6631478 -11574047 -13195658 -223001 12513289 14149731 5077932 -8044925 -19790433
37999 -19790433 -27900259 -30094293 -23291383 -9322503 1634491 95397 -9931740 -14021719
37991 -14021719 -5480406 5930723 7182252 -1515768 -8480326 -5428153 4534506 12377492
37983 12377492 12471772 6298099 -738750 -4833070 -5565202 -3059955 2818406 8306728
37975 8306728 5660784 -7234753 -20854721 -24903577 -22612105 -25512035 -35368790 -41642955
37967 -41642955 -37970240 -30558181 -26622462 -23963803 -17303576 -7530009 701111 4924573
37959 4924573 4751112 1706552 1527430 8891546 17315441 14213591 455583 -6561403
37951 -6561403 2881358 14715861 10486022 -6068574 -15582632 -10592886 -1870752 312058
37943 312058 -3407532 -10433840 -21467250 -32580249 -33634651 -21203368 -5179354 3816604
37935 3816604 7425995 13124621 19098469 13877854 -7943704 -34832581 -47025644 -36100215
37927 -36100215 -13468429 2774942 7688873 11284440 20678625 28934689 27087298 19467406
37919 19467406 16629896 17034742 8660379 -10469028 -26420664 -28987925 -25504077 -26388423
37911 -26388423 -26659774 -14955419 4014726 11835680 3094450 -5055195 2117458 14135682
37903 14135682 10385288 -8984540 -23599559 -23458375 -20860653 -25467114 -25441383 -8582545
37895 -8582545 10878148 8581123 -11383582 -18072887 2554932 28278517 35007307 29366304
37887 29366304 29849550 32481270 19395302 -6414348 -20842750 -14384902 -5684501 -12727956
37879 -12727956 -28523288 -34937447 -26618234 -10462845 7279191 21170403 22177063
37872 22177063 6559070 -14374573 -24863719 -23676712 -22734947 -27495023 -29121488 -19082185
37864 -19082185 -3110125 5391323 1961471 -4728924 -4679420 2329907 9626365 14280470
37856 14280470 19663122 27233680 32038627 30332318 26011045 22463456 12963658 -9457839
37848 -9457839 -33762419 -36704629 -12077653 17849387 28429371 20089540 9353420
37841 9353420 2055127 -8750213 -22050118 -23858563 -7346911 14539813 23344398 14440664
37833 14440664 -2754103 -16958026 -22230076 -18828995 -12508598 -9393412 -8173805 -2044589
37825 -2044589 8680383 12899818 3573705 -10098032 -13811485 -7394715 -3212594 -7125366
37817 -7125366 -11966320 -12058873 -13825604 -25242056 -40986651 -46543906 -36100125 -20096951
37809 -20096951 -13308564 -18726702 -25687866 -23312736 -13654685 -9284786 -17494297 -30216048
37801 -30216048 -33235633 -23378583 -10812422 -4077309 145609 8622271 18791187 21041058
37793 21041058 11655483 -2311894 -10774447 -9206990 -530547 7284936 6361277 -3753636
37785 -3753636 -14219206 -16402103 -11925413 -8196998 -6169504 -864488 6063146 4946630
37777 4946630 -6459671 -15710481 -10979253 3690527 16439406 24152302 30838945 34805087
37769 34805087 30583501 22716746 24408753 39130561 53986529 55811569 45227360 30358821
37761 30358821 15569343 2797361 -3725029 -2328947 1377865 1742201 596295 1021315
37753 1021315 -789313 -8556059 -15484810 -12148417 -3063813 -3203060 -16342695 -28600617
37745 -28600617 -28314776 -22206349 -24301607 -36452406 -49332733 -58305780 -67301694 -76431269
37737 -76431269 -75701563 -57111537 -28794114 -10178497 -11701381 -23361994 -26972957 -17811460
37729 -17811460 -8269952 -8542028 -10947644 -821267 20768628 35463703 30284459 13071492
37721 13071492 1366176 3080237 13199124 23159939 26814983 21904607 13023411 10152802
37713 10152802 17389508 25620255 23168386 11120964 320046 -4655479 -8849281 -14341645
37705 -14341645 -14975168 -7314176 1918421 5040031 3864844 4918419 8275260 7147538
37697 7147538 -2808587 -17496223 -27006493 -23356981 -8132801 7398429 13828291 14965901
37689 14965901 21271151 31670059 31808954 14883051 -6102631 -15629176 -16855143 -23638224
37681 -23638224 -36776483 -42602776 -34654396 -22344622 -14135771 -4822932 12253882 29190062
37673 29190062 30517737 13443390 -7806414 -18416405 -17395198 -13516950 -11824645 -9151534
37665 -9151534 -2382830 4334805 5125607 2808911 6560847 17041024 21305967 9187370
37657 9187370 -10001104 -15923758 -1322719 20147321 30342373 23584402 6534949
37650 6534949 -10931441 -21740128 -24533320 -23852568 -23680979 -20529312 -8724654 7758268
37642 7758268 17650312 18683240 21497432 32086397 40039426 32840653 14775985 1507617
37634 1507617 -61970 3393129 4576552 3076012 -542557 -8510442 -19403017 -23601900
37626 -23601900 -11025313 16555225 43427679 52692170 42800559 29455837 27357758
37619 27357758 32527379 29970780 17103495 7263791 6894609 3999178 -10778899 -24643253
37611 -24643253 -19773677 -1603226 8022820 2076472 -6188751 -9023771 -15377601 -30087694
37603 -30087694 -39315715 -28154576 -1970291 20334806 27199553 20695930 9389791
37596 9389791 3123824 8592486 21759654 28980293 21922019 6654591 -6742174 -16122786
37588 -16122786 -22514929 -22496632 -15469495 -11342277 -18758750 -30312724 -32296960 -26298728
37580 -26298728 -27156480 -39475265 -50382483 -49010678 -40179128 -32420235 -23550342 -7683923
37572 -7683923 10125802 16477170 5403370 -14798079 -29744317 -30151422 -17112441 -854184
37564 -854184 6817465 2703493 -5342139 -8018065 -4637310 -1069267 -645781 -2036796
37556 -2036796 -4888517 -11428243 -20506919 -24823030 -18486452 -5924765 943859 -4287918
37548 -4287918 -14664274 -17175574 -7106078 7334202 14943504 13029759 6667543 -822331
37540 -822331 -11254285 -24465421 -33186907 -29909769 -17062030 -5243011 -863359 -135745
37532 -135745 2795343 6472673 5463356 338056 -1913877 2177987 7831444 9390887
37524 9390887 7606555 6124377 4967897 2502930 920732 3508811 7387550 5516258
37516 5516258 -2726054 -8522428 -4074599 7581192 16172130 15250090 7055108 -2258824
37508 -2258824 -9889685 -18404894 -30409297 -41736558 -43140323 -31032094 -12963180 1582809
37500 1582809 11510756 18734268 17686361 2169048 -18513677 -24800534 -12391886 1023333
37492 1023333 1685149 -837697 8831183 26330769 34103721 26085300 10758370 -5159959
37484 -5159959 -19880912 -26578316 -18248638 -3510596 -407154 -10860169 -17596446 -11850298
37476 -11850298 -7328727 -17454829 -33958133 -40741094 -37123386 -33171754 -31003853 -25879177
37468 -25879177 -19727820 -18244894 -18180744 -12717630 -7679074 -16460367 -37372870 -51288589
37460 -51288589 -46400302 -31976070 -21271275 -13387781 -1500608 11108762 15788469
37453 15788469 14158666 16668686 26379387 34610999 34446302 29888718 27527845 25353071
37445 25353071 15986158 -1078261 -16094668 -19414591 -12358505 -5232660 -5241849 -9243947
37437 -9243947 -9720752 -5172770 -1014396 -1133322 -3200472 -3685310 -3394240 -5127446 -8721117
37428 -8721117 -11746651 -13112579 -12691718 -9315940 -3014678 2408021 3797199 4698473
37420 4698473 11186120 21190914 24635416 17075398 7144754 5609566 11809769 16955462
37412 16955462 17104884 15533845 14583260 13800832 15843489 24604589 35072273 34788489
37404 34788489 20977979 7773163 8189571 15261678 11367371 -6994539 -24641077 -27542611
37396 -27542611 -17032937 -2896138 7514037 9588247 615358 -14613940 -24094669
37389 -24094669 -21689331 -15143422 -14471526 -17457523 -15097373 -7384799 -2770175 -2759237
37381 -2759237 765101 9176237 9548931 -7504146 -29514274 -33490998 -14650562 6475843
37373 6475843 8155821 -9756086 -31482581 -45661324 -51599137 -50072997 -39363877 -21985047
37365 -21985047 -6629540 215406 -1335405 -10354091 -26803759 -43253486 -44864503 -26805687
37357 -26805687 -4472926 4545522 2987884 5615696 13175787 11861920 -775205 -8027503
37349 -8027503 1082563 15154948 18860080 14622222 13396172 14947537 12308631 8213009
37341 8213009 10812184 16582051 13095897 -1357964 -14295918 -16442145 -11526170 -7514042
37333 -7514042 -7922608 -12655721 -18426883 -18613422 -11766178 -8166405 -16646286 -27728769
37325 -27728769 -24990076 -12125421 -9735226 -21642403 -25363911 -6268026 17969634
37318 17969634 22853564 12392967 9970470 23034511 36588435 37916196 29434235 17257350
37310 17257350 3556015 -7027178 -7337411 1247799 8222445 8582866 9040268 15431972
37302 15431972 22073544 19062577 4778748 -13495224 -27704903 -34278966 -34026945 -29954467
37294 -29954467 -24865139 -20643451 -19306242 -21648732 -23860698 -20565219 -13891526 -12889563
37286 -12889563 -19213957 -21334347 -10471872 6056725 17559082 27114864 41730401
37279 41730401 53197048 47961276 32338354 25873781 28656230 19010507 -9704567 -33885552
37271 -33885552 -34097848 -23645790 -25188336 -35975257 -37576246 -28023307 -21033310 -19992788
37263 -19992788 -16014815 -9943731 -13906665 -28188748 -36219552 -28504291 -15332468 -8666650
37255 -8666650 -5640663 1110110 8210312 6960434 -3169197 -15319036 -24823820 -31050728
37247 -31050728 -33419159 -31687966 -28104281 -25395608 -24712601 -27485170 -35380052 -45400080
37239 -45400080 -48459655 -36888671 -13199407 9571701 16970247 6144390 -8032674
37232 -8032674 -5600032 14022633 26975542 14434862 -9217175 -13353612 6203543
37225 6203543 21207941 11950838 -6257058 -9086753 1854965 7532612 3299737 1844217
37217 1844217 8787119 14623420 12265465 7003406 5068103 4382608 1625718 -629479
37209 -629479 1055323 4879538 6262070 2142388 -7852032 -19027927 -20609243 -4657760
37201 -4657760 22200339 42550300 45579283 34891489 18792657 1609762 -12493471
37194 -12493471 -16673665 -9581648 -684450 -105276 -6063292 -8285164 -1745961 8336289
37186 8336289 13865333 11283404 1838980 -11411110 -25387301 -36983074 -41995798 -35723653
37178 -35723653 -18142754 1124266 7998381 -2328120 -19700659 -30368757 -31492611
37171 -31492611 -30666201 -33453648 -36486295 -32754190 -19776322 -2076209 11604323 13818713
37163 13818713 4593794 -7612609 -14527616 -17897358 -26198319 -40090264 -47302733 -37723724
37155 -37723724 -19387103 -10321396 -14440154 -16055368 -3628099 10972055 8360001 -8618141
37147 -8618141 -16324048 -2955688 15366795 18176591 7180409 -2122055 -4753807 -6778655
37139 -6778655 -7964604 -2402925 4167374 -3371111 -24672611 -38299858 -30341372 -14292520
37131 -14292520 -9809537 -13831918 -9942318 827091 -762139 -20841712 -39126349 -35402643
37123 -35402643 -16405434 -4703493 -7975215 -12005495 -3199737 12967730 20248307 12053630
37115 12053630 -2401016 -10427512 -8469246 -731995 9884023 23583936 36719687
37108 36719687 39707973 27049059 7051370 -4203095 376808 12038337 17595962
37101 17595962 13879499 7509003 3100895 -2445893 -12672021 -23586530 -27501364 -23142539
37093 -23142539 -17393957 -16887425 -21856684 -28746180 -34207385 -35171834 -30566317 -25894428
37085 -25894428 -29916200 -41759995 -47684705 -38232354 -22935444 -17816733 -22708640 -24225497
37077 -24225497 -19583094 -21393064 -35238622 -48223170 -48010004 -40193939 -36421094 -36228098
37069 -36228098 -32553316 -26157273 -21480356 -15528341 -4742422 3320703 480847 -4684140
37061 -4684140 2809685 18854277 24096839 14792014 9806261 20002269 29325725 18956476
37053 18956476 -3370674 -13342416 -1844156 17021666 25886672 20335291 6846746
37046 6846746 -5252449 -8852503 -2904147 7211987 15822794 22125202 27345440 30494711
37038 30494711 29853610 24644264 12992897 -5692082 -23397367 -27202741 -16448883 -7482893
37030 -7482893 -12286802 -20306423 -13446982 6631939 20355765 17257318 7159260 3589661
37022 3589661 8836980 17846062 24966513 23141403 7835142 -12672288 -20656698 -9116355
37014 -9116355 8883555 16423412 11042241 2040862 -2229283 1709351 13066363 23995951
37006 23995951 23725522 13326508 8589395 18792138 30615008 25730250 8197204 -1157724
36998 -1157724 4824749 11809878 8884579 4922356 12590260 28672776 40365586 42828259
36990 42828259 40399545 35839998 28334150 19662898 13739434 10502457 6841840 3433376
36982 3433376 4721226 10961067 14783642 8274645 -7691497 -22681362 -26528828 -20777237
36974 -20777237 -17929094 -25971736 -36729588 -36450151 -25864089 -19235783 -22621229 -26105978
36966 -26105978 -22767595 -21299668 -29563424 -38347984 -36076942 -29678540 -33215153 -42690349
36958 -42690349 -42158769 -31282846 -24771408 -24155730 -14049237 7765805 20313183 10869567
36950 10869567 -4683966 -8064303 -6514595 -15790076 -30444067 -33100171 -23451373 -15723357
36942 -15723357 -13288213 -7706782 170106 27367 -7012557 -8038459 -1201764 592288
36934 592288 -7226529 -12989120 -9886958 -6936456 -10602084 -11774010 -1326945 14735621
36926 14735621 25778039 30333534 29936031 21184187 5017307 -6325917 -3155000 8569462
36918 8569462 17147004 19553544 17468815 9533091 -1944602 -7170176 -3582843 -3664314
36910 -3664314 -14779732 -22818922 -12884408 4045329 5801882 -6725271 -13117737 -7944831
36902 -7944831 -6691889 -15070381 -17607338 -5415218 6367777 1479597 -13885743 -23672927
36894 -23672927 -24582278 -22788296 -19820646 -15896459 -17567164 -26744442 -29449748 -12112265
36886 -12112265 14554451 24693469 10926553 -6391783 -7952145 -590534 -4781349
36879 -4781349 -24496428 -40371161 -33068072 -6013654 19272661 26943331 19642617 7895749
36871 7895749 -3819409 -13526240 -12618771 5301762 27679864 30977326 10428727 -11774299
36863 -11774299 -15396488 -6146788 -746327 -1255144 574597 3168845 -1872006 -10657502
36855 -10657502 -9246003 4573774 17228448 18293384 9455444 -5457079 -23021293
36848 -23021293 -31194880 -16874473 11038618 24488846 12146918 -4598638 -3866354
36841 -3866354 5896801 4946949 -3073644 614039 15210967 20049183 8506392 -2251912
36833 -2251912 -176120 5033769 2747204 -744880 2739121 6856791 4082273 2401128
36825 2401128 11877213 23736955 20958448 4977314 -5890320 -3403479 2285692 3135898
36817 3135898 5468581 15223592 24281365 21267051 8135185 -3003802 -5006211 -517249
36809 -517249 4630079 5956248 343564 -12023323 -25324332 -31862759 -29556141 -24339072
36801 -24339072 -24472445 -31937163 -38782903 -33775066 -15206687 4878282 13301875 10665043
36793 10665043 8062368 10744708 13334382 11879264 11283199 16900829 26430016 34664027
36785 34664027 39307933 37356926 23262299 -2443898 -28333101 -42589891 -44004180
36778 -44004180 -37727209 -26797199 -14445263 -7635802 -9498697 -13948798 -16546769 -24139763
36770 -24139763 -42874759 -62742660 -67502750 -56552844 -43591785 -36474600 -32795146
36763 -32795146 -32590227 -37490487 -37001943 -16347729 15938942 28306792 5721166 -27303266
36755 -27303266 -37242459 -21833029 -3880238 4026636 8630414 14581084 14505554 4018726
36747 4018726 -7859563 -9402278 650493 13950106 20561230 14915268 -209156 -14736541
36739 -14736541 -21295099 -23539522 -29394360 -38438992 -43295059 -41379709 -36082939 -27099690
36731 -27099690 -10425592 9964567 20996480 15957145 3040731 -6405473 -10591677
36724 -10591677 -12730647 -11593677 -5014682 2175525 2968458 -916596 -1046934 5120580
36716 5120580 10830646 9892057 3361639 -5057657 -13547719 -18862174 -14889834 -655231
36708 -655231 13997119 18085996 14099242 15600174 28410150 41004835 38528814 21897038
36700 21897038 6603384 4217594 11189535 16133960 12460292 1815830 -10534534 -20437671
36692 -20437671 -26675598 -29940441 -29569157 -22403816 -7622692 8425615 16690039 15118825
36684 15118825 9927267 7219675 8176775 12508581 20093304 27439123 29168771 25795861
36676 25795861 23368329 22164871 13778424 -4730983 -21478280 -23347999 -14039042 -9006060
36668 -9006060 -14776994 -22526626 -22071364 -14233570 -7604219 -8309718 -14281849 -16582946
36660 -16582946 -7389859 9993850 21472274 17069966 3145374 -5303948 -1809514 7981041
36652 7981041 16869425 22264764 22716141 16776600 7416672 1595018 2676026 6415153
36644 6415153 5793655 -1736075 -11029802 -12180435 222949 19057642 30580999 30432348
36636 30432348 26843236 25093218 19375164 6952158 -1694674 1473601 7321986 5424299
36628 5424299 4152723 15431803 27798839 19355087 -4978997 -15740169 -1878758
36621 -1878758 14419538 13824218 5926673 6502466 11015687 8047234 2219820 5402393
36613 5402393 16521310 25520921 27685605 21959385 6848808 -10107816 -12761307 324767
36605 324767 8569028 1353768 -312384 23870987 55198149 58080891 31173551 6816558
36597 6816558 3204746 6623042 2618885 -3616064 -4746260 -5032450 -7506212 -6639505
36589 -6639505 -1598386 432127 274372 8324122 23691435 29871993 18879762 2510607
36581 2510607 -7844700 -14593985 -19026311 -12837820 3466242 11988707 1708670 -14098614
36573 -14098614 -18871230 -16055958 -16215857 -16096684 -8774671 -1701758 -4336628 -7662007
36565 -7662007 2710787 19619670 21911282 5938762 -10168592 -12898562 -6224412 2008810
36557 2008810 9565239 13697115 10323279 2103156 -4284994 -9244060 -16971962 -22948253
36549 -22948253 -19322674 -12066636 -15825414 -29168019 -32180233 -14894634 7249298 14981207
36541 14981207 9475834 4861371 6231466 6695713 1651369 -3747458 -1294214 10064444
36533 10064444 20626833 17768169 1009042 -13936144 -13367944 -4187898 -3436620 -12195161
36525 -12195161 -15032898 -6143266 1473560 -1380207 -5308420 -124716 7267194 5829778
36517 5829778 -114931 1362334 10564201 18671616 23638372 29833343 35304093 32011335
36509 32011335 17400597 -3594392 -25002966 -39599991 -38040018 -20238103 -3243276
36502 -3243276 -3938896 -15826461 -17081112 -1603601 12384061 7322251 -13324532 -34093263
36494 -34093263 -45170015 -44996224 -34952887 -19121349 -4175834 5681837 10865315 12965583
36486 12965583 14255045 19366400 29593802 36768033 32843058 24376816 24278729 28955676
36478 28955676 20757817 -2353626 -18835076 -15526267 -8712822 -16998138 -29697876 -24742675
36470 -24742675 -6960139 -1723834 -13810329 -20067050 -7226662 8376525 9031984 1854203
36462 1854203 2144968 7787700 7914678 4905632 8462541 14736340 10546531 -3834016
36454 -3834016 -13591500 -11939566 -8230890 -10742672 -15797886 -18880194 -23050974 -28729308
36446 -28729308 -26742492 -11729437 5821035 11611081 5636835 -2480728 -10859951 -24253262
36438 -24253262 -37089528 -33663233 -11437174 8084525 2685956 -22257063 -39934965
36431 -39934965 -35127280 -20473597 -16844959 -26222667 -31646347 -20741831 -814974 11743046
36423 11743046 11482471 8030479 11528398 19311232 19855743 7715452 -9101260 -17413689
36415 -17413689 -12711233 -3423434 -1805278 -11358395 -23354723 -25595393 -14697002 150204
36407 150204 5814009 -2027560 -14640623 -18957524 -10444331 3554090 13453403 17993628
36399 17993628 21948932 24524321 16860231 -4211750 -24783289 -25304321 -4281679 17713923
36391 17713923 22111122 13879441 12066745 22956745 32146659 24561562 4720470 -7854860
36383 -7854860 -685360 18173860 28900422 20806476 3408956 -4626615 3317420 16236250
36375 16236250 22724025 26397012 36423908 48046514 45547665 25783973 5937058
36368 5937058 1737669 8379801 11664541 9105565 7703855 6186310 -5220011 -25913780
36360 -25913780 -39219819 -32078038 -12116070 2152086 3094314 -1257602 -1513882 1578493
36352 1578493 1295424 -4641947 -11933038 -17050774 -22678330 -32608638 -42485596 -40929085
36344 -40929085 -22861459 1897135 17625752 17984412 8300336 -3698092 -12418774 -12377224
36336 -12377224 -2024559 8755087 5145823 -13693490 -30632369 -31444774 -21421471
36329 -21421471 -13215793 -6776922 5762974 20244989 21838455 7821389 -5920436
36322 -5920436 -6883654 -1376616 638076 3829149 16717978 30542621 26673218 4674844
36314 4674844 -13665078 -12919510 -2336173 2033526 480267 3017718 9516830 12151299
36306 12151299 13138562 23058058 40384238 48543119 39072867 24743289 21306577 26191834
36298 26191834 24918382 11393103 -7782738 -23450896 -28786296 -19509261 -429669
36291 -429669 11549820 2944064 -18179643 -29898983 -22312138 -5898183 5653493 9292470
36283 9292470 7219712 -311958 -11105031 -18684458 -19637450 -17121329 -14027221 -10383264
36275 -10383264 -10071534 -19552518 -34512508 -38582020 -23567594 -1802985 10568039 13445255
36267 13445255 15174768 14401470 4572755 -8803274 -12251746 -5217556 -1298933 -6232480
36259 -6232480 -9234017 -1703339 8298034 8703069 1146581 -3712741 -2620900 -1426729
36251 -1426729 -2776175 -1690656 4676669 9375239 2519442 -15421043 -30906889 -30221173
36243 -30221173 -14208192 2778532 8783328 4798603 -2048661 -9050959 -15443690 -14986437
36235 -14986437 -1763386 16791128 22808927 7582713 -18454654 -38362416 -44772534
36228 -44772534 -39756053 -25872193 -4821885 17801211 33531619 38065808 34375878
36221 34375878 28490355 24053899 21114463 18632006 16896089 16791163 17032699 13997349
36213 13997349 5304476 -7828924 -21950831 -32109014 -31281578 -15542273 6545687
36206 6545687 16353182 4118387 -18682548 -32918283 -33450397 -28898279 -24373706 -16240189
36198 -16240189 -3155184 9250579 16353315 18006740 13709466 4176130 -2546293 1350480
36190 1350480 8608154 3281741 -14838566 -26886172 -21889162 -11862685 -10679576 -12830514
36182 -12830514 -7166341 349237 -4165552 -16569934 -16931412 1263516 19470600 17259915
36174 17259915 -2148944 -15733975 -6328605 19505751 39009797 37623500 23430553
36167 23430553 13865832 11643546 3917121 -14100622 -28004242 -23535737 -6179538 7749474
36159 7749474 11208695 8684686 6527806 10551979 25229188 44764349 52360670 39228127
36151 39228127 17335269 3087467 -2470178 -5073026 -450232 15757257 29515274
36144 29515274 21199900 -5780062 -28584416 -35614397 -34454153 -30569683 -19698707 -3904336
36136 -3904336 5741192 7516279 11023328 16109206 10371446 -5330317 -10645084 3610763
36128 3610763 18779256 17209105 9753986 15762907 29406800 27683316 5485267 -17318651
36120 -17318651 -22975002 -14585202 -6210368 -5289181 -7539880 -3440400 11075700 28118575
36112 28118575 34650347 26866458 12305832 -2496596 -16740082 -26053044 -21916035 -6892627
36104 -6892627 2078485 -5654517 -21295658 -32051264 -37194885 -38998121 -31587594 -12496693
36096 -12496693 6681501 16078150 22665791 33506382 36239787 17580688 -7540297
36089 -7540297 -10276479 10876732 26789632 17871878 -3525572 -15466462 -12420888 -2427588
36081 -2427588 5935875 6831791 256585 -3020756 7965015 25270228 27948644 12109580
36073 12109580 -516857 7510070 25011002 29082167 15692052 1218456 -21144
36066 -21144 10759367 21851786 21862351 8870743 -6056333 -8823501 608748 7333005
36058 7333005 1486023 -8822582 -10383669 -3100755 2179906 -1470421 -11348102 -19729792
36050 -19729792 -18405931 -3914673 15344228 22400010 9455843 -11438021 -22183881
36043 -22183881 -19395800 -14408223 -16209814 -22916471 -28991678 -32493102 -33468255 -31325306
36035 -31325306 -26865550 -23527453 -23403634 -22783764 -14328365 4058274 22876366 27719033
36027 27719033 15443305 -116076 -3860154 2649603 6465150 3245806 780909 2483900
36019 2483900 587684 -9100143 -17216936 -13991480 -4290194 -900153 -8454508 -21499889
36011 -21499889 -33200832 -38572638 -34193258 -22782088 -14422773 -16124352 -23595999 -29230872
36003 -29230872 -32648290 -35443145 -31595129 -14778666 7133771 16860087 8418313 -6268737
35995 -6268737 -13475319 -12060556 -8835038 -7378977 -7239809 -10023434 -19463632 -34140263
35987 -34140263 -43732951 -37402143 -18276507 -5490119 -14587282 -36573468 -45798830 -31354556
35979 -31354556 -10232641 -3094966 -7825420 -8228544 -611406 3296947 -3170300 -13145911
35971 -13145911 -19329379 -22863320 -26083517 -26937141 -24418584 -20961928 -16090136 -5616730
35963 -5616730 9788427 23005337 30278595 34505289 35733362 27820932 9957920 -7029303
35955 -7029303 -12924773 -10092990 -6560204 -3902596 -128380 1513381 -2810067 -7081821
35947 -7081821 -765307 14949567 25806737 21919723 8708760 -3162426 -11686050 -21263354
35939 -21263354 -30826463 -31950435 -19848630 -1703503 8719860 3893316 -10964164
35932 -10964164 -23487139 -25570318 -19574376 -14035988 -14066904 -16694312 -15376515 -7384321
35924 -7384321 4533634 16275187 25383902 30158992 29337182 24480339 20130228 19287644
35916 19287644 20641310 22100904 23974717 25463745 21533384 8671103 -8182036 -19989859
35908 -19989859 -23297135 -19835369 -9187810 9501377 29441476 39907630 39362292 35323362
35900 35323362 30328955 20116070 8080010 6203437 14640247 16073405 1446912 -13926192
35892 -13926192 -14833329 -11796023 -21606626 -34236361 -26015394 -1106455 9480333 -6178341
35884 -6178341 -23626334 -20376361 -6784238 -3732411 -10111152 -11498699 -6354836 -3135429
35876 -3135429 -708771 8358349 19668894 20229172 8726673 -2226799 -4375010 -2208050
35868 -2208050 -2568005 -6018334 -9115323 -7591708 1200205 12018705 12440210 -795462
35860 -795462 -11753275 -4413858 12680274 16857361 4595877 -4353752 866809 5556154
35852 5556154 -5723599 -24557680 -33110100 -30910641 -30082272 -30554952 -18867486 7447935
35844 7447935 30130158 30910502 11759947 -11902213 -29944335 -41124633 -43823447 -35257832
35836 -35257832 -21445502 -17562822 -30858521 -48322561 -50588310 -37030134 -26995440
35829 -26995440 -33354586 -45357957 -45477861 -34361800 -26291108 -24314118 -16030442 3254426
35821 3254426 18220453 13185089 -5775329 -18500010 -14423209 953044 17881632
35814 17881632 28921502 25974433 4413510 -25688841 -42502073 -33994632 -11907610
35807 -11907610 1627387 -1817649 -12001445 -16958531 -17370360 -21390089 -30309478 -35601587
35799 -35601587 -30671859 -20546493 -15657998 -17718938 -17187158 -6436419 9159361 17498279
35791 17498279 14865230 9937840 12505018 21905495 28091988 22334563 6114333 -9557891
35783 -9557891 -14013861 -7417552 -419775 -1806049 -8698411 -12270940 -10721090 -10655396
35775 -10655396 -15770487 -20732159 -18594766 -8922201 4326251 17669292 26843889 25815202
35767 25815202 13259061 -2444195 -10321490 -7787806 -543280 5990311 9970995 10303600
35759 10303600 7248053 5196897 8201586 12392377 9341928 -1958067 -12931051 -17028229
35751 -17028229 -17029096 -17817811 -18009397 -13239873 -3564390 6620796 13185743 14155152 10353835
35742 10353835 6253784 6290632 8846162 8870461 7302526 10080998 15474529 12907932 560823
35733 560823 -6955068 955626 12243819 8316023 -7573255 -14757189 -5607760 6124108
35725 6124108 8925722 7714238 8827041 7458011 -395424 -7283029 -7338653 -8730779
35717 -8730779 -19812225 -31822904 -30567629 -19418935 -14026519 -16075145 -9751339 12022422
35709 12022422 32937518 33087015 13585406 -7281318 -16162072 -14411459 -9607329 -6145622
35701 -6145622 -4644080 -4599350 -5099598 -4981609 -3599301 -1286538 294229 -1703118 -8408998
35692 -8408998 -15219305 -13757660 -1292354 13577122 19180509 14781300 11543942 17623310
35684 17623310 27086149 28211577 19413237 9904505 4962199 -1162343 -13811126 -26450327
35676 -26450327 -28294335 -20608843 -17397205 -28558767 -47245960 -55636542 -41191782 -8239931
35668 -8239931 23691758 35251416 25096917 10124131 4194369 2412305 -5543952 -13886400
35660 -13886400 -8490914 5669437 5227183 -16552183 -34441403 -24913304 -635809 6975400
35652 6975400 -9163470 -26285112 -26228758 -15608700 -9298259 -11118578 -17121663 -24696938
35644 -24696938 -30806349 -30613896 -24452607 -18857661 -16160382 -10891486 -646568 8326425
35636 8326425 11579412 13496833 17460939 17911285 10380826 1394684 -1365327 -1930709
35628 -1930709 -7880396 -14680483 -11437729 -196615 4420103 -3254858 -11167895 -7107019
35620 -7107019 4928816 12338822 10451703 4154182 -2259127 -9487572 -18924174 -28800765
35612 -28800765 -34167865 -29103580 -12015040 9255471 22103372 22258361 17632357 15670788
35604 15670788 13621956 7741724 4365987 10086791 15553191 4392742 -20967185 -37950124
35596 -37950124 -33390497 -19880680 -14298587 -14260505 -9065093 -2475961 -7095764 -22018418
35588 -22018418 -33786442 -37250546 -38452978 -37597878 -27597981 -12158599 -6782321 -15566404
35580 -15566404 -23879413 -21809608 -17995293 -20028042 -18300586 -3839202 12592248 16780480
35572 16780480 15101967 23337609 39638052 47980658 42905836 31627752 16158264 -5823726
35564 -5823726 -24174027 -22093069 -987315 19402537 27810491 29652956 27426922 15657856
35556 15657856 332410 -1087869 10796201 11381368 -9968348 -28498779 -19992065 1518405
35548 1518405 6306285 -5139984 -6410038 11862137 30950632 35427890 30972656 27193294
35540 27193294 23910870 20850761 23293623 30461129 32456932 25863940 20109907 21929089
35532 21929089 25206615 22930354 18110178 15263701 10770988 -280863 -15242093 -28395082
35524 -28395082 -37017855 -38077951 -28239523 -13357083 -7839192 -16491265 -26742206 -27896986
35516 -27896986 -27098788 -33684533 -38506390 -27006565 -7132145 -3405918 -22134894 -41765670
35508 -41765670 -43443766 -34164819 -30449168 -33509254 -33350171 -27597233 -22348131 -19756578
35500 -19756578 -17470515 -17142245 -21444903 -24531216 -18006357 -6844223 -6594489 -20927809
35492 -20927809 -33374523 -28282314 -11281253 -80279 -249055 91516 12258651 31335541
35484 31335541 40744062 29299973 2685018 -20584533 -24711801 -9205359 13469547
35477 13469547 30240091 34342866 23573319 765403 -22345825 -31083968 -23129662
35470 -23129662 -11267432 -6394121 -6150847 -6473748 -13302819 -30527870 -44703227 -38230543
35462 -38230543 -14757344 4680951 10207272 11022447 13161498 8313323 -7279156 -19401879
35454 -19401879 -14059979 1915473 10922033 7083513 -3020636 -14599467 -26291171
35447 -26291171 -32346942 -27043831 -15865351 -10657501 -13506366 -15535234 -12112012 -9242576
35439 -9242576 -12904975 -20802563 -27601378 -31022729 -29596959 -20989737 -6876236 4926928
35431 4926928 7180238 -221079 -12121556 -23292002 -29794436 -28728687 -20357856 -9652393
35423 -9652393 -3126412 -3452859 -7732962 -11331986 -13278754 -17002808 -24793441 -32848308
35415 -32848308 -34654285 -29143538 -22125030 -18756465 -17671034 -13702426 -3918415 9348353
35407 9348353 18762889 16490512 3154634 -8947379 -8210593 1107207 3907330 -5466226
35399 -5466226 -17375627 -22192653 -19983110 -12411234 1188796 13650587 10362595 -10287582
35391 -10287582 -29588260 -32758162 -27777265 -27124905 -24909450 -10343775 7880204 13002615
35383 13002615 8462691 11089860 20411663 20084445 9282810 5800895 13479641 13345934
35375 13345934 -2991983 -16130131 -10043755 644644 -6225971 -24889044 -29661060
35368 -29661060 -10253141 18459742 37543256 40811273 33252116 23573790 16894615 9153654
35360 9153654 -6565135 -25001685 -30358847 -18947716 -7353780 -8234079 -11264081 -1987325
35352 -1987325 12286438 13075084 -648550 -12931765 -15758856 -15962925 -19317581 -24136276
35344 -24136276 -29811762 -36256188 -35680947 -20947675 -1972442 3436724 -3074477 -322599
35336 -322599 20423162 41388169 44357453 34025755 23977063 14324064 -1230744 -16364459
35328 -16364459 -17660824 -5053404 8524049 16548404 23833542 31061161 28523289 11309237
35320 11309237 -9581962 -19784961 -19323608 -19208745 -23337207 -23341746 -13060638 -245272
35312 -245272 1450699 -11629251 -30129929 -41954099 -40571229 -25934731 -4937401 8901523
35304 8901523 4751855 -12805571 -26579176 -26007150 -17491517 -11567718 -7597737 1093522
35296 1093522 12781260 17915178 11895596 -881617 -13885372 -21816535 -19705008 -7626634
35288 -7626634 5008783 8767865 6428258 6383583 6200847 -3604251 -18582558 -19608727
35280 -19608727 -278544 19480804 18818052 4004739 -3083844 2946437 7046629 -327276
35272 -327276 -10188062 -11709951 -7935160 -6981724 -7481958 -2950845 4312056 3861885 -8740513
35263 -8740513 -26042916 -38501653 -44451124 -47390285 -47316752 -39510736 -22141329 -2274956
35255 -2274956 8148082 3483712 -8774218 -14082927 -5045589 11542925 22949157 23679422
35247 23679422 17686443 9694614 -177919 -12674155 -25804063 -37298426 -46163602 -49616054
35239 -49616054 -43893981 -31537165 -21911630 -19520866 -18004108 -12302994 -9632575 -18060393
35231 -18060393 -29841315 -29618438 -16781809 -5061437 -72420 6365983 16345866 17909064
35223 17909064 5340989 -7967050 -8455128 -1709333 -284190 -3316345 -2724797 -742496
35215 -742496 -5001244 -11540980 -8501970 5794056 21642852 31618764 32927480 21271996
35207 21271996 -2233616 -21943879 -22672923 -11737125 -8117073 -11472983 -3781280 16016694
35199 16016694 23718781 5878365 -17954051 -23646781 -15139428 -11388748 -15357670 -16404473
35191 -16404473 -14019175 -17228098 -23494894 -18527408 711336 18928095 22707344 15460436
35183 15460436 7890631 4247643 3423057 4960781 7325279 5650674 -2713373 -13188869
35175 -13188869 -18622664 -16978067 -11661869 -6478550 -3327631 -3525919 -8088470 -15910347
35167 -15910347 -23016002 -24637287 -18438691 -6223121 6989168 15764078 17619869 15169403
35159 15169403 14086669 16508192 17300218 11261649 3770215 6405260 18405256 22016530
35151 22016530 5700999 -15484004 -16652991 2780248 17778084 12363802 -617820
35144 -617820 -1365790 9507477 16782372 14137478 9115066 9159154 13335602 16171263 12657609
35135 12657609 1969020 -8506669 -7485425 5751445 16537786 11682986 -4106616
35128 -4106616 -16552843 -20561506 -20280701 -15540321 -2114028 14742655 20467898 9224884
35120 9224884 -7592038 -15474742 -12218926 -4917619 1689242 7546702 11607382 10461542
35112 10461542 3373584 -4515161 -5911200 1522254 12307421 18471745 17672072 14340833
35104 14340833 12898125 12872975 11681530 9054835 7159539 8631673 14421688 20122383
35096 20122383 16092724 -1755743 -21611909 -25622289 -12127710 2346751 6770524
35089 6770524 8591757 16125392 22028057 17076186 9186272 12479635 24444814 30772792
35081 30772792 28535612 27473612 30548794 30797193 27494843 27729598 29687246 22235704
35073 22235704 6155241 -1414848 8281257 21521166 22499278 14850896 11822747 15799122
35065 15799122 19689377 20675137 20579490 17861097 9772309 -1311075 -12169311 -25045898
35057 -25045898 -41767807 -56279499 -61231805 -57575635 -49725732 -36663268 -17513538
35050 -17513538 -1049891 2135636 -5212388 -10882899 -10954779 -12065027 -16117188 -15909390
35042 -15909390 -9342784 -5244044 -8026089 -7214850 7548018 28027913 35679532 25772477
35034 25772477 11934400 6032245 4445224 -1195033 -8764179 -9428923 -1939617 5621791
35026 5621791 6874912 2023631 -7687086 -21238000 -31568059 -27937793 -10842512 2866783
35018 2866783 -1762339 -18664330 -28169104 -20809902 -5473778 4694016 6067168 3861165
35010 3861165 4756217 11161840 17792776 14935577 579650 -13292857 -13833378 -3746233
35002 -3746233 4655379 8430217 14152939 20373301 16246717 1664045 -7043388 452699
34994 452699 13549660 17423950 12355401 5657332 -3626309 -17979854 -28877013 -27046949
34986 -27046949 -19371195 -19519623 -25624058 -24073046 -14209460 -11386355 -22136504 -32466803
34978 -32466803 -28084243 -13958722 -5080247 -6286828 -9857218 -8014556 -853298 5404534
34970 5404534 4132634 -4812220 -12506506 -10322931 -2771397 -3194778 -14065192 -21522238
34962 -21522238 -16037862 -8572870 -14582117 -28400741 -28938709 -10810679 5895870 3571319
34954 3571319 -7851148 -5706138 12929864 28701083 29059420 24076556 27092357 33438765
34946 33438765 31130085 23740957 25145423 32988800 25937577 -6102154 -43772686 -61000918
34938 -61000918 -55535280 -44490039 -37274516 -28218402 -13726299 -1516818 805316 -3977043
34930 -3977043 -8137254 -7699576 -2684033 5249854 12747271 17090119 19642016 22282082
34922 22282082 21590878 14029428 6030982 8523775 19383975 22689721 10901471 -2565631
34914 -2565631 -1007018 13570904 25412870 25430615 16284263 2024874 -15141436 -28974204
34906 -28974204 -31679247 -24406060 -16769749 -13792056 -10535763 -1287291 13464340 31110563
34898 31110563 49608980 62554276 60216019 42024323 21814932 13419785 15298202
34891 15298202 16173816 11622478 6891273 6022986 7200024 8324128 8986501 6980926
34883 6980926 1351735 -908142 8469250 23191007 24719564 6768749 -12747823 -13569407
34875 -13569407 1121228 11829779 9500573 1795487 -4375598 -11601821 -21054635 -25919371
34867 -25919371 -21608547 -13711354 -10207567 -12348283 -17509328 -24537185 -31790645 -35667880
34859 -35667880 -35363087 -34376305 -34806885 -35799423 -38791009 -45789972 -50290956 -41079153 -20484697
34850 -20484697 -7313277 -13222695 -26823314 -31383101 -27475320 -24518515 -19654380 -3529833
34842 -3529833 17102499 21942601 4191616 -20409886 -34703580 -37142488 -34820860 -32383391
34834 -32383391 -31998965 -33067884 -28452431 -12423260 4673557 3257563 -18532170 -38315110
34826 -38315110 -37485588 -22618794 -9481902 808070 15727282 31591926 36501007
34819 36501007 28629309 17132988 7349914 -1703640 -7220243 -4328852 1472762 -2240538
34811 -2240538 -15082434 -19931863 -5282482 17894450 29442130 23863051 12936387
34804 12936387 8264824 9387106 9252860 5090876 460256 -1383194 -2393924 -5930207
34796 -5930207 -9625105 -6641022 4167895 14181424 15690269 12543224 13106496 15404730
34788 15404730 9251066 -5981547 -16824241 -14454137 -8412855 -12388424 -23166234 -26143502
34780 -26143502 -19125097 -16152888 -24517521 -32027488 -26366177 -16014957 -17269168 -25903173
34772 -25903173 -19971694 6404303 29421494 26172571 6302800 -1798786 10235217
34765 10235217 22701452 18074607 2851741 -6322958 -5261112 -1789979 -1025091 -687904
34757 -687904 3279445 13748710 30568396 44507920 38686297 6982795 -31176301 -46642617
34749 -46642617 -33494579 -15661429 -15906324 -28104244 -29506602 -14065332 -412778
34742 -412778 -5539661 -21936108 -28032237 -15338244 3232394 10004871 -578001 -21666363
34734 -21666363 -41731912 -49246484 -37907392 -14331142 4149395 6593649 503870
34727 503870 563810 9264924 17037277 18381627 16867009 14271848 6396359 -7016909
34719 -7016909 -17831818 -19287263 -12541828 -695480 14485357 26310481 24726135 11155929
34711 11155929 2064779 8863876 22158704 25292186 16346180 6163722 407346 -4462310
34703 -4462310 -10162304 -12612779 -9036359 -2033982 2350129 -2998886 -19712179 -34706051
34695 -34706051 -27797672 1499815 25592534 21504892 1926230 -4879261 2690776 1983163
34687 1983163 -13003011 -22278574 -16528488 -14282825 -28925035 -43021690 -34804840 -12121516
34679 -12121516 1139190 -719559 -6401405 -13629941 -30267913 -52066659 -60861187 -48295827
34671 -48295827 -26345837 -11323592 -9023407 -16655540 -27719919 -33141788 -27785545 -17617492
34663 -17617492 -12345299 -11757540 -8350039 -1340446 3146833 4391874 7085090 9607914
34655 9607914 6015437 470618 4641915 17493924 23012735 13897994 2872182 2429320
34647 2429320 6981239 5112548 -2630438 -9787244 -17254794 -27391137 -32805246 -24572397
34639 -24572397 -6707401 8993774 17658171 20626266 16974738 8364627 5803365 16454817
34631 16454817 28234678 23964564 8198548 2171273 12390401 23393374 24574361
34624 24574361 24041008 28299253 27478807 13429510 -2829543 -6832596 -2547007 -2707475
34616 -2707475 -5402220 2813856 23857650 43510173 50206100 46851863 42734874 42167899
34608 42167899 42010108 35171691 18571902 1454668 -1055657 10752742 16284049 2579115
34600 2579115 -13422810 -8405842 9236293 8454238 -18076931 -41861980 -39293794 -21040032
34592 -21040032 -9194087 -6174610 -3021410 -1758290 -8873466 -16794616 -12316401 1484209
34584 1484209 9267999 5903573 -924278 -7117485 -14584878 -19203176 -13639235 -2847573
34576 -2847573 -184190 -5816508 -5295163 6431557 15899034 12462249 3514152 -130346
34568 -130346 -46562 -902892 1933593 12363911 20898699 16482145 4469896 -1454704
34560 -1454704 -709498 -4306742 -14129400 -19313616 -15070663 -10875116 -14939750 -22259782
34552 -22259782 -24807314 -24047503 -24958994 -24503172 -15639118 218704 13104519 16023080
34544 16023080 10026078 -1472799 -16230882 -29581118 -34112609 -27441581 -16760790
34537 -16760790 -11339339 -12549786 -15266613 -17057361 -20231050 -24712365 -25468411 -20227100
34529 -20227100 -14339284 -12653368 -10523064 -284352 14678683 20821056 11652197 -3062764
34521 -3062764 -9733155 -7200274 -4817028 -7738780 -10943437 -7675156 1463265 9220743
34513 9220743 8644035 -1055691 -13032792 -17271168 -9499584 3617736 10349099 5507284
34505 5507284 -5439655 -13599443 -15381325 -13357129 -11008156 -8787722 -5155740 -577395
34497 -577395 410168 -7055319 -21081607 -31698612 -30059812 -18926755 -10448335 -11981077
34489 -11981077 -16964845 -12720546 3940176 22128609 28656320 22055956 12567017 9003412
34481 9003412 9421309 7335488 4064090 8318603 21767123 31367180 22461978 -2694923
34473 -2694923 -26046473 -33461989 -27229071 -17561974 -8803789 749111 10007707 13551290
34465 13551290 8841343 -89987 -6909620 -7442680 -120908 13087974 24666695 25448006
34457 25448006 14650607 3479252 4289108 16766325 28470583 28888714 19041703 6437044
34449 6437044 -4687403 -14342774 -21351516 -23359785 -22925064 -27176612 -36761010 -39221856
34441 -39221856 -20974177 13597140 41746439 44471331 24576967 -276010 -16658670
34434 -16658670 -21729416 -16502447 -3587919 9182028 13817663 13522807 19313201 31417002
34426 31417002 34582493 19330063 -1512415 -8093045 1193892 11365116 12923913 9016254
34418 9016254 3052923 -5964734 -14417998 -14406791 -6972342 -2473897 -3300810 770482 13475405
34409 13475405 21642137 13751353 -2486237 -12974890 -18028787 -26448236 -36009164 -35695918
34401 -35695918 -24590911 -13821387 -9768572 -8058124 -4842915 -1858994 1621669 10425570
34393 10425570 23555095 31910043 29523169 19958136 9920292 4066423 6583179 18291498
34385 18291498 30345564 30812267 20615594 13290864 15433416 17834940 11295393 940177
34377 940177 -2698155 1771572 9501660 19615002 32516517 41471829 37355024 21534039
34369 21534039 6545376 2570371 7254290 9778320 3224156 -7323453 -9712639 643636
34361 643636 14035804 19293456 19253394 23469201 27868327 16989719 -9392169 -27790884
34353 -27790884 -19926850 1669769 10347829 -479139 -14471306 -19047431 -19231327 -23961432
34345 -23961432 -31467419 -32940289 -23535283 -6300135 10642345 19694169 19926056 17264471
34337 17264471 15944706 12528369 2448125 -10953274 -19707662 -21390076 -20337415 -19972421
34329 -19972421 -18956370 -14826593 -8625218 -6273510 -14601346 -31642140 -42425647 -33866645
34321 -33866645 -14916237 -9186497 -22686852 -33564529 -23427318 -3790531 3365840
34314 3365840 -2031091 -4688266 -3042681 -8676357 -20646438 -23805189 -13735630 -2165480
34306 -2165480 5234791 15647509 28862534 31197607 18350824 5748039 5380324 8838579
34298 8838579 5604628 3000918 12489164 26940756 28012619 11247515 -8996396 -17035759
34290 -17035759 -9577513 4605330 11809701 3920339 -13344272 -26979708 -32923561 -37376728
34282 -37376728 -41382277 -38185012 -29982695 -29914380 -38631335 -37770891 -20616279 -9639657
34274 -9639657 -22538574 -37910270 -22998354 14819420 36489501 28416937 17449592
34267 17449592 23621295 31607320 24063506 14092759 21626374 38421266 42413724 33283349
34259 33283349 27385232 25747022 14775181 -3302012 -8354113 4442167 14140909 6686047
34251 6686047 -3777220 -542306 7421475 2198106 -11323102 -12901424 383572 11513130
34243 11513130 12115582 11438033 13749721 8719823 -7094752 -18344923 -13028519 -1440798
34235 -1440798 635631 -5262668 -9085799 -12179892 -21112610 -30384642 -29697096 -22697859
34227 -22697859 -20776123 -23252929 -21901981 -19932135 -25761005 -31842904 -23230940 -5690381
34219 -5690381 831533 -2025345 8402235 32892689 40544202 16951826 -8840608 -8170809
34211 -8170809 3712082 -2858555 -20428267 -17188802 10934231 36153229 42058711 37718909
34203 37718909 28524614 5970985 -26004731 -43302895 -33556511 -14856584 -9547253
34196 -9547253 -15571668 -16380030 -6813726 2585024 -763290 -20458767 -46380591 -58334047
34188 -58334047 -45002463 -21427218 -14774401 -29971313 -44348525 -40540243 -27492181
34181 -27492181 -20885787 -20062858 -16854062 -12958490 -13599073 -14196177 -8302305 -1718651
34173 -1718651 -4973799 -16629200 -25833649 -27318827 -23846485 -18500429 -14003370 -14325698
34165 -14325698 -17479092 -12802265 4254237 21033055 22827632 12736251 3512033 -3618801
34157 -3618801 -15590094 -27604816 -26459850 -14361683 -9565604 -18236880 -24401715 -16591453
34149 -16591453 -6792696 -9436989 -16227347 -10071333 4669732 6155242 -12295490 -32036440
34141 -32036440 -35091898 -25042538 -15812914 -12753115 -13740813 -18468062 -25116337 -24735452
34133 -24735452 -11602041 3943874 5147349 -9119946 -22900702 -24381236 -17780897
34126 -17780897 -12263351 -10312414 -11045921 -14241723 -15767582 -9529553 21146 -980704
$$ [...]
##END NTUPLES=NMR SPECTRUM
##END=
