##TITLE=31Pdec_LR-659-C1-B
 D2O, 24 sc
 12.3.2019
##JCAMPDX= 6.0         $$ Bruker NMR JCAMP-DX V2.0
##DATA TYPE= NMR SPECTRUM
##DATA CLASS= NTUPLES
##ORIGIN= UXNMR, Bruker Analytische Messtechnik GmbH
##OWNER= root
$$ XWIN-NMR		Version 3.5
$$ Tue Mar 12 16:40:42 2019 Russian Standard Time (UT+4h)  she@DPX200
##.OBSERVE FREQUENCY= 81.013821
##.OBSERVE NUCLEUS= ^31P
##.ACQUISITION MODE= SIMULTANEOUS
##.ACQUISITION SCHEME= undefined
##.AVERAGES= 24
##.DIGITISER RES= 17
##SPECTROMETER/DATA SYSTEM= spect
##.PULSE SEQUENCE= zgpg30
##.SOLVENT NAME= D2O
##.SHIFT REFERENCE= (INTERNAL, D2O, 0, 182.463)
##AUDIT TRAIL= $$ (NUMBER, WHEN, WHO, WHERE, WHAT)
$$ ##TITLE= Audit trail, XWIN-NMR		Version 3.5
$$ ##JCAMPDX= 5.01
$$ ##ORIGIN= Bruker BioSpin GmbH
$$ ##OWNER= she
$$ F:/spectra/data/she/nmr/P31/1/pdata/1/auditp.txt
$$ ##AUDIT TRAIL=  $$ (NUMBER, WHEN, WHO, WHERE, WHAT)
(   1,<2019-03-12 16:39:44.01 +0400>,<she>,<DPX200>,
      <created by zg, POWCHK disabled, PULCHK disabled
       configuration hash MD5:
       00 E9 B6 7A A2 85 ED C7 34 08 36 98 17 FE 4E 26
       data hash MD5: 32K
       88 84 69 95 01 21 0F 69 A5 1D 1E CE CB 8C 0F 24>)
(   2,<2019-03-12 16:39:46.60 +0400>,<she>,<DPX200>,
      <Start of raw data processing
       efp BC_mod = 2 LB = 1 FT_mod = 6 PKNL = 1 PHC0 = -1855.632 PHC1 = 144.599 SI = 64K 
       data hash MD5: 64K
       C9 51 36 14 FB B9 2A 37 A3 F5 27 DA DF 0C B0 D3>)
(   3,<2019-03-12 16:40:03.67 +0400>,<she>,<DPX200>,
      <pk PHC0 = -4.900481 PHC1 = 0 
       data hash MD5: 64K
       C4 AA 05 39 CC A8 BB 6F B7 12 95 5A 2B C2 63 80>)
(   4,<2019-03-12 16:40:06.70 +0400>,<she>,<DPX200>,
      <abs ABSG = 5 
       data hash MD5: 64K
       A4 D8 BC D1 3A 83 8F 0D 9C 91 87 41 8C 75 1D 97>)
$$ ##END=
$$ 
$$ hash MD5
$$ A3 88 9B C9 52 FA E4 78 BB 7F 70 D6 73 B6 E3 38
##$RELAX= 
##$RELAX= 
##$RELAX= 
##$RELAX= 
##$RELAX= 
##$RELAX= 
##$RELAX= 
##$RELAX= 
$$ Bruker specific parameters
$$ --------------------------
##$DU= <F:/spectra>
##$EXPNO= 1
##$NAME= <P31>
##$PROCNO= 1
##$TYPE= <nmr>
##$USER= <she>
##$AMP= (0..31)
100 100 100 100 100 100 100 100 100 100 100 100 100 100 100 100 100 100 
100 100 100 100 100 100 100 100 100 100 100 100 100 100 
##$AQSEQ= 0
##$AQ_mod= 1
##$AUNM= <au_zg>
##$AUTOPOS= <>
##$BF1= 81.014009
##$BF2= 200.13
##$BF3= 200.13
##$BF4= 200.13
##$BF5= 200.13
##$BF6= 200.13
##$BF7= 200.13
##$BF8= 200.13
##$BYTORDA= 1
##$CFDGTYP= 0
##$CFRGTYP= 5
##$CHEMSTR= <none>
##$CNST= (0..31)
1 1 145 1 1 1 1 1 1 1 1 1 1 1 1 1 1 1 1 1 1 1 1 1 1 1 1 1 1 1 1 1 
##$CPDPRG= <waltz16>
##$CPDPRG1= <>
##$CPDPRG2= <waltz16>
##$CPDPRG3= <>
##$CPDPRG4= <mlev>
##$CPDPRG5= <mlev>
##$CPDPRG6= <mlev>
##$CPDPRG7= <mlev>
##$CPDPRG8= <mlev>
##$CPDPRGB= <>
##$CPDPRGT= <>
##$D= (0..31)
0 1 0 0 0 0 0 0 0 0 0 0.03 2e-05 3e-06 0 0 0 0 0 0 0 0 0 0 0 0 0 0 0 0 
0 0 
##$DATE= 1552394383
##$DBL= (0..7)
120 120 120 11 120 120 24 19 
##$DBP= (0..7)
150 150 150 150 150 150 150 150 
##$DBP07= 0
##$DBPNAM0= <>
##$DBPNAM1= <>
##$DBPNAM2= <>
$$ [...]
##$SUBNAM3= <"">
##$SUBNAM4= <"">
##$SUBNAM5= <"">
##$SUBNAM6= <"">
##$SUBNAM7= <"">
##$SUBNAM8= <"">
##$SUBNAM9= <"">
##$SW= 369.568048894756
##$SWIBOX= (0..15)
0 1 3 0 0 0 0 0 0 0 0 0 0 0 0 0 
##$SW_h= 29940.119760479
##$TD= 32768
##$TD0= 1
##$TE= 0
##$TE2= 300
##$TE3= 300
##$TEG= 300
##$TL= (0..7)
0 120 53 12 22 120 120 120 
##$TP= (0..7)
150 150 150 150 150 150 150 150 
##$TP07= 0
##$TPNAME0= <>
##$TPNAME1= <>
##$TPNAME2= <>
##$TPNAME3= <>
##$TPNAME4= <>
##$TPNAME5= <>
##$TPNAME6= <>
##$TPNAME7= <>
##$TPOAL= (0..7)
0.5 0.5 0.5 0.5 0.5 0.5 0.5 0.5 
##$TPOFFS= (0..7)
0 0 0 0 0 0 0 0 
##$TUNHIN= 0
##$TUNHOUT= 0
##$TUNXOUT= 0
##$USERA1= <user>
##$USERA2= <user>
##$USERA3= <user>
##$USERA4= <user>
##$USERA5= <user>
##$V9= 5
##$VALIST= <valist>
##$VCLIST= <CCCCCCCCCCCCCCC>
##$VD= 0
##$VDLIST= <DDDDDDDDDDDDDDD>
##$VPLIST= <PPPPPPPPPPPPPPP>
##$VTLIST= <TTTTTTTTTTTTTTT>
##$WBST= 1024
##$WBSW= 4
##$XGAIN= (0..3)
0 0 0 0 
##$XL= 0
##$YL= 0
##$YMAX_a= 12086
##$YMIN_a= -14279
##$ZGOPTNS= <>
##$ZL1= 120
##$ZL2= 120
##$ZL3= 120
##$ZL4= 120
##$ABSF1= 182.463
##$ABSF2= -187.1042
##$ABSG= 5
##$ABSL= 3
##$ALPHA= 0
##$AQORDER= 0
##$ASSFAC= 0
##$ASSFACI= 0
##$ASSFACX= 0
##$ASSWID= 0
##$AUNMP= <proc_1d>
##$AZFE= 0.1
##$AZFW= 0.5
##$BCFW= 0
##$BC_mod= 2
##$BYTORDP= 0
##$COROFFS= 0
##$CY= -3
##$DATMOD= 1
##$DC= 0
##$DFILT= <>
##$DTYPP= 0
##$F1P= 0
##$F2P= 0
##$FCOR= 1
##$FTSIZE= 65536
##$FT_mod= 6
##$GAMMA= 0
##$GB= 0
##$INTBC= 1
##$INTSCL= 5.30512e-09
##$ISEN= 30
##$LB= 1
##$LEV0= 0
##$LPBIN= 0
##$MAXI= 10000
##$MC2= 0
##$MEAN= 0
##$ME_mod= 0
##$MI= 50
##$NCOEF= 0
##$NC_proc= -6
##$NLEV= 6
##$NOISF1= 182.463
##$NOISF2= 159.3651
##$NSP= 0
##$NTH_PI= 0
##$NZP= 0
##$OFFSET= 182.463
##$PC= 4
##$PHC0= -1860.532
##$PHC1= 144.599
##$PH_mod= 1
##$PKNL= yes
##$PPARMOD= 0
##$PSCAL= 0
##$PSIGN= 0
##$REVERSE= no
##$SF= 81.0140089999434
##$SI= 65536
##$SIGF1= 159.3651
##$SIGF2= -187.1042
##$SINO= 113.3802
##$SIOLD= 16384
##$SREGLST= <1H.CDCl3>
##$SSB= 0
##$STSI= 65536
##$STSR= 0
##$SW_p= 29940.119760479
##$SYMM= 0
##$S_DEV= 0
##$TDeff= 32768
##$TDoff= 0
##$TI= <>
##$TILT= no
##$TM1= 0
##$TM2= 0
##$TOPLEV= 0
##$USERP1= <user>
##$USERP2= <user>
##$USERP3= <user>
##$USERP4= <user>
##$USERP5= <user>
##$WDW= 1
##$XDIM= 65536
##$YMAX_p= 403522421
##$YMIN_p= -19006492
$$ End of Bruker specific parameters
$$ ---------------------------------
##NTUPLES= NMR SPECTRUM
##VAR_NAME=  FREQUENCY,     SPECTRUM/REAL,   SPECTRUM/IMAG
##SYMBOL=    X,             R,               I
##VAR_TYPE=  INDEPENDENT,   DEPENDENT,       DEPENDENT
##VAR_FORM=  AFFN,          ASDF,            ASDF
##VAR_DIM=   65536,         65536,           65536
##UNITS=     HZ,            ARBITRARY UNITS, ARBITRARY UNITS
##FACTOR=    0.456856943014862, 1,           1
##FIRST=     14782.0589164792, 0,            0
##LAST=      -15158.0608439998, 0,           0
##MIN=       -15158.0608439998, -19006492,   0
##MAX=       14782.0589164792, 403522421,    0
$$ Real data points
##PAGE= N=1
##DATA TABLE= (X++(R..R)), XYDATA
$$ [...]
47267 -329860 -2220709 -3774748 -4549279 -4793735 -4681026 -4035345 -2882545 -1711751 -998581
47258 -998581 -804887 -963828 -1351448 -1829445 -2149092 -2078297 -1542243 -613284 522277 1593974
47248 1593974 2379309 2802356 2807523 2253159 1161356 0 -634443 -732376 -988648 -1979026
47238 -1979026 -3375515 -4227557 -3956084 -2816570 -1378143 139833 1803622 3426824
47230 3426824 4422640 4266766 2985261 1194358 -233760 -695743 -401501 -398924 -1617445
47221 -1617445 -3684457 -5065793 -4657881 -2890999 -955089 564870 1681451 2108877
47213 2108877 1446332 328748 306454 1949518 3756729 3751152 1851890 -105265 -620762
47204 -620762 -38323 386604 221331 81669 447245 977305 1171402 1187596 1585873 2500869
47194 2500869 3497753 4134838 4262705 3903209 3368295 3374576 4252987 4997679 4143306 1988018
47184 1988018 751258 1615024 2732957 1643522 -1101258 -2576710 -1522794 290887
47176 290887 1089480 1443655 2559886 3898628 4049284 2981643 1876016 1258737 707730
47167 707730 105918 -130117 -33763 -212078 -913569 -1794794 -2555497 -3002965 -2648571 -1223844
47157 -1223844 408209 881900 73607 -677052 -349906 609464 1284087 1593507 2015805
47148 2015805 2562899 2680804 1981027 710505 -389509 -632365 -108418 150286 -763289
47139 -763289 -2356565 -3195762 -2794502 -2201748 -2283610 -2373603 -1541397 -459006 -620936 -1853846
47129 -1853846 -2092134 -154163 2477947 3620754 3265319 3130448 3682987 3262681 696907
47120 696907 -2613666 -4375759 -4315187 -4003988 -4192907 -3955870 -2689310 -1369323 -1055065
47111 -1055065 -1410072 -1724566 -2315325 -3573987 -4452260 -3591033 -1670187 -888336 -1907512
47102 -1907512 -2949930 -2496642 -1357506 -1055394 -1385196 -971185 439088 1704396 2118763
47093 2118763 2192578 2470594 2720843 2699360 2750125 2991737 2629318 961162 -1237773 -2242522
47083 -2242522 -1395395 89669 639630 124455 -310159 110858 917128 1170634 591184
47074 591184 -336038 -1034220 -1281373 -1157041 -927882 -1041849 -1938531 -3592186 -5249001
47065 -5249001 -5866802 -5063503 -3587216 -2563857 -2252245 -1951320 -1288267 -960750 -1615349
47056 -1615349 -2537062 -2444842 -1396378 -770896 -1244581 -1978895 -2229889 -2520211 -3393883
47047 -3393883 -4086980 -3590269 -2290212 -1313734 -772483 6774 838771 772089 -93883
47038 -93883 -307957 937061 2585210 3080766 2167531 785533 -201601 -632694 -800925
47029 -800925 -977128 -957650 -44686 2081958 4482795 5576810 4768682 2891546 1004935
47020 1004935 -495105 -1454245 -1579747 -930611 -63520 791305 2051731 3753503 4804126
47011 4804126 3978606 1411493 -1397328 -2913631 -2687697 -1507007 -723455 -1084341 -1950093
47002 -1950093 -1972196 -719156 770863 1243719 589430 -281952 -498852 91484 952787
46993 952787 1372380 1182820 915821 904243 577000 -622239 -1969525 -2260117 -1752357
46984 -1752357 -1882614 -2819926 -2930118 -1411093 72974 -391956 -2241338 -3285037 -2556871
46975 -2556871 -1012747 133331 569714 626007 762573 1108594 976493 -550780 -2969671
46966 -2969671 -4256904 -3342616 -1667052 -1076042 -1222608 -651058 465406 716573 112256
46957 112256 132601 1076496 1483814 630956 -352274 -546702 -607789 -1102840 -1136134 25679
46947 25679 1185876 622220 -1386966 -2827328 -2467514 -973682 404060 1215283 1610692
46938 1610692 1477129 366481 -1702390 -3671825 -4081616 -2495767 -19796 1904370
46930 1904370 2860160 3172944 2810797 1506984 -226689 -1272050 -1248329 -855646 -742194
46921 -742194 -826233 -875478 -934564 -976753 -885423 -925690 -1452279 -2038593 -1750863 -425866
46911 -425866 1182794 2569843 3737949 4223917 3194306 926066 -1058832 -1876706 -2100035
46902 -2100035 -2158281 -1353343 598328 2372303 2657151 1982915 1644436 1667626 1282376
46893 1282376 744565 1032319 1932595 2004351 690525 -764088 -963238 -71780 662311
46884 662311 625352 527117 1330279 2737427 3205705 1866778 18066 -229460 1312090
46875 1312090 2740491 2849188 2616110 3185986 3810968 3054955 1008005 -1052057 -2407443
46866 -2407443 -2980732 -2458415 -886869 404272 113786 -1072468 -1397778 -721950 -642269
46857 -642269 -1875226 -3175821 -3262846 -2401008 -1543545 -1136315 -1386516 -2635611 -4676352
46848 -4676352 -6381733 -6659947 -5396954 -3224718 -936488 659734 1000078 290955 -612517
46839 -612517 -1050086 -962649 -546506 -43429 188480 15827 -56856 591621 1745363 2447864
46829 2447864 2072104 939343 30025 303840 1776785 2947875 2054346 -459609 -1906547
46820 -1906547 -876486 534683 -295429 -2545244 -3280439 -1912859 -536693 -93903 713434
46811 713434 2288034 3033480 2434255 2310951 3419704 3468687 644162 -3047183 -4365543
46802 -4365543 -3188088 -1896974 -1656172 -1727238 -1688541 -1962798 -2431498 -2459300 -2125754 -1935016
46792 -1935016 -1731886 -1337278 -1575390 -2994381 -4206927 -3369597 -884760 1191902 2001471
46783 2001471 2190553 1776547 20565 -2436235 -3526259 -2428995 -548465 678717
46775 678717 1321581 1829253 2033630 1973794 2296610 3114691 3625803 3378054 2759011 1909407
46765 1909407 548480 -706772 -433533 1453669 3104124 3151862 2432927 2371756 2914788
46756 2914788 3135156 2811251 2290332 1660216 1058680 959630 1213692 736998 -787784
46747 -787784 -1830159 -898870 1210183 2401575 2043135 1421315 1678939 2520942 2976853
46738 2976853 2509311 1318176 196131 -43779 458317 545405 -440855 -1566699 -1522956
46729 -1522956 -469354 289492 119998 -483366 -1024603 -1469852 -1613238 -1097911 -285744
46720 -285744 -136848 -869622 -1540461 -1363410 -753342 -541387 -685790 -415876 535445 1437197
46710 1437197 1438148 607431 -194612 -402001 -305690 -326355 -163375 713835 1926476 2397130
46700 2397130 1847078 1228497 1305771 1675364 1790149 2090602 3133272 4141565 3626593
46691 3626593 1457510 -640924 -965105 339207 1627897 1674508 960081 944859 2093658
46682 2093658 3074765 2443755 715780 -281282 -35292 35400 -1046964 -2330771 -2660697
46673 -2660697 -2467839 -2562204 -2346391 -881030 1053527 1707604 790582 -426916 -1142480
46664 -1142480 -1583797 -1751622 -1272816 -576615 -660797 -1458154 -1823115 -1373358 -1009483 -1345910
46654 -1345910 -1907614 -2143436 -1997167 -1299186 47125 1063082 378472 -1706575 -3331598
46645 -3331598 -3664191 -3760456 -4259463 -4022288 -2145253 220723 1404852 1409514 1278744
46636 1278744 1271331 980342 486244 110104 -403447 -1322098 -2022691 -1636708 -194367 1598478
46626 1598478 3131586 3773815 2834349 564479 -1533046 -2350667 -2494719 -3102410 -4071805
46617 -4071805 -4409589 -3678756 -2231537 -709942 -91825 -1290479 -3758161 -5455854 -5200985
46608 -5200985 -3966633 -2883185 -1520164 312558 793412 -1461139 -4336611 -4419013 -1780604
46599 -1780604 216944 -124589 -874401 23653 1854997 2782728 2402814 1535339 947569
46590 947569 1165887 2283600 3320930 3010175 1604774 542299 135742 -616948 -1612592
46581 -1612592 -1228687 796250 2195938 1232623 -834244 -1777621 -1369852 -815282 -568855
46572 -568855 -312166 -63722 88687 393882 436497 -950391 -3411650 -4226409 -1640690
46563 -1640690 2150336 3482398 1843877 -150916 -758004 -669897 -748190 -622149 -80383
46554 -80383 51180 -760543 -1808219 -2154827 -1695651 -900922 -323043 -475877 -1388064 -2277435
46544 -2277435 -2426606 -2139824 -1963145 -1426915 204633 2291035 3358296 3144389 2682502
46535 2682502 2436237 1886247 1033853 691827 931708 721817 -398241 -1555621 -1913491
46526 -1913491 -1646893 -1176963 -553641 98164 624391 1478691 3075893 4489504 4334492
46517 4334492 3051021 2493922 2956163 2680005 964935 -475449 -341586 257281 92994
46508 92994 12089 992483 1891223 1341653 359542 658009 1624704 1544428 789487 933223
46498 933223 1373635 40367 -2558534 -3262557 -972794 1470235 1343217 -526459 -1876946
46489 -1876946 -2347400 -2833312 -3241695 -2982374 -2585502 -2859568 -3174390 -2393138 -979759
46480 -979759 -407862 -767700 -697911 309164 1166923 1030455 448006 214655 272461 302719
46470 302719 363715 298407 -524383 -2031651 -2793605 -1638816 465170 1281113 85039
46461 85039 -1406161 -1228215 491817 1984030 2133947 1559434 1444807 1994508 2377959
46452 2377959 1852288 523263 -930778 -1934689 -2304076 -2108254 -1539397 -935714 -669805
46443 -669805 -777563 -798688 -282305 551021 1013566 911160 831319 1176897 1418698 875622
46433 875622 -144427 -703863 -469866 224705 1284968 2688377 3472536 2368118 -37337
46424 -37337 -1199971 271006 2479702 2496175 25614 -2495196 -3003947 -1680917 48752
46415 48752 1048159 928065 54572 -692857 -831107 -813622 -1064627 -1040373 -228687 594773
46405 594773 501588 213712 1010738 2216501 1887136 -11795 -1439441 -1622938 -2000217
46396 -2000217 -2977389 -2525825 252809 2602612 1581905 -1662227 -3668105 -3456638 -2832415
46387 -2832415 -2707034 -2066355 -565253 516805 435229 35647 114736 417899 634045
46378 634045 777169 345001 -1184152 -2763649 -2549116 -677472 614455 183962 -698397
46369 -698397 -930618 -1262432 -2168717 -2171281 -107181 2520572 3441539 2742990 2198768 2381056
46359 2381056 2387121 1851273 1340078 1041662 735408 833478 1851108 2989317 2804268 1265837
46349 1265837 -263258 -1009107 -1275951 -1057732 125264 1751964 2296226 1214702 -412224
46340 -412224 -1637510 -2602501 -3238060 -2671188 -950094 26423 -1335084 -4097083 -5957741
46331 -5957741 -5990567 -5060247 -4088464 -3210852 -2425514 -1893218 -1574196 -1449199 -1981273 -3399489
46321 -3399489 -4642163 -4241034 -2533343 -1761629 -3209330 -5166662 -4851241 -1896337 1278486
46312 1278486 2542348 2255873 1949767 1975076 1584803 749412 497480 1361752 2637829
46303 2637829 3526412 3995413 4048332 3224739 1648448 638464 1165225 2328082 2538112
46294 2538112 1739121 1170565 1235085 1063678 243954 -461371 -511603 -485500 -1012393 -1743961
46284 -1743961 -1974400 -1599816 -1032166 -746058 -1145663 -2240709 -3338524 -3768020 -3853077
46275 -3853077 -4221611 -4306845 -2942655 -589332 679827 -14413 -1134511 -1112691 -432777
46266 -432777 -296883 -669991 -929337 -1184584 -1558878 -1304837 -112650 777320 351780
46257 351780 -308651 325528 1685305 2180565 2026041 2716711 4075651 4190587 2385333
46248 2385333 144401 -1159332 -1508345 -1008057 487469 2033493 1976866 537635 168940
46239 168940 2280837 5118609 5968261 4206516 1230672 -1368895 -2560234 -1975057 -395369
46230 -395369 664842 670694 559613 1015785 1396690 1040142 402626 78106 -116422 -240939
46220 -240939 289365 1359126 1618213 445573 -817881 -856533 -353435 -586389 -1288270
46211 -1288270 -1516500 -1536194 -2038081 -2424838 -1808689 -950015 -1156178 -1842823 -1405148 -215093
46201 -215093 -415034 -2571816 -4705578 -5105466 -4202604 -3107766 -2127665 -1474995 -1746953
46192 -1746953 -2694914 -2884340 -1633704 -227626 -200353 -1242267 -1717670 -651416 1481303
46183 1481303 3368047 3753076 2372792 477526 -232099 398582 757387 -360688 -2173474
46174 -2173474 -3052753 -2508649 -1411789 -821594 -1167562 -2105754 -2699500 -2171017 -822142
46165 -822142 243554 496625 448312 601758 807836 955898 1293660 1547029 790454 -998596
46155 -998596 -2229685 -1634668 -205017 59848 -1027320 -1584782 -301168 1794533 2673194
46146 2673194 1734057 297760 -119116 494948 927651 537427 174710 887044 2175930
46137 2175930 2442309 1137347 -484696 -1025645 -476004 314640 804558 736723 -282274
46128 -282274 -2235502 -4059790 -4408465 -3083711 -1287734 -506794 -1342938 -3155679 -4564172
46119 -4564172 -4546390 -3276553 -1720484 -494170 421017 1014888 1182662 1410258 2485156
46110 2485156 4109992 4767041 3553177 1330255 -506230 -1503996 -1748938 -1015265 644875
46101 644875 2203407 2659385 2285842 1954784 1732086 1141210 380796 180035 627792
46092 627792 1062909 994175 399975 -607595 -1647833 -1899786 -880083 802510 2115875
46083 2115875 2696089 2655826 1843712 137720 -1964739 -3875791 -5545034 -6729951 -6348017
46074 -6348017 -3769968 -289554 1980932 2416870 1950955 1268282 335372 -499953 -474436
46065 -474436 355979 1045935 1041586 510811 -482735 -1936794 -3116955 -3073090 -1999247 -976599
46055 -976599 -506955 -480480 -1220352 -2974493 -4615922 -4691360 -3733348 -3565278 -4224555 -3823257
46045 -3823257 -1876504 -316481 -288339 -371910 604428 1235352 -86634 -2274397 -3143863
46036 -3143863 -2598384 -2133577 -2166718 -1927711 -1326967 -989846 -869019 -505095 -207125 -390425
46026 -390425 -326291 696365 1489380 231650 -2578127 -4401673 -3967972 -2459733 -1219353
46017 -1219353 -190232 802253 997438 -68018 -1473080 -2018839 -1655704 -1132328 -891596
46008 -891596 -879498 -923394 -876625 -731187 -654477 -501818 421779 2332877 4043862 4216763
45998 4216763 3371268 3246066 4086806 4173240 2540711 591737 58825 637486 801095
45989 801095 42040 -892309 -1353538 -1240612 -527292 594983 1337306 997378 -68152
45980 -68152 -842176 -879642 -581972 -491564 -879260 -1711265 -2379306 -1807572 354404 2812206
45970 2812206 3730921 2781132 1387223 900431 1209813 1303744 603611 -492018 -1008342
45961 -1008342 -292720 1086971 1476990 -165831 -2743739 -4014865 -3267769 -2047267 -1824963
45952 -1824963 -2045737 -1375942 48105 978517 1155961 1451611 1938657 1571383 368443
45943 368443 229319 2306234 4795996 5025445 3067186 1479012 1661541 2363215 2090025
45934 2090025 1140723 410552 -237846 -1161454 -1684353 -1129295 -355916 -761922 -2116853
45925 -2116853 -2802854 -2084476 -827044 55551 565141 828549 633494 245896 549690
45916 549690 1631473 2136804 981199 -883674 -1466188 -322260 838154 355745 -1319682
45907 -1319682 -2312109 -1672277 -339030 302690 105634 -128062 -107297 -268691 -575018
45898 -575018 -204165 1051199 1962798 1268229 -640345 -2227759 -2625583 -2170037 -1497632
45889 -1497632 -944480 -647059 -513354 -275837 -120597 -780812 -2270262 -3171361 -2271243
45880 -2271243 -365110 852860 1196244 1697998 2260241 1591938 -294171 -1549371 -1177011
45871 -1177011 -477627 -843783 -1709693 -1885050 -1526191 -1380996 -1211519 -503940 80615
45862 80615 -463788 -1700127 -2211947 -1546346 -453592 516126 1425135 2161487 2452205
45853 2452205 2610062 3170820 3780078 3482094 2231553 1187928 1267418 2061840 2339199
45844 2339199 1165475 -1316062 -3662436 -3982490 -1786503 1187720 2723034 2443229
45836 2443229 1601936 984491 247626 -732628 -1218244 -728955 189664 753563 706648 9387
45826 9387 -1329670 -2666803 -2855543 -1632283 -223657 87974 -533197 -1083615 -1313005
45817 -1313005 -1774257 -2422526 -2160716 -232221 2458299 4041166 3662353 2276880 1282231
45808 1282231 876821 374692 -187199 157137 1605273 2756737 2328258 958036 237278
45799 237278 457010 606071 394317 759561 2014766 2868763 2104551 277220 -1171074
45790 -1171074 -1785825 -2082607 -2135161 -1385678 106946 1289743 1395519 861301 453466
45781 453466 88907 -721460 -1650561 -1803963 -1217021 -986222 -1451442 -1383010 67266 1628090
45771 1628090 1634047 821954 1395016 3351012 4032538 2071619 -390715 -791258 426895
45762 426895 1304898 1722551 2887415 4347731 4073367 1483031 -1681231 -3666049 -4183278
45753 -4183278 -3569869 -2282802 -1393963 -1813117 -2720295 -2415867 -943913 -109696 -648068
45744 -648068 -1345484 -1410890 -1563396 -1984191 -1414384 461288 1756477 1079900 -197549
45735 -197549 -30992 1412519 2641247 3209814 3354935 2549224 532855 -1168149 -958294
45726 -958294 224789 171168 -1212532 -1988934 -1390031 -558342 37979 1483687 3945012
45717 3945012 5437590 4353180 1807595 196393 347188 1216017 1689918 1546000 939051
45708 939051 -43457 -1159722 -1891068 -1843991 -1231378 -811646 -1151865 -1958856 -2478535 -2575616
45698 -2575616 -2801213 -3185908 -2826805 -1265304 516708 1259588 886531 9984 -1157462
45689 -1157462 -2334378 -2512292 -1202680 336007 698802 571492 1536065 3084423 3067325
45680 3067325 1218936 -95426 673358 2162396 2484556 1867078 1545531 1501835 903131
45671 903131 -131032 -692992 -519268 -125083 76892 -85131 -780438 -1725192 -2022480
45662 -2022480 -1282687 -414640 -499764 -1343769 -1922646 -1804968 -1339220 -850511 -452226 -311541
45652 -311541 -363936 -100077 668945 1219773 839424 -29440 -395505 -191188 -244413 -900147
45642 -900147 -1581630 -1838830 -2003150 -2378048 -2302204 -689774 2367020 4955608 4945864 2452037
45632 2452037 54331 -73856 1314713 1885235 1034746 272071 398544 344346 -501850
45623 -501850 -780241 630835 2398037 2436897 854291 -462620 -444564 582509 2209934
45614 2209934 4026773 4821389 3589633 1277795 -133977 -221053 -140254 -198833 608125
45605 608125 2343134 3433656 2990737 2109722 1983491 2276475 2331514 2442521 2721208
45596 2721208 2147079 255176 -1431576 -1400605 -682752 -1428069 -3426257 -4151631 -2391628
45587 -2391628 129150 1347875 1422760 1735295 2628092 3386339 3720431 4022499 4431809
45578 4431809 4619653 4365918 3599311 2126520 190142 -959930 -217715 1569198 2170772
45569 2170772 786984 -887605 -1098628 -305131 136801 467103 1914006 4045571 4720416
45560 4720416 2982399 346034 -1359458 -1962146 -2085179 -1771931 -976552 -217682 373876
45551 373876 1626231 3798599 5471074 5229396 3570071 1828682 206205 -1541912
45543 -1541912 -2437676 -1415676 375844 645181 -744794 -1704812 -1264217 -739363 -1106469
45534 -1106469 -1469911 -1017357 -433780 -260732 253074 1396543 1915126 1172553 658755
45525 658755 1563307 2437635 1420551 -503067 -957727 -62852 -147881 -1783750 -2804659
45516 -2804659 -1774348 -83308 334568 -461822 -1205127 -1294995 -883430 -257233 -16343
45507 -16343 -786499 -1969402 -1950669 -428317 745903 208024 -719588 -92294 1392978
45498 1392978 1283080 -816421 -2505285 -2085592 -889743 -1118506 -2714157 -3662954 -2693097
45489 -2693097 -514971 1311824 1848156 1282171 683753 1145554 2619233 3773304 3490797
45480 3490797 2213003 1224220 993293 1045321 1166364 1624600 2173349 2016956 1160589
45471 1160589 761248 1526552 2616992 2873437 2451042 2414895 3189494 4177317 4546070
45462 4546070 3738735 1681558 -728881 -1813355 -772958 1063612 1599666 436814
45454 436814 -953424 -1418912 -1414216 -1917620 -3021163 -4016116 -4257880 -3604510 -2408831
45445 -2408831 -1233348 -268713 824194 2059587 2487055 1223510 -1056710 -2560217
45437 -2560217 -2288998 -778658 850343 1639358 865019 -1362755 -3551948 -4105324 -3231643
45428 -3231643 -2365189 -1744974 -234450 2151789 3426338 2271436 10897 -1171716
45420 -1171716 -840194 -92368 232702 61886 -423885 -930475 -1303646 -2060352 -3678736
45411 -3678736 -5092753 -4455425 -2015314 -407186 -1038510 -2063735 -1363650 327335 1055849
45402 1055849 651695 -29340 -1258026 -3312412 -4484402 -3020445 -292812 729723
45394 729723 -311731 -1203510 -1020642 -1053099 -1892965 -2508594 -2608459 -3228805 -4390779 -4668722
45384 -4668722 -3704572 -2751560 -2149216 -783965 1244108 2076746 1186179 398373 711520
45375 711520 753930 -248451 -746228 140256 636569 -446779 -997757 1163887 4343814
45366 4343814 5190787 3385001 1248863 -121370 -1389864 -2482358 -2512677 -1868121 -1763226
45357 -1763226 -1967856 -1398557 -607797 -1043659 -1972406 -976068 2105828 4405356 3967223
45348 3967223 2116213 935381 520417 -528 -455905 -111314 902894 1802438 2111844
45339 2111844 1789598 1145099 960295 1737294 2607543 2166078 615797 -317169 50206
45330 50206 476128 66985 -307900 123575 419639 -409743 -1461389 -1330836 -480416 -435094
45320 -435094 -1205081 -1342286 -396047 445092 406156 272580 885905 1705820 1724252 1042423
45310 1042423 648599 1020025 1740883 2340301 2741918 2789691 2044654 498304 -942434
45301 -942434 -1275280 -578149 164021 343373 229653 153537 -38184 -404569 -554020 -400756
45291 -400756 -589962 -1479699 -2330062 -2353022 -1991995 -2098195 -2287543 -1441416 262431 1198306
45281 1198306 438458 -1130782 -2222846 -2562132 -2342125 -1382260 242536 1449795 1117075
45272 1117075 -355252 -1254463 -435560 1478194 2921505 3124925 2742208 2719107 2920005
45263 2920005 2475217 1450471 1186522 2382381 3751055 3669057 2533732 2079506 2619391
45254 2619391 2576962 1029390 -759773 -1047598 178278 1424234 1434173 163908 -1399416
45245 -1399416 -1973207 -1047891 526316 1498076 1700448 1820352 1880683 1216653 121096
45236 121096 49409 1525956 3083864 3175435 2188464 1652861 2175103 3025197 3255056 2552976
45226 2552976 1417718 889011 1572062 2721700 3011781 2232702 1146471 -279456 -2764868
45217 -2764868 -5442113 -5773722 -2925065 581334 2069760 1931217 1932796 2001054 1052206
45208 1052206 -194829 -44996 979090 529429 -1805664 -3631013 -3244143 -1830457 -1229155
45199 -1229155 -1305149 -751129 721789 2154630 2596114 1823618 383032 -630094 -441800
45190 -441800 452182 876104 644213 753922 1691517 2549515 2291829 1071655 -183370
45181 -183370 -823722 -764924 -390832 -442500 -1316065 -2297064 -2312166 -1605131 -1631341 -2915696
45171 -2915696 -4124914 -3939395 -2874000 -2350815 -2678292 -2926017 -2408462 -1421287 -659093
45162 -659093 -512308 -795531 -762134 289801 1950318 2635899 1307286 -939580 -1824231
45153 -1824231 -602279 866133 296302 -2159361 -4005285 -3443797 -1482138 -367046
45145 -367046 -611302 -806625 -187841 220580 -487238 -1592578 -2160823 -2579139 -3314249
45136 -3314249 -3396364 -1998420 -604469 -1356957 -3618566 -4507273 -2922674 -749131 328634
45127 328634 876749 1776046 2457645 2335112 2158503 2514581 2509254 1402029 194329 69835
45117 69835 455286 213286 -309176 -113137 443836 213769 -786081 -1633930 -2199405 -2940010
45107 -2940010 -3423000 -2742222 -1229112 -203322 -131100 -448723 -985304 -1951213 -2592127
45098 -2592127 -1613249 753682 2646632 2944838 2382661 1945376 1626046 1354359 1702175
45089 1702175 2721834 3202059 2149323 278590 -920230 -1059577 -921940 -1021317 -954666
45080 -954666 -183775 1057727 1814809 1377603 262897 -84652 971147 2186210 1932292
45071 1932292 525789 -91947 924239 2197824 2122582 728592 -1063308 -2765595 -3917732
45062 -3917732 -3527908 -1366480 827117 906368 -1117656 -3274237 -4183853 -4148657 -3806272
45053 -3806272 -3180210 -2429367 -2183200 -2374055 -1758133 454380 3145078 4413988 3808975
45044 3808975 2610401 2144682 2618205 3461757 3929261 3262372 1150252 -1534298 -3056803
45035 -3056803 -2454097 -631037 539563 79129 -1324200 -2165267 -1512695 233867 1744672
45026 1744672 2064477 1602585 1558139 2363777 3244515 3459775 3201185 2795619 1894588 374647
45016 374647 -650574 -23750 1489674 1778070 76769 -2075636 -2832024 -1914016 -220878
45007 -220878 1266999 1725771 804769 -597847 -917758 -45598 185136 -1428402 -3432735
44998 -3432735 -3527270 -1649298 128254 330864 -628954 -1642694 -2090965 -1888331 -1451300
44989 -1451300 -1578482 -2375270 -2494264 -605750 2502513 4579022 4671302 3879962 3243052
44980 3243052 2464219 1298687 640489 1163688 2020556 2106207 1802169 2149223 2801345
44971 2801345 2284278 358083 -1175434 -622754 1410274 2738313 2229674 954723 513330
44962 513330 868633 595774 -858896 -2171629 -1922219 -598030 140089 -200271 -477866
44953 -477866 178832 1119058 1247782 529231 -159373 -161389 463651 1215456 1526976 1126165
44943 1126165 295962 -435040 -914153 -1288037 -1295674 -306764 1591026 3092528 2827438
44934 2827438 863634 -1266810 -1989118 -1054735 350182 856085 435280 492510 2079103
44925 2079103 4289091 5100164 3755055 1591472 404650 655129 1465355 1741639 1028909
44916 1028909 -253615 -1216714 -1478487 -1630430 -2208953 -2531652 -1532610 399709 1699712
44907 1699712 1923197 2384335 3940445 5464362 5437454 4008910 2421564 1222802 169038
44898 169038 -707230 -1086056 -1067654 -932549 -515269 310573 898986 552132 -295991 -605819
44888 -605819 -273575 -125079 -397421 -313971 511665 1146548 435119 -1378065 -2661018
44879 -2661018 -2019006 277398 2481299 2930886 1427042 -859323 -2577889 -3096858 -2582140
44870 -2582140 -1763771 -1482339 -1834035 -1865452 -822079 481685 535353 -688896 -1676326
44861 -1676326 -1636628 -1376965 -1466265 -1152894 -37628 691742 35649 -967775 -609418
44852 -609418 1134583 2927290 3891021 3773482 2242345 -392347 -2497569 -2801632 -2157225
44843 -2157225 -2088848 -2398169 -2051041 -1588841 -2290901 -3401190 -2850546 -822352 79615
44834 79615 -1214766 -2656120 -2383820 -1290518 -1023417 -1481264 -1792502 -2044328 -2439461
44825 -2439461 -2210443 -1031481 -247702 -978491 -2054625 -1644407 -124601 535756 -227224
44816 -227224 -1013110 -747882 115812 802900 1199227 1314053 887504 -11722 -706550 -574572
44806 -574572 352758 1413279 1612024 265615 -2074276 -3727744 -3634853 -2647901 -2285472
44797 -2285472 -2588969 -2283396 -902119 492919 977799 1043038 1570713 2315441 2294722
44788 2294722 1444682 1017221 1984185 3493555 3568664 1488549 -1088768 -1928584 -827893
44779 -827893 338495 91838 -1055072 -1707282 -1376659 -622934 -85322 30953 -48582
44770 -48582 216663 1078321 1783309 1240517 -267495 -1055928 -330383 575850 153695 -1152494
44760 -1152494 -1954990 -2109006 -2393949 -2693939 -2185421 -1026536 -214414 130412 733781
44751 733781 1446698 1267817 290335 -155880 183929 -178918 -1935929 -3398800 -2746232
44742 -2746232 -628015 885114 1044706 664837 312758 -122825 -324884 392304 1717453
44733 1717453 2336904 1731319 1007060 1460727 3073446 4870838 6054653 6227455 5164551
44724 5164551 3193446 1509702 1298900 2493037 3938012 4776445 5040387 4792330 3507526
44715 3507526 907969 -2095127 -4092733 -4704489 -4732300 -4806245 -4652775 -3960024 -3211637
44706 -3211637 -3047224 -3217385 -2852775 -1652814 -250385 641460 1016571 1345425 1771523
44697 1771523 1750691 628597 -1370443 -3023717 -3410678 -3130096 -3466511 -4332982 -4128241
44688 -4128241 -2186020 -311588 -794473 -3505952 -6150581 -7035554 -6327608 -4743387 -2524563
44679 -2524563 -148173 1240777 1006718 -21771 -493792 -28106 715751 984244 421613
44670 421613 -943903 -2543910 -3319661 -2604368 -1045712 -199127 -967000 -2600192 -3441178
44661 -3441178 -2682321 -1256249 -806587 -1834286 -3207765 -3597742 -2921942 -2057084 -1622859
44652 -1622859 -1597475 -1736580 -1705651 -1099764 -40834 531788 -56841 -1161419 -1753503
44643 -1753503 -2034252 -2862650 -3804960 -3382538 -1511078 -8757 9404 -328211 284042
44634 284042 1174369 983753 -24928 -556547 -428399 -455449 -615954 -752 1481446
44625 1481446 2836533 3493074 3725493 3485935 2270912 512915 -289535 497591 1675544
44616 1675544 1886221 1334313 1092080 1468678 1885206 1815125 1126957 -52555 -1197581
44607 -1197581 -1565687 -1108446 -728339 -1060717 -1561334 -1481841 -1138374 -1298319 -1779379 -1708052
44597 -1708052 -889341 137354 1163696 2211801 2487954 959638 -1645177 -2898534
44589 -2898534 -1580268 639038 1442503 798495 371099 730317 733938 -418215 -1936194
44580 -1936194 -2582313 -2099440 -1165375 -608366 -843288 -1471156 -1413705 -120381 1443990
44571 1443990 1837846 1027284 181174 -287112 -1037422 -1985193 -1872117 -374029 968541
44562 968541 1000536 661799 1116155 1607777 967692 88947 689565 2255775 2593619 1327107
44552 1327107 525309 1478652 2969795 3436549 2967108 2254916 1278706 158349 -77820
44543 -77820 1149066 2816032 3558305 3252861 2529722 1680138 924729 763859 1089984
44534 1089984 887412 -225205 -1138198 -958214 -510200 -921210 -1751072 -1988707 -2000202
44525 -2000202 -2799660 -3992483 -4180110 -3115850 -1914911 -1375940 -1524862 -2426334 -3815965
44516 -3815965 -4263984 -2575235 35828 1050687 21069 -1101175 -1206694 -1354366 -2139752
44507 -2139752 -2052387 30625 2435151 2610849 471219 -1808598 -2659349 -2305828 -1534082
44498 -1534082 -665927 318869 1613929 3428143 5314222 6059961 5062859 3378988 2445364
44489 2445364 2096272 938805 -1400917 -3519018 -3967943 -2912876 -1671980 -1151917 -1153614
44480 -1153614 -981262 -390949 168992 257333 173638 606706 1578321 2308416 2300422 1915856
44470 1915856 1542445 907061 -221635 -1303386 -1749331 -1858357 -2188324 -2408341 -1776405
44461 -1776405 -588091 -106219 -891601 -2038547 -2361199 -1724171 -903297 -622614 -1062252
44452 -1062252 -1967743 -2835965 -3027558 -1983528 342139 3058466 4618443 4128501 2412529
44443 2412529 1105838 585520 -286569 -2034280 -3382519 -3081828 -1828794 -1063149 -704144
44434 -704144 269060 1521441 1624003 628034 352741 1499931 2275125 932182 -1675671
44425 -1675671 -3290025 -3002468 -1642816 -206768 868155 1361560 1388565 1644812 2626194
44416 2626194 3823931 4445722 4545149 4544900 4047862 2304185 -193038 -1746260 -1413654
44407 -1413654 -132802 423772 -471943 -2218387 -3532063 -3295913 -1431369 762507 1679497
44398 1679497 1105947 346406 399031 649624 -94201 -1771813 -3009632 -2754552 -1333775
44389 -1333775 171949 1077449 1385508 1341100 1148011 1072199 1422816 2229080 3146193 3910338
44379 3910338 4692803 5639112 6195101 5479501 3477338 1302280 -40128 -621065 -922463
44370 -922463 -853440 -198457 437494 214157 -491459 -336969 984763 1997146 1315159
44361 1315159 -442063 -1407008 -792970 285303 303850 -916916 -2159000 -2260821 -1345249
44352 -1345249 -465808 -187697 -34972 418539 621978 29522 -525351 251867 1893468
44343 1893468 2372132 935412 -776922 -1251435 -1218802 -1935930 -2664362 -1728970 623864
44334 623864 2409624 2730408 2546846 2593239 2402288 1779965 1473253 1704946 1594080 753533
44324 753533 -36364 -500275 -1529629 -3099969 -3322135 -1251627 865450 324817 -2032696
44315 -2032696 -2939818 -1388004 285465 139356 -938028 -1273732 -842541 -509242 -376013
44306 -376013 -136052 16014 -59031 130662 777159 1181617 1029009 1214620 2225775 2723650
44296 2723650 1280007 -1207081 -2580357 -2490486 -2494485 -3141129 -3053812 -1523787 -69484
44287 -69484 -155059 -789855 -16669 2026761 3235408 2498197 983004 238781 313760 344855
44277 344855 69492 -77817 68964 82058 -493800 -1642333 -2836326 -3252657 -2305604
44268 -2305604 -375550 1183825 1234077 -26404 -1532539 -2748051 -3903203 -4859137 -4738701
44259 -4738701 -3298593 -1917552 -2192259 -3772699 -4620364 -3572126 -1741803 -948972 -1490182
44250 -1490182 -2119124 -1778940 -626938 483665 890378 495412 -214392 -448755 152421
44241 152421 965599 925685 -279539 -1880464 -2945430 -3214807 -2874968 -2019139 -796372
44232 -796372 198019 304643 -359357 -939327 -981375 -1141813 -2273602 -3958071 -4618207
44223 -4618207 -3386943 -1326857 -191198 -289251 -434848 -10659 16005 -1234870 -2754213
44214 -2754213 -2657227 -707837 1319678 1892348 1269172 469684 -238233 -1056694 -1646412
44205 -1646412 -1451425 -745393 -385998 -544679 -535974 -52282 247400 -231682 -1034541 -1255292
44195 -1255292 -760440 -263767 -339674 -846502 -1306460 -1454378 -1334788 -1140963 -1048115 -1017367
44185 -1017367 -757098 -129151 377659 -69558 -1662338 -3480068 -4299278 -3763737 -2498040
44176 -2498040 -1224469 -201068 487341 667382 433224 342237 778520 1369947 1533186
44167 1533186 1364278 1333139 1264680 586468 -248926 231562 2330169 3990540 3085538
44158 3085538 361983 -1410193 -1143072 -626366 -1577487 -3156791 -3503416 -2417042 -989301
44149 -989301 531638 2641439 4652252 4842472 2943972 858293 171889 296441 -46428
44140 -46428 -737258 -883892 -625617 -847773 -1491127 -1530169 -610781 450120 929031 977355
44130 977355 945418 799765 486839 162680 -161654 -559212 -691533 -185364 378195 -100622
44120 -100622 -1400649 -1687655 101685 2456100 2962325 1260718 -799789 -1668990 -1538431
44111 -1538431 -1237288 -922870 -428446 -82679 -420662 -1404846 -2486077 -3268953 -3696981
44102 -3696981 -3715990 -3220740 -2419149 -1896618 -2033579 -2437751 -2251888 -1186653 -35537
44093 -35537 192461 -410711 -724937 -187547 291173 -408349 -1821675 -2256631 -1016662
44084 -1016662 552175 675363 -720968 -2052447 -1982680 -728752 506415 919040 710271
44075 710271 542903 683610 791766 496440 -31423 -290352 -133682 92771 157925 318088
44065 318088 861226 1598673 2130229 2341350 2237104 1573660 301171 -740752 -441584
44056 -441584 969552 1751251 742666 -991183 -1524402 -711101 -288605 -1281387 -2554091
44047 -2554091 -2532622 -1315744 -122426 604107 1295120 1789773 1154546 -754545 -2604102
44038 -2604102 -2994843 -1946015 -622195 -155247 -983896 -2625417 -3674945 -2775413 -258420
44029 -258420 1712343 1343468 -802957 -2644177 -2997071 -2433005 -2022991 -2089996 -2208524
44020 -2208524 -1797747 -681876 497168 618266 -601270 -1872496 -1662318 -107610 1217394
44011 1217394 1369103 910798 599015 217528 -814693 -2432797 -4035669 -5073696 -5195433
44002 -5195433 -4408767 -3409107 -3061530 -3197554 -2710699 -1304790 -208478 -407880 -1122705
43993 -1122705 -1134510 -796139 -1219287 -1961731 -1405694 383130 1081311 -666887 -2910598
43984 -2910598 -2709510 4947 2418138 2471026 1066205 332374 895105 1677482 1739929
43975 1739929 1319903 1085199 1146370 1188772 1189142 1485762 2139308 2643428 2525167 2008547
43965 2008547 1719150 1769356 1538276 521478 -931845 -2030111 -2486714 -2714096 -3177103
43956 -3177103 -3921608 -4720817 -5278042 -5196827 -4202355 -2687861 -1699382 -1941231 -2932467
43947 -2932467 -3547466 -3316864 -2761876 -2447719 -2255449 -1845861 -1366316 -1188189 -1158557 -695303
43937 -695303 296388 1064838 806521 -456385 -2000125 -3123081 -3460693 -2862162 -1468236
43928 -1468236 109181 1171151 1618498 1857280 1952010 1470975 448625 -218985 29180
43919 29180 455202 149910 -420471 -240122 235290 -430026 -1993607 -2319012 -641483
43910 -641483 871941 295089 -1032666 -726786 719103 862497 -516905 -1128766 -112077
43901 -112077 745730 464624 600792 2076819 2953229 1486844 -664928 -777308 833416
43892 833416 1553923 392783 -1258436 -2138717 -2045758 -712885 1818786 3833429 3322302
43883 3322302 953613 -459663 253532 1416700 1448977 912301 952313 1581107 2307543
43874 2307543 2860112 2620506 952573 -1285946 -2221234 -1547986 -891681 -1074170 -1124033
43865 -1124033 -751823 -1328985 -3068045 -3731941 -2082810 -333913 -753936 -1815686 -646997
43856 -646997 2131058 3283065 1955701 517379 452496 517599 -423477 -1390810 -1114110
43847 -1114110 147923 1543042 2713005 3178773 2256638 451734 -480466 246885 1342154
43838 1342154 1294482 248858 -650472 -742146 -57877 937231 1300653 394931 -824796
43829 -824796 -599639 924829 1222367 -1344305 -5025303 -6747663 -5744907 -3760437 -2331050
43820 -2331050 -1408423 -498500 223442 272361 -468860 -1755478 -3274426 -4748856 -5844884
43811 -5844884 -5968810 -4405963 -1232044 2001773 3423312 2979041 2508197 3215511 4056731
43802 4056731 3401419 1387487 -457486 -1317370 -1598484 -1627104 -1056445 260898 1653926
43793 1653926 2182626 1425972 -254642 -1882124 -2496479 -2074098 -1597200 -1760798 -1957521
43784 -1957521 -1166579 475954 1798408 2130926 1866005 1467214 806662 -230544 -1224843
43775 -1224843 -1749337 -1894365 -1815748 -1214022 121238 1458712 1536736 60721 -1667523
43766 -1667523 -2043968 -910543 444730 1002121 1113533 1586467 2278336 2356060 1696599
43757 1696599 1117736 1095443 1112520 697000 389343 985230 2178446 2684509 1753051 115894
43747 115894 -746590 -170826 951094 1108366 -93132 -1424437 -1581181 -858844 -579102
43738 -579102 -1057516 -1177589 -217534 932956 1017262 121327 -651083 -760887 -707327 -1089879
43728 -1089879 -1812413 -2241456 -1874158 -920196 -262866 -501461 -1005563 -505811 1208401
43719 1208401 2877055 3361623 2904227 2371604 2069488 1973475 2369559 3348524 4161101
43710 4161101 3998456 3122407 2427069 2154824 1844207 1362304 1203049 1754491 2790799
43701 2790799 3648304 3621310 2483050 901777 -107499 -396366 -669159 -991976 -405584
43692 -405584 1316757 2763702 2852409 2552259 3172619 3928965 3068164 780869 -1025810
43683 -1025810 -1558407 -1679993 -1715155 -942431 387573 731113 -291127 -1062698 -530352
43674 -530352 217894 51136 -238084 517054 1732857 2040076 1358184 621669 344748
43665 344748 715965 2091744 3980574 4575578 2979678 1021152 971015 2146276 1944276
43656 1944276 -79999 -1577661 -1133596 -316699 -1071834 -2895674 -3860668 -3186700 -1590248
43647 -1590248 -10646 879133 588146 -701517 -1963823 -2384375 -2136238 -1612250 -721941
43638 -721941 276170 196067 -1588448 -3722475 -4347158 -3658716 -3499370 -4450947 -4944397
43629 -4944397 -3697247 -1618870 -495006 -836282 -1921835 -3138853 -4255634 -4875218
43621 -4875218 -4595522 -3503787 -1864742 291804 2572168 3743224 2937650 1158207
43613 1158207 491919 1702465 3476394 4180104 3505398 2213823 1176754 1013312 1823889
43604 1823889 2807026 2867703 2083450 1827979 2856948 4012907 3638644 1710592 -366668
43595 -366668 -1705851 -2586023 -3205756 -2963191 -1558654 -91594 -139595 -1735587 -2974901
43586 -2974901 -2128227 177696 1611420 1003197 -345240 -700286 -242702 -263057 -772962
43577 -772962 -585131 401716 827552 132306 -547415 -405804 -196606 -495967 -435902 513974
43567 513974 1103122 356201 -301993 914102 2949961 3114254 1074144 -697500 -536374
43558 -536374 517996 874722 559460 538924 1309372 2749980 4189301 4253535 1943599
43549 1943599 -1689217 -4141427 -4154082 -2725720 -1250624 -45609 887425 1160767 837457
43540 837457 744311 1149882 1153986 129176 -1152696 -1525615 -779518 510323 1710438
43531 1710438 2267983 1916454 1066386 301662 -417201 -1057065 -465509 2222800 5270678
43522 5270678 5694847 3400490 1615394 2289229 3449049 2565928 306007 -1015122 -891047
43513 -891047 -375265 200877 1023844 1346151 385799 -1048449 -1665207 -1598908 -1450213 -521799
43503 -521799 1787830 3739313 2981562 198974 -1431790 -481349 1236321 1607394 636650
43494 636650 -430681 -655454 281289 1828364 2493949 1472840 245954 896360 2969026
43485 2969026 3956694 2965817 1762492 1800511 2389692 2561592 2698321 3196861 3224988 2105083
43475 2105083 709286 329029 1065201 2160663 3033238 3361283 3107023 2924377 3448443
43466 3448443 3842831 2493021 -327418 -2140008 -1499740 76109 603580 483018 1236945
43457 1236945 2651772 3184833 2642263 2462410 3237556 3582648 2096174 -500017 -1940909
43448 -1940909 -928398 1406936 2795901 2467185 1887838 2478085 3422157 2919952 1078532
43439 1078532 -134027 176093 772184 610960 349457 620315 554086 -612655 -1829895
43430 -1829895 -1705090 -724064 -449582 -1134403 -1570288 -947814 321505 1354383 1436603
43421 1436603 296428 -1450884 -2586174 -2657057 -2358355 -1957927 -565447 1906458 3347778
43412 3347778 1823854 -1387468 -3049395 -1983021 -39504 866152 829461 688061 372783
43403 372783 -541890 -1616648 -1796249 -579616 1452628 3113466 3599572 3206461 2847437
43394 2847437 2735747 2209656 1235061 1015778 2115841 2953967 1689324 -936291 -2317887
43385 -2317887 -1408765 196703 719584 168340 -542665 -1026970 -1300300 -1277400 -1093682
43376 -1093682 -1199446 -1618963 -1739910 -1223413 -540116 -301368 -592791 -1165336 -1751726
43367 -1751726 -2066193 -1988359 -1754020 -1505006 -914001 99306 742578 445192 139635
43358 139635 1101566 2765717 3312745 2442537 1733452 1874802 1551883 33325 -1021713
43349 -1021713 98393 2336246 3119816 1672392 -494362 -1844885 -2079711 -1515892 -711779
43340 -711779 -578318 -1464900 -2103717 -789676 2204164 4644269 5095612 4444371 4135466
43331 4135466 4104640 3440429 2246128 1562358 1683764 1728258 1082082 350785 375525 911961
43321 911961 961072 186558 -641651 -691204 -80392 371355 143976 -415071 -382031 901918
43311 901918 3021596 4527044 4217326 2525396 1143291 1026842 1343325 854845 -240535
43302 -240535 -636756 197883 1307065 1415560 145655 -1954114 -3947210 -4982087 -4844363
43293 -4844363 -4247615 -4124673 -4491034 -4438840 -3363559 -1732792 -443657 218334 752381
43284 752381 1739629 3039494 3669078 2774956 927114 -59412 875525 2674673 3515535
43275 3515535 3078435 2503705 2443711 2445685 2273887 2440527 2987650 3008026 2123575 1417348
43265 1417348 1942582 3005830 2963714 1399769 -406754 -1132993 -817185 -448920 -603650
43256 -603650 -844303 -521453 102946 74571 -733773 -1063002 73318 1820529 2653253
43247 2653253 2619568 2966348 3734519 3526545 1996429 715640 702763 773411 -388384
43238 -388384 -1927441 -2174447 -1304048 -901060 -1427118 -1821426 -1455012 -928344 -785326
43229 -785326 -747600 -571857 -637721 -1217571 -1850532 -1888338 -1320301 -806841 -1010011 -1851828
43219 -1851828 -2398079 -1812588 -516468 178714 -208777 -772550 -738811 -501832 -431815 184209
43209 184209 1781886 3051094 2443901 638011 -208037 499284 1182080 661944 -361847
43200 -361847 -942991 -1455685 -2520235 -3391250 -2665747 -363323 1567746 1061607 -1909991
43191 -1909991 -5085646 -5992592 -4357007 -2100289 -867894 -386270 233252 665853 93920
43182 93920 -983561 -1252910 -642962 -321814 -638234 -595460 381289 1541751 2026730 1787281
43172 1787281 1052975 118170 -189134 733164 1779660 1038273 -1345720 -2907880 -2202247
43163 -2202247 -685678 -257754 -601431 -348261 543406 1185521 1467714 1774621 1806589
43154 1806589 1153192 334020 -79009 -580893 -1556059 -1846067 -191160 2515296 4146014
43145 4146014 4069044 3292870 2387503 1174961 217422 537267 1703731 2057442 1103304
43136 1103304 -17892 -607906 -1112812 -1489434 -922043 233993 280710 -1125963 -2041021
43127 -2041021 -1158926 134898 52916 -916254 -1296252 -1161806 -1456063 -1817854 -1126666
43118 -1126666 393268 1485022 1852501 2111659 2165622 1459047 600317 813583 1778828
43109 1778828 1921949 1034701 644650 1326875 1664402 777606 19209 784328 2066795
43100 2066795 1818842 -114552 -1924366 -2192170 -1049224 578770 1654089 1303894 -283388
43091 -283388 -1340894 -143895 2727137 4813329 4643722 3130252 1833978 1019305 155246
43082 155246 -607902 -620363 -46526 118786 -513377 -1121436 -857455 31954 805925 1421324
43072 1421324 2305067 3157364 3028566 1874822 1043578 1469817 2145658 1458085 -371129
43063 -371129 -1472827 -973704 -146295 -456013 -1548197 -1944151 -1043509 320210 943123
43054 943123 411029 -418364 63353 2468012 5011582 5023539 2378320 39142 200000
43045 200000 1379135 984164 -556264 -636121 1123105 2058525 476765 -1957391 -2876543
43036 -2876543 -2288239 -1657905 -1479447 -1345415 -1381266 -1992213 -2745039 -2873259 -2546069 -2493499
43026 -2493499 -2690940 -2486776 -1781288 -1074915 -567277 -182660 -268155 -1180761 -2214236
43017 -2214236 -2031970 -421328 1232456 1547916 611224 -394383 -478807 457743 1752774
43008 1752774 2567438 2620643 2391182 2336203 2103652 1065069 -466313 -1291807 -833909
42999 -833909 11674 -63818 -1237218 -2498304 -2972121 -2871709 -3012290 -3600121 -3845418
42990 -3845418 -2992545 -1540333 -924597 -1797248 -3059948 -3016668 -1256017 995501 2223587
42981 2223587 1947220 827225 -98886 -223777 301339 874976 1039157 705857 -36710
42972 -36710 -931495 -1348302 -634754 1007341 2373104 2318666 767489 -1417814 -3118384
42963 -3118384 -3408152 -2016763 185776 1605551 1258939 -533741 -2804671 -4696059
42955 -4696059 -5558466 -5258019 -4683005 -4928369 -5573801 -4950458 -2699964 -694060 -488214
42946 -488214 -1283375 -1667483 -1918267 -2849094 -3636270 -2949227 -1415981 -731793 -906674
42937 -906674 -733411 -521310 -1679279 -3617274 -3938697 -2249713 -973441 -1375352 -1469315
42928 -1469315 591922 3393157 4466169 3828278 3281824 3507923 3826320 3879706 3749079
42919 3749079 3145208 2094018 1708530 2734823 4017373 3953012 2828172 2129059 2120728
42910 2120728 1832150 1061937 600730 515834 -104366 -1487468 -2700526 -3171921 -3479346
42901 -3479346 -4199494 -4914707 -4782713 -3464173 -1297495 884915 2077737 1818242 626688
42892 626688 -634599 -1597716 -2177493 -2060208 -1173380 -284765 -282749 -1058005 -1769995 -1907204
42882 -1907204 -1423215 -291888 1222804 2231043 2027350 986909 -14523 -648662 -977394
42873 -977394 -928796 -714796 -968979 -1556209 -1239804 291303 1232690 143167 -1482204
42864 -1482204 -1220301 531916 1290943 501652 24525 534310 373119 -1252522 -2685561
42855 -2685561 -2687422 -2461601 -3205537 -3745182 -2561633 -603424 -48206 -1290367 -2923540
42846 -2923540 -3869334 -3936824 -3105349 -1869456 -1579155 -2814903 -4021500 -3369923 -1434213
42837 -1434213 -288716 -349807 -74896 1167734 1925461 1004180 -585195 -1032287 -129140
42828 -129140 722148 437420 -638945 -1484392 -1722423 -1929618 -2625475 -3215179 -2459651
42819 -2459651 -164934 2187288 2980114 2210812 1203212 1014615 1730962 2908044 3913661
42810 3913661 4049344 3102961 1719229 637833 -239176 -1360392 -2361455 -2309071 -1162267
42801 -1162267 -98396 -10088 -295249 342548 2137661 3760437 3710567 2092121 674590
42792 674590 861464 1857711 1595635 -491551 -2638742 -3162841 -2640366 -2689657 -3409690
42783 -3409690 -3437370 -2259943 -1003719 -675865 -813479 -437090 463950 1067071 951089
42774 951089 634757 884798 1711971 2240075 1784886 931435 913043 1781955 2115880 1111469
42764 1111469 -42738 57425 763926 420235 -805097 -946034 788366 2768513 3177364
42755 3177364 2067446 575420 -593284 -1112647 -664781 401428 946606 511686 144928
42746 144928 903134 2323894 3319792 3785586 4201681 4339046 3676119 2687076 2379434
42737 2379434 2718263 2743448 2182118 1729863 1697587 1614910 1367803 1494881 1960961 1803472
42727 1803472 596624 -725785 -1174762 -943002 -642091 -233939 357903 454942 -281992
42718 -281992 -563035 1136670 3937814 4946285 2899227 153585 -11955 2631326 5130607
42709 5130607 4968481 2712220 786646 501497 1100950 1486074 1880532 3198062 5261730
42700 5261730 6697497 6859335 6911348 8165883 9980079 10547181 9631283 9064015 10062695
42691 10062695 11404840 11241908 9663138 8110227 6974081 5533096 4215697 5035715
42683 5035715 8897352 13688537 16226834 15547036 13281284 11172714 9360991 7250262
42675 7250262 5024369 3530222 3001802 2705319 2090996 1766795 2752056 4915289 6809440
42666 6809440 7207423 6228068 4754295 3487506 2993915 3754708 5254447 5772173 4346065
42657 4346065 2526966 2790901 5379618 8168712 9647276 10373485 11173393 11683946 11528354
42648 11528354 11463400 12323693 13964363 16091776 18850861 21653796 22955472 22592009 22948478
42639 22948478 26048235 30589656 33776151 35108056 36128714 37069907 36332039 33366914
42631 33366914 29742558 26871717 24617502 22600192 20980727 19351656 16701873 13299157
42623 13299157 10975276 10682851 11236685 11246622 10772763 10260120 9476231 8518301 8262616
42614 8262616 8675565 8310701 6754914 5788054 6458734 6836913 4933613 2348258 2220770
42605 2220770 4417818 5737313 4680857 3067702 2585706 2641751 2574231 3315807 5246340
42596 5246340 6491687 5363641 3154254 2545507 4050934 5820926 6462499 6312803 6094738
42587 6094738 5998906 6364265 7801360 9932551 11003215 9662374 6709281 4287976 3457581
42578 3457581 3266831 2418692 1155669 752628 1407991 1767885 1022358 424347 1558338
42569 1558338 3686909 4395039 2943650 1388976 1729213 3304889 4057437 3325073 2139093
42560 2139093 1437549 1331056 1812333 2898125 4052730 4479546 4055208 3235293 2229370
42551 2229370 1148074 675517 1413150 2634684 2966971 2401706 2297264 3158466 3894480
42542 3894480 3754015 3397512 3222165 2289495 270539 -1014761 149655 2580150 3687142
42533 3687142 3138441 2808281 3326562 3245548 2224072 2601971 6299989 11704001 15231045
42524 15231045 15102415 12302897 8670004 5452879 3238738 1906919 727595 -594679
42516 -594679 -1221732 -307585 1616062 3287036 4281656 4923553 5141789 4716066 4311774
42507 4311774 4743082 5254320 4214925 1908309 953724 2999825 6249047 7475505 5749584
42498 5749584 3017085 1486631 1640580 2722550 4063539 5460151 6727490 7362913
42490 7362913 6802550 5093170 3206778 2328946 2737488 3692357 4421421 4702983 4449372
42481 4449372 3523009 2354255 1959458 2660856 3395793 3153191 2652322 3501611 5738427
42472 5738427 7340632 6655386 4515087 3192229 3622752 4517326 4346783 3430922 3337025
42463 3337025 4454229 5158790 3890512 1362987 -197925 257400 1686587 2745013
42455 2745013 3367227 4122539 5003237 5654105 6131190 6566217 6544993 5713344 4700959
42446 4700959 4532692 5232395 5842455 5804060 5514682 5444675 5484808 5393019 5232787 5085760
42436 5085760 4852119 4598004 4653284 5137182 5787205 6411120 7060568 7638616 7920149 8191149
42426 8191149 9192180 10979000 12474972 12824119 12702141 13443788 15131040 16486136 16678389
42417 16678389 16319569 16412690 17163146 18292243 19748286 21380220 22489721 22655782 22773999
42408 22773999 24366135 27896273 32619555 38076624 44690607 52644339 61340289 70674384
42400 70674384 81896220 96327616 114105213 135325853 161500049 193851094 230122035
42393 230122035 265214542 296235374 325484348 356327971 385905462 403522421 397850858
42386 397850858 366373015 317884403 265948903 220088284 182664403 152200258 127351775
42379 127351775 107435175 91400181 78236491 67755289 59633678 52375085 44753396
42372 44753396 37772048 33412049 31594451 30174194 27974699 25914487 24783238 23816423
42364 23816423 22130653 19839719 17065390 13637803 10572268 9853908 11549068 12990012
42356 12990012 12229469 10473906 9498740 8664845 6749395 5017173 5625317 7922743 9168346
42347 9168346 8513490 7637674 7589962 7577810 7063911 6669447 6567599 6082179 5346540 5452320
42337 5452320 6529329 7476161 7887685 8381280 8821508 8381350 7725320 8727427 11279759
42328 11279759 12796500 11961786 10642355 10794615 11861025 12917033 14988297 18818124
42320 18818124 22203333 22406186 20148685 18444280 18071643 16991140 14183412 11328182
42312 11328182 10018629 9603954 8953422 8643167 9858496 12010687 12933341 11368284 8312262
42303 8312262 5749183 4709782 4937072 5947764 7564372 9268763 9956052 9113519 7702310
42294 7702310 6957494 6773137 6381854 6135034 6993411 8380735 8448684 6862343 5465123
42285 5465123 5474322 5819144 5234431 4286309 4098466 4599302 5330725 6546809 8159916
42276 8159916 9045790 8817600 8769257 9520136 9469127 7556374 5777370 6379085 8007732
42267 8007732 7657993 5491893 4422789 5265374 5682495 4280910 2614251 2278916 2725095
42258 2725095 2999982 3325381 3825020 3738982 3021254 2890842 3746831 4229151 3314218 1721322
42248 1721322 423605 -473452 -551917 1201052 4328356 6466812 6337650 5425126 5297784
42239 5297784 5119734 3568459 1551637 962811 1965720 3478733 5248837 7384502
42231 7384502 8736115 7975056 5910606 4832013 5742919 7769330 9888466 11635459
42223 11635459 12468864 12123425 11511796 11945352 13689980 16411520 20339994 25483939 30503717
42214 30503717 34400758 38833055 46345745 56085904 63426399 64476044 59406674 51075813
42206 51075813 42237708 34666584 29100144 24846712 20523180 15926012 12235940 10093596
42198 10093596 8834406 8029877 8190234 9204737 9635750 8590347 7029001 6210171 5997876
42189 5997876 5681015 5268004 4884027 4046165 2728373 2042857 2579021 3140071 2565035
42180 2565035 1776459 2334615 3791069 4365768 3731205 3173759 3227195 3119799 2646727
42171 2646727 2686129 3480405 4102791 4121338 4210252 4538315 4131500 2624946 1170275 609880
42161 609880 77674 -1392962 -2972811 -3090007 -1609783 302934 1876440 3045599 3599038
42152 3599038 3320252 2671286 2133574 1164065 -917356 -3226861 -3968675 -2886401 -1643596
42143 -1643596 -1422196 -1509305 -874781 108150 442700 82281 -295758 -464413 -579642 -337488
42133 -337488 762059 2353720 3236775 2656089 1125767 -90328 -72317 1056794 2253030
42124 2253030 2511759 1879655 1258045 1145553 1159329 1014360 1117937 1611343 1750111 1222129
42114 1222129 1221959 2768468 4520068 4122507 1738069 264351 1441055 3575074 4214862
42105 4214862 3458025 3035245 3318320 3162598 2150456 1127589 668746 684492 1475509
42096 1475509 3374203 5162053 4840811 2681327 1572486 3129587 5198050 4930205
42088 4930205 2907166 1962525 2764752 3173763 1917483 271230 -579499 -1366008 -2596103
42079 -2596103 -2769936 -770478 1492442 1267466 -963815 -2072122 -780326 860849
42071 860849 884345 -52241 -515954 -621945 -993305 -972840 271928 1813730 2010078 1001055
42061 1001055 389752 594851 286719 -1241887 -2678896 -2373878 -422628 1611207 2427295
42052 2427295 1932860 932149 288361 163388 11420 -452385 -619827 72006 1013645
42043 1013645 1273311 1287224 2291834 3997695 4475772 2979704 1312285 1293973 2180387
42034 2180387 2033432 706728 -220761 -3871 524195 771761 1318444 2535023 3549310
42025 3549310 3373559 2284087 1318910 850116 343283 -609149 -1544140 -1562993 -377385
42016 -377385 1191303 1887354 1242300 -46728 -967060 -1026834 -149861 1550877 3357535
42007 3357535 3974592 2889045 1332131 896259 1448783 1559231 862353 539271 1142036
41998 1142036 1504796 728284 -74421 588282 2040397 2181041 551378 -960307 -807326
41989 -807326 193652 275848 -824579 -1833353 -1867711 -1372308 -1135467 -1188292 -1016061 -445881
41979 -445881 46213 -156570 -1129892 -2210424 -2529072 -1898400 -1127604 -1209977 -2166661 -2994940
41969 -2994940 -2915695 -2363560 -2377957 -3131497 -3518577 -2417050 -137684 1696310 1804553
41960 1804553 641966 -85706 624936 1861435 1900051 430113 -932573 -653701 762192
41951 762192 1487945 768904 -249755 -219368 657920 1054143 283484 -873032 -1045704
41942 -1045704 255307 1986057 2358066 547283 -2301668 -4093217 -3902831 -2710150
41934 -2710150 -1929965 -1812921 -1669483 -1058941 -28543 1475151 3500094 5298807 5478442
41925 5478442 3478620 558892 -1213198 -989944 110856 380037 -550111 -1391404 -826236
41916 -826236 888562 2280005 2453765 2000969 1960363 2338317 2086470 441053 -2027811
41907 -2027811 -3799360 -3828525 -2591214 -1564532 -1585086 -2075527 -2199833 -2212496 -2822549
41898 -2822549 -3608504 -3362445 -2122858 -1457876 -2136095 -2827324 -2081541 -472444 470057
41889 470057 542128 587724 601213 -126922 -1156780 -1003315 570051 1893429 1593884 174411
41879 174411 -1235599 -2436299 -3527937 -3797458 -2549675 -585510 376684 -239854 -1265757
41870 -1265757 -1362084 -511594 317181 472208 121170 -393939 -1192390 -2484429 -3722300
41861 -3722300 -3728762 -2059096 137661 1205275 813932 140918 236757 832739 973322
41852 973322 330609 -464169 -590557 80491 830972 855938 251053 -25538 567572 1289900
41842 1289900 1052254 -55106 -821034 -414338 746744 1548842 1107430 -638023 -2622571
41833 -2622571 -3212636 -1853472 37046 654875 21284 -424654 -146301 24680 -219868
41824 -219868 11945 1017312 1565015 719100 -628229 -1143112 -963964 -1028415 -1291822
41815 -1291822 -959723 -47184 580304 584835 509743 752582 1036850 981695 580258 81910
41805 81910 -175166 68542 632885 931174 661276 82499 -664612 -1854116 -3284584
41796 -3284584 -3845486 -2804449 -976760 286770 831984 1465384 2349239 2719008 2128189
41787 2128189 1032985 90287 -386367 -312772 96083 196894 -422956 -1193993 -1133705 -73976
41777 -73976 1344285 2713696 4060345 5074349 5055242 3802711 1897543 31775 -1317132
41768 -1317132 -1659805 -840997 284210 427719 -563535 -1459490 -1303978 -626611 -552893
41759 -552893 -1263538 -1906720 -1806592 -1309296 -1367135 -2353846 -3376234 -3098537 -1452307
41750 -1452307 -25804 -211827 -1424536 -1960650 -1314941 -621533 -837860 -1548122 -1811077
41741 -1811077 -1306137 -328414 566542 613393 -644312 -2469337 -3339992 -2772630 -2043392
41732 -2043392 -2467573 -3582211 -3857768 -2831898 -1587598 -1099945 -993015 -412009 407894
41723 407894 277645 -1113219 -2273979 -1607094 272729 1011464 -419941 -2230533 -2125521
41714 -2125521 -204605 1528248 1881974 1396061 908245 657386 851039 1761063 2883451
41705 2883451 3060280 1867735 140502 -1053813 -1202455 -171249 1695637 3214571
41697 3214571 3241666 2133288 1260169 961152 269012 -1141975 -2271374 -2542108 -2704829
41688 -2704829 -3323160 -3867674 -4077996 -4560012 -5005576 -3653922 -120561 2836648 2410102
41679 2410102 -487383 -2576664 -2445264 -1273452 -71524 1263718 2248670 1709937 -66249
41670 -66249 -1129589 -517475 599766 1075470 1390549 2268914 3271477 3817127 4268561
41661 4268561 4875391 4788437 3350217 1477546 588674 884808 1742730 2964810 4352870
41652 4352870 4778856 3303804 991198 49893 1006203 2030150 1391483 -582472 -2469137
41643 -2469137 -3561369 -3898047 -3271434 -1340732 1306929 3021458 2426097 -205989 -3007747
41634 -3007747 -4032048 -2913943 -1099148 -280936 -660852 -1042959 -542038 429235 1079899
41625 1079899 1413133 1831203 2079198 1535448 463759 14684 741237 1933685 2792874
41616 2792874 3434588 4133279 4374689 3630735 2586191 2476087 3372455 4236810 4674269
41607 4674269 5410463 6682372 7342014 6294253 3974350 1631307 -119977 -1202934
41599 -1202934 -1288519 -274331 821235 680430 -579298 -1500146 -1199270 -243373 520574
41590 520574 971306 1178562 872904 140262 -122069 671091 1624501 1175151 -1038661
41581 -1038661 -3750769 -5414087 -5448001 -4335636 -3146256 -2868623 -3467340 -3558011 -1834032
41572 -1834032 999963 2652112 2066590 853470 1052283 2353865 2876904 2178983 1769658
41563 1769658 2518916 3316297 3015280 2169293 1726168 1305394 249874 -593819 65594
41554 65594 1623825 2146246 1202964 393255 843822 1855371 2461704 2714925 2735560 1974916
41544 1974916 355224 -1049006 -1366826 -910924 -80920 1377839 3044567 3242015 1297066
41535 1297066 -804789 -805006 643523 1088800 -20516 -875958 -403088 388148 577300
41526 577300 869524 2029409 3296833 3525158 2897233 2379464 2118671 1481002 412981
41517 412981 -214852 223538 1198806 1668668 1488626 1732952 3215716 4928811 4811947
41508 4811947 2380890 -320164 -1122442 -321529 130059 -617460 -1646381 -2049189 -1959565
41499 -1959565 -1707995 -1188141 -435011 48407 -102423 -711791 -1296125 -1247685 -160751
41490 -160751 1355111 1809016 777141 -18749 1035108 2871543 3287629 2462098 2527113
41481 2527113 3756203 3940590 2133570 288479 68428 600648 864443 1743186 3646466
41472 3646466 4398982 2168842 -1155110 -2370005 -1623673 -1730579 -3443068 -4435646 -3124789
41463 -3124789 -839461 395208 160074 -818511 -1638119 -1259071 756151 3085315 3755694
41454 3755694 2720207 1745115 1574523 1204469 452988 967950 3480461 6007012 6385940
41445 6385940 5129564 4075444 3422367 2024942 -97284 -1511550 -1503219 -873189 -498654
41436 -498654 -341659 -58913 415435 1080267 1855464 2280493 1982289 1451199 1511831 1943267
41426 1943267 1563577 29689 -1290020 -865412 1065033 2753360 2930094 2001110 1284910
41417 1284910 1496338 2160274 2305290 1513673 311323 -332117 135504 1350095 2337352
41408 2337352 2471171 2189431 2492866 3581947 4422247 4123900 3357601 3596986 5064733
41399 5064733 6365247 6322618 5215646 3806943 2233218 694319 296615 1875001 4333376
41390 4333376 5479317 4580397 3025126 2311190 2422145 2458977 1812911 234666 -2226730
41381 -2226730 -4606898 -5228237 -3521668 -1114562 -124996 -733356 -1381851 -1016952 2276
41372 2276 1041282 1898747 2178267 1257058 -529158 -1699648 -1319469 -32378 1228053
41363 1228053 2554950 4155541 5105532 4424830 2842042 1944410 1764648 810345 -1344778
41354 -1344778 -3090131 -2969525 -1494336 -3946 1094363 2000309 2498683 2489889 2800591
41345 2800591 4100780 5399670 5015631 3024098 1428324 1557942 2395900 2131056 630525
41336 630525 -450285 226456 2162107 3742814 4053814 3582242 3180121 2887634 2272661
41327 2272661 1587510 1694907 2740797 3834066 4419820 4958466 5530855 4848402 1961935
41318 1961935 -1694844 -3533194 -2918660 -1540089 -610468 599225 2797971 4818188
41310 4818188 5006826 3601914 2388461 2325336 2664661 2395338 1572999 944653 914838
41301 914838 1279139 1672612 1937539 2056389 1861859 990005 -652549 -2386528 -3105735
41292 -3105735 -2391744 -1053831 -250767 -222806 -228707 339961 1200192 1664098 1526268 1093116
41282 1093116 459466 -689445 -2256740 -3171058 -2369334 -349386 983520 347442 -1566722
41273 -1566722 -3080232 -3240178 -2138321 -338874 1164739 1096117 -807011 -2937479 -3443943
41264 -3443943 -2532351 -1865527 -1802390 -925377 1304991 3245258 3484085 3076585 3862905
41255 3862905 5571783 6336223 5604748 4772313 4890730 5337419 5158658 4428580 3657052
41246 3657052 2888015 2139291 1936559 2525745 3050471 2434159 913348 -130431 53816
41237 53816 664617 489265 -520934 -1267922 -907545 209411 1061080 1124193 829655 942516
41227 942516 1632071 2209777 1861293 696605 -126773 352819 1659060 2429944 2267408
41218 2267408 2243421 3112075 3895625 3291572 1955406 1963530 3951284 6178049 6920704
41209 6920704 6552885 6447836 6880013 7132612 6977323 6800653 6594549 5998944 5253234
41200 5253234 5027283 5239171 5021485 4040228 2938077 2196585 1442786 332778 -645220
41191 -645220 -861666 -502722 -207063 -88824 281764 1082279 1895633 2127963 1535289 471456
41181 471456 -276116 -235591 15242 -600392 -2055217 -2863728 -1984085 -379601 356251
41172 356251 377599 1075662 2296638 1956078 -821062 -3834594 -4437871 -2866526 -1396324
41163 -1396324 -1111676 -1381955 -1929228 -3112124 -4123265 -3346504 -1263969 -745601 -3101881
41154 -3101881 -5760811 -5622571 -3206513 -1444120 -1507389 -2115303 -2286392 -2347968 -2347773 -1776233
41144 -1776233 -1139125 -1720424 -3286466 -3915538 -2711062 -902416 389934 1596876 3009180
41135 3009180 3554427 2602043 1386270 1107354 981315 -149850 -1457609 -1332481 -190641
41126 -190641 -32046 -1447502 -2936864 -3292143 -2979022 -2774963 -2496619 -1800937 -1249720
41117 -1249720 -1702848 -3033263 -4074490 -3870311 -2734224 -1863668 -1806425 -1693642 -610718
41108 -610718 618342 264620 -1552886 -2523389 -1350310 197580 -239015 -2305643 -3775684
41099 -3775684 -3833405 -3610779 -3836197 -3888928 -3348145 -2866588 -3063236 -3662621 -4031604 -3734377
41089 -3734377 -2591391 -1103521 -595752 -1777670 -3291478 -2959090 -499729 2200010
41081 2200010 3553679 3770485 3803495 4090351 4599288 5017177 4669985 3243644 1620780
41072 1620780 941728 930024 385190 -807979 -1642670 -1889862 -2321261 -2890919 -2537929
41063 -2537929 -1218417 -318545 -481920 -846941 -1088511 -2210865 -4326654 -5664955 -5169181
41054 -5169181 -4289823 -4619517 -5383667 -5066091 -4062191 -3666957 -3555869 -2455704 -601339
41045 -601339 562491 656823 409114 -146577 -1488151 -2850131 -2718678 -1182974 95345
41036 95345 454586 906741 1920254 2506240 2229315 2255207 3273350 3980226 3096981 1657234
41026 1657234 1490858 2122443 1207950 -1808340 -4317540 -3736990 -841067 1401219 1670481
41017 1670481 1400360 2012713 2800739 2564621 2003563 2730805 4447058 5039786 3686826
41008 3686826 2069417 1855287 2597142 3137493 3647798 4816743 5987838 5726104 3844026
40999 3844026 1540061 -239601 -1442792 -2138767 -2210522 -1762484 -960781 387071 2268948
40990 2268948 3720695 3583185 1946219 59820 -1087941 -1392401 -1039610 -129564 1105152
40981 1105152 2310516 3217614 3516360 2899066 1626643 488713 -277109 -1276000 -2561935
40972 -2561935 -2939588 -1644647 176396 854322 302315 -468525 -1084606 -1650583 -1719854
40963 -1719854 -1121842 -1099017 -2721902 -4735767 -5065390 -4036275 -3735399 -4306262 -3563599
40954 -3563599 -791870 1686422 1833295 604406 -9506 162217 95119 -339714 -497961
40945 -497961 -343994 -446171 -1113324 -2285200 -3645016 -4406785 -3919507 -2850098 -2580482
40936 -2580482 -3043620 -2676355 -1172356 -518497 -2080281 -4211706 -4396660 -2709195 -1440935
40927 -1440935 -1870178 -2959801 -3119445 -2105975 -1080424 -1325816 -2833130 -4090958 -3780333
40918 -3780333 -2511957 -1879767 -2031595 -1807563 -1286964 -1973119 -3822006 -4521168 -3010603
40909 -3010603 -1400203 -1644083 -2515880 -2096891 -1242222 -1799420 -2908146 -2204217 121621
40900 121621 1537833 1107452 350127 233885 48749 -472808 -434829 361997 1010333 1287210
40890 1287210 1761500 1929489 592390 -1529786 -2063354 -582814 491349 -421404 -1859100
40881 -1859100 -2070260 -1656555 -1762259 -1642076 -165217 1633920 1678595 -219298 -2346579
40872 -2346579 -3474090 -3701494 -3360026 -2568660 -1758203 -1475836 -1662898 -1830886 -1719966
40863 -1719966 -1251875 -345874 610747 743041 -127492 -872263 -392752 954061 1946429
40854 1946429 1940124 1082288 -205400 -1185147 -944631 541541 2081137 2793224 3258166
40845 3258166 4224769 4986348 4342098 2652977 1500647 1454267 1538925 1030075 490252
40836 490252 562413 724347 -20149 -1650691 -2954975 -2811165 -1314159 508559 1931005
40827 1931005 3072197 4052449 4252648 3204968 1824020 1581474 2459669 2959378 2327446
40818 2327446 1417864 959682 531436 25516 514871 2369816 3802404 2839116 -57336
40809 -57336 -2643322 -3399220 -2232412 275091 2846506 3659289 2142204 -76405 -1421762
40800 -1421762 -2491743 -4165837 -4934273 -2764957 1086085 3110461 2347307 1259961
40792 1259961 1537556 2034684 1723009 1707646 2778662 3495049 2639539 1597320 2232615
40783 2232615 3892726 4535582 3712062 2560581 1757326 1252246 1305168 2076321 2693397
40774 2693397 2214904 1100834 487712 538888 671534 766002 987238 1143480 1363486 2455780
40764 2455780 4297841 5043811 3624915 1864671 2003334 3161251 2830052 1158269 703885
40755 703885 1971781 2413546 602912 -1578502 -2203109 -2066163 -2469173 -2545560 -964578
40746 -964578 1385942 2683744 2971999 3517547 4261254 4104110 3206385 2824412 2986937
40737 2986937 2369694 710558 -432412 184827 2008323 3759391 4661451 4131011 1687020
40728 1687020 -1867508 -4185579 -3469419 -446751 2548061 4142408 4811126 5430694 5911727
40719 5911727 5633422 4651300 3776196 3425882 2970529 1635634 -275397 -1673817 -2072713
40710 -2072713 -1940316 -1663850 -1146001 -736116 -1372789 -2966786 -3711521 -2283066 901
40701 901 695822 -536220 -1819734 -2013290 -1954142 -2473842 -2966554 -2729276 -2264787 -2240284
40691 -2240284 -2305354 -2002274 -1853308 -2365521 -2723743 -1722774 438840 2347128 2998830
40682 2998830 2381418 939454 -560233 -1099485 -403016 493532 641772 638042 1503609
40673 1503609 2652766 2576077 1381799 907140 1998730 3281159 3207131 1935111 483195
40664 483195 -649362 -1129542 -292271 1808153 3657902 3755724 2341918 792006 -129112
40655 -129112 -530970 -573700 -448488 -699209 -1492741 -1969484 -1395864 -542939 -665473 -1426675
40645 -1426675 -1337673 -271278 85560 -1202268 -2716259 -2539766 -741772 929915 1185171
40636 1185171 163272 -1240909 -2160476 -2107076 -1269509 -428970 -165008 -298802 -414034
40627 -414034 -550109 -892149 -1100142 -592360 560893 1541961 1670205 1122256 754717
40618 754717 1281676 2441177 2963220 1820298 -341108 -1642636 -1188821 -90056 318934
40609 318934 386872 1164260 2234618 2173090 1039684 598401 1554550 2301004 1479847 318372
40599 318372 796790 2437080 2885873 1455083 84840 339208 1214688 953408 -317580
40590 -317580 -1184264 -1375786 -1942388 -3133106 -3682319 -2747394 -1392126 -1238045 -2271928
40581 -2271928 -2952857 -2300508 -1027815 -485192 -1130306 -2337823 -3283555 -3621120 -3480699
40572 -3480699 -3164852 -2860426 -2474253 -1747259 -615413 603191 1476331 1844927 1861555
40563 1861555 1758375 1696418 1692224 1494221 694396 -727238 -2108183 -2808755 -3141964 -3909400
40553 -3909400 -4831487 -4377797 -1955449 481627 382433 -1980763 -3587357 -2612667 -740791
40544 -740791 -467369 -1513594 -1768529 -968278 -1030254 -2606315 -3762469 -3120328 -2173304
40535 -2173304 -2732913 -3713282 -2794937 -397012 652463 -587679 -1723699 -624802 1641274
40526 1641274 2715776 2211449 1602596 1906196 2883830 3857942 4104777 3056328 1255700
40517 1255700 463703 1596224 3204467 3375388 2492509 2409916 3334128 3596188 2567704
40508 2567704 1596318 1422344 804969 -1054615 -2533158 -1767325 353972 1225726 -48366
40499 -48366 -1947756 -2918017 -2827785 -2088059 -926758 54890 -91192 -1389742 -2548971
40490 -2548971 -2487293 -1667174 -1313488 -1721330 -1975995 -1259362 80844 1021313 1282792
40481 1282792 1817934 3429160 5124303 4811817 2054363 -813893 -1249097 487881 2060339
40472 2060339 2334878 2364247 3007204 3260138 1873908 -447730 -1629237 -649123 1384071
40463 1384071 2401107 1174978 -1728145 -4331028 -4805601 -3047220 -603147 1012319
40455 1012319 1532528 1437435 997210 302825 -287943 -366021 58280 648202 1061566 976382
40445 976382 221983 -822645 -1382332 -1120761 -401828 436198 1407877 2241208 2289509 1603661
40435 1603661 1223482 1704864 2228433 2039885 1841911 2516476 3212518 2253813 -394356
40426 -394356 -3108081 -4915398 -6223992 -7140283 -6779304 -4860689 -2578807 -1071457 -151984
40417 -151984 602119 579467 -902804 -3015570 -3953186 -2900696 -738343 1063153 1718374
40408 1718374 1519404 1457120 2323866 3874870 5043421 5126476 4436883 3722729 3468715
40399 3468715 3879031 4846581 5653024 5387568 4004124 2317353 761076 -915388 -2437798
40390 -2437798 -2794304 -1961820 -1506186 -2302847 -2909643 -1805070 -220049 -657139 -3042933
40381 -3042933 -4600048 -3699742 -1708014 -415141 337765 1365424 2185770 1925912 1116923
40372 1116923 996666 1582878 1844526 1472962 1168384 1246960 1180549 692953 279416 269023
40362 269023 164005 -598888 -1704013 -2188476 -1390003 471233 2322319 2795376 1354512
40353 1354512 -745497 -1129106 1358704 5043564 6779146 5112213 1671463 -782960
40345 -782960 -1143133 -307758 687609 1819582 3264504 4556157 5293832 5997740 7321617
40336 7321617 8785889 9329786 9046859 9304044 10902705 13113807 15054222 17205543 20808595
40327 20808595 26199082 32455290 38504451 44063093 49620873 55847716 62802998 69423860
40319 69423860 74074689 75871007 75055901 71833194 65664530 56589933 46652145 38686099
40311 38686099 33555401 29562352 24831918 19385707 14505240 10980416 8729052 7524933
40303 7524933 7154327 7008949 6379445 5375870 5002270 5946691 7577542 8562122 8436741
40294 8436741 8082896 8338374 8551399 7327224 4809022 3210122 4256500 6746797 7852930
40285 7852930 6639559 4918426 4388923 4458847 3786667 2678357 2458685 3144120 3403944
40276 3403944 2747198 2201707 2489189 2871138 2451300 1554850 980453 639844 -176888
40267 -176888 -1637772 -3201670 -4238606 -4215351 -2768579 -386732 1372466 1282223 -34256
40258 -34256 -758312 7654 1446247 2200535 1595866 -165128 -2140271 -2977608 -2002202
40249 -2002202 -101482 1240258 1750733 2243062 2744862 2148044 132984 -1945418 -2864313
40240 -2864313 -3027158 -3267337 -3350840 -2811418 -2185163 -2014833 -1542631 -21496 1366453
40231 1366453 764364 -1477115 -3009967 -2569607 -1116225 158576 1120190 1706959 1585078
40222 1585078 1389276 2443340 4397412 4968639 3156904 983405 653542 1654031 2356258
40213 2356258 2898339 4221040 5384139 4504102 2008380 423430 741513 1262200 542342
40204 542342 -566009 -641291 259418 1227529 1810563 1824422 1094040 192075 216589 1026598
40194 1026598 1025129 -323001 -1186896 35335 2079853 2548782 1408337 746860 1408791
40185 1408791 1959495 1253156 186045 149115 1046305 1691460 1326557 106337 -1217045
40176 -1217045 -1586691 -329646 1923627 3614399 3966519 3674670 3542071 3321767 2537114
40167 2537114 1591371 1175846 1221134 1344406 1722642 2476845 2767861 1817078 466725
40158 466725 213979 769874 273195 -1723534 -3234022 -2643721 -924379 250025 1208754
40149 1208754 3257252 5752018 6368587 4365489 1743345 617792 876317 1157426 971403
40140 971403 898040 1395068 2269398 2963363 2844269 1614896 -170626 -1447631 -1779716
40131 -1779716 -1601043 -1145437 -39034 1558078 2378707 1479267 -420356 -1853346 -2275577
40122 -2275577 -2040404 -1407269 -574169 -103375 -189231 34886 1282986 2626417 2540502
40113 2540502 1172036 132539 138644 419270 599973 1457303 3162116 4281309 3560131
40104 3560131 1695896 345149 62295 90516 -321488 -1148132 -1786460 -1544477 -310803
40095 -310803 991720 1183496 286727 -500484 -484890 -186799 -39275 456178 1583399
40086 1583399 2492055 2335451 1471452 650471 -128466 -1005573 -1431193 -1130056 -1088754 -2207088
40076 -2207088 -3539038 -3331931 -1515689 199852 527445 -354065 -1741743 -3004462 -3253383
40067 -3253383 -1847382 411522 1657718 932740 -909696 -2315024 -2317523 -886377 1064492
40058 1064492 2077492 1475501 184711 -575035 -967633 -1777190 -2583863 -2392450 -1730032
40049 -1730032 -2047182 -2954728 -2346000 100953 1796216 764439 -1643893 -2972931 -2881781
40040 -2881781 -2520865 -2193717 -1562890 -1108080 -1384876 -1518975 -339555 1454348 2110928
40031 2110928 1514743 1180221 1588260 1434590 -44704 -1656327 -1946207 -1145103 -570948
40022 -570948 -833354 -1415414 -1673757 -1619544 -1666552 -1861121 -1675215 -881362 -331566 -939787
40012 -939787 -1874790 -1192422 1130421 2457372 1092941 -980062 -950681 543641 607780
40003 607780 -1223064 -2602257 -2652975 -3218153 -4876317 -5046953 -2131234 1100589 1009921
39994 1009921 -1703095 -3190058 -1951314 -255305 -210203 -1093364 -1192182 -223913 995669
39985 995669 1782805 1538691 -345922 -3470307 -6009141 -6267457 -4342014 -1664653 694445
39976 694445 2622293 4161850 4928323 4567230 3412813 2352394 2015307 2205667 2197446
39967 2197446 1542868 510605 -231208 -269199 122709 63606 -1200277 -3292153 -4650967
39958 -4650967 -4052337 -2096283 -493227 99376 597606 1655326 2468409 2139718 1282560
39949 1282560 1193252 1978382 2574773 2314318 1467490 459034 -424395 -637848 234792
39940 234792 1552591 2050004 1521283 1250730 2293721 3945357 4506630 3298266 1406567
39931 1406567 385102 474160 386095 -986812 -2967156 -3849996 -3230883 -2568241 -2986480
39922 -2986480 -3650808 -3295478 -2340728 -2019543 -2109536 -1412218 -304877 -720032 -3044721
39913 -3044721 -4924326 -4273809 -2107161 -1011452 -1673591 -2354567 -1513522 259883 1097193
39904 1097193 -23750 -2197125 -3460464 -2851337 -1576612 -1679051 -3488092 -5087018
39896 -5087018 -4593337 -2266129 92985 1200445 1198792 984534 1205116 1729371 1866250
39887 1866250 1319413 783127 979573 1314902 549732 -1183423 -2356088 -2323629 -2147949
39878 -2147949 -2571184 -2802032 -2304578 -2144891 -3098572 -3873464 -3057490 -1701743 -1869171
39869 -1869171 -3359091 -4060771 -3144258 -1682934 -259010 1745641 4213578 5805984
39861 5805984 5962362 5520137 4847205 3322339 1362086 885287 2569679 4385203 4238627
39852 4238627 2686405 1673185 1829189 2407349 2782911 2589307 1364729 -486503 -1303144
39843 -1303144 -233316 1171519 994734 -284746 -875508 -723894 -1224712 -2179956 -1565035
39834 -1565035 1119428 3430329 3043203 748242 -797992 -325985 1119695 1851776 1180525
39825 1180525 -318437 -1532124 -1873895 -1712637 -1472508 -676817 1149176 2828769 2329674
39816 2329674 -316291 -2418630 -1963903 -250457 207299 -625581 -604421 951147 1996578
39807 1996578 733208 -1766325 -3045206 -2476714 -1729719 -2292580 -3674396 -4344409 -3681355
39798 -3681355 -2407719 -1397984 -662431 390573 2065583 3976580 5337772 5492126
39790 5492126 4371160 2676147 1431836 1085945 1189705 1190148 1206259 1549212 1795673 1118135
39780 1118135 -487844 -2080022 -2969671 -3259623 -3049842 -2086486 -607410 476014 901105
39771 901105 1570793 2875167 3545401 2511077 1038657 1210377 2638968 2759765 649069
39762 649069 -1498970 -1548890 -241128 504807 603809 1303569 2551525 2877333 1784931
39753 1784931 548825 329437 803307 1064691 848465 460958 364000 1145096 3032410
39744 3032410 5094765 5810372 4893078 3745464 3599089 4024080 3931981 3308330 3099646
39735 3099646 3830972 5105860 6192171 6511491 5890139 4906361 4634688 5464305 6538635
39726 6538635 6947015 7023068 7748654 9284619 10924168 12212272 13270325 14226264 15146911
39717 15146911 16360377 18076116 19924433 21622281 23611059 25966255 27206378 25756038
39709 25756038 22468847 19972142 19248131 18596525 16530869 13897824 12115613 10953895
39701 10953895 9492357 8014337 7301038 6897744 5776320 4277682 3850383 5013881
39693 5013881 6805165 8042868 8066459 6642109 4418898 3108595 3748282 4974577 4541039
39684 4541039 2465745 1023079 1502540 2757263 3384253 3516356 3649338 3411022 2663124
39675 2663124 2359493 2898250 2819752 771371 -2075283 -3296517 -2440822 -1285732 -1022625
39666 -1022625 -849773 356685 2343763 3949808 4316181 3288849 1462292 60927
39658 60927 -79870 433393 482655 454460 1862094 4486240 5673361 3830904 1179869
39649 1179869 1019011 3043458 3788510 1757133 -420713 48001 2161975 2983864 2079695
39640 2079695 1788394 3422468 5411760 5715105 4392277 2917872 2134317 1888312 1934139
39631 1934139 2208952 2580560 3021866 3703458 4391796 4257122 2937293 1316340 463219
39622 463219 174785 -554783 -1879566 -2895279 -3036403 -2695178 -2261534 -1455638 -67487
39613 -67487 1276364 1631722 753264 -707633 -1791211 -1859070 -955661 207394 784679
39604 784679 472032 -372674 -1156946 -1412622 -939247 1754 683073 486826 -447202 -1324839
39594 -1324839 -1371745 -343166 1235560 2102729 1163181 -1059629 -2482011 -1811322 -289434
39585 -289434 15808 -806633 -752100 922017 2486631 2303193 1103802 672750 1291640
39576 1291640 1714210 1166797 290798 208563 1331674 3014401 4008129 3510737 2099118
39567 2099118 1295411 1873752 2917480 2856751 1165402 -1141756 -2389633 -1616922 452152
39558 452152 1849346 1349981 -131481 -868579 -691766 -814013 -1525246 -1756370 -1123991
39549 -1123991 -484155 133540 1982155 4787636 5652231 2769451 -1372343 -2843693 -1282816
39540 -1282816 356869 366047 -39242 471283 1371384 1713762 1597851 1455293 1292911 1219876
39530 1219876 1544932 2018194 2147135 2386362 3603120 5166095 5181340 3143862 844069
39521 844069 -40281 141998 268090 227511 424612 614466 432513 391595 1262884 2807371
39511 2807371 3900612 3716691 2370264 687895 -403969 -614292 -491970 -524760 -308711
39502 -308711 670853 1845276 2279756 2250462 2668007 3185543 2743647 2024342 3061432
39493 3061432 5735176 7023262 5103232 2147303 1253680 2284745 2824529 1957476 743817
39484 743817 -295417 -1692319 -3067328 -2820924 -397549 2518435 3688008 2486924
39476 2486924 218011 -1153727 -627561 947951 1760148 1059455 -243615 -1205440 -1949404
39467 -1949404 -2525095 -2053030 -197723 1704577 2417832 2622806 3375140 3855449 2661288
39458 2661288 531776 -474212 -130530 -125415 -1089444 -1753372 -1277991 -399446 102676
39449 102676 281691 101799 -578504 -910834 129415 1593271 1353726 -478360 -1187358
39440 -1187358 682078 3279724 4353566 4115654 3860611 3638194 2930991 2122085 1675145
39431 1675145 1111425 225431 26201 1031546 1924746 1420957 223390 -389986 -594137
39422 -594137 -987291 -958351 -26443 532480 -384201 -1368943 -620269 641182 -182401 -2580797
39412 -2580797 -3329677 -1459928 388601 286038 -383269 33882 507192 -658374 -2783525
39403 -2783525 -3840530 -3322447 -2357259 -1830777 -1856420 -2382747 -3041262 -3018845 -2190431 -1733025
39393 -1733025 -2561841 -3793637 -3808649 -2287966 -278868 1138677 1361053 218138 -1485569
39384 -1485569 -2078844 -864419 709167 874628 -69360 -519751 -145267 -105120 -927162
39375 -927162 -1792428 -2036366 -1919649 -1677944 -1107703 -363918 41090 260494 891938 1550241
39365 1550241 1126129 -153450 -572030 433326 1180610 502180 -8369 1664646 4445625
39356 4445625 5204236 3066114 644802 590409 2516913 4025591 3581662 1606244 -439513
39347 -439513 -1287600 -705099 285801 346396 -692254 -1664135 -1566286 -643750 258664 694874
39337 694874 524679 -407735 -1758056 -2407877 -1599901 -69633 769139 565559 132691
39328 132691 -17318 -209463 -553631 -427687 459153 1309861 1278602 732704 705875 1428582
39318 1428582 2202467 2555085 2627044 2338513 1120149 -1031125 -2928769 -3372292 -2609259
39309 -2609259 -1876730 -1616582 -976717 692685 2570787 3164748 2088773 575060 298248
39300 298248 1930895 4615180 6507730 6094142 3498795 499318 -1100907 -1019537 -129165
39291 -129165 997939 2313299 3249188 2745880 851814 -777868 -896567 -389835 -847736
39282 -847736 -1989572 -1999211 -366910 1205972 1303950 806897 1317706 2542408 2714917
39273 2714917 1377631 279964 1077116 3144943 4413101 3840279 2314197 1291113
39265 1291113 1273070 1793211 2340503 2798628 3092490 2883503 1895573 431752 -682163
39256 -682163 -768191 137607 1398883 2368494 2801928 2761308 2292770 1370306 192164 -639828
39246 -639828 -504883 565346 1750741 2153318 1612081 715055 111649 10063 269644
39237 269644 644045 805175 429760 -436598 -1246133 -1514892 -1456659 -1617726 -1817289 -1097852
39227 -1097852 729416 2010130 802999 -2354342 -4345342 -2882442 728982 3180679
39219 3180679 2969548 1428851 293156 -178963 -372396 -201428 292408 463959 281588
39210 281588 989201 3256421 5561624 6035082 5290939 5480849 6722383 6717749 4472989
39201 4472989 2199931 2170830 3386418 3245696 1495103 382204 1143751 2423873 2672799
39192 2672799 2408975 3036070 4498838 5418511 5130319 4351352 3752333 2952200 1499542
39183 1499542 138151 179832 1727884 3333436 3651466 2811912 1771995 892281 -197804
39174 -197804 -1653674 -3061729 -3942232 -3999622 -2966833 -890987 1370154 2587008 2281103
39165 2281103 988339 -552680 -1912041 -2776121 -3022865 -3032840 -3157400 -2906115 -1647078
39156 -1647078 -123923 80797 -1011536 -1367141 159152 1934047 1870249 460671 -217264
39147 -217264 244364 317007 -656193 -1384860 -823369 202485 393626 -163029 -456391 -91254
39137 -91254 535088 1141835 1848441 2695259 3411897 3634667 3118833 1895445 426316
39128 426316 -562707 -616404 94678 918927 1114210 292815 -1151603 -2127745 -1804094 -608679
39118 -608679 37464 -837595 -2698477 -3953117 -3446736 -1573923 148323 805930 1172212
39109 1172212 2501581 4415031 5075572 3779193 2093050 1548024 1406401 128695 -1820340
39100 -1820340 -2439044 -1183213 249433 250325 -1071488 -2757416 -4012143 -4049437 -2440371
39091 -2440371 -208392 706025 -263680 -1621365 -1931556 -1504625 -1400940 -1910746 -2701418
39082 -2701418 -3420068 -3509950 -2493322 -1029566 -511225 -1008651 -1028479 -99450 65834
39073 65834 -1749096 -4016832 -4597343 -3819351 -3476818 -3730793 -3164884 -1367288 675581
39064 675581 2493193 4357160 5646226 5089554 2984022 1339680 1341049 2233614 3075533
39055 3075533 3884123 4509328 4127525 2772403 1944805 2730017 4452537 5966909 7021040
39046 7021040 7487520 6611388 4206641 1492527 -440666 -1919192 -3212470 -3078110 -653474
39037 -653474 2090424 2112520 -557540 -2625812 -1931415 -30164 573581 9433 233916
39028 233916 1678834 2614919 1765222 -18122 -1111905 -1025110 -337409 389176 831199
39019 831199 636759 -113150 -490479 219344 1136882 593574 -1480624 -3143905 -2929088
39010 -2929088 -1587525 -558092 80881 829184 1005308 -312717 -2042313 -1939479 106232
39001 106232 1672253 1369619 857489 2104244 4292421 5098403 3943068 2203631 871822
38992 871822 -177432 -810673 -288248 1397178 3098559 3796382 3379297 1996019 -308649
38983 -308649 -2937434 -4659830 -4774879 -3798194 -2590309 -1335246 184441 1724717 2516858
38974 2516858 2032203 643825 -487531 -382922 659569 1205927 344702 -1062441 -1363786
38965 -1363786 -146053 1381595 1870038 954671 -946718 -3007679 -4098164 -3521919 -1993772
38956 -1993772 -1087808 -1400544 -2021524 -2056688 -1706939 -1397583 -877612 61584 825687 850351
38946 850351 513523 342968 -5926 -932508 -1626727 -916536 826669 1898815 1483906
38937 1483906 586144 515882 1381342 2384503 2781933 2195153 718776 -840557 -1429715
38928 -1429715 -862958 18355 571312 1104193 2017311 2889192 3091228 2843796 2888540 3302958
38918 3302958 3345836 2492366 1074727 -199211 -947065 -1213099 -1210113 -1165613 -1275235 -1649563
38908 -1649563 -2286386 -3052944 -3649114 -3681918 -2914995 -1468437 239279 1712751 2589355
38899 2589355 2773742 2411032 1675222 645377 -520773 -1451333 -1813748 -1568492 -759459
38890 -759459 658801 2361627 3343266 2798059 1231035 -88372 -771253 -1476828 -2329518
38881 -2329518 -2396233 -1329092 -348496 -570464 -1268743 -1066214 -217753 -246261 -1569588
38872 -1569588 -2974288 -3511692 -3482822 -3204275 -2206157 -419946 932376 665118 -754115
38863 -754115 -1829362 -1913466 -1605415 -1440071 -1071202 -56002 1087758 1196395 -91072
38854 -91072 -1614971 -1918588 -1097517 -702497 -1552456 -2557213 -2432190 -1641843 -1360212
38845 -1360212 -1221416 67905 2063601 2666901 1386850 430886 1398764 2743541 2227166
38836 2227166 478961 -50014 1057713 1653990 344737 -1676463 -2625315 -2338683 -1665429
38827 -1665429 -842525 429603 1810826 2165152 670276 -2230339 -5034406 -6326110
38819 -6326110 -5787454 -4080573 -1932676 195716 1671339 1933553 1596664 2251173 4350802
38810 4350802 6256009 6414318 5497227 4961295 4429285 2492095 -307351 -1533963 -152850
38801 -152850 2226413 3890051 4894423 5639448 5452480 3882711 2049579 1353949 1755340
38792 1755340 2382855 2912228 3272746 2925860 1646517 322773 -120684 43143 162667
38783 162667 485047 1484813 2630592 3058397 2891605 2663909 2017035 347032 -1695353
38774 -1695353 -2786198 -2742963 -2402304 -1988459 -1122051 -283663 -546033 -1628103 -1850163
38765 -1850163 -560872 768474 515613 -1161186 -2940362 -3794538 -3229077 -1180802 1478052
38756 1478052 3166791 3152299 2312199 1825568 1837473 1935756 2034976 2042125 1517268 577433
38746 577433 355709 1496382 2828000 2716774 1291896 85983 -228900 -375061 -800331
38737 -800331 -943569 -515308 -168898 -210964 232189 1793927 3417965 3489989 2054439
38728 2054439 785090 790141 1477346 1815100 1754156 1828410 2042113 1952691 1542394 1204431
38718 1204431 901374 102277 -1216854 -2155325 -1932879 -980387 -503546 -1133465 -2394596
38709 -2394596 -3342307 -3321264 -2266124 -802657 -21300 -501370 -1352040 -869301 1365377
38700 1365377 3572039 3748397 2321740 1785171 3422637 5479119 5479834 3573032 2144203
38691 2144203 2379061 3027346 3060685 3538709 5272093 6255350 3990775 -200843 -2069352
38682 -2069352 -102030 2425610 2297781 714587 717632 2279929 2789389 1383769 -162134
38673 -162134 -654795 -810771 -1064133 -641233 390228 470609 -880152 -1782179 -670077
38664 -670077 1310927 1995601 992440 -569003 -1880056 -2644643 -2550904 -2004227 -2317263
38655 -2317263 -3657315 -3977727 -1842750 804277 1043571 -591572 -851464 1140247 2467217
38646 2467217 882292 -1932714 -3039759 -2173780 -1223628 -1176111 -1443907 -1473480 -1365648
38637 -1365648 -1241107 -1249298 -1900817 -3324962 -4548448 -4543845 -3645896 -2890799 -2332766 -1249863
38627 -1249863 161484 676121 -120808 -1027666 -766730 445144 1355439 1164199 127651
38618 127651 -964596 -1553059 -1653212 -1528789 -1062797 130477 1697849 2333182 1361907
38609 1361907 11258 2880 1195720 1930811 1595240 1263177 1515014 1342439 55651
38600 55651 -1244144 -1306236 -633734 -370851 -285015 571827 1922830 2702858 2986933 3667631
38590 3667631 4352399 3507633 1033567 -1055987 -1195457 -67900 894366 1477565 2224213
38581 2224213 3099714 3652847 3740995 3279989 2085209 760071 793993 2699277 4814496
38572 4814496 5135262 3756573 2347613 1781796 1648836 1749496 2516035 3811633 4635093
38563 4635093 4453336 3935102 4012369 4892905 6197827 7419922 8071310 7948716 7379359
38554 7379359 6792273 6200297 5628598 5686716 6859301 8484215 9435872 9693238 10166721
38545 10166721 11024471 11348170 10539747 8941064 6980783 4953975 3753804 4299947 5809624
38536 5809624 6187134 4818769 3438868 3323210 3288856 1896060 153376 76904 1471368
38527 1471368 2287121 1850039 1619648 2507161 3344810 2760017 1132449 -291115 -1262474
38518 -1262474 -2431649 -3803740 -4232569 -2573488 995442 4826959 6900450 6271395
38510 6271395 3699496 945432 -547084 -471468 388235 838099 258943 -835166 -1464892
38501 -1464892 -1435254 -1341146 -1211602 -128063 2149658 4090028 4026060 2338969 816554
38492 816554 196818 -289011 -1029540 -1262108 -650594 -256948 -1010484 -2097077 -1921959
38483 -1921959 -249005 1550577 2241537 1942432 1559899 1650609 2085601 2414069 2221347
38474 2221347 1369180 283345 -92779 826671 2252497 2476981 916543 -778856 -557887
38465 -557887 1346909 2756733 2629800 2333983 3215273 4382653 4183608 2781167 1639653
38456 1639653 1099850 255334 -945051 -1283129 -279731 925107 1300418 1280657 1645687
38447 1645687 2057072 1660680 596038 13574 646589 1817554 1958677 173428 -2594066
38438 -2594066 -4225804 -3616769 -1815330 -480263 196855 1100556 2268099 2730923 2173388
38429 2173388 1372220 844089 365533 36771 389968 1005631 485137 -1444964 -3080220
38420 -3080220 -2908425 -1575327 -736991 -907171 -1503267 -2231992 -3193449 -3976406 -3740969
38411 -3740969 -2245844 -244654 1128630 1253805 647059 662195 1961213 3429376 3567294
38402 3567294 2760304 2686760 3430494 3159244 1311354 -53077 587215 1664980 1003309
38393 1003309 -730601 -1254288 -217098 856020 1441690 2337706 3330623 3012086 1275941
38384 1275941 -72559 187914 1213542 1659331 1306956 610429 -113690 -516327 -285877
38375 -285877 238037 447413 556841 1212766 1999128 1690159 211475 -1030171 -1159403
38366 -1159403 -887468 -1104276 -1601014 -1678596 -1027636 270223 1589526 1607431 -316052
38357 -316052 -2566303 -2767231 -1043477 150802 -149632 -111412 1455304 2852237 2393444
38348 2393444 1337991 1665219 2678449 2473966 1562407 2072630 3862321 4381426 2619952
38339 2619952 570529 108132 667264 961434 1081913 1638307 2221773 2018371 1065456
38330 1065456 -91285 -1222244 -2076227 -2035229 -1028377 -148207 -437143 -1512049 -2175082
38321 -2175082 -1924792 -1055396 274298 2056111 3709346 4374836 4078614 3797804 4118147
38312 4118147 4505461 4252885 3531799 2945677 2457450 1505247 133665 -734825 -502620
38303 -502620 117471 -141941 -1524295 -2912871 -3080819 -1905493 -324128 556066 292328
38294 292328 -533198 -739967 206260 1313420 1007285 -866827 -2660532 -2907228 -1983947
38285 -1983947 -1172022 -697799 329897 2259132 4143781 4845716 4286290 3374038 3005355
38276 3005355 3216647 3148424 1968357 -23882 -1561506 -1919862 -1702443 -1678861 -1606808
38267 -1606808 -1101833 -965091 -2215779 -4017645 -4169600 -2024043 455273 1182625 342260
38258 342260 -489827 -582496 -366860 -246091 -269335 -680991 -1714083 -2821452 -2939902 -1700450
38248 -1700450 116753 1406351 1647683 1027125 56375 -830688 -1453976 -1674349 -1153847
38239 -1153847 195031 1481679 1360059 -213908 -1453384 -761472 1233146 2596387
38231 2596387 2660596 2507136 2932631 3213492 2362281 643632 -842101 -1472042 -1372567
38222 -1372567 -856110 -232938 127369 174239 444453 1361844 2326563 2099688 270537
38213 270537 -2075596 -3427556 -3368784 -2772807 -2606485 -2879220 -2894347 -2247009 -1197610
38204 -1197610 -132361 842948 1590926 1759371 1369461 1137561 1511832 1710789 707671
38195 707671 -850089 -928143 1134085 3206260 2734778 -80587 -2642385 -3252750 -2797427
38186 -2797427 -2872148 -3355415 -2707410 -273357 2511809 3392011 1538699 -1540835 -3341604
38177 -3341604 -2686852 -689842 683298 767658 554471 1109340 2329649 3421857 3904724
38168 3904724 3676513 2676939 1245428 521398 1531658 3682749 4967021 4200807 2516799
38159 2516799 1921906 2709632 3288353 2658935 1895444 2379606 3459255 3249884 1541590
38150 1541590 355450 1150794 2845041 3521868 3002607 2474039 2370433 2165083 1901530
38141 1901530 2322019 3408522 4208021 4266108 3873582 2802759 522807 -1906459 -2165353
38132 -2165353 9109 1688271 556630 -1689273 -1796004 328879 1787963 1082598
38124 1082598 -201079 -252190 738104 1801712 2602868 2763778 1592066 -427277 -1404540
38115 -1404540 -507976 683842 541149 -232548 -139748 320472 -596478 -2836239 -4275101
38106 -4275101 -3627590 -1948923 -796086 -256880 510155 1733042 2758609 2812455 1582937
38097 1582937 -506108 -2315472 -2774688 -1954874 -950521 -494173 -203892 518887 1425273
38088 1425273 1771027 1376889 790647 542438 694944 1060897 1435079 1575931 1342920
38079 1342920 991645 1006082 1389047 1379795 299914 -1364333 -2200057 -1383718 431453
38070 431453 2046959 3121898 4080016 4895564 4838232 3649131 2296031 2065868 3161214
38061 3161214 4486793 4671700 3255978 1184617 129457 835891 2089787 1968394 304987
38052 304987 -875663 133213 2474574 3734266 2784336 855433 -78553 664213 2098107
38043 2098107 2815915 2455963 1909594 1978557 2177971 1555763 467195 311206 1225078
38034 1225078 1437233 -236623 -2454650 -3070930 -1850553 -185278 1054954 1885563 2080645
38025 2080645 1406187 700660 1054464 1976338 1971028 979066 615625 1736729 3289785
38016 3289785 3929138 3368362 1839297 -273426 -1835311 -1547685 263440 1826398 2364819
38007 2364819 2789521 3424792 2981155 889220 -1123944 -1259978 -47554 916760 1263428
37998 1263428 1346066 834457 -305645 -586902 1111547 3222415 3219580 1138373 -749722
37989 -749722 -1298595 -1185946 -525397 1505942 4231006 5279922 3912463 2429319 2979309
37980 2979309 4696331 5409611 4705274 3681275 2768889 1535775 123523 -606634 -239283
37971 -239283 807829 1798553 1941290 745191 -1107909 -1955270 -1153221 -143049 -384803
37962 -384803 -999429 -31895 2375085 3903188 3261471 1704659 823627 458734 -192943
37953 -192943 -708287 -65140 1566490 2999325 3685301 4015782 4110447 3512931 2271598
37944 2271598 1244578 897956 683468 170542 -180 881133 2156480 2350763 1059250
37935 1059250 -557562 -1252153 -931490 -231036 426184 899102 983383 613910 251416
37926 251416 575523 1729196 3088683 3805551 3488872 2421168 1199861 171985 -703886
37917 -703886 -1395899 -1523294 -919947 -206132 -181691 -752603 -1154255 -1166195 -1209896 -1237898
37907 -1237898 -774280 -409112 -1701681 -4550602 -6093431 -3978543 115543 2259089
37899 2259089 1277681 -144023 413010 2064393 2627473 1749084 516076 -680915 -2017738
37890 -2017738 -2687921 -1484688 1005891 2464102 1627154 -170221 -879206 -185553 733326
37881 733326 1123639 1210681 1145686 619817 -201913 -371901 548448 1562386 1455126 527713
37871 527713 102187 435664 323272 -917336 -2210391 -2147468 -722577 1186474 3199755
37862 3199755 5150354 6040470 4725654 1628592 -1344238 -2724357 -2561196 -1767572 -1291639
37853 -1291639 -1683901 -2422517 -1960685 263988 2175130 1127332 -2353936 -4854695 -4487686
37844 -4487686 -2916650 -2159344 -1692220 -377985 727002 -151742 -2391550 -3720703 -3483597
37835 -3483597 -2939576 -2657435 -1896064 -658154 -173960 -813168 -1335393 -883989 -168397
37826 -168397 33353 110577 553486 906599 648957 78905 -440264 -1100314 -1786839 -1702289
37816 -1702289 -736334 -151941 -859601 -1967460 -2217060 -1971268 -2390980 -3337394 -3679723
37807 -3679723 -3303953 -3148839 -3307866 -2805321 -1590978 -1104469 -2043214 -2921020 -2049801
37798 -2049801 -118951 545636 -960743 -2992479 -3464837 -2221008 -832854 -524941 -884775
37789 -884775 -641293 696221 2342115 3325026 3585881 3604617 3300364 2107697 258011
37780 258011 -866720 -276153 1206561 1766736 640958 -1270451 -2650860 -2910586 -2134564
37771 -2134564 -741742 510556 880929 475130 262982 859237 1742873 2132125 2122802
37762 2122802 2280858 2449736 1798201 67642 -1865505 -2801482 -2242824 -725109 470876
37753 470876 215761 -1221271 -2051966 -892835 1339814 2399507 1512685 60881 -687921
37744 -687921 -1152841 -2128584 -3195461 -3489940 -3155524 -2919716 -2907756 -2944342 -3378960 -4420427
37734 -4420427 -5202974 -4824946 -3903900 -3701059 -4018295 -3569234 -2376064 -2030033 -3208240
37725 -3208240 -4613363 -5060118 -5060806 -5358620 -5262472 -3791191 -1582372 -266663 -367535
37716 -367535 -964270 -1178259 -1029851 -975640 -1341197 -2023952 -2214117 -877658 1779699
37707 1779699 3883703 3882546 2569232 2073498 3116825 4408300 4635662 3796009 2413670
37698 2413670 736912 -753415 -1106884 -3529 1509096 2111822 1723988 1380617 1839878
37689 1839878 2750450 3092996 2230609 668807 -201590 519331 2049721 2582358 1307495
37680 1307495 -685393 -1723212 -1259509 -42129 819305 554516 -907842 -2692067 -3482472
37671 -3482472 -2839844 -1698564 -1094710 -879109 -340397 401035 588412 182111 -60717
37662 -60717 53279 -268828 -1507995 -2920046 -3393652 -2665054 -1326778 -152177 333680
37653 333680 244566 559331 2155852 4221187 4618006 2583104 68850 -716080 -211944
37644 -211944 -421919 -1537226 -1658522 23119 1817067 2079292 1457282 1457840 2164130 2746634
37634 2746634 3135459 3609710 3530293 2219245 651027 483554 1531889 1955774 1032182
37625 1032182 -88419 -712071 -1666407 -3159309 -3524028 -1643813 834466 1578658 874930
37616 874930 789151 1587545 1353957 -615407 -2325068 -1978585 -555614 -24325 -254026
37607 -254026 446489 2265065 3307005 2343876 544075 -329704 -301495 -650062 -1678886
37598 -1678886 -2368204 -2189985 -1941894 -2214169 -2055615 -241493 2542344 3973034 2765376
37589 2765376 190484 -1529751 -1660665 -1150621 -918510 -900862 -769311 -652937 -699487
37580 -699487 -548920 81465 597243 120400 -1042617 -1345220 40264 1763060 1701275
37571 1701275 -223614 -1599278 -356820 2624922 4465903 3478058 649529 -1884757
37563 -1884757 -2948438 -2716089 -1892479 -1195532 -1275635 -2377456 -3914453 -4763628 -4267431
37554 -4267431 -2887544 -1697412 -1214217 -952103 -307572 405412 361357 -380653 -677742
37545 -677742 125653 1144732 1109060 6481 -1148142 -1641548 -1308871 -50944 1724183
$$ [...]
##END NTUPLES=NMR SPECTRUM
##END=
