##TITLE=31Pdec_LR-659-C1-0
 CDCl3, 124 sc
 12.3.2019
##JCAMPDX= 6.0         $$ Bruker NMR JCAMP-DX V2.0
##DATA TYPE= NMR SPECTRUM
##DATA CLASS= NTUPLES
##ORIGIN= UXNMR, Bruker Analytische Messtechnik GmbH
##OWNER= root
$$ XWIN-NMR		Version 3.5
$$ Tue Mar 12 15:56:12 2019 Russian Standard Time (UT+4h)  she@DPX200
##.OBSERVE FREQUENCY= 81.013821
##.OBSERVE NUCLEUS= ^31P
##.ACQUISITION MODE= SIMULTANEOUS
##.ACQUISITION SCHEME= undefined
##.AVERAGES= 124
##.DIGITISER RES= 17
##SPECTROMETER/DATA SYSTEM= spect
##.PULSE SEQUENCE= zgpg30
##.SOLVENT NAME= CDCl3
##.SHIFT REFERENCE= (INTERNAL, CDCl3, 0, 182.463)
##AUDIT TRAIL= $$ (NUMBER, WHEN, WHO, WHERE, WHAT)
$$ ##TITLE= Audit trail, XWIN-NMR		Version 3.5
$$ ##JCAMPDX= 5.01
$$ ##ORIGIN= Bruker BioSpin GmbH
$$ ##OWNER= she
$$ F:/spectra/data/she/nmr/P31/1/pdata/1/auditp.txt
$$ ##AUDIT TRAIL=  $$ (NUMBER, WHEN, WHO, WHERE, WHAT)
(   1,<2019-03-12 15:54:48.29 +0400>,<she>,<DPX200>,
      <continue with go, POWCHK disabled, PULCHK disabled
       configuration hash MD5:
       00 E9 B6 7A A2 85 ED C7 34 08 36 98 17 FE 4E 26
       data hash MD5: 32K
       E8 C4 30 B6 F3 CF 3C 4D 1F EC FE 1A 1F 53 03 1F>)
(   2,<2019-03-12 15:54:56.00 +0400>,<she>,<DPX200>,
      <Start of raw data processing
       efp BC_mod = 2 LB = 1 FT_mod = 6 PKNL = 1 PHC0 = -1991.159 PHC1 = 524.999 SI = 64K 
       data hash MD5: 64K
       C1 30 ED B9 D3 F0 D9 B4 57 5F 82 70 62 DD 95 6C>)
(   3,<2019-03-12 15:55:20.71 +0400>,<she>,<DPX200>,
      <pk PHC0 = 20.42925 PHC1 = -33.8 
       data hash MD5: 64K
       9C 2B F3 E7 D3 4D 10 E7 41 7A 98 51 02 AD DA 2A>)
(   4,<2019-03-12 15:55:25.01 +0400>,<she>,<DPX200>,
      <abs ABSG = 5 
       data hash MD5: 64K
       3D 4F 1D 0F 4C 50 EB C2 7C FF 95 EE C6 73 D2 E3>)
$$ ##END=
$$ 
$$ hash MD5
$$ 84 04 6F E1 CB 10 9B 2C AB AB 30 56 02 6A 0E F2
##$RELAX= 
##$RELAX= 
##$RELAX= 
##$RELAX= 
##$RELAX= 
##$RELAX= 
##$RELAX= 
##$RELAX= 
$$ Bruker specific parameters
$$ --------------------------
##$DU= <F:/spectra>
##$EXPNO= 1
##$NAME= <P31>
##$PROCNO= 1
##$TYPE= <nmr>
##$USER= <she>
##$AMP= (0..31)
100 100 100 100 100 100 100 100 100 100 100 100 100 100 100 100 100 100 
100 100 100 100 100 100 100 100 100 100 100 100 100 100 
##$AQSEQ= 0
##$AQ_mod= 1
##$AUNM= <au_zg>
##$AUTOPOS= <>
##$BF1= 81.014009
##$BF2= 200.13
##$BF3= 200.13
##$BF4= 200.13
##$BF5= 200.13
##$BF6= 200.13
##$BF7= 200.13
##$BF8= 200.13
##$BYTORDA= 1
##$CFDGTYP= 0
##$CFRGTYP= 5
##$CHEMSTR= <none>
##$CNST= (0..31)
1 1 145 1 1 1 1 1 1 1 1 1 1 1 1 1 1 1 1 1 1 1 1 1 1 1 1 1 1 1 1 1 
##$CPDPRG= <waltz16>
##$CPDPRG1= <>
##$CPDPRG2= <waltz16>
##$CPDPRG3= <>
##$CPDPRG4= <mlev>
##$CPDPRG5= <mlev>
##$CPDPRG6= <mlev>
##$CPDPRG7= <mlev>
##$CPDPRG8= <mlev>
##$CPDPRGB= <>
##$CPDPRGT= <>
##$D= (0..31)
0 1 0 0 0 0 0 0 0 0 0 0.03 2e-05 3e-06 0 0 0 0 0 0 0 0 0 0 0 0 0 0 0 0 
0 0 
##$DATE= 1552391503
##$DBL= (0..7)
120 120 120 11 120 120 24 19 
##$DBP= (0..7)
150 150 150 150 150 150 150 150 
##$DBP07= 0
##$DBPNAM0= <>
##$DBPNAM1= <>
$$ [...]
##$SUBNAM3= <"">
##$SUBNAM4= <"">
##$SUBNAM5= <"">
##$SUBNAM6= <"">
##$SUBNAM7= <"">
##$SUBNAM8= <"">
##$SUBNAM9= <"">
##$SW= 369.568048894756
##$SWIBOX= (0..15)
0 1 3 0 0 0 0 0 0 0 0 0 0 0 0 0 
##$SW_h= 29940.119760479
##$TD= 32768
##$TD0= 1
##$TE= 0
##$TE2= 300
##$TE3= 300
##$TEG= 300
##$TL= (0..7)
0 120 53 12 22 120 120 120 
##$TP= (0..7)
150 150 150 150 150 150 150 150 
##$TP07= 0
##$TPNAME0= <>
##$TPNAME1= <>
##$TPNAME2= <>
##$TPNAME3= <>
##$TPNAME4= <>
##$TPNAME5= <>
##$TPNAME6= <>
##$TPNAME7= <>
##$TPOAL= (0..7)
0.5 0.5 0.5 0.5 0.5 0.5 0.5 0.5 
##$TPOFFS= (0..7)
0 0 0 0 0 0 0 0 
##$TUNHIN= 0
##$TUNHOUT= 0
##$TUNXOUT= 0
##$USERA1= <user>
##$USERA2= <user>
##$USERA3= <user>
##$USERA4= <user>
##$USERA5= <user>
##$V9= 5
##$VALIST= <valist>
##$VCLIST= <CCCCCCCCCCCCCCC>
##$VD= 0
##$VDLIST= <DDDDDDDDDDDDDDD>
##$VPLIST= <PPPPPPPPPPPPPPP>
##$VTLIST= <TTTTTTTTTTTTTTT>
##$WBST= 1024
##$WBSW= 4
##$XGAIN= (0..3)
0 0 0 0 
##$XL= 0
##$YL= 0
##$YMAX_a= 11734
##$YMIN_a= -59488
##$ZGOPTNS= <>
##$ZL1= 120
##$ZL2= 120
##$ZL3= 120
##$ZL4= 120
##$ABSF1= 182.463
##$ABSF2= -187.1042
##$ABSG= 5
##$ABSL= 3
##$ALPHA= 0
##$AQORDER= 0
##$ASSFAC= 0
##$ASSFACI= 0
##$ASSFACX= 0
##$ASSWID= 0
##$AUNMP= <proc_1d>
##$AZFE= 0.1
##$AZFW= 0.5
##$BCFW= 0
##$BC_mod= 2
##$BYTORDP= 0
##$COROFFS= 0
##$CY= -3
##$DATMOD= 1
##$DC= 0
##$DFILT= <>
##$DTYPP= 0
##$F1P= 0
##$F2P= 0
##$FCOR= 1
##$FTSIZE= 65536
##$FT_mod= 6
##$GAMMA= 0
##$GB= 0
##$INTBC= 1
##$INTSCL= 5.30512e-09
##$ISEN= 30
##$LB= 1
##$LEV0= 0
##$LPBIN= 0
##$MAXI= 10000
##$MC2= 0
##$MEAN= 0
##$ME_mod= 0
##$MI= 50
##$NCOEF= 0
##$NC_proc= -9
##$NLEV= 6
##$NOISF1= 182.463
##$NOISF2= 159.3651
##$NSP= 0
##$NTH_PI= 0
##$NZP= 0
##$OFFSET= 182.463
##$PC= 4
##$PHC0= -1970.73
##$PHC1= 491.199
##$PH_mod= 1
##$PKNL= yes
##$PPARMOD= 0
##$PSCAL= 0
##$PSIGN= 0
##$REVERSE= no
##$SF= 81.0140089999434
##$SI= 65536
##$SIGF1= 159.3651
##$SIGF2= -187.1042
##$SINO= 113.3802
##$SIOLD= 16384
##$SREGLST= <1H.CDCl3>
##$SSB= 0
##$STSI= 65536
##$STSR= 0
##$SW_p= 29940.119760479
##$SYMM= 0
##$S_DEV= 0
##$TDeff= 32768
##$TDoff= 0
##$TI= <>
##$TILT= no
##$TM1= 0
##$TM2= 0
##$TOPLEV= 0
##$USERP1= <user>
##$USERP2= <user>
##$USERP3= <user>
##$USERP4= <user>
##$USERP5= <user>
##$WDW= 1
##$XDIM= 65536
##$YMAX_p= 402032242
##$YMIN_p= -151370014
$$ End of Bruker specific parameters
$$ ---------------------------------
##NTUPLES= NMR SPECTRUM
##VAR_NAME=  FREQUENCY,     SPECTRUM/REAL,   SPECTRUM/IMAG
##SYMBOL=    X,             R,               I
##VAR_TYPE=  INDEPENDENT,   DEPENDENT,       DEPENDENT
##VAR_FORM=  AFFN,          ASDF,            ASDF
##VAR_DIM=   65536,         65536,           65536
##UNITS=     HZ,            ARBITRARY UNITS, ARBITRARY UNITS
##FACTOR=    0.456856943014862, 1,           1
##FIRST=     14782.0589164792, 0,            0
##LAST=      -15158.0608439998, 0,           0
##MIN=       -15158.0608439998, -151370014,  0
##MAX=       14782.0589164792, 402032242,    0
$$ Real data points
##PAGE= N=1
##DATA TABLE= (X++(R..R)), XYDATA
$$ [...]
##PAGE= N=2
##DATA TABLE= (X++(I..I)), XYDATA
8494 49314597 36997627 -12930792 -69223728 -81337255 -49376674 -26677415 -40658669
8487 -40658669 -50626599 -11729229 51486792 75020678 41892588 -1651756 -11336626
8480 -11336626 9894363 33898262 42771551 33874210 13673913 -3251037 -5238186 629129
8472 629129 -2439346 -14588678 -18022763 -3697326 17058851 29552108 28550158 13602278
8464 13602278 -10392745 -25823808 -14313318 19184272 49867315 62928770 63296154
8457 63296154 55652482 36872021 12545738 -2155247 -6166357 -15068166 -30414793 -29318091
8449 -29318091 1807755 43717375 69788478 75952134 69461621 48802576 16832757
8442 16832757 -3649224 5229455 25885094 26474133 7491857 45374 16763801 31130162
8434 31130162 15814409 -18084255 -35964270 -25134791 -9784326 -18606531 -47163524
8427 -47163524 -62178290 -43511478 -10153510 5645723 464975 -2915551 4151319 5210491
8419 5210491 -5587740 -5497656 20697922 49743589 50627133 30697529 23016448 36663896
8411 36663896 48475172 41486094 23951831 7613909 -8096737 -23795604 -32676937
8404 -32676937 -32899778 -31121062 -28385020 -19013957 -8439087 -13539994 -36748957 -57239165
8396 -57239165 -59361195 -54717291 -61691655 -74507968 -69626425 -39070127 -3568778 9230104
8388 9230104 -6680355 -29832212 -32767974 -11214017 10417757 8719260 -7837237 -10405962
8380 -10405962 10063573 33139464 43445271 52412540 72102818 88204869 82178921
8373 82178921 66900429 71773589 95735003 103660854 75063116 31360603 3851784
8366 3851784 -3262553 -2057338 6930284 27669874 45316957 38078348 11816955 -2836233
8358 -2836233 6207701 15530890 3957288 -14302552 -12980278 5653596 17300160 14556703
8350 14556703 13871225 24159061 32895608 29740565 23326417 24042405 26037442 18021868
8342 18021868 -427117 -24584127 -55076942 -89419031 -111333834 -103070348 -66779764
8335 -66779764 -25377955 -3804564 -11761100 -37090114 -52536971 -40172626 -15338887
8328 -15338887 -14054680 -48549102 -88753501 -98149485 -73547484 -37125159 -6228461
8321 -6228461 10612429 4073305 -23785871 -46653547 -39316883 -12614187 -666840 -16438529
8313 -16438529 -41590319 -56270820 -55194307 -37424467 -6479033 19618841 24531809
8306 24531809 20602564 33024743 56787336 60327152 35683940 10712746 2469654 -5345638
8298 -5345638 -23087147 -29897719 -11450268 9071461 6418543 -7384543 -10485314 -13552196
8290 -13552196 -37630999 -67252120 -66378438 -33784851 -4730722 990914 -2464953 -3436147
8282 -3436147 -14548748 -47472707 -89816074 -118079245 -118149602 -89225478 -44693632 -12139362
8274 -12139362 -14115533 -43083641 -68658630 -70704783 -51310297 -17893311 23667212
8267 23667212 58039777 66626551 52657376 41157305 45814961 52445959 42615153 17415060
8259 17415060 -9775435 -28387514 -30613047 -11991435 17918365 37548433 34422718
8252 34422718 15215710 -7271018 -23593685 -24253976 -7435287 6002619 -10505334
8245 -10505334 -48168849 -64174110 -38306537 -2645058 5110601 -7045563 -7758365 5625691
8237 5625691 12056422 10531305 19881736 37357033 35137148 4748512 -27807540 -42228512
8229 -42228512 -49349782 -60878524 -61092073 -31821295 13097301 42913746 47962203 40276789
8221 40276789 26400840 5311558 -11008513 -3390542 22494873 34005129 13227937
8214 13227937 -17245179 -24251833 -5640713 13982127 18122731 10618081 89309 -7000652
8206 -7000652 247567 28410158 59911335 63042807 32202089 962882 2114959 29337255
8198 29337255 53104553 60089645 57310729 48985604 34528464 25468758 38441897 67936163
8190 67936163 87719782 84866298 72941667 65580813 57598407 42077376 27021740 21763919
8182 21763919 22170263 22137228 24814128 28769493 19026807 -10148151 -37086782 -38385041
8174 -38385041 -22969563 -18225219 -29032475 -35291018 -28204950 -23015385 -30367383 -37999061
8166 -37999061 -31664088 -16662940 -5199701 5510256 27732523 60873010 86681244
8159 86681244 87463701 63858402 34308334 18666710 21500212 31385859 36263931 34525597
8151 34525597 28671151 17586539 4365624 2631238 19293243 35900523 26590468 -4789421
8143 -4789421 -25996576 -20579354 -10055855 -19401177 -37818554 -33085470 3500499 45257599
8135 45257599 61876710 49268596 27136083 17359693 26440509 41995762 45047328 29573592
8127 29573592 8241999 -4687264 -10903426 -21303825 -36316820 -43760494 -36705504 -24140393
8119 -24140393 -20070324 -27166755 -34889166 -32125511 -20126934 -12293161 -18819227 -31918121
8111 -31918121 -32814381 -16757067 -2974885 -11313187 -34762898 -46747580 -33807941 -9073982
8103 -9073982 7848213 12441827 12356480 13652775 17888341 25881031 35212234 37129536
8095 37129536 24477267 2967855 -11569482 -9163684 3889853 11542607 3524714 -15088670
8087 -15088670 -28155946 -23303673 -4573661 10957823 12163337 8487560 20557401 53968749
8079 53968749 87297298 92940511 69615102 46366751 49234224 69389341 73292780 43450027
8071 43450027 -973403 -27472456 -25091204 -9602966 -1251859 -6489450 -17660839 -21455589
8063 -21455589 -9889423 8792799 13499289 -5106566 -26772992 -22446548 7718050
8056 7718050 33429034 33812710 19293791 7403810 -1586110 -10154669 -5748361 17662873
8048 17662873 34081863 12317109 -35764376 -65278393 -59903759 -51401368 -65643262
8041 -65643262 -79797827 -56564756 323998 52640752 77873575 85510172 88652829
8034 88652829 87127300 82049064 84002677 97332978 110749757 111490911 99032892 80335548
8026 80335548 61226638 46088314 36586272 27435488 12191592 -4924292 -12541818 -8209189
8018 -8209189 901360 14547731 41411995 78945258 106287267 107330480 89641503 70493752
8010 70493752 54655163 37888132 23680241 21589425 31209464 39212091 33272916 13426130
8002 13426130 -9007803 -20690251 -18591916 -15125456 -23712577 -37283414 -33301126 -6365012
7994 -6365012 18568292 17893851 1979338 -1060196 13529213 22000615 6772592 -22140288
7986 -22140288 -44289465 -52861726 -54445424 -53970084 -48161290 -31906830 -6864662 18029412
7978 18029412 35627132 47061134 53226173 44138041 11372809 -28314844 -42110719
7971 -42110719 -22460980 1527985 7468441 10734186 29614830 43592783 23145672
7964 23145672 -12548270 -12893479 26622522 47649179 6857756 -62238923 -89008570
7957 -89008570 -47141906 24792051 71254874 70264931 42948486 24946748 26942438 24646075
7949 24646075 -4202581 -42601908 -55864973 -43541915 -37491061 -46965999 -43861868 -14072153
7941 -14072153 15961007 25105131 32475520 57063996 76054824 60853744 28018179
7934 28018179 11903550 6176892 -20996079 -64341621 -82327475 -60734269 -31843914
7927 -31843914 -23727733 -28501169 -30123178 -28665463 -24711401 -10980394 6455675 6535546
7919 6535546 -12398112 -21959787 -3095279 27002229 43270739 45813198 46617493 44176687
7911 44176687 33586943 26770241 38877224 61725616 70164669 51881334 17782941
7904 17782941 -13053209 -27971848 -25191321 -13504404 -4059305 3112078 17822899 40460846
7896 40460846 54273330 45136733 20884606 2720820 3328388 18599870 33680425 33414315
7888 33414315 16202436 1147485 10126900 38410603 55869803 42970711 12115543
7881 12115543 -13008787 -24193442 -26298995 -23339971 -18313959 -14875473 -9941619 2730418
7873 2730418 14575114 5434586 -24883494 -47923765 -43931584 -27839098 -19827310 -11322250
7865 -11322250 13899088 42239962 46133432 28363414 17920162 23989120 25727467 11481491
7857 11481491 -1752410 1040341 6474800 -7295631 -37911322 -60410502 -56581433 -34690698
7849 -34690698 -20295457 -27821436 -42416722 -38432151 -17078842 -7869563 -22912699 -32951983
7841 -32951983 -11122294 20545040 21180169 -6495218 -22695395 -12778915 -90163 3781171
7833 3781171 14382116 29147786 15420397 -31704637 -62207885 -36724294 12931299
7826 12931299 27478370 507508 -25764511 -28620625 -25347755 -31618199 -40572739 -47111810
7818 -47111810 -58767907 -73851970 -75448342 -56253933 -29106968 -7644280 3725801
7811 3725801 -1864917 -30893025 -66824018 -73628038 -36090357 18723496 51988297 52616738
7803 52616738 37743174 27910196 32004395 44384309 46766716 24548744 -9157579 -18769854
7795 -18769854 11978021 54689310 67074704 40810829 4785302 -11747359 -3544483
7788 -3544483 17425190 34752360 33061284 7065256 -29149948 -51490351 -48328925 -26964248
7780 -26964248 1843413 34743019 68145625 90547391 90112080 65624922 26959449
7773 26959449 -9296763 -22914360 87312 51025545 97963500 112294276 94832396
7766 94832396 68447567 48940772 34699022 23079583 19600134 23213397 17845294 -5627118
7758 -5627118 -27834084 -21234907 9521487 28755694 16881703 -4454438 -6905012 4567169
7750 4567169 7838874 5926545 23171121 60633777 85391410 73610766 39607263 8347407
7742 8347407 -18278972 -47455295 -66202145 -54533820 -21710798 -2617951 -14989720
7735 -14989720 -40057698 -50267832 -39742852 -21475093 -7842510 -589445 8681909
7728 8681909 30720060 62746805 82305744 70840857 42480869 31439016 48318115
7721 48318115 68627013 69967014 58300145 46933892 33139652 13853157 4751208
7714 4751208 20391509 48637200 67038193 72234874 69532995 47287917 -5837281 -64316404
7706 -64316404 -82857078 -55013101 -23124126 -20845119 -35423921 -40098324 -34854006 -34028970
7698 -34028970 -35757725 -28772468 -16586469 -12317077 -16647059 -18530124 -11777764 2686397
7690 2686397 22865194 40732757 41267682 21475756 776826 -3276177 701634 -4353978
7682 -4353978 -13119407 -7798209 8377533 13417376 607022 -14891915 -24671371 -36458233
7674 -36458233 -49576559 -47475063 -26903972 -11765056 -20512711 -36296728 -28789862 4632564
7666 4632564 37849261 49706613 40780209 18460927 -16358612 -60495589 -96620043
7659 -96620043 -101420859 -68109750 -17562542 17981717 24999585 18916913 20578259 28892845
7651 28892845 26838191 10396084 -3730572 -1593711 11172334 22039157 28566397 34454317
7643 34454317 39234943 41597552 44762363 49146301 47266683 35629709 23945164 20907036
7635 20907036 17703351 350526 -24774923 -33797714 -15978011 11951559 26997145
7628 26997145 24416737 14396765 3902033 -7537288 -17981605 -19775091 -7625582
7621 -7625582 16394868 46993784 78152096 99105735 96173762 66722470 27087827
7614 27087827 -2836305 -21068760 -39262810 -58227029 -62873188 -46543712 -24825717
7607 -24825717 -14465104 -11994924 -7428353 -6638948 -20593283 -40329188 -44783129 -30899417
7599 -30899417 -15446949 -9006785 -9853986 -21174136 -46964902 -68656414 -57541508 -20732785
7591 -20732785 -2810233 -24166948 -48802145 -39280477 -15444027 -22099195 -56689265
7584 -56689265 -71223136 -41239631 6710075 40085290 56727202 65219305 60566940
7577 60566940 38651055 13841841 2488910 1510712 -1001255 -4328090 829139 13969429
7569 13969429 24012595 23731012 15848634 8302726 10583625 29774998 61508784 87549408
7561 87549408 90414005 70289499 42834552 21964550 10253642 5677612 10781972 29192937
7553 29192937 53257284 62331445 42649020 9560768 -1234953 26888966 68303659
7546 68303659 82614944 60407446 27830868 7891740 -5127513 -27157958 -55860435
7539 -55860435 -72852776 -66711399 -42300249 -10587376 20353160 43434329 49813786
7532 49813786 33681334 -116561 -35005637 -51999237 -43503865 -19225097 2311374
7525 2311374 8378538 -336777 -12120135 -11805392 9273926 45123114 77803153 91444446
7517 91444446 82319337 55353004 18442781 -15361448 -29346788 -17321165 7884827
7510 7884827 28934180 42374079 53161122 57208265 44182003 16761947 -6972811
7503 -6972811 -13280412 -4939829 7563917 17235708 21870338 23916726 30445769 44428577
7495 44428577 55865588 51278006 32214905 14381305 8698031 13897706 26402349 43407925
7487 43407925 55143873 49714697 31009793 19313982 28476320 52377399 76897926
7480 76897926 93693946 99323270 93861837 84738662 79732679 73089715 52375195 21585407
7472 21585407 150085 -5681790 -10236866 -18687039 -12621797 17975967 47102675 39734233
7464 39734233 -3111186 -46038211 -59849232 -43762613 -13607744 13947864 27683026
7457 27683026 27833304 26060728 30269741 34595628 34250675 40063337 61234955 81381920
7449 81381920 74151299 42116710 17828255 20647590 32645523 28526879 13542810 14798408
7441 14798408 41762833 72570697 81884395 70020052 56563086 51776736 46473736 31943026
7433 31943026 17697257 18797642 31727612 36885010 25440077 11333477 13252021 34321655
7425 34321655 62013745 78407145 69447789 36540683 1732406 -11701373 -6615776
7418 -6615776 -5162956 -12862216 -11191180 5904708 13414276 -7695870 -34456352 -28125775
7410 -28125775 13951236 56438948 70397684 57888637 34976508 11567520 -8035536
7403 -8035536 -19320780 -18703157 -6286778 11361256 20195026 10022359 -9173825 -15558651
7395 -15558651 -5673891 1575701 -505344 7850499 35741762 56016627 43253403 15750048
7387 15750048 7849595 17890024 19511178 10943620 12638751 24112395 26657156 26767458
7379 26767458 50509730 88464395 92763586 45479440 -10031035 -27010600 -10403939
7372 -10403939 8251469 19383599 31275853 41324975 40105130 29956553 18058692
7365 18058692 3984471 -9285419 -7993069 11136816 27431904 21436584 -146137
7358 -146137 -19537788 -32101071 -39852958 -37707292 -24418598 -12825212 -12257166 -15326807
7350 -15326807 -17500193 -30682825 -57131098 -69221660 -41824619 8640364 44403306
7343 44403306 55335572 60713999 70305596 73686141 67216477 63655852 69320549 72757635
7335 72757635 63127662 44807502 28052334 16041095 5111398 -9053129 -25938837
7328 -25938837 -36759108 -31406477 -13886683 -2522118 -8088723 -21812335 -31950225
7321 -31950225 -38071790 -38603278 -21278150 17173380 55423168 69639746 59993653 39456645
7313 39456645 11639569 -19552898 -33481505 -12931218 27387318 56569656 64453560
7306 64453560 60680816 47649655 21583100 -7617322 -26977906 -45422670 -77764801
7299 -77764801 -107779861 -101281662 -58242049 -18903020 -10856032 -19520749 -19953746 -9923592
7291 -9923592 716500 9722139 18070809 23144778 25136601 25656551 18258475 -974904
7283 -974904 -14985395 -2833693 25077427 38206703 33686484 38097689 55569717 54867272
7275 54867272 24799653 2500424 19437680 52095227 58135263 35865020 14756475
7268 14756475 7757135 7390272 13433331 29301559 40497801 29625185 7717380 1724994
7260 1724994 15430399 29983617 37748110 45915182 49383691 32771876 4238665 -2662639
7252 -2662639 27583979 69105376 85893644 69193279 34626903 -857160 -27025117
7245 -27025117 -37690151 -32854855 -18933199 -1480447 16764135 29479065 28689624 16997631
7237 16997631 8262924 11084040 19747707 25935601 30243749 35160599 34389411 19687169
7229 19687169 -3262148 -15241945 -4306713 17679369 25937262 11913101 -4847046
7222 -4847046 -476946 22554056 39831933 38102701 28304342 21756319 11397799 -10830501
7214 -10830501 -32055823 -31682773 -9615239 15247562 30618146 38663551 40066329 27707621
7206 27707621 839693 -26781165 -39619478 -35614049 -25882290 -23092406 -30194446 -37292320
7198 -37292320 -31647536 -13713023 1187114 151536 -15509107 -38863720 -64981060
7191 -64981060 -81795816 -69762263 -28813547 5880458 -1213380 -39313330 -62822864
7184 -62822864 -49438170 -22663811 -11591569 -13270539 -8580413 4152533 10958391 7634434
7176 7634434 4452233 7535091 10103413 4672764 -5582593 -11756857 -10122483 -3599969
7168 -3599969 5020986 15094138 21613763 14221597 -8017211 -24510384 -10539529 29604754
7160 29604754 61602980 61416940 42529452 31680993 32658557 31724324 26318338 25230404
7152 25230404 26655184 19736384 5825651 -4003575 -11220114 -26180147 -42280475 -39852582
7144 -39852582 -19530349 -4039785 1356091 20686995 63878861 98975709 91985798
7137 91985798 55648581 32023975 37361120 49106547 41999784 14275435 -20394591
7130 -20394591 -46499593 -49662672 -22604843 25231384 71754248 98719812 101118773
7123 101118773 84984155 63390654 50186905 48651069 48382513 39075164 22376044 4815192
7115 4815192 -11793015 -23860417 -20933141 -1979060 11737948 -63513 -22751320
7108 -22751320 -17317332 29412379 81802223 92689575 53763810 35409 -28680325
7101 -28680325 -21945025 1137475 16042003 14080727 2428914 -12392937 -34175395
7094 -34175395 -65809598 -94637985 -100306640 -78008334 -43863588 -14490455 7411386
7087 7411386 20546036 11592468 -28013783 -76144017 -93255059 -70410783 -45758181
7080 -45758181 -55803270 -83566604 -81529606 -42410589 -13572980 -28157902 -52762310
7073 -52762310 -32125336 32866100 86961749 94336630 75079447 63389379 62723881 57811864
7065 57811864 46158693 37396061 35854701 39934862 47555136 49873521 32163374 -5974245
7057 -5974245 -42934682 -60541558 -65711607 -73453439 -80134543 -70256887 -42623231 -14841510
7049 -14841510 -5354764 -19545191 -46524113 -63135346 -52567634 -26282577 -13104401
7042 -13104401 -19434466 -20778024 -3643692 11340278 8853884 12594019 46160333 82855808
7034 82855808 77399919 36165623 9572832 15378630 16283878 -15227451 -52182180 -54714646
7026 -54714646 -24677781 6529571 23625572 36400414 54501755 73180653 80673164
7019 80673164 69944063 46480716 26773160 22715165 29463455 37050231 45990946 57683011
7011 57683011 62478042 59947769 75452619 121057408 151114425 105213356 -1789350
7004 -1789350 -83462679 -89080196 -56961340 -39731814 -30784401 -3208532 25743067 22312986
6996 22312986 -1389208 -6332790 9218438 13397164 -2700775 -18176091 -24843807 -33065316
6988 -33065316 -39630230 -31826762 -21237708 -32322386 -57645799 -65120355 -50634973 -41328963
6980 -41328963 -43229589 -30731759 2340564 26490956 27719893 32381908 58462415 79963775
6972 79963775 67351503 32911437 8258103 2654002 9748702 29771111 55209130
6965 55209130 56872725 18295783 -29473327 -38727017 -3366513 38390643 51710298
6958 51710298 33557944 2495221 -18003002 -14103842 992342 -5305192 -40471286
6951 -40471286 -65013917 -41073980 10757906 35042250 13367490 -21913894 -41678952
6944 -41678952 -49107655 -50298439 -35438935 -5762588 12824156 5519612 -5289094 7005044
6936 7005044 31942320 38335061 20355285 2439436 2720079 13886643 21518783 23255116
6928 23255116 24792069 29545459 37974213 48981639 57863485 59365324 55830223 55599037
6920 55599037 59135117 53315780 27105144 -10061236 -34701558 -36122439 -28817984 -32003653
6912 -32003653 -42959381 -41659624 -21172713 -647845 -1546311 -19913011 -31766440 -21539009
6904 -21539009 3669954 25428808 31154695 21493356 8096433 2970829 3936871 -5527583
6896 -5527583 -32756235 -56031876 -42553023 11323102 70641755 98081443 88729651
6889 88729651 62790009 37002594 16688766 7430206 15499153 34532904 46892032
6882 46892032 45347212 42497483 49555355 55427851 41521907 13162097 -2433342 5811595
6874 5811595 14915208 1167420 -22702622 -24480039 -565702 17306912 7131735 -14763841
6866 -14763841 -22036006 -16349487 -18681403 -33638287 -42812449 -31589311 -6588982 15302500
6858 15302500 24240515 21643155 14755804 9453604 6080754 3629658 6626057 18954884
6850 18954884 30235777 23653854 3772959 -1849892 18137303 37441208 30352134 13094304
6842 13094304 17377328 35025789 26434363 -16246127 -52127986 -48206920 -21049198 -6078218
6834 -6078218 -11382830 -20861798 -23006058 -17385704 -7683234 -4674139 -22050680 -54105395
6826 -54105395 -71588225 -55187314 -20277660 5406249 13700746 10863318 -1204489
6819 -1204489 -17494116 -19393035 2444797 24566690 16602912 -14240164 -29845022 -10713254
6811 -10713254 24743574 50418845 58249152 50409800 29423621 5971602 -800865 17059215
6803 17059215 45510697 64619147 67800469 60515722 48281346 32571537 15085310
6796 15085310 1715933 543342 12588397 25650305 26659083 21603757 28786866 47455319
6788 47455319 53867036 41431846 40683339 74730394 115301421 117048675 83039372 57911039
6780 57911039 61519850 70870422 69769956 71934219 81989568 75677837 41842442 10063119
6772 10063119 9756320 28621030 38024850 35432507 34002081 32442039 25899812 27668909
6764 27668909 46273504 55540902 24023029 -33455586 -69182756 -64569291 -44770459
6757 -44770459 -31436644 -16650042 8118492 29313922 32055213 19950111 1556275
6750 1556275 -21406356 -40085479 -35423285 -6824243 14002930 -1391775 -39533613
6743 -39533613 -60500350 -44951139 -9530120 18431670 24706952 9843733 -15838620
6736 -15838620 -36444955 -41653541 -36607081 -32653010 -28911366 -14216922 11185312 29245921
6728 29245921 26915344 15470981 16509842 34501415 55043471 67328018 73991087 76860710
6720 76860710 69272504 52525047 46547605 67081133 98355396 107788274 88642308 69614827
6712 69614827 76333498 100359951 116633066 117111475 112464948 109727097 104480310 92288849
6704 92288849 74979217 55726356 36722104 21463896 13834697 16567515 32231937
6697 32231937 58247910 78750428 75276178 53320536 42029352 53810889 61581885
6690 61581885 37704982 509238 -8179411 15240688 31557812 18482115 -200337
6683 -200337 2043152 14001240 12542362 6199816 24465696 72898258 122675532 142562276
6675 142562276 125237594 85667699 48588612 34724665 44147717 52699715 36627823
6668 36627823 1577296 -22269767 -14014880 17333490 45617787 52626126 39935216
6661 39935216 23004659 15670158 17579029 17985511 13201629 13347391 25370123 36743283
6653 36743283 28354012 1702726 -19477344 -17684976 -1623054 7735976 3739020 -908921
6645 -908921 7192591 26292791 44751913 57124593 68025457 78709281 77823965 55135313
6637 55135313 22361844 7251763 20859403 40962283 38519619 14027142 -5879334
6630 -5879334 -5485428 3038521 4952574 8655883 29755805 56930288 55968334 14743112
6622 14743112 -33454667 -47337619 -28460445 -14797292 -27062818 -45448712 -45618087
6615 -45618087 -33160569 -26032135 -23074030 -14224357 -9105767 -26507311 -58681903 -73746932
6607 -73746932 -57066946 -27153852 -6268625 2301322 2803023 -2639000 -3386723 15893812
6599 15893812 48007765 61782996 42579852 14078426 4572343 12570704 22807002
6592 22807002 32815712 40659542 29577194 -4522472 -28996457 -14135482 15542353
6585 15542353 10351464 -28321599 -44400869 -7257808 45575999 64583613 53762158
6578 53762158 52635363 73842751 89180555 72680599 34625801 8053564 11238314
6571 11238314 27873938 24562766 -10829604 -52660730 -65918326 -45216137 -14213904
6564 -14213904 7101922 17344657 20144897 17199834 16017996 23839789 31519965 24789108
6556 24789108 13067250 20282795 41432111 40074797 3667025 -30151249 -25921575 -1753377
6548 -1753377 1484274 -19162144 -33539616 -29097177 -18597007 -4277630 24534744 54363375
6540 54363375 48292755 -242416 -46034290 -46595189 -14867537 7344787 10893489 22834421
6532 22834421 53932817 75945371 62964487 32233127 22760883 43126299 63044552
6525 63044552 57784121 40004158 37232495 54330160 75209392 90220509 99145300 91834573
6517 91834573 53339873 -5438005 -46604901 -47490652 -24912343 -4305744 14634571
6510 14634571 42115244 66606426 66551255 45598992 30141536 33579385 44648352 49834581
6502 49834581 46253292 32640724 9656222 -7831687 277701 31856150 61122053
6495 61122053 69720077 62902751 51073628 34597641 14482594 -362945 -7203586 -15616873
6487 -15616873 -29464115 -37255085 -30866818 -19368603 -12704703 -6000296 6415502 14674105
6479 14674105 6616288 -12868143 -30023448 -39555331 -40374830 -27601145 -6733335 -1849225
6471 -1849225 -25475124 -51018136 -45003980 -21308059 -27503073 -72459771 -105474492 -85750949
6463 -85750949 -40001552 -21803886 -36885810 -45367093 -27580815 -8243509 -11061199
6456 -11061199 -23692937 -22928272 -10077919 -2193325 -3975439 -7396374 -9422362 -13123004
6448 -13123004 -17682453 -21809358 -30827139 -46587029 -57655334 -55077171 -49973731 -56260893
6440 -56260893 -63175457 -49898677 -24233418 -16317299 -29203785 -28601500 3339302 34393008
6432 34393008 25995934 -13084514 -44429946 -52879825 -50836354 -43018065 -21962825 5298134
6424 5298134 19127229 18205845 20633920 31426916 35980616 29421183 24324950 23214831
6416 23214831 12494060 -6648584 -11130509 5268800 14005565 -7162069 -38325141
6409 -38325141 -44797681 -21514829 11748826 41940863 65446175 73762082 62594375
6402 62594375 46770229 43112591 45072426 34455191 10719144 -11270986 -24506825
6395 -24506825 -30699383 -27167648 -15102031 -11742789 -29018987 -46994843 -35606776 1847586
6387 1847586 34800321 50868140 63693834 76068624 70994045 47423821 31147541
6380 31147541 35881119 42581324 33708901 21026233 19807671 19767450 5296187 -13804340
6372 -13804340 -15965011 831628 22771153 43177171 60165913 61920895 38208784
6365 38208784 2220450 -19511034 -17375500 -3303275 10972320 24370384 38192693
6358 38192693 52286502 67133126 77238339 67650370 32133451 -9246449 -26738515
6351 -26738515 -13253453 13880387 39138818 58978790 67931207 56169217 27458672
6344 27458672 3491883 1446051 16922587 34417886 44466810 44098313 29703346 -187421
6336 -187421 -35952470 -56563368 -43241191 1220143 46804548 60093976 40544742
6329 40544742 23910246 39956012 75808537 93776152 76946445 41696167 12684755
6322 12684755 4086885 19679759 48975230 64152143 43497610 864488 -28377316
6315 -28377316 -32450687 -31371740 -37355421 -35777647 -17090586 487859 454077 -2016740
6307 -2016740 15363955 42377797 48266635 26853464 5040874 5847259 21903314 29565785
6299 29565785 17537082 -1745359 -4167028 20206374 50622155 54446230 27895012
6292 27895012 3839861 8351433 25717546 24208323 2032708 -16237559 -19759590 -20771094
6284 -20771094 -26374886 -27634276 -20167058 -12407631 -7512366 2876739 20587572 34984727
6276 34984727 40735362 43008436 39425506 17911094 -18124562 -43452867 -43230002 -32900226
6268 -32900226 -30775353 -29069418 -12159429 11341971 19371666 11682552 10154998 25406759
6260 25406759 44406789 53383298 54662945 56524763 61912983 72153319 87593299 98504155
6252 98504155 89162511 59868857 33200148 27013598 30282029 19780661 -4560677 -18252427
6244 -18252427 -7989485 8713127 10229377 3524375 11005626 29541948 27461776 -8304508
6236 -8304508 -43815725 -37681915 3538513 35432844 36777900 30532912 38159932 44928830
6228 44928830 31084642 12738954 20240487 46827799 52799048 23413995 -7133991
6221 -7133991 -2138086 29009247 46640164 32565739 6400583 -6143321 -3714120 -4176750
6213 -4176750 -21092787 -52870223 -88384094 -113750986 -115708556 -90104527 -52613772
6206 -52613772 -32046779 -42032378 -62844772 -62936133 -37229857 -10773397 -3708290 -9322981
6198 -9322981 -12599958 -12386102 -12961477 -9847368 -1047018 652826 -13363801 -26705073
6190 -26705073 -19101766 -1038839 -1147239 -22036081 -37082356 -33189447 -26871521 -30180745
6182 -30180745 -31185755 -22825401 -22106130 -39131935 -52122422 -40052216 -19631556 -18058891
6174 -18058891 -23992174 -3055915 43034306 71847622 60640040 36364737 31645282
6167 31645282 41086874 42185638 35988387 39855637 52566859 54040151 37457774 19872580
6159 19872580 18205119 30502611 44497125 52293659 52444821 46679174 38151645 27195495
6151 27195495 9798637 -12086644 -22973888 -10628699 11031476 14554886 -1507033
6144 -1507033 -7133565 14003856 36495918 31014009 10707872 9482256 25897055 26511711
6136 26511711 4062048 -9000078 4396718 18839618 16339571 23148647 61079806
6129 61079806 95363435 79040841 28606072 1403468 6927109 -485373 -36703503
6122 -36703503 -57559790 -34502934 -3319587 -1931085 -7756041 16734668 53299627
6115 53299627 57024707 32572449 24227228 39974957 41898326 14635700 -8663202 -1838087
6107 -1838087 16505969 19592953 11929258 11454960 19950929 31327939 46507375 61079443
6099 61079443 58212760 32943569 7406961 4470648 19382521 31942998 33675022 29573148
6091 29573148 25342887 24885899 28765369 26510251 5048751 -27304032 -43438472 -33415554
6083 -33415554 -17118023 -9803166 92236 21636082 36079140 26152895 9348908 13062330
6075 13062330 33166252 46987618 52275334 59928257 60076493 33892521 -4548765 -16346410
6067 -16346410 8608566 39648647 52698934 57105485 65835304 70662898 63226900 55748316
6059 55748316 62336210 77045323 85946342 87071993 85589240 80850741 68680744 48126835
6051 48126835 21901936 -538985 -3875689 12266238 19638994 -4982490 -36658001
6044 -36658001 -29260967 11497131 27031962 -6823756 -40616784 -30504979 -9354730
6037 -9354730 -29420608 -70256733 -67776954 -18808819 11160790 -12162117 -47488357
6030 -47488357 -51100562 -38100650 -40084491 -47524585 -35004509 -13187759 -12430061 -31074915
6022 -31074915 -39354697 -27106859 -13166530 -10007825 -10239705 -9682010 -15156935 -23266276
6014 -23266276 -16562721 8732302 30431983 27168962 3804121 -18563995 -25387393 -14326388
6006 -14326388 8062663 26607641 27833964 19330393 24512694 47152232 58758500 39488508
5998 39488508 14607253 21892358 51603546 53422495 6540926 -50823559 -74912540
5991 -74912540 -68962251 -61172292 -56666168 -42126234 -21689929 -13184416 -14488542 -7587860
5983 -7587860 3368545 -7095112 -37796915 -47450483 -9687128 43434877 59181646
5976 59181646 31062279 2044820 7554367 39662264 68527658 78484049 75361822 71021177
5968 71021177 70355978 69888794 63808164 50761815 35065615 22608258 17986857 22892655
5960 22892655 31242411 29208132 10424473 -10985221 -16237591 -9485512 -11313329 -23193017
5952 -23193017 -21913042 2694965 29852369 41515952 47765069 58406069 56446295 30183353
5944 30183353 9115346 28498774 70684061 84018206 56911449 31051616 36130329
5937 36130329 51675643 46767984 23200935 1595271 -7960481 -3963953 14463224 36759522
5929 36759522 41805709 24161996 1914567 -11384274 -21073782 -28344431 -20010092 3091305
5921 3091305 14048388 -3580893 -30450786 -43204303 -47885726 -58050575 -62699087 -44603338
5913 -44603338 -12677378 12125632 27414070 38726917 35801363 10449234 -17249711
5906 -17249711 -23848232 -19922022 -27154531 -31848580 -4449497 41051337 54752391 22876540
5898 22876540 -11512156 -11709022 7252145 12180575 -3070633 -24414199 -41263868 -45060710
5890 -45060710 -28374293 -2789274 4060996 -14881290 -32969174 -27403525 -8681098
5883 -8681098 1450587 -743204 -9156151 -23358724 -39277400 -44733963 -39743104 -40125623
5875 -40125623 -47339563 -41338780 -19983974 -12797224 -29900779 -31928126 11004514 59538503
5867 59538503 53212674 827227 -30771488 -12909293 14006191 12649583 459081
5860 459081 9268404 34927459 54715693 65924246 78830348 89460726 83726242 58850222
5852 58850222 25969183 1736534 4179779 37840489 73581341 67687509 17986179
5845 17986179 -22968443 -13343458 21965103 30795144 11008492 9235304 47830993 93501523
5837 93501523 107023659 90596474 69945301 55576791 42363476 30052825 22959017
5830 22959017 18924901 15634424 19841604 34676926 45887909 38540088 22056617 19512167
5822 19512167 34018453 45277536 40059534 24843668 3904362 -30646465 -73458174
5815 -73458174 -92843741 -66682627 -19745242 -354574 -23386816 -58460159 -73623092
5808 -73623092 -67458556 -53772636 -38236705 -22913830 -16807093 -25930725 -41881496 -52526244
5800 -52526244 -56926998 -59588528 -57347587 -43000372 -17412390 10279911 30251851 35224142
5792 35224142 24872746 12474074 14764897 26686506 21723445 -8301978 -30324460
5785 -30324460 -10124258 35740414 57235952 37843471 13728532 19162413 41163298
5778 41163298 44119832 18184111 -16620741 -40558340 -48158685 -40366000 -22768174 -9428138
5770 -9428138 -11650018 -22105162 -23775938 -15539851 -14253979 -27244407 -37813041 -28697289
5762 -28697289 -8761295 -873736 -8545274 -13434932 -7991463 -9443346 -28768434 -44315561
5754 -44315561 -29772023 1555629 10160995 -11653380 -27566752 -13923573 4156108
5747 4156108 -3583725 -21379882 -14743733 9938327 15349317 -3677032 -11496465 8458873
5739 8458873 28247169 25953359 21864957 37298277 50022862 27090902 -18421501 -42704327
5731 -42704327 -33896633 -21243597 -22348433 -19170068 2692151 23423210 18962946 589896
5723 589896 -415629 21213334 36942196 23248721 -8761189 -28166705 -18414889 9240755
5715 9240755 29721475 25495939 -1120308 -29481410 -35947954 -15055644 13137229 21753053
5707 21753053 3851569 -24559850 -46990167 -61391217 -69376016 -63971653 -40368149
5700 -40368149 -11545624 1138365 -8007612 -24225610 -29741830 -17704481 6527360
5693 6527360 27399224 28036646 10410484 1162876 21210712 54543230 66795122 50979127
5685 50979127 30707658 18866959 2669570 -23282395 -39659339 -33304276 -18917261
5678 -18917261 -11253065 -429495 22190960 36575593 22047123 -3538564 -5086328
5671 -5086328 17634789 30359507 14271757 -12543125 -24675839 -15914968 6265239
5664 6265239 30937033 45173664 43728940 38336039 39724663 33661311 -909786 -49947257
5656 -49947257 -69877227 -44308175 -8776271 -3390437 -22040591 -28333836 -7293558
5649 -7293558 20947905 33234667 29020122 20822604 12332480 -4292942 -30317001 -48012666
5641 -48012666 -37175914 -5400216 12473051 -4374062 -35027808 -46170184 -35737900
5634 -35737900 -23577095 -9832518 22144771 60745493 63410490 15545036 -39525956
5627 -39525956 -53693771 -34543464 -26444626 -47208705 -71558724 -70129902 -39929889
5620 -39929889 2014909 35172884 45181040 32091528 9832023 -10528227 -29913677
5613 -29913677 -44077763 -32028825 16886606 73533243 93995875 73830313 50882962
5606 50882962 49313327 48754318 22903173 -16483788 -38082251 -37825564 -38468402 -46839766
5598 -46839766 -41406127 -10721556 20654675 23426007 6416034 5994828 37111869 75389530
5590 75389530 89081728 69915942 28484501 -19688073 -52757714 -47950156 -7786411
5583 -7786411 31983446 40382630 26976848 20097854 22357861 16179529 5177433 12993951
5575 12993951 36923809 39939119 4402935 -37520517 -48024795 -31858862 -15872454
5568 -15872454 -4109433 14874650 31888686 25836336 6030410 10986478 55448000
5561 55448000 103285715 107225402 61682897 4371408 -26456329 -26401007 -19326078 -24675810
5553 -24675810 -35263103 -30776647 -9039840 9151467 9914530 5481368 12472817 24902015
5545 24902015 25728320 15727188 10856556 15098928 16313471 10086489 8936763 21317475
5537 21317475 34296170 25431031 -12405925 -60225469 -85154217 -68945752 -30303100
5530 -30303100 -10947918 -29359258 -56197479 -49212550 -6100793 33768294 37108314
5523 37108314 9309522 -20792782 -33093220 -29312370 -23775571 -23958230 -18121353 9332947
5515 9332947 45182244 48580570 2625240 -52925243 -67689479 -46018838 -32215592
5508 -32215592 -39496160 -37434584 -13027478 4087241 -3794954 -6428372 24314318 62417774
5500 62417774 65235131 40877252 35402297 62277388 85577209 74699865 40441573
5493 40441573 8518265 -13249279 -27661155 -30224542 -15993029 6605225 21600694
5486 21600694 19644593 581469 -29633147 -57865458 -67862688 -54882072 -33458800
5479 -33458800 -23931391 -32025331 -45604942 -50636628 -46773657 -45781530 -55214377 -65821435
5471 -65821435 -59010441 -28783403 6823850 20172897 125644 -36891442 -60397580
5464 -60397580 -51142806 -17923289 8859154 5080890 -23088371 -47484898 -51571403 -47471023
5456 -47471023 -54230489 -68526161 -68940493 -45834322 -14137179 5268836 6335671 -3889123
5448 -3889123 -17909653 -30298853 -33468794 -22660118 -6770586 -4815204 -25076915 -52495565
5440 -52495565 -63932912 -53251192 -33106243 -13840399 7278993 32610112 52440829
5433 52440829 55276439 41257536 17257020 -12043022 -38364697 -46084425 -29411845
5426 -29411845 -5674820 5053701 7137214 17601247 33045078 31749511 8320131
5419 8320131 -17593196 -30027117 -30822973 -21872659 -583501 19279220 12822784 -14294884
5411 -14294884 -19390517 18496379 60200707 58256290 26744638 21129447 58090744 95781158
5403 95781158 96079594 69662143 47792209 40244004 40052093 47531947 65330349 79395209
5395 79395209 67245374 26776863 -16767069 -37889338 -38695955 -43781720 -68075447 -96327373
5387 -96327373 -101127533 -78426707 -53494494 -47855675 -52640634 -45022048 -22515875 -7205601
5379 -7205601 -17735868 -47628074 -72520183 -74015601 -57203185 -45434555 -52311716 -60333304
5371 -60333304 -40906906 2459749 31436876 23909186 5797864 12069324 34855797
5364 34855797 38375942 14264369 -9484652 -12174547 -2703078 5591431 14856000 27929708
5356 27929708 35338776 29195525 15750980 5019429 -789267 -2404853 2323412 14125098
5348 14125098 29406857 42315962 43780562 25639490 -2596958 -11591914 13812087
5341 13812087 46784019 48457664 19562881 -4911242 -7817171 -4201303 -4093363 2088506
5333 2088506 14070660 14910938 5831029 10506455 27990696 21348565 -20826452 -50444448
5325 -50444448 -25141116 22852198 28391400 -13976818 -45975819 -28505502 14378375
5318 14378375 38083161 28340983 588139 -23659789 -28745878 -12197215 11389195
5311 11389195 25508296 30913416 36855364 38839021 24439448 -1896648 -21156952 -26712305
5303 -26712305 -28618500 -30271376 -21569665 765402 23820821 34000688 28917261 14221436
5295 14221436 2107625 8200085 32491902 50189940 43990040 37457511 64912460 111169089
5287 111169089 120798133 76395523 27944778 24175850 50001989 61003161 50860343
5280 50860343 46505740 53011162 44675932 10021319 -28249366 -45600928 -43783786 -37971409
5272 -37971409 -34399885 -30941353 -27117836 -23417609 -17754719 -10111088 -6478840 -12183384
5264 -12183384 -22141110 -21599714 -182147 32202817 47014516 23726847 -23394913 -54629443
5256 -54629443 -45388832 -9002723 24543928 40355640 42084916 37930416 36173591 43192971
5248 43192971 50579879 34532444 -12966855 -60053672 -64866618 -27590185 10367670
5241 10367670 21103947 19959391 32871496 57758131 74314154 75062622 67267587 53907739
5233 53907739 32023621 6491703 -10203222 -11370464 1509877 26211792 56734082
5226 56734082 75769650 66436312 34792816 7619829 2755648 12434474 21143216 28109452
5218 28109452 42376725 63680655 79904577 80924053 66370465 41734798 14775299
5211 14775299 -5584559 -14968451 -18851896 -26219933 -38181585 -48609463 -54427054 -57093697
5203 -57093697 -54247948 -39954315 -16125010 5658648 18537961 28396782 41748417
5196 41748417 53450031 54165417 44178227 31880796 22921293 17386857 12155444 -494742
5188 -494742 -27915004 -60352629 -69263681 -39652561 1947584 13583453 -8021527 -22969420
5180 -22969420 -3876643 28182377 37273323 20667528 2560379 -4660308 -8198986 -12838232
5172 -12838232 -16542409 -23966798 -38683304 -42722864 -12085121 41922265 75650339 69565401
5164 69565401 53706896 57594761 62300232 33707563 -15399496 -36527490 -14239013
5157 -14239013 16226689 26781918 33504386 57010417 78076070 62900764 14446184
5150 14446184 -31689917 -53188657 -54907821 -43163599 -17143614 11042163 16589089
5143 16589089 -5783547 -29895013 -30577121 -12403982 4961984 14347289 19992064 21828255
5135 21828255 17189898 10613436 7891883 6532007 4059515 7343909 18736667 20911605
5127 20911605 -4827280 -47342608 -72103088 -60944541 -28817433 1340575 22103118
5120 22103118 34222171 35105138 27167709 23296598 29056601 29923115 12552890 -8815109
5112 -8815109 -6670913 20088155 39892036 27770732 -3802266 -22455431 -13875175 8238751
5104 8238751 22922841 20906083 6514779 -7288825 -6109494 12208438 29245914 22633903
5096 22633903 -4932636 -24753007 -16711432 7278099 24433727 32305732 41334888 46739994
5088 46739994 33929999 11364133 9280316 35177768 56303032 45622255 24875439
5081 24875439 35030348 74436224 96234371 68918053 14692015 -20821654 -19030636
5074 -19030636 2380077 18211816 20744698 19698219 26335662 40373205 52938086 61200630
5066 61200630 72630461 89539585 98338210 85615901 58630730 35347433 17873805
5059 17873805 -7035392 -40533618 -62440558 -55568504 -27027230 -27645 6533720
5052 6533720 -10329031 -34649228 -40551059 -19391112 2566519 -6958583 -37992509 -44106725
5044 -44106725 -5854420 37995745 40915089 7527068 -22582595 -31878134 -34444471 -38041550
5036 -38041550 -31886531 -15786589 -10235163 -24256962 -35700729 -20180292 15579797
5029 15579797 46302807 62739038 73842715 79859737 67082505 36241059 15914890
5022 15914890 29803255 60659111 68905699 46420514 27727676 38968038 60144297
5015 60144297 58090115 36725675 24158590 21785283 4894043 -24896159 -28645939 12359158
5007 12359158 61296716 71337633 41891157 6043201 -15527620 -21393917 -10381879
5000 -10381879 11842663 19534313 -7075333 -47828983 -63124223 -44075991 -16063047
4993 -16063047 1683133 10884705 13340911 7883425 8021415 29010383 53095644 41396343
4985 41396343 -10551863 -60869410 -76235430 -67704915 -58425192 -48675355 -33278273 -23214270
4977 -23214270 -23552056 -14879635 14608111 39712990 32250318 7583815 3021077 20444504
4969 20444504 25634967 993546 -34213543 -57142948 -64287979 -57434449 -36408007 -13814992
4961 -13814992 -9971178 -22314678 -24569339 -8709997 -2200711 -25122833 -53722748 -53002685
4953 -53002685 -29763604 -22531840 -44903285 -69772977 -72321793 -59636575 -47526024
4946 -47526024 -34395346 -17161322 -13101043 -39296128 -78920445 -94924335 -77833020
4939 -77833020 -56268205 -54843603 -64122112 -62721911 -48402988 -30721230 -9121651 20912009
4931 20912009 49732629 62428610 60697132 57259939 53099296 39323021 17870859 -2941
4923 -2941 -13272269 -27642713 -35182833 -23143484 -3497141 -4089902 -24483486 -32235889
4915 -32235889 -15257369 -5376697 -29905125 -69682730 -91147139 -93209732 -90982063 -77224229
4907 -77224229 -39692639 -649216 6066908 -7662304 4882370 52424287 87252195
4900 87252195 74305910 40362447 30505891 44574763 46270310 19214090 -13747194
4893 -13747194 -21988426 1131680 36198483 56797371 54015904 46380062 56395657 74969279
4885 74969279 67075521 22032829 -22462881 -25329554 4082777 20819408 5020546
4878 5020546 -17194113 -13637512 15266258 44327967 54550384 47379656 36375782 31295883
4870 31295883 27520319 11481966 -18403353 -39876441 -26814753 18005319 60578618
4863 60578618 70076436 48124607 20589649 8436620 12762579 22483942 27588742 24504295
4855 24504295 15046185 4625676 202726 5408981 14918853 16459878 3331287 -16294329
4847 -16294329 -29037345 -35097323 -47653056 -69233693 -79348964 -56880161 -10193284
4840 -10193284 26798539 29026659 2599767 -27352669 -42837078 -44319397 -41828455 -39662774
4832 -39662774 -31227281 -10655466 12224335 17204119 -1484839 -24525178 -29975006 -18091462
4824 -18091462 -3023743 10611075 25892629 35609050 29759949 21078975 36283826 72139307
4816 72139307 84932747 42212537 -31998683 -83525875 -86525449 -55259870 -10799778
4809 -10799778 35336088 68690129 74863538 63216511 62430441 79576255 84217884 49853206
4801 49853206 -5383043 -40316263 -42855237 -37191309 -41681020 -44199177 -27462819 724801
4793 724801 18912401 23903253 32644543 52807818 68863505 64976952 48282451 35945139
4785 35945139 27899424 11536353 -7940853 -4580942 31635983 74605332 94413548
4778 94413548 94515022 96899779 103661630 100163952 88892213 87537655 91632052 73667180
4770 73667180 31598465 6061990 27556093 71123215 88681842 67303874 29094718
4763 29094718 -9310826 -44599380 -64282449 -52009325 -17207247 8815010 11021464
4756 11021464 2827481 -1325833 -2092213 -915920 6676449 17452698 20619112 16346420
4748 16346420 14307209 11422292 -5438575 -30846384 -41162444 -29952430 -15636956
4741 -15636956 -6366726 10483303 31280609 25917993 -11321345 -35353891 -9028063
4734 -9028063 38404833 50727500 23585327 1962818 10810000 32171782 47838013
4727 47838013 60641802 67910853 54774901 27307672 17701785 38635328 60158413
4720 60158413 50907736 20040305 -406771 3624515 22719623 43086828 53730772
4713 53730772 49000375 41259619 57036463 101182367 137759629 130943840 97673989 91294953
4705 91294953 129773605 167359205 152493322 94708852 50756026 51528559 69832528
4698 69832528 67566599 48882987 43383495 52416850 46888464 19343405 1712272 15452094
4690 15452094 36360431 35241897 25792939 35176901 47200442 22371660 -30849191 -55263045
4682 -55263045 -25426196 16392544 24769262 11937089 15144429 34888145 42314964 29958954
4674 29958954 18873108 22350933 33245715 45609689 62331569 78271632 77530574 54733066
4666 54733066 25249345 7824167 5309390 6832130 3786919 -471793 2275655 8668434
4658 8668434 1249203 -28562709 -60789869 -66190904 -43183524 -16138323 2430066 22058576
4650 22058576 42614464 45357766 31665581 38033606 84327268 131729422 126396035 70408875
4642 70408875 16448960 1601192 18005487 41489501 55156245 45570998 7935103
4635 7935103 -39381846 -69773002 -80583042 -88494345 -94822414 -82981177 -52284020 -25054789
4627 -25054789 -12993502 -2945281 14956122 30024535 32747456 30747108 30957625 27131813
4619 27131813 18223674 19239156 38479155 60245747 64913385 52839415 36724330 25319197
4611 25319197 26669534 50068810 87620411 107784517 87205900 41718778 9361053
4604 9361053 8323867 25997272 43662986 56024157 67375756 81036566 94376518
4597 94376518 98421743 84707815 57991416 37790414 39792288 57121216 64838938 42814249
4589 42814249 -5627241 -54109164 -74047420 -61752770 -42602801 -40510339 -48869834
4582 -48869834 -44982347 -26426175 -11249344 -3920786 10751150 32342031 32457092 -4765595
4574 -4765595 -52634373 -74355708 -69040001 -62682933 -65892487 -65164507 -50311701 -28185813
4566 -28185813 -9244727 3761398 13523870 24336374 36768748 39570079 17433460
4559 17433460 -23617543 -52926538 -51778804 -38426097 -37949587 -42585403 -27815162 3053864
4551 3053864 21291614 16669773 8176249 7339756 -17423 -25084253 -52731098 -60963381
4543 -60963381 -48093589 -28828998 -15235230 -10783449 -13003736 -14300325 -8059210 2019975
4535 2019975 6798075 6008863 6300649 6501115 927210 -2954580 8878149 28745355
4527 28745355 29625919 6381821 -9817337 3256757 20825347 5274724 -35094983
4520 -35094983 -53932452 -31912063 -2003877 452307 -14025566 -11473732 11821496
4513 11821496 25770732 14066833 -2151068 684850 11558285 5140533 -12478982
4506 -12478982 -8485962 23014911 43087378 22705198 -8344019 1532459 49807903
4499 49807903 76791297 44742974 -11113537 -29283489 752223 32497787 25883063
4492 25883063 -7621735 -28656051 -22140433 -11543210 -23526968 -51794026 -66436472
4485 -66436472 -54864217 -37588723 -37040063 -45842429 -41338303 -21639178 -6857596 -7566728
4477 -7566728 -12701497 -10311588 -926849 12885954 30078498 38682970 21578627 -14529386
4469 -14529386 -35568537 -19761619 15119355 37806586 40370756 33256413 20671065
4462 20671065 2482923 -11322885 -10827760 -3511399 -1339704 1344430 15541693 31597168
4454 31597168 31249388 20950828 25067027 46190130 61228329 60255092 58546427 62027254
4446 62027254 53677638 30221045 20155327 40210883 61217572 49662335 22296580
4439 22296580 20649808 43863091 51447675 32133081 22788229 44618933 64304822 47554340
4431 47554340 17252650 18126205 43302423 42311618 187494 -35469039 -20785258 24315283
4423 24315283 45428459 22599717 -14387267 -28980149 -13731645 13371925 30081500
4416 30081500 26021331 9766265 765868 6590057 12075530 912866 -18034537 -21457192
4408 -21457192 -6248753 5208220 -1723756 -13487074 -10890781 2851731 11340182 12536016
4400 12536016 19084924 33235815 39290573 27221285 11012629 12451490 32571472 50974994
4392 50974994 52651525 43509683 35338006 27432910 14065380 1889281 3537380 15323899
4384 15323899 18822000 8839416 2958443 14913184 34522322 45847237 49718052 52747275
4376 52747275 49335494 35554982 28033962 42904716 64498467 64884067 50706826 56865914
4368 56865914 90993440 120712767 126808470 131169650 150309035 156180324 117120293 53951487
4360 53951487 16588432 16525300 19626882 2087763 -21475410 -28885257 -18810162 -928883
4352 -928883 16760890 22232839 4379590 -25238777 -35738662 -14597302 14956990 26506146
4344 26506146 23095354 21177460 17318744 -5945618 -46111736 -74558005 -68550049 -35207018
4336 -35207018 1582876 27025813 40888049 45130339 37481309 18389426 -2889905
4329 -2889905 -14128642 -10164496 6156277 30385501 57024620 73179391 61420883
4322 61420883 18257188 -32559063 -54619705 -31593723 16043385 48467697 41057280
4315 41057280 3694682 -31609465 -41202853 -27372596 -7108553 9012535 19503872
4308 19503872 20014325 4155295 -21553272 -38314306 -37402582 -29579049 -25219993 -19592290
4300 -19592290 -9000848 -6116868 -20932763 -37032516 -28782880 1842320 26959120
4293 26959120 31436236 29181569 36286240 47254814 48503316 41918223 41177893 49532974
4285 49532974 52744362 36523295 5899099 -18815632 -27869356 -36745156 -63048846 -92370833
4277 -92370833 -88809444 -46631168 -7349660 -7393266 -30082883 -35484825 -20427589 -14784246
4269 -14784246 -27565097 -35622993 -27744419 -23232137 -36708041 -55347554 -63925137 -66343700
4261 -66343700 -69394012 -68780030 -63795399 -63638861 -67649142 -61630445 -44063879 -31063715
4253 -31063715 -24713168 -6046345 25294466 37071550 13265765 -13647176 -8673623
4246 -8673623 13695498 17189131 2168221 -558640 20321169 48965094 73850300 91826593
4238 91826593 89891277 59713585 25592884 21732163 42695990 50609092 31439268 9290922
4230 9290922 2539815 1658118 -2448957 -2219243 4061853 4497344 -166198 8362538 31959221
4221 31959221 44968142 31174746 6555819 -8625746 -15751170 -22496588 -27096468 -32172186
4213 -32172186 -47565641 -63811475 -52519811 -13590991 9806222 -7567714 -26262262
4206 -26262262 4830008 69526685 102799023 78947136 36833286 16054703 11054046
4199 11054046 1995075 -4671987 9495533 40370298 63800979 64159408 45140792 18350263
4191 18350263 -5806225 -18414725 -14197478 3633510 24231833 36667153 36396820 24519640
4183 24519640 3000729 -23799957 -40711057 -26030065 21023353 63187939 58387209
4176 58387209 13132759 -21870923 -18193420 -3475711 -11117419 -26579009 -15853292
4169 -15853292 15488716 33051636 30962033 32969473 39352095 22511018 -14448335 -24416319
4161 -24416319 13527231 52485200 41450811 -878418 -16976306 6568072 33028661
4154 33028661 42567267 55625740 82103234 91910349 59973870 11206832 -8702974
4147 -8702974 7415818 25949421 24391839 18350113 29360209 46444900 38771533 1497314
4139 1497314 -30419107 -22925500 14171041 40330121 37320212 30610579 50735577 89742474
4131 89742474 112341806 102014237 76827950 59791494 51862388 41260539 25441481
4124 25441481 11514812 896018 -14238729 -37572606 -58427312 -59336753 -33496186
4117 -33496186 7557159 45316773 71393399 88624356 96739085 87884440 62255160
4110 62255160 37102143 27597967 25963579 15278053 -683517 -1647925 14036132 21039990
4102 21039990 3119769 -22264967 -30205579 -23417042 -22229092 -30060718 -30160447 -13757142
4094 -13757142 6761661 13699817 134992 -28925926 -59767805 -77144760 -80278724
4087 -80278724 -86324447 -102807322 -104429891 -61268253 11342721 58976390 52056914 19410670
4079 19410670 6796780 24724221 51859928 68083373 64481499 38791248 3522259
4072 3522259 -14625150 -4748626 11071716 10661827 5521275 15453565 26480183 11046018
4064 11046018 -18956912 -22783365 3697222 17961821 -1139861 -18988941 -2723001
4057 -2723001 25547020 27412448 10607378 11226593 30929067 35983850 14373097 -7353419
4049 -7353419 -9231146 -3436165 -2369506 7519922 39581729 75698625 84529864 61661688
4041 61661688 32617559 19330368 18619745 15012194 4502213 385639 16973751 49183313
4033 49183313 71344097 60847547 22432592 -15925838 -30749483 -21459802 -3141348
4026 -3141348 10222560 14007101 12758849 15415712 26003447 38155752 43692719 44669312
4018 44669312 48610987 53583917 49858995 37185237 26384789 19563546 4341684 -22422776
4010 -22422776 -39290407 -24163163 14722670 48316763 63019507 69973472 78494260
4003 78494260 79968796 66930151 52876457 57220038 75545055 79901433 51613108 4227279
3995 4227279 -31060699 -36444517 -18462384 6037020 24662852 30823429 22326462 6233268
3987 6233268 -1601929 7847501 22716322 20687612 -5006933 -37298601 -55277649 -55168337
3979 -55168337 -46790621 -35441499 -15567200 17709910 56338507 82060923 82588177 65494037
3971 65494037 53005253 58256202 68389408 58834557 25054260 -9967573 -24850238
3964 -24850238 -25811134 -33008173 -49063422 -57402964 -50522989 -41658206 -41467931 -39006970
3956 -39006970 -20131712 4685410 9259669 -12310029 -35107045 -33952103 -11562883
3949 -11562883 11281635 22500109 24881916 23651137 21065947 19831676 19399893 10461430
3941 10461430 -14293695 -43695891 -55303981 -41860748 -18872830 -2651196 6624131
3934 6624131 14956078 21174805 22517146 23032104 26817969 31121557 34040935 39649677
3926 39649677 47394280 47809025 39227473 36741990 51245046 70787586 77850915 74158135
3918 74158135 71279760 67971631 57396950 46229524 42214634 32266845 2818791 -23954150
3910 -23954150 -10446807 36867398 65749137 48354257 18589309 20063861 46907049
3903 46907049 62012438 51408504 32150922 20400955 17619802 19913259 20313804 9586274
3895 9586274 -8322151 -11996991 9227764 34339255 36341267 17701666 1388281 -1777484
3887 -1777484 3102505 11404825 16828052 5011850 -25559358 -47171348 -35033407 -6449382
3879 -6449382 2391414 -9383131 -11558838 2484654 5826162 -11047467 -19180810 2504605
3871 2504605 32622471 40387670 28125313 18585501 19169530 21035854 20310397 19674812
3863 19674812 17025968 8837652 -369310 -3002833 1909557 10315629 18504816 24730921
3855 24730921 33186136 52824914 78536358 81303003 42468911 -5931030 -9692732 33055886
3847 33055886 63953641 45655311 11119036 6151910 20798944 16346639 -7599313
3840 -7599313 -18253586 -6075107 8100394 14709824 22537438 26619361 9689223 -20401317
3832 -20401317 -31585057 -13957290 7077243 12970351 15946887 27965208 34456349 17185212
3824 17185212 -16681409 -44319011 -51579916 -37613776 -11192127 8786858 6081431
3817 6081431 -10700485 -15476748 -1642872 8398936 347183 -8003094 4233215 27916369
3809 27916369 39805448 36775342 33286840 35472862 38674093 43969301 56810838 71413723
3801 71413723 73845527 61535426 46717394 39011637 34202882 22046102 -420591 -23864296
3793 -23864296 -33748505 -26377938 -17359345 -24909456 -44384706 -53416656 -45460826 -39392934
3785 -39392934 -46264666 -46921568 -20300501 22570990 55009200 72981051 91852397 112156967
3777 112156967 116540908 101554986 86903328 86544396 91034926 86223883 71670087 51992322
3769 51992322 26513432 -1423080 -18245884 -15676058 -3188482 5807628 11688795 20877024
3761 20877024 27543113 17782044 -8331547 -30741940 -29408924 -3994926 29646428 57861648
3753 57861648 78993888 95746095 103747334 94053262 68116803 44407064 43730461 68043349
3745 68043349 97342563 107376708 88700770 51588111 17277925 2666547 7376302
3738 7376302 14813243 9661520 -5691057 -15376667 -9306381 6495103 18197435 17433035
3730 17433035 5377334 -11162906 -24085635 -26371949 -14627439 6818186 23701922
3723 23701922 19292553 -8607731 -39255946 -45667398 -20898371 18950234 55514424
3716 55514424 79169379 80221765 50220431 2226572 -29021559 -24151282 -3470209
3709 -3470209 2152331 -8863554 -17810639 -20502032 -26045768 -29396612 -16343776 4940934
3701 4940934 8124444 -10732436 -25428029 -20104957 -9596867 -8336447 -6399647 7409914
3693 7409914 22520967 25353057 21377992 20143938 16708158 6830047 2565081 11720203
3685 11720203 18359295 6722271 -10012459 -9300614 4960302 11853764 8041731 5551700
3677 5551700 3010361 -11462646 -31628834 -35562882 -17560836 5969432 20849485 21287346
3669 21287346 -3453096 -57116375 -110552312 -121820561 -89683977 -55229947 -41339273
3662 -41339273 -25939870 8936307 39366317 39155246 26622945 35284624 57697236 58069416
3654 58069416 31670058 12752686 22284969 41946630 47978650 42585608 39576940 41001350
3646 41001350 42292303 44355574 46458395 39113012 17301734 -8197482 -24834731 -36012817
3638 -36012817 -52153590 -69717708 -73189270 -56481640 -29448228 -2271762 23688912
3631 23688912 45622057 53317392 43402427 29901879 27283651 28633740 16690018 -4919988
3623 -4919988 -10812231 9632343 33161716 32881704 13260299 -1125399 -58702 8400049
3615 8400049 18873401 29417915 26157367 -4413103 -44324107 -53409536 -20590024 17967370
3607 17967370 25526051 7507303 -8592660 -13439303 -12907718 -3333340 20783681 43789509
3599 43789509 43791376 28965806 31008410 57966885 78376704 62421125 20334351 -12168920
3591 -12168920 -14163568 5850623 26750381 35386972 33802081 33212350 41316662 54919020
3583 54919020 66050399 71591669 71924592 64655643 47902628 26833708 8152338 -9386569
3575 -9386569 -29530223 -45730299 -44317940 -20975647 13411756 42223554 52530604
3568 52530604 40278912 15125581 -4602571 -10604535 -11901759 -15350874 -11726268 4018601
3560 4018601 13898227 2355102 -11245208 3669786 39120278 58127545 53601553 57328709
3552 57328709 81565569 94533162 74935044 51655748 57990468 77554862 72908433
3545 72908433 45819312 29713797 36305421 48757235 59648047 76716972 92971923
3538 92971923 89040887 69442107 61988163 73145725 75836124 52993056 23766148 10987440
3530 10987440 8240932 -2061081 -18556502 -29036649 -33159041 -37567561 -39953881 -36052289
3522 -36052289 -33012838 -38167392 -41833444 -28787638 -2138943 20765751 33249623 43670524
3514 43670524 55297095 58053259 44335746 20535512 -2371324 -19809374 -30016465
3507 -30016465 -29148764 -18144868 -8031266 -8885437 -16238618 -17169363 -8415096 1551667
3499 1551667 8859854 19520364 32454111 31835372 11022448 -6899018 5369450 37293653
3491 37293653 50700934 35912626 27310166 48000456 69540394 55203718 19588797
3484 19588797 5812871 15249125 5600336 -37212769 -69172549 -48637900 6578434
3477 6578434 46197233 46930392 20614167 -16283681 -51962751 -69345090 -55668638 -21244188
3469 -21244188 10341571 28458015 36534130 33709680 16250293 -4315249 -6165912 13617996
3461 13617996 30162622 19400316 -12990009 -37635046 -32378973 -3967381 19958883
3454 19958883 21331556 13416623 25284126 63368064 100548256 109838024 94967226 75899979
3446 75899979 58736612 39077960 24487910 28328124 42681257 41362454 15518123
3439 15518123 -11952117 -14280607 10977588 46544989 73440836 77528342 52204137
3432 52204137 6243973 -37232301 -57878981 -52885674 -34959608 -21730175 -25782007
3425 -25782007 -45710338 -66029606 -73324983 -70626209 -67489203 -62016665 -47494012 -31930536
3417 -31930536 -30665820 -39405177 -36158407 -13809255 10989095 27222867 43865203 64197816
3409 64197816 69997924 48325480 14381639 -10605321 -26320559 -38657575 -36719715
3402 -36719715 -10248625 22879925 33716959 19184225 -2310131 -22862893 -44200425
3395 -44200425 -52274429 -28503397 10244229 17659320 -22612888 -70353051 -77102089 -39606587
3387 -39606587 10123570 47039992 65639638 66993815 57101402 51392023 61154670 77392906
3379 77392906 81647192 69629508 52435434 38981990 30052503 25905863 25595563 19834890
3371 19834890 -802250 -27010128 -32049689 3252 51865872 85365906 76897649
3364 76897649 39245155 7818653 6001477 26429927 46535474 54904788 55048230 51366174
3356 51366174 47464394 55620507 86190967 121385208 121600773 72994245 12161456 -14887472
3348 -14887472 -5802634 5699374 -353648 -12015660 -12571443 -1575908 13318291 26145048
3340 26145048 31360332 28960067 31543928 49537652 70030464 69942145 50607006 36675270
3332 36675270 37733808 36508177 22506934 9839574 7611398 -724281 -27404650 -51942669
3324 -51942669 -48789906 -28139021 -21478802 -35015112 -43907744 -29760870 -755085 25507524
3316 25507524 40106201 42804329 38812430 35285037 30792956 14968219 -9845875 -19562006
3308 -19562006 168416 26117503 25284947 -565681 -26396585 -48806265 -82372256
3301 -82372256 -115442262 -112868910 -70471010 -26557499 -6744847 3159777 13635649
3294 13635649 5245815 -26622272 -42948473 -16778918 15025445 1781967 -42649301
3287 -42649301 -60840254 -36315682 -5489182 8757249 21812171 40311958 41557667
3280 41557667 16638041 -8662554 -17410671 -29468197 -61515915 -90899003 -87844075
3273 -87844075 -59157145 -30851767 -7382915 20884420 43944423 38688260 4777834
3266 4777834 -32386714 -53167856 -57401298 -50141783 -35540679 -24105118 -25392765 -31881201
3258 -31881201 -28157443 -17223714 -18482876 -35770574 -46557104 -31350761 1482288
3251 1482288 30037308 45442085 52930191 55738587 50644223 36044881 15414759 -5128153
3243 -5128153 -16787439 -10458709 12101516 32336473 30701622 9930330 -6363104 -1652504
3235 -1652504 15508594 27563858 33235395 44111016 59392989 60891060 39186738 10598581
3227 10598581 -3919215 -6743677 -14601351 -27223250 -24629797 1580025 31744648 41383989
3219 41383989 28790878 10589379 -339289 -2769451 -733649 -48104 -7501303 -24840679
3211 -24840679 -45060660 -59265297 -63939770 -58894592 -45352981 -31237859 -30084110 -45951132
3203 -45951132 -64228744 -65123732 -43393656 -10941265 13884424 16145811 -5663165 -31683127
3195 -31683127 -33899702 -8364869 15998044 13835752 -2483011 -3716831 9686220 7200773
3187 7200773 -24023586 -55483671 -52632183 -17410720 18237309 31656697 28558882 26343354
3179 26343354 30121619 28607900 9844878 -22055346 -47414370 -49058005 -28393888 -2708884
3171 -2708884 10154119 3272335 -16493947 -32209712 -29510300 -11900136 1734879 171480
3163 171480 -7525078 -9509013 -10436733 -20658707 -35356332 -40591580 -33896885 -21543126
3155 -21543126 -409827 37082010 81038093 107764816 108211170 95055606 79796194
3148 79796194 62235842 45502845 39102882 39068612 25998268 -5865295 -35715087 -44327117
3140 -44327117 -38279355 -33195314 -29282873 -18810213 -3470820 12486665 34464277 65725519
3132 65725519 93383339 103062258 98814697 92019068 80220096 56990680 35628470 39427285
3124 39427285 68125428 94552826 98403531 86180307 72596941 58450308 36535287
3117 36535287 8663957 -14480535 -26667477 -31034098 -31485850 -24530818 -4318261 23489509
3109 23489509 39030152 27935939 1863467 -12531470 -7502116 -3500211 -17517373
3102 -17517373 -35680042 -30317191 3650119 42149485 58060512 45482356 22588812
3095 22588812 15924417 34295792 54068110 43065261 4945106 -18755779 -3152495
3088 -3152495 24340025 23732644 -722479 -11890002 3978756 23980602 26777613 13649777
3080 13649777 -7069205 -26443738 -25624345 7739083 49761237 60310042 40282693
3073 40282693 32873019 53839069 60000727 14880628 -47628534 -64504111 -29451469
3066 -29451469 3829937 -2119552 -27860534 -36794050 -22089794 -868552 14056298
3059 14056298 18932660 9863086 -12842777 -34839819 -35554573 -9007348 27676014 48916801
3051 48916801 43425177 21629610 673843 -14022411 -26830441 -34940916 -26042164 1971164
3043 1971164 30389519 39358992 31504870 24862351 26780622 27503826 19170563 8810632
3035 8810632 7691613 14874533 16735594 964487 -30364197 -60158624 -69945063 -57398197
3027 -57398197 -39151953 -32478199 -35756235 -32562866 -14917402 4627154 8032837 -5814721
3019 -5814721 -19878034 -18505467 -1525089 21119635 39399894 43768464 28008172 4363593
3011 4363593 5543963 49251536 102912577 111223600 66037692 19781016 14099355 27306984
3003 27306984 21253757 9701895 33490782 83382917 102717946 70441885 30602525
2996 30602525 24473731 39317806 47405252 54006462 73860923 91580580 82394918 53438242
2988 53438242 33288920 34553698 50893505 73874997 89472367 78327275 45316773
2981 45316773 27119483 42196306 57759198 40326620 12464030 14518144 32045113
2974 32045113 16659495 -31242738 -59706713 -47016188 -28971916 -33125910 -39960906
2967 -39960906 -29448863 -17032612 -16159472 -6814688 27577527 65466963 79820307 77239894
2959 77239894 76342882 74015117 61799387 50352048 47579986 36186992 4502970 -22693476
2951 -22693476 -18590362 -231372 -2975802 -24347929 -32442366 -19814225 -8121820 -3675610
2943 -3675610 9648946 29629632 27487622 -7825278 -49457650 -70957725 -76950107 -78808596
2935 -78808596 -64615457 -18231469 43423703 76092987 53788199 -2372322 -45104197
2928 -45104197 -47848199 -27130282 -15456804 -17377393 -7374214 25704117 54349463
2921 54349463 50415971 30745081 38239813 83431914 130275867 139850305 106812332 52927924
2913 52927924 6204335 -12326752 -2550132 10751044 6256273 -2156908 15707918 56367062
2905 56367062 80091671 65057609 36096850 27346213 41382378 60324128 74386714
2898 74386714 81474684 77665903 66173969 59146759 54813363 32366513 -11766426 -43995990
2890 -43995990 -35691592 -8118695 -5551926 -35342749 -66333430 -79228066 -83526486 -84643129
2882 -84643129 -70493270 -40947853 -19857815 -21345687 -27158829 -14776399 10689366
2875 10689366 30572471 42427137 54949311 64379134 58667858 41070309 28906340
2868 28906340 27734586 23787724 6059726 -17246570 -28977080 -19944777 6714321 37117580
2860 37117580 50307552 34606435 7076697 2173180 29382930 55522367 46198976
2853 46198976 14060357 2048343 22992910 44855419 41846915 30020326 34600929
2846 34600929 48153659 48734311 41381149 47366466 60536041 51684649 18538902 -5488061
2838 -5488061 -3795778 -3293281 -28377978 -57952172 -56507308 -26377635 2893103 22230855
2830 22230855 44449998 64929154 59252637 25468847 -4680106 -9422188 -4955166 -14192116
2822 -14192116 -30685073 -33694228 -21904565 -9747798 -1004513 11700773 26687084
2815 26687084 33083774 28749419 19999628 5511924 -18748185 -37363701 -22661276 25482455
2807 25482455 68344603 74124154 58813374 59515435 78639667 83122542 57173426 24680338
2799 24680338 9783395 4179752 -6857258 -10466177 11664612 41150942 38909388 3309874
2791 3309874 -21160170 -3223175 34976793 51645825 35962595 7275807 -15452875
2784 -15452875 -21218443 -783120 40275823 71590606 67594244 42963394 33733831 45531584
2776 45531584 47386664 19360151 -21206956 -49492242 -63680653 -71655442 -69572151 -54013989
2768 -54013989 -40572239 -47070497 -63444927 -58406958 -18097461 34798498 63933083
2761 63933083 54465045 24076172 3226453 5253990 15997972 15612740 7008643 11524386
2753 11524386 35666275 58061808 58239474 44323491 38275503 44257615 48884675 46444257
2745 46444257 44100520 42521446 31159098 9076048 -5677624 1657691 21541929 33868206
2737 33868206 36417889 44833545 63637835 72534643 52566751 18156117 6395478 31063902
2729 31063902 62059358 61337600 28256930 -6250123 -22159944 -25099922 -21195159 -5008415
2721 -5008415 18242510 24504065 3895492 -17075381 -8800687 19510617 35321584 29903767
2713 29903767 22633683 23180872 19356903 5740608 -3945995 -2970168 -5907684 -21998442
2705 -21998442 -32622304 -13471622 30676092 68622744 75692720 54504246 27351847
2698 27351847 14660052 16988565 15627695 -2789951 -23189389 -16647583 19293343 51279271
2690 51279271 49760379 23781704 4749429 6786022 15830862 10429361 -17218718 -54127816
2682 -54127816 -72583525 -52896646 -9186326 17749878 3629574 -32614239 -53954314
2675 -53954314 -44316775 -12151701 27905421 58697533 60150796 29066964 -7333630
2668 -7333630 -18894089 -8521675 -1445085 -5993256 -8368316 -1101177 9360329 21306218
2660 21306218 36510483 39852192 10495400 -40109589 -71196276 -65463891 -51649099
2653 -51649099 -59406602 -77897706 -79720558 -63736209 -49102856 -42370753 -36595918 -33723483
2645 -33723483 -42228679 -55089174 -51782050 -25055849 7640359 21028591 3388946
2638 3388946 -34270251 -63361204 -60445115 -33766040 -16918908 -25972300 -36705395 -20014696
2630 -20014696 14082524 30353068 18024152 1656255 3475093 17054414 21663327
2623 21663327 5653323 -26786702 -57265307 -61258556 -30378108 12706171 37032592
2616 37032592 40643286 47574347 66974218 75979615 50719988 -1191792 -47067932 -58090928
2608 -58090928 -30254147 11052250 27669606 5285696 -27173898 -31808781 -11383165
2601 -11383165 567838 -2752485 9661310 49049936 77285136 61777888 29012576
2594 29012576 26894045 53937931 66915368 49645497 31244957 32703902 35406756 18642090
2586 18642090 -1777639 5181807 43100961 86344956 110045855 105506966 75116976
2579 75116976 30461765 -7183242 -20950730 -16193177 -13731763 -22315832 -27298665 -12257947
2571 -12257947 16038559 34194005 31403667 21134777 20303777 27002896 27831565 20102572
2563 20102572 13207059 10015378 2807172 -8235372 -8086502 10952341 31411313 29566771
2555 29566771 7769747 -5821819 9313623 42862709 67204799 68131806 57454178
2548 57454178 55490701 64312548 64574023 42950354 14995635 7991119 24103190 37732908
2540 37732908 32021827 19103048 16253665 21223799 24691531 29525276 39033550 39812805
2532 39812805 18182967 -14236450 -31847669 -26591379 -10060696 8771276 27303218
2525 27303218 36627516 28329344 12502732 8178961 17635996 30299223 46188446 67874077
2517 67874077 72130089 25369801 -63173064 -135731552 -149515059 -119976499 -84986153
2510 -84986153 -54063437 -17347976 18616798 36598776 39640758 46990619 62277901
2503 62277901 70255442 65245809 60592908 64951477 66831338 51799324 25335484 9674312
2495 9674312 19738525 46344564 65347450 63871746 52576094 46152615 39130594 16288014
2487 16288014 -16070466 -31011080 -18232586 1197090 7256535 6620430 11716555 15885776
2479 15885776 10064093 5862291 16731598 29706630 23787897 7394288 7056017 21759250
2471 21759250 20411819 -9349273 -38309162 -35348485 -9733034 3570182 -9101576
2464 -9101576 -23390176 -7357835 38566852 76780286 71276439 29035992 -8654602
2457 -8654602 -18706954 -21671897 -42555976 -66644005 -59440032 -18731991 22483756 41242100
2449 41242100 44313999 41972924 30560967 8770521 -11515853 -19969195 -17686550 -9146382
2441 -9146382 -371838 -2892526 -18096344 -21694172 7306885 44258480 42817711 6389405
2433 6389405 -7559517 28979659 70639625 66338512 30746138 10268633 11657284 11166966
2425 11166966 9785559 25904980 46026703 38089356 12170149 13809525 49157618 69098064
2417 69098064 45382689 13835539 14474937 31211988 27579866 9247576 7496387 20777748
2409 20777748 17715449 -9272054 -34456521 -43676158 -52245004 -70806700 -84636826 -79102146
2401 -79102146 -60674350 -39366573 -12496623 18083203 31826629 13231737 -21213850
2394 -21213850 -38508573 -25492006 4312505 32234088 47162451 44194028 29644735
2387 29644735 24361447 42856733 68824389 69915364 39305155 3956840 -12967075
2380 -12967075 -17786342 -25370526 -32583131 -28396808 -15906607 -6389947 -989615 5250139
2372 5250139 10064256 12503899 26518400 63881476 106202500 117042277 86411640 44946789
2364 44946789 27694848 38770509 57672455 65998310 59912799 47849517 44082118 56099959
2356 56099959 72801399 73667567 53471058 28074409 12358390 4335517 -3707759 -10947447
2348 -10947447 -12642410 -8309773 2450376 22262583 46319545 60092896 54726881 36277649
2340 36277649 14236826 -6994726 -18385166 -4594836 33439813 67403412 71765270
2333 71765270 57061869 53455761 65394386 64711334 32707597 -10158200 -28090473 -12689426
2325 -12689426 11601904 22119638 24612587 37867233 59651872 64358307 39458522
2318 39458522 8167150 305098 11711217 14584679 2560701 -1704581 14188544 34453370
2310 34453370 45292506 54476189 66562599 67145452 52616156 48720467 71717929 93801180
2302 93801180 80784115 47584278 38373426 60255112 76100790 63445915 42943812
2295 42943812 39705398 47793065 46665720 29841949 4108995 -22952056 -44448548 -55868139
2287 -55868139 -60666586 -62871737 -55035620 -29370289 1486933 15515166 13131158 15229676
2279 15229676 26937728 27798069 5146047 -25478139 -43440690 -47863432 -49505116 -53064262
2271 -53064262 -54876972 -45356728 -12841783 37547985 70719749 52438812 -3720470
2264 -3720470 -46924354 -51472682 -39469797 -34355875 -26955883 -4474425 19733572 29396335
2256 29396335 31898079 37105879 33957058 14763703 266651 9578249 22501911 4966073
2248 4966073 -37845988 -64649476 -50507323 -11508275 20146579 26215108 12056859
2241 12056859 2479380 21147384 60947553 86568114 78850576 57505423 43540073
2234 43540073 25691434 -8217932 -33218452 -20524027 9205000 11598609 -11520539
2227 -11520539 -15811327 12553003 35781717 25333668 -751485 -17362770 -29444319
2220 -29444319 -48148991 -63293269 -64626780 -64722349 -75750920 -83700249 -69338525 -38576493
2212 -38576493 -10047344 13169732 36756787 50670270 35432253 -8160900 -51611677
2205 -51611677 -63056747 -33694335 14953868 45230507 33354257 -7169065 -37921030
2198 -37921030 -35620451 -13298023 -470728 -12195086 -38911937 -55634342 -41014161
2191 -41014161 -172436 33442916 35301684 24142081 34876277 60932099 59349785
2184 59349785 20379482 -9200987 5551071 33065637 22410571 -23212948 -59655644
2177 -59655644 -68419939 -66080446 -58438101 -33711552 -3777618 -5621134 -45678310 -79799344
2169 -79799344 -71206109 -40441203 -31680337 -49307028 -57428870 -34309652 -735010 7635234
2161 7635234 -21412355 -69381065 -106070360 -112611184 -94010473 -71586636 -58664850
2154 -58664850 -46215482 -19819850 13328928 28076317 13736801 -11449820 -25139748
2147 -25139748 -26490760 -25064322 -16772648 9164472 44138129 63479177 58943838 47925187
2139 47925187 44384439 40752675 27860357 11592047 -4107500 -29136965 -62834493
2132 -62834493 -78899899 -61049185 -36205870 -40736026 -67325221 -81471483 -80200090
2125 -80200090 -90318707 -110008384 -101790672 -56138539 -16039765 -15864825 -35214408 -40639351
2117 -40639351 -37763357 -48689786 -66362322 -68829545 -59502343 -57587855 -62048067 -57158956
2109 -57158956 -42628900 -29259412 -16682033 -3383298 -4219660 -26453823 -42809381
2102 -42809381 -24389526 11036687 22426629 7853563 -12361 3928833 -10370115
2095 -10370115 -46429898 -61912334 -31302996 12899360 27419539 14212258 1909257
2088 1909257 -1877216 -9281013 -21364961 -28122303 -29753397 -34331189 -40365107 -39742351
2080 -39742351 -31889033 -20413325 -3557980 17539291 29237364 19923015 -889065
2073 -889065 -12444091 -9300508 -6232812 -17071344 -36445452 -43149203 -20407980 23313224
2065 23313224 55401633 50726540 21576077 2954630 8463894 19325928 20082715 20670325
2057 20670325 30615419 34811072 16415125 -12576653 -28593303 -34872595 -56037276 -94931689
2049 -94931689 -118906681 -97916560 -42351922 7154430 22646848 14895617 16176858
2042 16176858 40370865 67074410 70413334 54479727 44253237 45982238 41084591 24569982
2034 24569982 21831837 49537428 81900653 80935328 47202108 15035034 4792749 4737066
2026 4737066 -2716401 -20502442 -43350961 -63057056 -63993632 -33390182 16965254 54965215
2018 54965215 61580870 47974242 33928699 22983712 8837511 -3929329 -304789
2011 -304789 23191815 46385049 43165650 12339157 -16260157 -14747642 8115679 19686304
2003 19686304 10488518 6798939 26799941 48158837 41404158 17533237 11973709 29854250
1995 29854250 40956323 30004552 18296128 24679752 34623902 27016074 10540719 10921925
1987 10921925 33440458 58368941 68783037 67300416 66882509 75267137 86312274 80568653
1979 80568653 41089262 -22679731 -73539856 -80352158 -50029107 -16599767 -2545883
1972 -2545883 -2124704 -439543 5334421 8585141 7079382 5547595 7356947 10192154
1964 10192154 10765858 9409358 6530678 -3633706 -29266905 -66782028 -95045601 -92915554
1956 -92915554 -64226672 -37573379 -36205052 -53385072 -64203888 -58470259 -52364931 -64634122
1948 -64634122 -88765464 -97218338 -72836525 -28721191 6534781 17973340 13509814
1941 13509814 9185399 13901606 26504506 37238113 31020445 892499 -36947129 -51946645
1933 -51946645 -30777576 6495946 27128179 15162139 -22789746 -67565106 -94758421
1926 -94758421 -87204294 -55515516 -34529798 -41288059 -46608931 -11016542 56864179 104012184
1918 104012184 96762607 56024486 22194443 8564783 2708189 -4574770 -9785084 -7259528
1910 -7259528 4939365 25159408 45587349 55012892 51117144 44383959 44392720 48873471
1902 48873471 51381030 52232159 55890792 64059141 76333888 90849828 99625541 90635926
1894 90635926 60361563 20093060 -11974299 -20174699 2721626 45773522 77849667
1887 77849667 73900901 46893302 34071962 45141960 47564378 17360606 -19466167
1880 -19466167 -21397742 8030994 24444014 3984433 -27457902 -32314929 -7589873
1873 -7589873 18223452 22535831 10895206 3968240 9870152 15382865 7407432 -4209527
1865 -4209527 1212430 22878418 39395213 46214263 64210928 94494898 95300754 38193739
1857 38193739 -33601533 -49371781 -8674520 14660824 -22588017 -72672875 -70509655
1850 -70509655 -28739684 -14090553 -47607848 -78441132 -60935704 -15774134 5655912
1843 5655912 -9758449 -30745590 -32020503 -22421076 -20149093 -22155868 -11875240 12743874
1835 12743874 34424075 39244851 32301373 27084591 28274019 31338867 32679292 31566774
1827 31566774 24833096 8883558 -11129297 -20652270 -9158053 16782032 37351526
1820 37351526 39383280 32149739 37443105 58945081 68579917 36923575 -24067596 -66666870
1812 -66666870 -62754132 -36296490 -26638421 -34428860 -26117056 14259436 62390203 86142851
1804 86142851 80385587 60922457 39931407 21216888 11630632 21829105 52546526
1797 52546526 86913086 102677044 94330548 80313168 82074198 96049215 96237449 68917337
1789 68917337 32956727 15468231 17816517 20596553 14927239 10729172 16420243 28321764
1781 28321764 41299410 53617572 58649418 47355565 23760873 5190397 3174118
1774 3174118 15284135 36274894 61788069 79062236 73416530 51927284 42478606 57034227
1766 57034227 71414811 57320168 22672487 1305972 8222328 24671800 29362067
1759 29362067 26904985 34953170 52865927 58724909 39665279 11793260 -1337681 -1156282
1751 -1156282 -5862734 -12236823 6803016 55122399 91470423 79244697 38226285 16723741
1743 16723741 26734074 40695440 41791276 37743358 28971670 6836868 -12834507 417990
1735 417990 37508101 50453985 24588085 5248218 27259656 60698981 60457691 32808297
1727 32808297 14192800 14474426 21616711 36447335 60702137 72894430 59087725 47862992
1719 47862992 70080212 101961064 96735756 58967646 35519033 40949992 46100029 39070513
1711 39070513 41900635 59435060 64387682 48167065 40595243 60935882 88060323 96231181
1703 96231181 86348221 68049460 44156338 24553418 22872134 31046046 30407735 29668024
1695 29668024 50544933 78022920 82183970 93624720 181682158 329179722 405539407
1688 405539407 319265814 139040350 2455880 -47182083 -66204903 -94504339 -115213508
1681 -115213508 -114753662 -109239399 -108241537 -105990439 -108387862 -123501120 -131761584 -110806606
1673 -110806606 -80154238 -73798053 -80491241 -64161555 -32573840 -25914976 -42733081
1666 -42733081 -41548707 -17365298 -9223383 -22662217 -14386215 26580344 50733026 29879210
1658 29879210 3206424 5435420 8727385 -19177029 -51742258 -50166524 -30576952 -31262447
1650 -31262447 -46429032 -45120189 -28479187 -16862176 -4036008 23904417 44437412
1643 44437412 27134484 -8369291 -16139031 4463279 13942114 2799225 780125 14619087
1635 14619087 12367251 -17666710 -41135170 -29501995 2042967 27507566 45969890
1628 45969890 63977438 71889097 60263377 39097613 23807306 19377669 27870457 49115315
1620 49115315 63831839 42346052 -13968638 -62980699 -70956828 -51202209 -36639034
1613 -36639034 -35291482 -35390198 -36980123 -50219075 -69038055 -72115929 -52219334 -26949889
1605 -26949889 -15434507 -15840279 -13086638 -4325150 -8055908 -41106502 -88987914 -113806369
1597 -113806369 -100316905 -79134873 -86925855 -116410495 -130171333 -114566293 -89109036
1590 -89109036 -66401688 -39015827 -10334408 -523577 -9517111 -9824835 7501737 15877633
1582 15877633 2928192 -1774780 19979012 31003836 -7710253 -65481584 -74741143
1575 -74741143 -22553181 39769942 72324918 80909280 73306843 35658380 -27175533
1568 -27175533 -71291363 -64194027 -28143881 -5853252 -4314167 88889 17055563 32708165
1560 32708165 37600666 37693148 36167967 24749066 -725586 -28482892 -41142954 -32743722
1552 -32743722 -13020162 2037698 3963536 -583317 3354897 21513622 40404827 38506877
1544 38506877 9353133 -27912088 -44760986 -32835231 -13790446 -12798998 -25133484
1537 -25133484 -22559736 4390937 28514033 22719646 -781742 -7994475 9347115 26488894
1529 26488894 22776518 3841138 -13864722 -19181977 -4119901 31995290 68964847
1522 68964847 76939918 52277219 25849344 24796015 41101804 50007274 45875027 45531744
1514 45531744 64204105 98886137 129508314 131682503 98614188 54691312 34027785
1507 34027785 41304645 50636971 47141237 44766729 51730659 47954488 20864543 -1809612
1499 -1809612 11345397 42488821 46439140 18781126 2638351 24021338 57122335
1492 57122335 66283241 52024310 37392990 31174369 25037867 13757275 842346 -9045712
1484 -9045712 -13166997 -13210397 -18950599 -37123797 -52971774 -41396767 -6033236 12841015
1476 12841015 -13399095 -60990040 -82091186 -63120665 -31697699 -11071590 5514600
1469 5514600 28959793 44718523 25744649 -30739068 -91300323 -114498610 -89676426
1462 -89676426 -46340699 -23589402 -32224297 -51795416 -60921214 -56821337 -43222209 -18230114
1454 -18230114 13481308 32902569 29652711 20520885 23608805 24760087 -2013015 -45611452
1446 -45611452 -63319415 -40529787 -11118955 -4343089 -4656361 11336209 27008729 10566118
1438 10566118 -29110044 -50930646 -41218565 -27631146 -30772888 -37950020 -36084274 -37728093
1430 -37728093 -54644271 -70524240 -63172499 -36988663 -12134985 4352570 15542541
1423 15542541 16464708 3825849 -5427792 8105652 33949367 43165306 31233556 22835233
1415 22835233 30355685 34897022 18890881 -6322236 -20691590 -24855770 -32673266 -47969761
1407 -47969761 -64994761 -81359978 -94264649 -91723775 -63956363 -20368664 16716611
1400 16716611 32205780 24237851 -1881146 -33995092 -53760793 -49918161 -28445731
1393 -28445731 -2587249 19008901 26637661 7916289 -29966073 -49386124 -19932857
1386 -19932857 37175537 68731126 54871916 28731760 25306832 38020547 40279157
1379 40279157 27123421 13926517 7154087 -888174 -11936132 -14805311 -1819130 17465691
1371 17465691 23196951 4968039 -24514438 -38631201 -26842313 -11551874 -21416996
1364 -21416996 -49809378 -60034764 -35905014 -3275680 10460234 13636457 26493157
1357 26493157 41676581 37958349 20809872 17097285 33198848 48768171 52815972 55920193
1349 55920193 60753188 49620543 13907705 -27085994 -50200407 -52808520 -43064308 -26756588
1341 -26756588 -15213885 -21986117 -35043592 -18077017 35860814 75649448 50704077
1334 50704077 -17396225 -59946686 -49753521 -23389218 -14662690 -11336974 6723696
1327 6723696 26830790 28084182 17865281 13792657 10158763 -6533897 -23705941 -17137047
1319 -17137047 9153461 29279411 37407371 50860849 70922933 74374568 52627434
1312 52627434 29033410 24237673 31284731 40175234 58953116 87381912 94537661 55063612
1304 55063612 -5705244 -36047310 -22589457 13784 3856827 279163 9015526 23623729
1296 23623729 25527714 13962912 3045565 -13225 2667438 11045109 24713958 32712156
1288 32712156 20822849 -9344014 -38102700 -46361998 -31187639 -4075202 19606068
1281 19606068 29701392 26336489 18268223 14054765 14910064 16718668 15110872 5945975
1273 5945975 -13295118 -35807030 -43379937 -22460240 15730231 39022080 23917986
1266 23917986 -20560861 -61505249 -73480121 -59641274 -43017544 -39942606 -44430177
1259 -44430177 -38763066 -16335290 10163442 23847707 23111087 22340981 32929882 46278173
1251 46278173 40325550 6644843 -32510946 -44336647 -25509195 -9709827 -24924468
1244 -24924468 -55312547 -64728227 -50795807 -47564965 -70294012 -88357796 -70957458
1237 -70957458 -34211253 -15091029 -15962095 -9426764 9275160 13774008 -3468255 -9330453
1229 -9330453 22971185 71718167 94602640 80270514 49254056 19746957 -905023
1222 -905023 -2691880 17223086 34693844 21254090 -9593458 -11749264 25787649 53287745
1214 53287745 26132185 -29655799 -50690675 -19886360 20516820 35122783 33993593
1207 33993593 35197110 27004081 -5980744 -43103372 -47034941 -14806408 18610516 26881674
1199 26881674 18331839 12183307 11500230 9872598 7959516 8970697 6502861 -9477305
1191 -9477305 -36259309 -56643685 -54870544 -32030598 -6617534 410838 -15326020 -37203559
1183 -37203559 -44823060 -32781633 -7976279 24064263 57174425 73578624 54897259
1176 54897259 9271088 -29489575 -38704541 -28958315 -21303616 -19020640 -15585028 -14678735
1168 -14678735 -21729490 -25345745 -10312376 13908523 20100993 1586117 -15824499 -7362191
1160 -7362191 19643392 36596402 25798316 -4690292 -30255800 -28762694 1291024
1153 1291024 35636211 44129308 22407564 -772101 6444608 44309067 81074919 85485844
1145 85485844 56086740 18545162 -2914013 -7501890 -9871944 -16556608 -21136210 -21866349
1137 -21866349 -27996740 -41084622 -46062227 -35282671 -27615876 -43135028 -68159548 -70321329
1129 -70321329 -45216743 -21680567 -18006417 -19392539 -7558147 11583679 23306393
1122 23306393 26626227 25674180 15795737 -4018040 -18572596 -14971723 -3526885 -2331464
1114 -2331464 -9634887 -10463407 -4757086 -8618251 -27729989 -46716576 -48525852 -32528499
1106 -32528499 -9712696 11890214 32819834 55198515 70812731 61111841 20077229
1099 20077229 -25106837 -36861754 -17401172 -11286176 -40857765 -65250501 -35118846
1092 -35118846 29861699 59807731 27456785 -20468261 -34144928 -23516085 -28701495
1085 -28701495 -57821751 -83883606 -87262436 -72977309 -52171445 -30279726 -13878725
1078 -13878725 -11435438 -22081875 -31892163 -24820265 2940225 35868065 48112318 30404683
1070 30404683 8343374 17295782 53706532 71378708 38878560 -18943534 -56023860
1063 -56023860 -64467339 -72402927 -93078602 -107590259 -99005800 -75456509 -52049575 -32965509
1055 -32965509 -21014423 -24429277 -41391900 -53713609 -49019419 -36652519 -29680137 -23788299
1047 -23788299 -8298697 11949379 21587768 16045177 4385765 -4865654 -8804475 -5822316
1039 -5822316 961476 -705902 -20214348 -48902858 -67510394 -66554783 -49751418 -23346309
1031 -23346309 3785711 15738095 5360919 -7377137 4397937 33222867 41178976
1024 41178976 13058499 -20770597 -29457731 -22685150 -22757666 -20476510 5087212 36698428
1016 36698428 31470850 -15687747 -60417351 -70034555 -59991076 -54116349 -45529920 -24492667
1008 -24492667 -14285657 -40512111 -81238543 -88360298 -54236766 -19803800 -13850088
1001 -13850088 -19802625 -13198674 5236 1174411 -8471590 -14084273 -10574474 -1214642
993 -1214642 14804993 35827072 48992655 45195798 34252756 29078762 24392649 10254690
985 10254690 -1774264 9818136 40698765 60735937 54045924 37552873 32060355 34443952
977 34443952 30596906 20648128 16166499 20537244 25154054 21989115 12866435 9817616
969 9817616 28116539 69496606 109024331 111986615 71577150 17609434 -19518840 -37206797
961 -37206797 -42142191 -25535812 18537734 64809262 78493582 61504612 46963337
954 46963337 47164803 39291506 10857164 -13093587 -6189018 20906275 39279263 39509079
946 39509079 29645766 13139404 -7489902 -18850915 -13097162 -4879324 -7529680 -4688429
938 -4688429 24471506 60997084 63281083 28097940 -1745996 2491726 22151281 29240157
930 29240157 23762598 15374865 -187327 -21963606 -28452598 -10529080 2585518 -17150954
922 -17150954 -48376499 -47742599 -14350509 12500811 16660880 24964790 56001256 86903155
914 86903155 89387365 70530672 55813359 51359211 45166314 33012044 22137647 15352174
906 15352174 8197585 -179503 -4019287 2943989 22788592 48470222 61389959 46905669
898 46905669 18408877 10072322 34002281 59777980 52438683 17316735 -12472216 -21630688
890 -21630688 -21274387 -18702257 -7566250 8920463 12052861 -4436817 -21154862 -19953686
882 -19953686 -6970956 3751309 12660514 23749437 24876821 492944 -41335316 -73235138
874 -73235138 -78035254 -59412055 -27551911 7758884 31857030 34129986 25872034 29714601
866 29714601 45527748 47584640 25375839 4537795 9053497 22489668 13307591 -13595891
858 -13595891 -22115266 829568 28087066 35611912 33339708 38668922 44793063 36860144
850 36860144 21726582 17498588 24185541 28139285 28559394 34994935 41089381 27159050
842 27159050 -5820971 -28327457 -19835247 3770691 14567284 10390851 10274485 19719154
834 19719154 21415199 3881655 -17163382 -17558010 2612378 18940511 16186725 7887883
826 7887883 12762629 22562814 12917590 -15437031 -30354225 -13268189 11757378 13348851
818 13348851 -772180 -280793 15415453 15047629 -13392425 -42332664 -45318718 -29331645
810 -29331645 -12061724 6494426 29601541 43411117 35820227 19674145 12124137 4487693
802 4487693 -19428404 -45308365 -41395774 -7922235 18588308 16050699 3199210 5391289
794 5391289 20245009 31792470 36207251 35214945 22214357 -4060322 -25221928 -24081295
786 -24081295 -10590521 -5929924 -8785031 -1820021 12347183 10113767 -13134645 -28846963
778 -28846963 -14267488 15704956 32703399 33979318 36471156 43719430 43080310 31789085
770 31789085 22019805 17973369 9108452 -8156712 -21037781 -21330298 -19266321 -25758052
762 -25758052 -34655535 -34026373 -22963086 -6374103 13624167 28563933 20970140 -11253320
754 -11253320 -40372812 -40030995 -21553395 -16343999 -30333672 -42930430 -46204658 -52525337
746 -52525337 -60006200 -44559365 -352634 39851885 43650177 17666650 -10133456 -27497961
738 -27497961 -38159648 -42250395 -38092611 -31612208 -24900941 -6992470 25251942 49159323
730 49159323 39818322 1803021 -41698046 -78743987 -105176982 -105973061 -71614636 -26032469
722 -26032469 -4913893 -7543695 -3562248 11274551 4958386 -33571104 -65100032 -51793624
714 -51793624 -9677410 18394459 21000078 18416565 18537710 7121233 -18836902 -37343270
706 -37343270 -29194076 -1249374 24914449 34249258 23930966 1529077 -16213090 -14035481
698 -14035481 5006465 21128512 21399089 13339962 9891626 11619333 13345621 18203571
690 18203571 29667927 35160992 17394689 -15593571 -31840224 -17031006 2505368
683 2505368 -5578569 -35103685 -51774299 -39456757 -12550176 12893572 32222169 35094400
675 35094400 7798564 -35157793 -51628502 -24099650 12865568 19832346 3920959
668 3920959 -4106723 -1587840 -6370821 -12732366 2543768 34002750 49177386 40261256
660 40261256 34933044 46875099 53803796 39569068 22022265 18166013 13784167 -6273622
652 -6273622 -24543147 -17743872 2357043 5454719 -12406037 -28465513 -29603694 -24097798
644 -24097798 -22261024 -26179363 -33939296 -37302695 -23238343 6021293 26362643 24109193
636 24109193 20264477 37900074 60025626 52503482 20053197 1925487 12219757 22807789
628 22807789 13167112 211003 3227832 12139022 12054603 11760879 21916104 26720168
620 26720168 6916661 -23170832 -32096289 -17737842 -7635055 -13707547 -15446162 4441647
612 4441647 31868905 42752763 36359201 31155455 35805953 39912861 32591184 18645672
604 18645672 12583024 21896550 39910725 53759619 56886111 52223352 44063683 31519504
596 31519504 13865310 -1896392 -7494480 -7687216 -18332899 -45148070 -72171110 -79035175
588 -79035175 -64561027 -45045867 -33501282 -30376028 -31826361 -35086659 -35043228 -26892372
580 -26892372 -14660850 -7171027 -4336346 706369 5047497 -1744779 -14251313 -10261422
572 -10261422 15536252 37045903 33091654 19257526 20326583 27975458 16751708 -8635565
564 -8635565 -18361400 -7967382 -6254978 -26007844 -42654944 -35918584 -20578329 -17223701
556 -17223701 -20835459 -20149710 -22442960 -33492899 -35134948 -12294762 14040916 11763439
548 11763439 -14977299 -33240794 -29862574 -23588416 -30203718 -41507252 -41405677 -23343626
540 -23343626 8410771 38066090 43317050 20424819 -1444206 6122407 27884444 23399544
532 23399544 -12298589 -37519230 -21161141 17152269 38040059 30558323 12316297
525 12316297 -1647029 -10988762 -19043205 -24244656 -20327840 136534 36483135 71862258
517 71862258 84198195 68977636 41910569 17761784 -362984 -8780681 1109355 24877054
509 24877054 38330739 24295097 -2060472 -9923200 7649360 24392426 14357872
502 14357872 -14204527 -27078403 -5827155 28025389 39463962 24665570 12006084
495 12006084 17530116 23536355 14233480 7357138 24098053 46221570 38068016 2788433
487 2788433 -20653786 -16297914 -9429643 -19074699 -28681887 -18827554 1963337 16539310
479 16539310 22299532 17605544 -7948424 -48328401 -70364271 -52615484 -15465342 10589073
471 10589073 26672610 49259479 70458802 66356921 35535376 550213 -23124774
464 -23124774 -34650794 -31549636 -12825917 5751176 6100608 -3515088 1327000 23290256
456 23290256 40077127 39046093 29262959 17010344 -3038384 -25499693 -30639763 -15046350
448 -15046350 -1221308 -1600678 2911811 27924854 51434371 44622960 22906222 29002359
440 29002359 64693827 78088692 36474913 -19145605 -23939955 22440283 55119297
433 55119297 31602246 -16837130 -35495707 -16179815 8870322 20186750 24887214
426 24887214 28179596 25185411 20136908 24068013 31707983 28467240 21925941 35189785
418 35189785 63608005 72186547 47882054 20621280 15187538 16072509 4096678 -4299577
410 -4299577 12994191 39282253 41297730 20139131 4184376 876510 -9977849 -37958852
402 -37958852 -66151634 -73690888 -53861521 -14505617 22177239 31303177 15891682 10003655
394 10003655 29385304 41270513 14397286 -25719342 -35324612 -25806457 -42536682 -79707750
386 -79707750 -80707805 -31124678 12144634 7152755 -14456761 -7528253 16696175 21426609
378 21426609 6933452 -2378003 -6386580 -20247148 -35008107 -29486155 -10849408 -5185894
370 -5185894 -13788709 -13602386 1645720 12650248 7194094 -6108500 -17939796 -26956143
362 -26956143 -26541021 -7134783 23527361 42884109 41002426 28499624 15250331 539710
354 539710 -11873676 -9770320 6945232 18285070 9013457 -9469465 -13447731 3996627
346 3996627 27918137 40761385 38027763 27400880 20245885 24320466 38824148 53567363
338 53567363 55846389 42273979 24025737 16335385 20739263 22414679 9611143 -9520712
330 -9520712 -17510351 -10899382 -1930129 1262025 2669936 5094316 3346600 -3301879
322 -3301879 -4360140 7786028 25645161 35246656 29647619 10088146 -16133390 -34612055
314 -34612055 -32793857 -16056867 -2461977 4335786 20675980 51349299 70762712 54213224
306 54213224 16042553 -4393698 10246447 40363461 58343760 55079904 37849979
299 37849979 17545459 1861321 -8391716 -18323191 -28815851 -30531613 -15866449 6931707
291 6931707 20790935 18372180 5976104 -6758942 -12722283 -8272108 1576808 3478547
283 3478547 -8133242 -19406471 -12832318 8508409 24049327 21533994 9166782 2711306
275 2711306 9507887 24832811 37026648 37367265 29320973 23885389 23055659 18037329
267 18037329 9293926 12742411 32759483 44414443 23334556 -16931626 -40748350 -37299717
259 -37299717 -26537417 -21346643 -12611255 3328999 10650626 677442 -9324045 -658212
251 -658212 18730513 27644690 22920573 20712357 31070890 45085238 47472959 33678187
243 33678187 13371598 90600 -3156882 -7365300 -22705562 -42403591 -49345904 -37672379
235 -37672379 -17478274 2008542 20599924 35189902 34942583 18167236 2363299 4638562
227 4638562 18764050 24009565 12865262 -2289019 -9068693 -9403580 -10740115 -12888992
219 -12888992 -11156199 -7940271 -12401909 -26990953 -40029252 -36061806 -11756303 21053851
211 21053851 44994749 46457970 21876952 -14920933 -35192097 -20707319 10029822
204 10029822 16516592 -15214365 -53807857 -63132136 -45641655 -28266832 -19280973 -4383902
196 -4383902 19530745 33735462 25793312 7800817 -1378063 2679350 12985128 22324711
188 22324711 25106965 19131222 10892122 9934498 15834914 21647181 29983880 49360385
180 49360385 71613312 72614230 45288492 14938935 8134047 19652603 25459732 17822839
172 17822839 9898981 11110020 15909186 17455295 18219562 23276294 32318520 41917945
164 41917945 49710413 54126271 54678722 53859495 54522975 54511235 48613888 37932144 32447485
155 32447485 39007360 48507532 42109824 13630317 -19365240 -33130537 -23845639 -8803079
147 -8803079 -3067668 -4679207 -4160991 2071671 11667405 19816610 19093578 7045182 -2505072
138 -2505072 9130106 36165482 48551797 32943088 13775526 16134496 27214312 19215594
130 19215594 -5335864 -20697143 -19578322 -15808362 -11685370 3286160 22020760 22593998
122 22593998 5340734 -5596110 -4243571 -13150357 -41368743 -64741898 -63511995 -50282073
114 -50282073 -42629296 -34385617 -14406506 8494856 19796384 20300231 16104476 5974882
106 5974882 -6359520 -7720154 1599060 2543859 -9549289 -12134232 4960943 14943646
98 14943646 -5267039 -35600398 -44383799 -36342753 -34770776 -35434722 -17716697 10372389
90 10372389 18829201 3372240 -9939698 -7750537 -4315072 -11265651 -21901460 -29043860
82 -29043860 -32843609 -28437932 -9837660 12692128 22475718 23469972 33390104 50667150
74 50667150 54665711 40141296 24430256 16370149 4208001 -19445541 -44536012 -61708344
66 -61708344 -71341037 -69614358 -49091525 -19688782 -6041132 -15808700 -30949272 -36477494
58 -36477494 -36115882 -33438091 -21959446 -4068181 2811409 -8862833 -24712149 -31589090
50 -31589090 -33735504 -36182260 -32497095 -21188288 -15515757 -23963123 -37156882 -45067963
42 -45067963 -50053052 -51965336 -38813687 -5857125 31533825 56331122 66932105 67099577
34 67099577 56677480 41908573 34837269 31081962 10428602 -26357805 -46033489 -28544510
26 -28544510 -1427636 -2716416 -27141993 -37848678 -20114297 4935825 14132484 4562293
18 4562293 -14655017 -31206566 -32658868 -19152716 -9414698 -17642822 -31386810 -31160552
10 -31160552 -23591358 -31044267 -52753389 -63014582 -50426682 -34409016 -34972380 -45458562
2 -45458562 -45529335 -28188451
0 -28188451
##END NTUPLES=NMR SPECTRUM
##END=
