##TITLE=31Pdec_LR-657-RM4
 CH2Cl2, 24 sc
 11.3.2019
##JCAMPDX= 6.0         $$ Bruker NMR JCAMP-DX V2.0
##DATA TYPE= NMR SPECTRUM
##DATA CLASS= NTUPLES
##ORIGIN= UXNMR, Bruker Analytische Messtechnik GmbH
##OWNER= root
$$ XWIN-NMR		Version 3.5
$$ Mon Mar 11 14:55:09 2019 Russian Standard Time (UT+4h)  she@DPX200
##.OBSERVE FREQUENCY= 81.013821
##.OBSERVE NUCLEUS= ^31P
##.ACQUISITION MODE= SIMULTANEOUS
##.ACQUISITION SCHEME= undefined
##.AVERAGES= 124
##.DIGITISER RES= 17
##SPECTROMETER/DATA SYSTEM= spect
##.PULSE SEQUENCE= zgpg30
##.SOLVENT NAME= DMSO
##.SHIFT REFERENCE= (INTERNAL, DMSO, 0, 182.463)
##AUDIT TRAIL= $$ (NUMBER, WHEN, WHO, WHERE, WHAT)
$$ ##TITLE= Audit trail, XWIN-NMR		Version 3.5
$$ ##JCAMPDX= 5.01
$$ ##ORIGIN= Bruker BioSpin GmbH
$$ ##OWNER= she
$$ F:/spectra/data/she/nmr/P31/1/pdata/1/auditp.txt
$$ ##AUDIT TRAIL=  $$ (NUMBER, WHEN, WHO, WHERE, WHAT)
(   1,<2019-03-11 14:50:59.15 +0400>,<she>,<DPX200>,
      <continue with go, POWCHK disabled, PULCHK disabled
       configuration hash MD5:
       00 E9 B6 7A A2 85 ED C7 34 08 36 98 17 FE 4E 26
       data hash MD5: 32K
       0B 94 75 7C C0 30 F3 07 8A 3E 4E E1 D4 84 42 66>)
(   2,<2019-03-11 14:54:05.01 +0400>,<she>,<DPX200>,
      <Start of raw data processing
       efp BC_mod = 2 LB = 1 FT_mod = 6 PKNL = 1 PHC0 = -1457.777 PHC1 = 76.99897 SI = 64K 
       data hash MD5: 64K
       CE E4 11 07 EA 0F F8 53 D9 1B 16 97 5B DC 39 77>)
(   3,<2019-03-11 14:54:29.62 +0400>,<she>,<DPX200>,
      <pk PHC0 = -473.794 PHC1 = 389.0001 
       data hash MD5: 64K
       4C 1E 7D F6 BD 98 3E 5D 71 9A 8A 45 55 8F 6F 9C>)
(   4,<2019-03-11 14:54:33.03 +0400>,<she>,<DPX200>,
      <abs ABSG = 5 
       data hash MD5: 64K
       7F 6A D2 3F 7D 3A D2 4F 27 DE 79 40 FF 74 B0 35>)
$$ ##END=
$$ 
$$ hash MD5
$$ 20 16 71 C1 F3 F2 EC C9 90 DF F5 5E 0C 8E 46 B5
##$RELAX= 
##$RELAX= 
##$RELAX= 
##$RELAX= 
##$RELAX= 
##$RELAX= 
##$RELAX= 
##$RELAX= 
$$ Bruker specific parameters
$$ --------------------------
##$DU= <F:/spectra>
##$EXPNO= 1
##$NAME= <P31>
##$PROCNO= 1
##$TYPE= <nmr>
##$USER= <she>
##$AMP= (0..31)
100 100 100 100 100 100 100 100 100 100 100 100 100 100 100 100 100 100 
100 100 100 100 100 100 100 100 100 100 100 100 100 100 
##$AQSEQ= 0
##$AQ_mod= 1
##$AUNM= <au_zg>
##$AUTOPOS= <>
##$BF1= 81.014009
##$BF2= 200.13
##$BF3= 200.13
##$BF4= 200.13
##$BF5= 200.13
##$BF6= 200.13
##$BF7= 200.13
##$BF8= 200.13
##$BYTORDA= 1
##$CFDGTYP= 0
##$CFRGTYP= 5
##$CHEMSTR= <none>
##$CNST= (0..31)
1 1 145 1 1 1 1 1 1 1 1 1 1 1 1 1 1 1 1 1 1 1 1 1 1 1 1 1 1 1 1 1 
##$CPDPRG= <waltz16>
##$CPDPRG1= <>
##$CPDPRG2= <waltz16>
##$CPDPRG3= <>
##$CPDPRG4= <mlev>
##$CPDPRG5= <mlev>
##$CPDPRG6= <mlev>
##$CPDPRG7= <mlev>
##$CPDPRG8= <mlev>
##$CPDPRGB= <>
##$CPDPRGT= <>
##$D= (0..31)
0 1 0 0 0 0 0 0 0 0 0 0.03 2e-05 3e-06 0 0 0 0 0 0 0 0 0 0 0 0 0 0 0 0 
0 0 
##$DATE= 1552301257
##$DBL= (0..7)
120 120 120 11 120 120 24 19 
##$DBP= (0..7)
150 150 150 150 150 150 150 150 
##$DBP07= 0
##$DBPNAM0= <>
##$DBPNAM1= <>
$$ [...]
##$SUBNAM3= <"">
##$SUBNAM4= <"">
##$SUBNAM5= <"">
##$SUBNAM6= <"">
##$SUBNAM7= <"">
##$SUBNAM8= <"">
##$SUBNAM9= <"">
##$SW= 369.568048894756
##$SWIBOX= (0..15)
0 1 3 0 0 0 0 0 0 0 0 0 0 0 0 0 
##$SW_h= 29940.119760479
##$TD= 32768
##$TD0= 1
##$TE= 0
##$TE2= 300
##$TE3= 300
##$TEG= 300
##$TL= (0..7)
0 120 53 12 22 120 120 120 
##$TP= (0..7)
150 150 150 150 150 150 150 150 
##$TP07= 0
##$TPNAME0= <>
##$TPNAME1= <>
##$TPNAME2= <>
##$TPNAME3= <>
##$TPNAME4= <>
##$TPNAME5= <>
##$TPNAME6= <>
##$TPNAME7= <>
##$TPOAL= (0..7)
0.5 0.5 0.5 0.5 0.5 0.5 0.5 0.5 
##$TPOFFS= (0..7)
0 0 0 0 0 0 0 0 
##$TUNHIN= 0
##$TUNHOUT= 0
##$TUNXOUT= 0
##$USERA1= <user>
##$USERA2= <user>
##$USERA3= <user>
##$USERA4= <user>
##$USERA5= <user>
##$V9= 5
##$VALIST= <valist>
##$VCLIST= <CCCCCCCCCCCCCCC>
##$VD= 0
##$VDLIST= <DDDDDDDDDDDDDDD>
##$VPLIST= <PPPPPPPPPPPPPPP>
##$VTLIST= <TTTTTTTTTTTTTTT>
##$WBST= 1024
##$WBSW= 4
##$XGAIN= (0..3)
0 0 0 0 
##$XL= 0
##$YL= 0
##$YMAX_a= 32189
##$YMIN_a= -61856
##$ZGOPTNS= <>
##$ZL1= 120
##$ZL2= 120
##$ZL3= 120
##$ZL4= 120
##$ABSF1= 182.463
##$ABSF2= -187.1042
##$ABSG= 5
##$ABSL= 3
##$ALPHA= 0
##$AQORDER= 0
##$ASSFAC= 0
##$ASSFACI= 0
##$ASSFACX= 0
##$ASSWID= 0
##$AUNMP= <proc_1d>
##$AZFE= 0.1
##$AZFW= 0.5
##$BCFW= 0
##$BC_mod= 2
##$BYTORDP= 0
##$COROFFS= 0
##$CY= -3
##$DATMOD= 1
##$DC= 0
##$DFILT= <>
##$DTYPP= 0
##$F1P= 0
##$F2P= 0
##$FCOR= 1
##$FTSIZE= 65536
##$FT_mod= 6
##$GAMMA= 0
##$GB= 0
##$INTBC= 1
##$INTSCL= 5.30512e-09
##$ISEN= 30
##$LB= 1
##$LEV0= 0
##$LPBIN= 0
##$MAXI= 10000
##$MC2= 0
##$MEAN= 0
##$ME_mod= 0
##$MI= 50
##$NCOEF= 0
##$NC_proc= -8
##$NLEV= 6
##$NOISF1= 182.463
##$NOISF2= 159.3651
##$NSP= 0
##$NTH_PI= 0
##$NZP= 0
##$OFFSET= 182.463
##$PC= 4
##$PHC0= -1931.571
##$PHC1= 465.9991
##$PH_mod= 1
##$PKNL= yes
##$PPARMOD= 0
##$PSCAL= 0
##$PSIGN= 0
##$REVERSE= no
##$SF= 81.0140089999434
##$SI= 65536
##$SIGF1= 159.3651
##$SIGF2= -187.1042
##$SINO= 113.3802
##$SIOLD= 16384
##$SREGLST= <1H.CDCl3>
##$SSB= 0
##$STSI= 65536
##$STSR= 0
##$SW_p= 29940.119760479
##$SYMM= 0
##$S_DEV= 0
##$TDeff= 32768
##$TDoff= 0
##$TI= <>
##$TILT= no
##$TM1= 0
##$TM2= 0
##$TOPLEV= 0
##$USERP1= <user>
##$USERP2= <user>
##$USERP3= <user>
##$USERP4= <user>
##$USERP5= <user>
##$WDW= 1
##$XDIM= 65536
##$YMAX_p= 291793902
##$YMIN_p= -78060640
$$ End of Bruker specific parameters
$$ ---------------------------------
##NTUPLES= NMR SPECTRUM
##VAR_NAME=  FREQUENCY,     SPECTRUM/REAL,   SPECTRUM/IMAG
##SYMBOL=    X,             R,               I
##VAR_TYPE=  INDEPENDENT,   DEPENDENT,       DEPENDENT
##VAR_FORM=  AFFN,          ASDF,            ASDF
##VAR_DIM=   65536,         65536,           65536
##UNITS=     HZ,            ARBITRARY UNITS, ARBITRARY UNITS
##FACTOR=    0.456856943014862, 1,           1
##FIRST=     14782.0589164792, 0,            0
##LAST=      -15158.0608439998, 0,           0
##MIN=       -15158.0608439998, -78060640,   0
##MAX=       14782.0589164792, 291793902,    0
$$ Real data points
##PAGE= N=1
##DATA TABLE= (X++(R..R)), XYDATA
$$ [...]
$$ plain form
4071 5400232 -909839 399922 6531135 9982189 4981777 -4199540 -5973595 2817849
4063 2817849 10577426 7648555 1891030 6723296 19563472 26015459 22734517 20833870
4055 20833870 25563461 27850205 21010694 12716967 12651353 18108814 20095864 16510880
4047 16510880 11508652 7246634 3307095 367427 -883940 -655883 3425566 14446312
4039 14446312 26905241 27897493 14866441 3858220 9586880 23676849 25821687 13221997
4031 13221997 3860787 9205090 18713177 18072476 10460777 8854506 14815909 17761952
4023 17761952 13268327 9691335 13335235 16554559 7611242 -12336905 -29345709 -32430514
4015 -32430514 -23090834 -9369409 2644353 8618079 3496438 -14385518 -38219684 -56315812
$$ packed form
4071E400232o310071J309761O131213L451054n000412r181317j774055Q791444
4063B817849P759577k928871n757525M832266J2840176O451987l280942j900647
4055B0833870M729591K286744o839511q293727o5614N457461J987050l584984
4047A6510880n002228m262018l939539k939668j251367K28057M081449J1020746
4039A4446312J2458929R92252j3031052j1008221N728660J4089969K144838j2599690
4031A3221997r361210N344303R508087o40701p611699j606271N961403K946043
4023A7761952m493625l576992L643900L219324q943317j9948147j7008804l084805
4015c2430514R339680J3721425J2013762N973726n121641j7881956k3834166j8096128
$$ plain form
4007 -56315812 -60470908 -48812952 -24066955 5531611 26308585 28622269 18249742
4000 18249742 12261999 20723485 36630839 45480848 39661297 21517372 -1183348 -18036239
3992 -18036239 -19464929 -4242999 17546553 32942293 36180246 28676114 14027734 -1531890
3984 -1531890 -7831765 1220426 17364149 22825176 9314864 -11350045 -19352880 -8042166
3976 -8042166 10425676 20351320 19126457 15289521 13049712 6784847 -6168643 -15640778
3968 -15640778 -10718184 2522988 7038847 -1557383 -9549790 -6277081 1707852 4180966
3960 4180966 3654375 8716888 19746513 31553344 42608149 50526481 46106089 26043905
3952 26043905 6213859 6073540 21725291 30571935 22789118 11341992 8189664 8237659
$$ packed form
4007e6315812m155096J1657956K4745997K9598566K0776974K313684j0372527
4000A8249742n987743Q461486J5907354Q850009n819551j8143925k2700720j6852891
3992a8036239j428690J5221930K1789552J5395740L237953p504132j4648380j5559624
3984a531890o299875R052191J6143723N461027j3510312k0664909q002835J1310714
3976h042166J8467842R925644j224863l836936k239809o264865j2953490r472135
3968a5640778M922594J3241172M515859q596230p992407L272709P984933K473114
3960D180966n26591N062513J1029625J1806831J1054805P918332m420392k0062184
3952B6043905j9830046j40319J5651751Q846644p782817j1447126l152328M7995
$$ plain form
3944 8237659 3633567 -2241593 -5016472 -10029924 -21253127 -30498777 -29820900 -25426744
3936 -25426744 -26475629 -27970163 -18883138 -1760090 10194752 12437404 11923020 12715616
3928 12715616 12139432 10429306 11179910 12162488 8388754 4296675 8937931 17953279 15923819
3919 15923819 456008 -11964549 -10367420 -3453805 -559918 4676239 17899120 26544824
3911 26544824 17857060 4073635 7803751 27061174 37296194 28222938 16021686 13765263
3903 13765263 11631074 -1843694 -16547871 -15100819 521992 13121777 15224811 14696081
3895 14696081 17586589 19114215 13492578 3100699 -4669243 -4067616 5413695 16817441
3887 16817441 18869479 7829200 -5401513 -6893330 3184036 12628492 14891799 15328815
$$ packed form
3944H237659m604092n875160k774879n013452j1223203r245650O77877M394156
3936b5426744j048885j494534R087025J7123048J1954842K242652n14384P92596
3928A2715616n76184j710126P50604R82578l773734m092079M641256R015348k029460
3919A5923819j5467811j2420557J597129O913615K893887N236157J3222881Q645704
3911B6544824q687764j3783425L730116J9257423J0235020r073256j2201252k256423
3903A3765263k134189j3474768j4704177J447052J5622811J2599785K103034n28730
3895A4696081K890508J527626n621637j0391879p769942O01627R481311J1403746
3887A6817441K052038j1040279j3230713j491817J0077366R444456K263307M37016
$$ plain form
3879 15328815 18892430 20910916 14066568 -1339880 -17263626 -24221935 -17231888 -441862
3871 -441862 13974689 16723883 10764943 4890315 1149232 -3184826 -4707998 2795108
3863 2795108 14831622 19311413 14167944 7823639 1005401 -13917735 -30969335 -29460279
3855 -29460279 -6426393 10237280 -1638740 -26121849 -34146437 -25569598 -20848493 -22264073
3847 -22264073 -13895113 3906577 11636092 5195433 3739691 15477818 23488995 17049634
3839 17049634 10705849 16491521 21485527 13303308 7093067 22412901 48071820 56351211
3831 56351211 43333701 29456285 24758324 18969388 6264269 -3557591 -3224398 1529638
3823 1529638 5204507 10617908 18349276 21952565 19298604 16767564 17302728 15528989
$$ packed form
3879A5328815L563615K018486o844348j5406448j5923746o958309O990047J6790026
3871d41862J4416551K749194n958940n874628l741083m334058j523172P503106
3863B795108J2036514M479791n143469o344305o818238j4923136j7051600J509056
3855b9460279K3033886J6663673j1876020k4483109q024588Q576839M721105j415580
3847b2264073Q368960J7801690P729515o440659j455742J1738127Q011177o439361
3839A7049634o343785N785672M994006q182219o210241J5319834K5658919Q279391
3831E6351211j3017510j3877416m697961n788936j2705119r821860L33193M754036
3823A529638L674869N413401P731368L603289k653961k531040N35164j773739
$$ plain form
3815 15528989 9271673 4918294 6411613 8949860 8133995 5821177 3158727 -2113227
3807 -2113227 -7758424 -7114993 -963202 1798917 -778694 -453594 4630745 4374966 -4945124
3798 -4945124 -11387586 -6379492 950482 644178 -192672 8962130 22166513 27141409
3790 27141409 25230512 23832594 18654334 3983331 -7230008 2407764 23992404 31070692
3782 31070692 19345303 11331772 17209785 18958306 4218701 -10725662 -8980470 -1411779
3774 -1411779 -5403181 -13130503 -5994777 11227042 16700805 5675132 -6584457 -12920637
3766 -12920637 -20569368 -29101298 -27293528 -17054620 -16637007 -30780804 -39285507 -27886856
3758 -27886856 -11014733 -7702628 -11665565 -5565161 7024182 7057407 -8020718 -20557101
$$ packed form
3815A5528989o257316m353379J493319K538247q15865k312818k662450n271954
3807b113227n645197O43431O151791K762119k577611L25100N084339k55779r320090
3798d945124o442462N008094P329974l06304q36850R154802J3204383M974896
3790B7141409j910897j397918n178260j4671003j1213339R637772K1584640P078288
3782C1070692j1725389q013531N878013J748521j4739605j4944363J745192P568691
3774a411779l991402p727322P135726J7221819N473763j1025673j2259589o336180
3766a2920637p648731q531930J807770J0238908M17613j4143797q504703J1398651
3758b7886856J6872123L312105l962937O100404J2589343L3225j5078125j2536383
$$ plain form
3750 -20557101 -21204197 -20393339 -26692805 -31823535 -25655407 -12143965 -502264 8935412
3742 8935412 19868403 29078727 30702435 26148674 20546952 13745962 3877674 -4167889
3734 -4167889 -4133453 -153372 -2248077 -9669989 -9467458 4973631 23044730 30082160
3726 30082160 24910616 18064046 16919657 19084331 18424196 11915172 1085374 -8843606
3718 -8843606 -11371511 -4212652 6958884 12925012 9579740 656331 -7010337 -8210604
3710 -8210604 -892680 12001862 21242565 16684260 -2587903 -25571374 -39235829 -39305036
3702 -39305036 -29673157 -15173945 6341 8959261 4703474 -11005645 -26335102 -30932319
3694 -30932319 -26585528 -23209744 -26171242 -30896580 -28731022 -15254359 5504486 21968160
$$ packed form
3750b0557101o47096Q10858o299466n130730O168128J3511442J1641701R437676
3742H935412J0932991R210324J623708m553761n601722o800990r868288q045563
3734d167889L4436L980081k094705p421912K02531J4441089J8071099P037430
3726C0082160n171544o846570j144389K164674o60135o509024j0829798r928980
3718h843606k527905P158859J1171536N966128l345272q923409p666668j200267
3710h210604P317924J2894542R240703m558305j9272163k2983471j3664455o9207
3702c9305036R631879J4499212J5180286Q952920m255787j5709119j5329457m597217
3694c0932319M346791L375784k961498m725338K165558J3476663K0758845J6463674
$$ plain form
3686 21968160 22872829 9653271 -856816 6628299 26105999 35822915 25765053 10165213
3678 10165213 6819398 13146078 13199763 2559399 -7275082 -8862349 -10051028 -20593795
3670 -20593795 -37019111 -47462120 -46066953 -36911673 -27298071 -21906949 -21189642 -21971074
3662 -21971074 -21075880 -19526623 -20440553 -22800066 -22132695 -17697384 -12721531 -6793163 3700107
3653 3700107 15367174 18104732 10432974 4047588 5930492 7072448 -618794 -7460546
3645 -7460546 -1061246 10654637 10449447 999225 1535785 14939244 20980620 8959112
3637 8959112 -4413894 -1983421 7124592 4494739 -6953242 -8908891 2277787 10641566
3629 10641566 5134569 -6776172 -13018192 -12689678 -13548887 -21018733 -32956738 -41370652
$$ packed form
3686B1968160R04669j3219558j0510087P485115J9477700R716916j0057862j5599840
3678A0165213l345815O326680N3685j0640364r834481j587267j188679j0542767
3670b0593795j6425316j0443009J395167R155280R613602N391122P17307p81432
3662b1971074Q95194J549257r13930k359513O67371M435311M975853N928368J0493270
3653C700107J1667067K737558p671758o385386J882904J141956p691242o841752
3645g460546O399300J1715883k05190r450222N36560J3403459O041376j2021508
3637H959112j3373006K430473R108013k629853j1447981j955649J1186678Q363779
3629A0641566n506997j1910741o242020L28514q59209p469846j1938005q413914
$$ plain form
3621 -41370652 -39115580 -28277211 -19462996 -18551652 -18758349 -12226867 -3674360 -2709975
3613 -2709975 -7418988 -8356612 -6433693 -11706258 -22809900 -23405500 -5741409 15450352
3605 15450352 22051936 15404159 9348991 8606245 7300380 4861251 8500901 17605681
3597 17605681 18294002 1335387 -21373633 -27883189 -12977234 4360659 3881598 -11302444
3589 -11302444 -19979887 -10459279 6223000 13145907 8475329 2612731 1184447 1069044
3581 1069044 411989 1646960 3995273 2609326 -2679867 -6136886 -5976360 -7070871 -10879041
3572 -10879041 -11675142 -7549257 -6144830 -12067951 -16087688 -6844712 10451977 17316276
3564 17316276 4433977 -16816922 -27779196 -22863892 -13364924 -12397873 -18880115 -19194250
$$ packed form
3621d1370652K255072J0838369Q814215R11344k06697O531482Q552507R64385
3613b709975m709013r37624J922919n272565j1103642n95600J7664091K1191761
3605A5450352O601584o647777o055168p42746j305865k439129L639650R104780
3597A7605681O88321j6958615k2709020o509556J4905955J7337893m79061j5184042
3589a1302444q677443R520608J6682279O922907m670578n862598j428284j15403
3581A069044o57055J234971K348313j385947n289193l457019J60526j094511l808170
3572a0879041p96101M125885J404427n923121m019737R242976J7296689O864299
3564A7316276j2882299k1250899j0962274M915304R498968R67051o482242l14135
$$ plain form
3556 -19194250 -5543804 11797128 16410583 7625397 1506555 8297787 18276050 15792148
3548 15792148 382462 -13727222 -15548958 -7960732 -1854301 -4428796 -12702365 -16706176
3540 -16706176 -11164562 -4039613 -7968544 -21957723 -29409129 -18669112 1664005 13763906
3532 13763906 10805021 81282 -8447472 -10237680 -7443022 -7431732 -14793520 -21140866
3524 -21140866 -12023721 9891436 20523526 4820460 -19014627 -21284481 523206
3517 523206 22165584 27001907 20549336 11748594 400045 -12010561 -17050153 -13101780
3509 -13101780 -10660672 -16021838 -21517146 -19394759 -13987218 -11921417 -10701535 -5893147
3501 -5893147 -544043 1479808 3366208 7683614 8499187 496075 -10622154 -15961448
$$ packed form
3556a9194250J3650446J7340932M613455q785186o118842O791232R978263k483902
3548A5792148j5409686j4109684j821736P588226O106431k574495q273569m003811
3540a6706176N541614P124949l928931j3989179p451406J0740017K0333117J2099901
3532A3763906k958885j0723739q528754j790208K794658J1290p361788o347346
3524b1140866R117145K1915157J0632090j5703066k3835087k269854K1807687
3517E23206K1642378M836323o452571q800742j1348549j2410606n039592L948373
3509a3101780K441108n361166n495308K122387N407541K065801J219882M808388
3501e893147N349104K023851J886400M317406Q15573q003112j1118229n339294
$$ plain form
3493 -15961448 -15538102 -13560940 -8203230 3160569 13568712 13105392 3492221 -4540758
3485 -4540758 -6749759 -7894805 -9770955 -7746680 -853394 4381167 3829700 2477006
3477 2477006 7219341 17224088 24226703 19874908 2429343 -20443669 -35618089 -34996348
3469 -34996348 -22318213 -7135438 5670976 15965259 21067326 16379668 3774634
3462 3774634 -7983846 -13564939 -16024316 -19101493 -20647297 -17684345 -12822122 -10070512
3454 -10070512 -7476460 -201441 9989478 14613047 9721449 2666773 4048426 15140323
3446 15140323 26918589 30563845 25173061 15335612 5964684 1480580 5223620 15037703
3438 15037703 22238919 20207696 12752857 9086709 11624720 14296917 12333724 7082271
$$ packed form
3493a5961448M23346J977162N357710J1363799J0408143m63320r613171q032979
3485d540758k209001j145046j876150K024275O893286N234561n51467j352694
3477B477006M742335J0004747P002615m351795j7445565k2873012j5174420O21741
3469c4996348J2678135J5182775J2806414J0294283N102067m687658j2605034
3462C774634j1758480n581093k459377l077177j545804K962952M862223K751610
3454a0070512K594052P275019J0190919M623569m891598p054676J381653J1091897
3446A5140323J1778266L645256n390784r837449r370928m484104L743040R814083
3438A5037703P201216k031223p454839l666148K538011K672197j963193n251453
$$ plain form
3430 7082271 214656 -9666471 -21410494 -28320758 -25651997 -17667143 -12958896 -14638637
3422 -14638637 -17984478 -16146534 -6440888 7021489 15712690 13727194 3194169 -8713546
3414 -8713546 -16532065 -17467238 -9474973 4713208 14056808 8863898 -5984221 -16321197
3406 -16321197 -17116802 -15348991 -14557026 -10255500 -3910513 -6016404 -17451699 -22036727
3398 -22036727 -8669282 11045017 19336767 15497367 9053876 130077 -16592536 -35000142
3390 -35000142 -41968284 -35646814 -24582440 -12185779 2737615 13675702 12012549 3729260
3382 3729260 3023787 8873766 5921682 -9025250 -20092447 -17203134 -9676491 -6727120
3374 -6727120 -1563208 12812103 25591879 20957528 1179286 -16452844 -21615179 -18778572
$$ packed form
3430G082271o867615r881127j1744023o910264K668761P984854M708247j679741
3422a4638637l345841J837944R705646J3462377Q691201j985496j0533025j1907715
3414h713546p818519r35173P992265J4188181R343600n192910j4848119j0336976
3406a6321197p95605J767811P91965M301526O344987k105891j1435295m585028
3398b2036727J3367445J9714299Q291750l839400o443491q923799j6722613j8407606
3390c5000142o968142O321470J1064374J2396661J4923394J0938087j663153q283289
3382C729260p05473N849979k952084j4946932j1067197K889313P526643K949371
3374f727120N163912J4375311J2779776m634351j9778242j7632130n162335K836607
$$ plain form
3366 -18778572 -15278689 -11204668 -2477396 10633959 19612364 13566528 -7612256 -28167595
3358 -28167595 -31907673 -21739389 -14365529 -15877691 -15318968 -5196813 6044845 9126773
3350 9126773 8439097 11642502 15764157 15047108 13820764 19350237 28474335 33129867 33360565
3341 33360565 32816484 26937594 9924138 -9345315 -13769430 -1864852 8663107 5732099
3333 5732099 -610574 5432007 20376456 23680240 4484090 -22401660 -32308882 -19212101
3325 -19212101 -1245688 3827982 257276 3431783 13700967 15053114 28386 -19069962
3317 -19069962 -29325074 -34068853 -41700894 -48982157 -46789631 -34566784 -18440802 -2130507
3309 -2130507 10166108 10306216 -1869485 -10890985 -4490196 6348206 2545054 -12963358
$$ packed form
3366a8778572L499883M074021Q727272J3111355Q978405o045836k1178784k0555339
3358b8167595l740078J0168284P373860j512162N58723J0122155J1241658L081928
3350I126773o87676L203405M121655p17049j226344N529473R124098M655532K30698
3341C3360565n44081n878890j7013456j9269453m424115J1904578J0527959k931008
3333E732099o342673O042581J4944449L303784j9196150k6885750r907222J3096781
3325a9212101J7966413N073670l570706L174507J0269184J352147j5024728j9098348
3317a9069962j0255112m743779p632041p281263K192526J2222847J6125982J6310295
3309b130507J2296615J40108j2175701r021500O400789J0838402l803152j5508412
$$ plain form
3301 -12963358 -19585047 -11931546 -6956679 -14398835 -20751789 -12055824 4305002 12779533
3293 12779533 11719234 9360216 7894693 5447503 6922518 18396008 33670143 39127544
3285 39127544 31173779 18138412 5649160 -8247571 -21877374 -25934235 -16798220 -5308207
3277 -5308207 -4313920 -12410203 -17874137 -15831460 -13095128 -16319127 -23669133 -30315763
3269 -30315763 -34389047 -33229653 -21049839 2393338 25476268 34963796 29636535 16666439
3261 16666439 -486316 -19551515 -29194477 -17847775 5433134 16045811 6269445
3254 6269445 -3678505 3158444 14887729 12060123 608428 2200614 19147036 31904602
3246 31904602 30436147 26047914 28200363 29605758 22623844 14020354 12404910 13005025
$$ packed form
3301a2963358o621689P653501M974867p442156o352954Q695965J6360826Q474531
3293A2779533j060299k359018j465523k447190J475015J1473490J5274135N457401
3285C9127544p953765j3035367j2489252j3896731j3629803m056861R136015J1490013
3277e308207R94287q096283n463934K042677K736332l223999p350006o646630
3269c0315763m073284J159394J2179814K3443177K3082930R487528n327261j2970096
3261A6666439j7152755j9065199r642962J1346702K3280909J0612677r776366
3254F269445r947950O836949J1729285k827606j1451695J592186J6946422J2757566
3246C1904602j468455m388233K152449J405395o981914q603490j615444O00115
$$ plain form
3238 13005025 6664703 -3971012 -8300262 -3286441 3832399 5901776 2239415 -3817709
3230 -3817709 -8916362 -11741251 -13240827 -14322783 -14368047 -14374076 -18049931 -23938514 -20605040
3221 -20605040 149006 26933986 37907750 27771765 13502219 10070272 13263473
3214 13263473 12267512 6674241 2160481 -605483 -2706281 -83476 10429331 23401605
3206 23401605 30839563 30926623 25086024 13867581 2810827 3740988 20302392 39014884
3198 39014884 45143027 41554917 40886176 44501359 42115223 29537181 13987648 1877775
3190 1877775 -7659845 -16028969 -21210891 -21955406 -18887738 -11609770 -1580487 3557898
3182 3557898 -3118283 -16972570 -25986536 -25986794 -24258052 -27708886 -34258351 -36211741 -27004090
$$ packed form
3238A3005025o340322j0635715m329250N013821P118840K069377l662361o057124
3230c817709n098653k824889j499576j081956m5264o029l675855n888583L333474
3221b0605040K0754046K6784980J0973764j0135985j4269546l431947L193201
3214A3263473r95961n593271m513760k765964k100798K622805J0512807J2972274
3206B3401605P437958Q7060n840599j1218443j1056754R30161J6561404J8712492
3198C9014884O128143l588110o68741L615183k386136j2578042j5549533j2109873
3190A877775r537620q369124n181922p44515L067668P277968J0029283N138385
3182C557898o676181j3854287r013966k58J728742l450834o549465j953390R207651
$$ plain form
3173 -27004090 -7038285 11139609 9090822 -15286518 -36429999 -27051725 5391571
3166 5391571 24837139 12396489 -11257526 -17092230 -4904029 4190980 589832 -5609414
3158 -5609414 -4649267 599797 3571567 3697437 3929943 5739885 9031670 12393725 12862327
3149 12862327 9866340 8960085 16353105 29597458 38997028 38937724 32752767 25552776
3141 25552776 18108958 10356619 5360342 5026208 5305695 1058647 -5849019 -8767267
3133 -8767267 -6572705 -6042535 -11766687 -18911746 -20409872 -17279712 -15249881 -13332441
3125 -13332441 -4729597 9039025 14098007 836950 -21283703 -33491840 -29131666 -17562154
3117 -17562154 -9085975 -5519999 -5984192 -11679037 -20538462 -25052891 -21419626 -15584372
$$ packed form
3173b7004090J9965805J8177894k048787k4377340k1143481R378274L2443296
3166E391571J9445568j2440650k3654015n834704J2188201R095009l601148o199246
3158e609414R60147N249064K971770J25870K32506J809942L291785L362055M68602
3149A2862327k995987r06255P393020J3244353R399570n9304o184957p199991
3141B5552776p443818p752339m996277l34134K79487m247048o907666k918248
3133h767267K194562N30170n724152p145059j498126L130160K029831J917440
3125a3332441Q602844J3768622N058982j3261057k2120653j2208137M360174J1569512
3117a7562154Q476179L565976m64193n694845q859425m514429L633265N835254
$$ plain form
3109 -15584372 -14656794 -17055476 -17161786 -15199068 -14741560 -13508608 -6263524 3041016 2083721
3100 2083721 -12728601 -27934428 -28399991 -15750587 -3631681 2035525 7846057 17081011
3092 17081011 20209050 8739093 -8264840 -12516101 -652809 10238861 4912701 -10427133
3084 -10427133 -17586239 -10238897 479954 3005529 -1103772 -3810654 -3916511 -7097210
3076 -7097210 -14738237 -19436550 -14161240 -2598221 3331124 -3988146 -20467872 -35929378
3068 -35929378 -44185316 -45557809 -42196449 -35319719 -26956731 -20445298 -17844851 -19003365
3060 -19003365 -23021252 -27484080 -26860795 -16991026 -2584647 5110195 969432 -8245197
3052 -8245197 -13658823 -14668607 -15539172 -16823048 -15826596 -11792888 -5010957 5589810
$$ packed form
3109a5584372R27578k398682j06310J962718M57508J232952P245084R304540r57295
3100B083721j4812322j5205827m65563J2649404J2118906N667206N810532R234954
3092A7081011L128039j1469957j7003933m251261J1863292J0891670n326160j5339834
3084a0427133p159106P347342J0718851K525575m109301k706882j05857l180699
3076g097210p641027m698313N275310J1563019N929345p319270j6479726j5461506
3068c5929378q255938j372493L361360O876730Q362988O511433K600447j158514
3060a9003365m017887m462828O23285R869769J4406379P694842m140763r214629
3052h245197n413626j009784q70565j283876R96452M033708O781931J0600767
$$ plain form
3044 5589810 18129200 25208758 22872435 18313023 19910153 22727843 14851561 -2681068
3036 -2681068 -14580608 -12533655 -5939696 -5773742 -8188757 -3199811 7283672 10803741
3028 10803741 1647556 -12104037 -19625781 -19093194 -16130945 -14373295 -10959520 -1679338
3020 -1679338 10936805 17797482 14130767 7692110 10523232 22767884 31538156 28040797
3012 28040797 18613923 13855163 13297257 8875030 -81969 -5117070 -2415149 759406
3004 759406 -2362835 -6703868 -2431391 9782065 18610965 17695892 13313340 12017623
2996 12017623 7829250 -8920569 -32915076 -45822027 -39584257 -27071844 -23440308 -26428301
2988 -26428301 -24626366 -17730010 -15526961 -19637375 -19899943 -10970101 -1643085 -3184046
$$ packed form
3044E589810J2539390P079558k336323m559412J597130K817690p876282j7532629
3036b681068j1899540K046953O593959J65954k415015M988946J0483483L520069
3028A0803741r156185j3751593p521744N32587K962249J757650L413775R280182
3020a679338J2616143O860677l666715o438657K831122J2244652Q770272l497359
3012B8040797r426874m758760n57906m422227q956999n035101K701921L174555
3004G59406l122241m341033M272477J2213456Q828900r15073m382552j295717
2996A2017623m188373j6749819k3994507j2906951O237770J2512413L631536k987993
2988b6428301J801935O896356K203049m110414k62568Q929842R327016j540961
$$ plain form
2980 -3184046 -15175203 -26455297 -26020047 -12601766 2272566 3032309 -11851975 -24361188
2972 -24361188 -18548699 -2946542 1860527 -5670895 -7644465 1769833 5642665 -7311482
2964 -7311482 -23536212 -26480660 -20867790 -19698348 -21035901 -15578500 -6798158 -4618637
2956 -4618637 -6361621 -2907969 1322156 -6022411 -22057081 -30165017 -24663899 -15732758
2948 -15732758 -8153881 6123851 28842290 45637736 44215902 30721868 20299130
2941 20299130 20204756 27641807 35213515 33377273 16512051 -7666478 -22148828 -18846845
2933 -18846845 -6284435 3383885 6462304 3867726 -4469243 -15184096 -19464377 -12386309
2925 -12386309 286241 8546698 7107757 -3009397 -15377705 -20465465 -15112865 -9259914
$$ packed form
2980c184046j1991157j1280094M35250J3418281J4874332P59743j4884284j2509213
2972b4361188N812489J5602157M807069p531422j973570R414298L872832j2954147
2964g311482j6224730k944448N612870J169442j337553N457401Q780342K179521
2956d618637j742984L453652M230125p344567j6034670q107936N501118Q931141
2948a5732758P578877J4277732K2718439J6795446j421834j3494034j0422738
2941B0299130r4374P437051P571708j836242j6865222k4178529j4482350L301983
2933a8846845J2562410R668320L078419k594578q336969j0714853m280281P078068
2925a2386309J2672550Q260457j438941j0117154j2368308n087760N352600N852951
$$ plain form
2917 -9259914 -13287005 -20134554 -14069442 2556515 9123195 -2373724 -15310474 -15448147
2909 -15448147 -10285890 -9000994 -2723648 16695644 34081391 29502998 9587462 -1660064
2901 -1660064 3230916 11560035 15528249 18651674 19034374 8464800 -9728418 -21210891
2893 -21210891 -21885466 -21324696 -23147690 -20210819 -12138680 -8417649 -9101855 -1822701 14534517
2884 14534517 21913649 9078392 -10665885 -18649872 -13379740 -3524790 6765295 13529044
2876 13529044 8423877 -7151019 -15460472 -4747752 12477364 18083999 14244956 13879678
2868 13879678 15238522 6468562 -9715809 -16576802 -8106096 4313881 11109763 15192730
2860 15192730 21669498 29932317 37805015 43201222 42445878 36979253 37528719 48633434
$$ packed form
2917i259914m027091o847549O065112J6625957O566680j1496919j2936750j37673
2909a5448147N162257J284896O277346J9419292J7385747m578393j9915536j1247526
2901a660064M890980Q329119L968214L123425L82700j0569574j8193218j1482473
2893b1210891o74575N60770j822994K936871Q072139L721031o84206P279154J6357218
2884A4534517P379132j2835257j9744277p983987N270132R854950J0290085O763749
2876A3529044n105167j5574896q309453J0712720J7225116N606635l839043l65278
2868A3879678J358844q769960j6184371o860993Q470706J2419977O795882M082967
2860A5192730O476768Q262819P872698N396207p55344n466625N49466J1104715
$$ plain form
2852 48633434 54772658 39532882 14055050 4176667 10261872 5931325 -18350338 -38544581
2844 -38544581 -36473373 -29394294 -39903759 -57930652 -58634620 -43357657 -33464972 -30406305
2836 -30406305 -12791476 23547964 49587625 38864020 1671257 -28920097 -34087687
2829 -34087687 -21455582 -8550356 -5704742 -12693578 -23031227 -29359340 -27759933 -18947711
2821 -18947711 -6929558 2512653 5126809 3650917 7055705 18975988 29284166 24252262
2813 24252262 4587910 -13851123 -18453053 -12746048 -9257423 -15108669 -27194706 -37364424
2805 -37364424 -39464505 -33301593 -23235522 -12717081 -2165274 6532679 8270573 2251526
2797 2251526 -3254332 -837759 4706426 3650582 -2125280 -315326 13102226 26216020
$$ packed form
2852D8633434O139224j5239776k5477832r878383O085205m330547k4281663k0194243
2844c8544581K071208P079079j0509465j8026893p03968J5276963R892685L058667
2836c0406305J7614829L6339440K6039661j0723605l7192763l0591354n167590
2829c4087687J2632105J2905226K845614o988836j0337649o328113J599407Q812222
2821a8947711J2018153R442211K614156j475892L404788J1920283J0308178n031904
2813B4252262j9664352j8439033m601930N707005L488625n851246j2086037j0169718
2805c7364424k100081O162912J0066071J0518441J0551807Q697953J737894o019047
2797B251526n505858K416573N544185j055844n775862J809954J3417552J3113794
$$ plain form
2789 26216020 25672537 11331734 -6783024 -19495606 -23131177 -19260436 -13825090 -12826366
2781 -12826366 -16849236 -22776477 -29623360 -37002161 -39718831 -32418909 -19144954 -8835936
2773 -8835936 -1406799 10353665 23882212 25678631 11959342 -2972080 -6584840 -3869084
2765 -3869084 -3908098 -3206187 4544563 11954812 6933808 -7060102 -14729656 -10425318 -2419606
2756 -2419606 2772833 6710188 9025651 4212437 -7961530 -18756371 -21064654 -16308845
2748 -16308845 -8493100 884692 9217422 11397071 5886267 -2771136 -9700919 -13129611
2740 -13129611 -11307337 -2844686 7363201 9292441 -606062 -13480346 -18084377 -13441035
2732 -13441035 -7529919 -5904723 -6071381 -2672392 5372462 14371051 21045233 25867232
$$ packed form
2789B6216020n43483j4340803j8114758j2712582l635571L870741N435346R98724
2781a2826366m022870n927241o846883p378801k716670P299922J3273955J0309018
2773h835936P429137J1760464J3528547J796419j3719289j4931422l612760K715756
2765c869084l9014P01911P750750P410249n021004j3993910p669554M304338Q005712
2756b419606N192439L937355K315463m813214j2173967j0794841k308283M755809
2748a6308845P815745R377792Q332730K179649n510804q657403o929783l428692
2740a3129611J822274Q462651J0207887J929240r898503j2874284m604031M643342
2732a3441035N911116J625196j66658L398989Q044854Q998589O674182M821999
$$ plain form
2724 25867232 29784662 29092252 17583180 -4315564 -25444629 -32265128 -21166797 -1731587
2716 -1731587 11054594 8335358 -5251621 -14719984 -8661968 8953206 24170709 29740986
2708 29740986 30793283 33621264 36213226 32363209 18957059 -2245733 -23213243 -30669686
2700 -30669686 -19416764 -4877961 -7600239 -22627327 -23108173 -1673231 13853116 1091277
2692 1091277 -21546884 -22298944 -2159353 13006094 14569734 15884407 21395944 21476855
2684 21476855 16759103 18219468 21545565 10692557 -9154186 -12482035 4854863 14893236
2676 14893236 581536 -18950879 -21678576 -14575780 -13370490 -14581017 -9796984 -7556344
2668 -7556344 -17371243 -28137119 -25521839 -17002568 -17246675 -21727413 -18101125 -12005562
$$ packed form
2724B5867232L917430o92410j1509072k1898744k1129065o820499J1098331J9435210
2716a731587J2786181k719236j3586979r468363O058016J7615174J5217503N570277
2708B9740986J052297K827981K591962l850017j3406150k1202792k0967510p456443
2700c0669686J1252922J4538803k722278j5027088m80846K1434942J5526347j2761839
2692A091277k2638161p52060K0139591J5165447J563640J314673N511537Q0911
2684B1476855m717752J460365L326097j0853008j9846743l327849J7336898J0038373
2676A4893236j4311700j9532415k727697P102796J205290j210527M784033K240640
2668g556344r814899j0765876K615280Q519271k44107m480738L626288O095563
$$ plain form
2660 -12005562 -17039591 -28545781 -32081276 -30121172 -34876890 -40576248 -29942035 -6357151
2652 -6357151 6563583 -905769 -14167907 -20290379 -22388049 -24798311 -25245682 -26700428
2644 -26700428 -37170696 -51605976 -52269970 -34057512 -13233076 -4506559 -4860398 -6542169
2636 -6542169 -10491089 -18349935 -24141519 -22730796 -17130559 -11543171 -6096770 -1902072
2628 -1902072 -1275965 -607852 5766088 12858662 8985785 -5442361 -16868829 -19046668
2620 -19046668 -19847199 -24035964 -25004596 -19411735 -15056601 -17256188 -20950776 -22694096
2612 -22694096 -26928015 -34346291 -38050345 -36814172 -36695043 -34009341 -15603495 15007035
2604 15007035 32000429 21554493 3737628 3576004 16134682 19513371 9786972 1803737
$$ packed form
2660a2005562n034029j1506190l535495J960104m755718n699358J0634213K3584884
2652f357151J2920734p469352j3262138o122472k097670k410262m47371j454746
2644b6700428j0470268j4435280o63994J8212458K0824436Q726517l53839j681771
2636f542169l948920p858846n791584J410723N600237N587388N446401M194698
2628a902072O26107O68113O373940P092574l872877j4428146j1426468k177839
2620a9046668q00531m188765r68632N592861M355134k199587l694588j743320
2612b2694096m233919p418276l704054J236173J19129K685702J8405846L0610530
2604A5007035J6993394j0445936j7816865j61624J2558678L378689r726399p983235
$$ plain form
2596 1803737 3075451 7125825 9009833 10365465 11248022 10554187 11467905 15009541 13721638
2587 13721638 3806909 -3594973 2525454 13336498 11500485 -2699300 -13354706 -14077272
2579 -14077272 -13907352 -18223408 -19967361 -12909535 -1264764 7057502 8184382 2907241
2571 2907241 -3002022 -1738623 5269033 4459725 -10737213 -24148734 -14705372 13808390
2563 13808390 36384457 38362938 27736138 16524817 6739037 -2053569 -6334532 -5722330
2555 -5722330 -5738138 -8787145 -10544099 -7665442 -1454989 6689246 15604178 20821722 18813381
2546 18813381 12983910 7324666 -1897470 -18159066 -33443513 -37216366 -32163022 -28203739
2538 -28203739 -26110985 -21185396 -16809111 -17751907 -16781314 -7201176 -1676529 -15660864
$$ packed form
2596A803737J271714M050374J884008J355632Q82557o93835R13718L541636j287903
2587A3721638r914729p401882O120427J0811044j836013j4199785j0655406p22566
2579a4077272J69920m316056j743953P057826J1644771Q322266J126880n277141
2571B907241n909263J263399P007656q09308j5196938j3411521R443362K8513762
2563A3808390K2576067J978481j0626800j1211321r785780q792606m280963O12202
2555e722330j5808l049007j756954K878657O210453Q144235Q914932N217544k008341
2546A8813381n829471n659244r222136j6261596j5284447l772853N053344L959283
2538b8203739K092754M925589M376285r42796R70593R580138N524647j3984335
$$ plain form
2530 -15660864 -38157779 -45381391 -38672643 -38287568 -42546975 -29759010 -3204661 6468845
2522 6468845 -7245971 -15796601 -10653750 -20515553 -46412932 -30819270 60859551 165996323
2514 165996323 190686797 129903874 63734248 43893419 44878377 31848494 16332866
2507 16332866 20815903 33408134 29318399 9792921 -6926639 -14023478 -14355616 -6903318
2499 -6903318 6291477 13107022 6852321 -3119171 -8239087 -14211653 -25444229 -30915914
2491 -30915914 -20413274 -2566587 8166916 12195044 18372475 26408912 30222049 31539699
2483 31539699 36283952 42307053 42246563 34549725 22964317 10291234 -104737 -3445139
2475 -3445139 -1091990 -780383 -3111578 971578 11352081 11583520 -6477080 -23890372
$$ packed form
2530a5660864k2496915p223612O708748L85075m259407J2787965K6554349R673506
2522F468845j3714816q550630N142851r861803k5897379J5593662R1678821J05136772
2514A65996323K4690474o0782923o6169626j9840829R84958j3029883j5515628
2507A6332866M483037J2592231m089735j9525478j6719560p096839l32138P452298
2499f903318J3194795O815545o254701r971492n119916n972566j1232576n471685
2491c0915914J0502640J7846687J0733503M028128O177431Q036437L813137J317650
2483C1539699M744253O023101o0490p696838j1585408j2673083j0395971l340402
2475c445139K353149L11607k331195M083156J0380503K31439j8060600j7413292
$$ plain form
2467 -23890372 -17489129 7668666 26357051 26813250 18139715 9182906 -221373 -7713066
2459 -7713066 -6492729 2355699 9635567 11590181 11134657 6392581 -6861622 -20417378
2451 -20417378 -17594895 3508266 24608912 30273324 24147476 17349862 13180362 10041665
2443 10041665 8586325 8019988 3487415 -5763786 -12084360 -9031875 1205 6412738
2435 6412738 4404334 -6703198 -20745233 -25135122 -13210314 2903876 4247369 -7771881
2427 -7771881 -11016067 5163232 23799361 26200437 17921297 14439547 14630324 7321540
2419 7321540 -4602728 -7396496 -380319 3069448 -1177296 -2265094 4477500 7850825
2411 7850825 -381972 -11103923 -12065847 -6066950 -4081275 -7251597 -7443186 -3142996
$$ packed form
2467b3890372O401243K5157795J8688385M56199q673535q956809r404279p491693
2459g713066J220337Q848428P279868J954614m55524m742076j3254203j3555756
2451b0417378K822483K1103161K1100646N664412o125848o797614m169500l138697
2443A0041665j455340n66337m532573r251201o320574L052485R033080O411533
2435F412738k008404j1107532j4042035m389889J1924808J6114190J343493j2019250
2427g771881l244186J6179299J8636129K401076q279140l481750J90777p308784
2419G321540j1924268k793768P016177L449767m246744j087798O742594L373325
2411G850825q232797j0721951r61924N998897J985675l170322j91589M300190
$$ plain form
2403 -3142996 -3822002 -16099199 -32658092 -39710383 -33160007 -23115853 -21546767 -28653769
2395 -28653769 -34832200 -34401080 -31439170 -30568252 -28621279 -20415386 -7835550 3157865
2387 3157865 11058312 17572197 20640055 16325746 6440197 -2799791 -8727598 -11908316
2379 -11908316 -9488459 2364666 19135872 29802797 29843271 25274849 22763711 23338330
2371 23338330 26710460 32916799 37532784 34070466 23943193 15689987 12315065 9408469
2363 9408469 8053991 16353677 32133002 38054784 24392381 5079581 -1191273 4440649
2355 4440649 9441413 13070324 22601923 32196946 27030842 9097798 -1664774 2647242
2347 2647242 5497822 -7128868 -23436314 -23039263 -6571359 6756811 5304593 -5133833
$$ packed form
2403c142996o79006j2277197j6558893p052291O550376J0044154J569086p107002
2395b8653769o178431M31120K961910Q70918J946973Q205893J2579836J0993415
2387C157865P900447O513885L067858m314309r885549r239988n927807l180718
2379a1908316K419857J1853125J6771206J0666925M0474m568422k511138N74619
2371B3338330L372130O206339M615985l462318j0127273q253206l374922k906596
2363I408469j354478Q299686J5779325N921782j3662403j9312800o270854N631922
2355D440649N000764L628911R531599R595023n166104j7933044j0762572M312016
2347B647242K850580j2626690j6307446L97051J6467904J3328170j452218j0438426
$$ plain form
2339 -5133833 -14913006 -20878406 -22310028 -17676707 -9370639 -4460812 -6641920 -11855859
2331 -11855859 -14631196 -14675545 -14388705 -13723028 -11512122 -9476183 -10146482 -11193185 -6692180
2322 -6692180 3947785 12355802 10780652 3170459 982294 7903991 15287722 15117455
2314 15117455 10415012 7526426 4910768 -1702282 -7830279 -5286001 2823125 4360598
2306 4360598 -3262766 -9250443 -7885807 -7785104 -15521425 -22553554 -19582433 -13701376
2298 -13701376 -17224902 -26456683 -27196704 -17506415 -8550549 -4029269 3469199 13281416
2290 13281416 12613295 -678401 -8436860 2178978 17059416 14726657 -2100296 -12262171
2282 -12262171 -8305653 -3981044 -9474053 -17029983 -16066880 -7519591 4104066 19748174
$$ packed form
2339e133833r779173n965400j431622M633321Q306068M909827k181108n213939
2331a1855859k775337m4349K86840O65677K210906K035939o70299j046703M501005
2322f692180J0639965Q408017j575150p610193k188165O921697P383731j70267
2314A5117455m702443k888586k615658o613050o127997K544278Q109126J537473
2306D360598p623364n987677J364636J00703p736321p032129K971121N881057
2298a3701376l523526r231781p40021R690289Q955866M521280P498468R812217
2290A3281416o68121j3291696p758459J0615838J4880438k332759j6826953j0161875
2282a2262171L956518M324609n493009p555930R63103Q547289J1623657J5644108
$$ plain form
2274 19748174 36928234 42548789 27673575 4065503 -6428805 2670677 17539353
2267 17539353 23217120 17748076 7137883 -3281455 -9078485 -6701780 1630597 8286098
2259 8286098 9671552 10901680 17132287 24700343 26196878 21825617 20190117 27658316
2251 27658316 40338912 47397603 41045419 23355553 3957376 -8930263 -14322280 -14909769
2243 -14909769 -11264895 -3945468 1490666 -1008787 -8844964 -14291728 -17708371 -26794773
2235 -26794773 -39583580 -40960858 -24556802 -6369592 -3664370 -9354976 -3797193 13339450
2227 13339450 22252986 14011341 2734636 1445596 3746428 -515431 -6271812 -3425364
2219 -3425364 4070475 3713790 -6170683 -14973920 -15040152 -8518649 -1283414 1825025 -1611525
$$ packed form
2274A9748174J7180060N620555j4875214k3608072j0494308R099482J4868676
2267A7539353N677767n469044j0610193j0419338n797030K376705Q332377O655501
2259H286098J385454J230128O230607P568056J496535m371261j635500P468199
2251B7658316J2680596P058691o352184j7689866j9398177j2887639n392017n87489
2243a4909769L644874P319427N436134k499453p836177n446764l416643r086402
2235b6794773j2788807j377278J6404056J8187210K705222n690606N557783J7136643
2227A3339450Q913536q241645j1276705j289040K300832m261859n756381K846448
2219c425364P495839l56685r884473q803237o6232O521503P235235L108439l436550
$$ plain form
2210 -1611525 -7952607 -9205568 -4770342 -4598990 -11884435 -11766029 8180205 33044417
2202 33044417 35277525 12939298 -6583177 -4233127 8909578 14652728 13327854 13524550
2194 13524550 11633575 -1188534 -20193153 -31435665 -30807912 -25180751 -17812430 -5665821
2186 -5665821 10047651 22369741 27750897 27527298 21586669 10032831 -571869 -3198236
2178 -3198236 -1806074 -6184870 -15851810 -20446496 -16368382 -10754669 -7547078 -2732846
2170 -2732846 3679080 4860682 1031556 1477773 5853297 -422758 -20542662 -31596800
2162 -31596800 -13172659 19624967 32190536 15315321 -5723859 -7125546 7083237
2155 7083237 18850096 19724713 12678302 2388443 -7073575 -11903882 -12644245 -13677450
$$ packed form
2210a611525o341082j252961M435226J71352p285445J18406J9946234K4864212
2202C3044417K233108k2338227j9522475K350050J3142705N743150j324874J96696
2194A3524550j890975j2822109j9004619j1242512O27753N627161P368321J2146609
2186e665821J5713472J2322090N381156k23599n940629j1553838j0604700k626367
2178c198236J392162m378796r666940m594686M078114N613713L207591M814232
2170b732846O411926J181602l829126M46217M375524o276055k0119904j1054138
2162c1596800J8424141L2797626J2565569j6875215k1039180j401687J4208783
2155G083237J1766859Q74617p046411j0289859r462018m830307p40363j033205
$$ plain form
2147 -13677450 -15403363 -13348709 -7566625 -4948071 -8728440 -13527706 -14005330 -9838763
2139 -9838763 802580 21576874 46238661 58245679 50578289 35949054 28246727 24229050
2131 24229050 14789661 4072012 2636552 8783016 12193207 11247226 11305856 10125191
2123 10125191 1989047 -6396528 -2889079 7393062 6351275 -6956728 -11042840 5751900
2115 5751900 27103022 33730844 29107885 26200241 23796487 13613117 406812 -3673839
2107 -3673839 955191 4018486 4291795 9132517 16472001 13899190 -1502032 -15769926
2099 -15769926 -14971786 -43144 18197562 30206666 31264221 22138379 9821301 1911310
2091 1911310 -1510392 -5252107 -8768579 -5906609 4648464 16417431 23946762 27315697
$$ packed form
2147a3677450j725913K054654N782084K618554l780369m799266m77624M166567
2139i838763J0641343K0774294K4661787J2007018p667390j4629235p702327m017677
2131B4229050r439389j0717649j435460O146464L410191r45981N8630j180665
2123A0125191q136144q385575L507449J0282141j041787j3308003m086112J6794740
2115E751900K1351122O627822m622959k907644k403754j0183370j3206305m080651
2107c673839M629030L063295K73309M840722P339484k572811j5401222j4267894
2099a5769926P98140J4928642J8240706J2009104J057555r125842j2317078p909991
2091A911310l421702l741715l516472K861970J0555073J1768967P529331L368935
$$ plain form
2083 27315697 26772415 21011831 13122620 10427258 15044084 21234146 24952415 28833900
2075 28833900 33907787 33702875 22792708 6688435 -3042811 -2192837 1308950 -3966991
2067 -3966991 -19978073 -34175364 -29865920 -4666851 25075107 43363731 52486325 62634909
2059 62634909 69538352 58614272 31643432 11158808 10977228 17507137 11180907 -5400522
2051 -5400522 -13680995 -5762706 7971230 13995807 8479277 -2261895 -7171619 -181114
2043 -181114 10564305 9998774 -2425973 -9014423 671445 13120908 11887195 2832004
2035 2832004 1572127 6146058 3054704 -6081329 -7168686 -534397 -980272 -9521030
2027 -9521030 -9943884 651731 2779636 -13075643 -27892566 -23104098 -8499565 -2914468
$$ packed form
2083B7315697n43282n760584p889211k695362M616826O190062L718269L881485
2075B8833900N073887k04912j0910167j6104273r731246Q49974L501787n275941
2067c966991j6011082j4197291M309444K5199069K9741958J8288624R122594J0148584
2059F2634909O903443j0924080k6970840k0484624j81580O529909o326230j6581429
2051e400522q280473P918289J3733936O024577n516530j0741172m909724O990505
2043a81114J0745419n65531j2424747o588450R685868J2449463j233713r055191
2035B832004j259877M573931l091354r136033j087357O634289m45875q540758
2027i521030m22854J0595615K127905j5855279j4816923M788468J4604533N585097
$$ plain form
2019 -2914468 -3511143 4208331 17329173 19641527 9419236 1681708 3829086 7330063
2011 7330063 4572138 -1690941 -7493922 -12972482 -16995805 -17982044 -20067020 -26741656
2003 -26741656 -29515643 -16727287 6457234 21962962 24156229 25137294 31401612 32905691
1995 32905691 22634983 9781500 2239437 -8429373 -29481422 -46820255 -40918612
1988 -40918612 -16567628 1557951 1350780 -5243383 -4326525 2015136 5217936 5297368
1980 5297368 7907863 13099957 14774971 9034380 -1304218 -9216266 -8800150 -332363
1972 -332363 8896667 11104854 5733019 -1899157 -8824573 -16769072 -25862808 -31430222
1964 -31430222 -29919929 -24348242 -20357911 -18902524 -16206855 -10427012 -5452874 -6834516
$$ packed form
2019b914468n96675P719474J3120842K312354j0222291p737528K147378L500977
2011G330063k757925o263079n802981n478560m023323r86239k084976o674636
2003b6741656k773987J2788356K3184521J5505728K193267R81065O264318J504079
1995C2905691j0270708j2853483p542063j0668810k1052049j7338833N901643
1988d0918612K4350984J8125579k07171o594163R16858O341661L202800P9432
1980E297368K610495N192094J675014n740591j0338598p912048M16116Q467787
1972c32363R229030K208187n371835p632176o925416p944499r093736n567414
1964c1430222J510293N571687L990331J455387K695669N779843M974138j381642
$$ plain form
1956 -6834516 -14939108 -23905971 -28067257 -27557318 -25215290 -19873498 -7938008 8156202
1948 8156202 19714208 22909132 23677878 26962831 27975606 21453478 13543508 14546835
1940 14546835 23614099 31564060 36562375 44471140 53573654 52734255 38687230 22937122
1932 22937122 15803678 14758215 15269063 21578563 36513344 49935119 49918022 39976599
1924 39976599 32997590 31239346 24429683 7333442 -11355734 -19472742 -13699727 -941245
1916 -941245 6920562 1255145 -13382440 -19377628 -4337821 21685118 35830360 28834666
1908 28834666 12503314 613646 -6407996 -14002710 -21076835 -22538791 -18420285 -13635484
1900 -13635484 -11201470 -9670702 -5143570 5740848 21167494 31680221 28005562 13499556
$$ packed form
1956f834516q104592q966863m161286N09939K342028N341792J1935490J6094210
1948H156202J1558006L194924P68746L284953J012775o522128p909970J003327
1940A4546835R067264P949961M998315P908765R102514q39399j4047025j5750108
1932B2937122p133444j045463N10848O309500J4934781J3421775j7097r941423
1924C9976599o979009j758244o809663j7096241j8689176q117008N773015J2758482
1916i41245P861807n665417j4637585n995188J5039807K6022939J4145242o995694
1908B8834666j6331352j1889668p021642p594714p074125j461956M118506M784801
1900a3635484K434014J530768M527132J0884418J5426646J0512727l674659j4506006
$$ plain form
1892 13499556 2879868 5322191 14308088 17934449 13787119 8763408 8612591 13054769
1884 13054769 18504335 20999016 18081030 10909371 3147849 -3221784 -8074286 -9403151
1876 -9403151 -5199479 39203 -1753781 -9875129 -13490728 -7053498 1408011 3631693
1868 3631693 3717917 8082061 10774908 1558514 -15475190 -24697354 -19827959 -10121333
1860 -10121333 -4542486 -897332 6130931 15568603 23156836 26711664 24752339 16093812
1852 16093812 4623441 -853455 4606535 17038017 29125422 36511710 37433051 31637715
1844 31637715 21931030 12092776 1891771 -10413177 -19852940 -16937986 -1574967 12584809
1836 12584809 13143804 2898352 -6299303 -8486601 -6868245 -6744961 -11236064 -20494245
$$ packed form
1892A3499556j0619688K442323Q985897L626361m147330n023711j50817M442178
1884A3054769N449566K494681k917986p171659p761522o369633m852502j328865
1876i403151M203672N238682j792984q121348l615599O437230Q461509K223682
1868C631693Q6224M364144K692847r216394j7033704r222164M869395R706626
1860a0121333N578847L645154P028263R437672P588233L554828j959325q658527
1852A6093812j1470371n476896N459990J2431482J2087405P386288R21341n795336
1844C1637715r706685r838254j0201005j2304948r439763K914954J5363019J4159776
1836A2584809N58995j0245452r197655k187298J618356J23284m491103r258181
$$ plain form
1828 -20494245 -29258137 -28205021 -13757172 5414191 16521425 15032926 5246194 -6708542
1820 -6708542 -14656355 -12734671 -2880247 2055697 -6429396 -16394756 -8052039 15932333
1812 15932333 27286126 6757969 -29588322 -49553212 -42822721 -27617455 -23211956
1805 -23211956 -29221469 -33892872 -31787995 -27279848 -26310876 -30076376 -34506255 -33444441
1797 -33444441 -24833897 -14831777 -11775502 -14547432 -12231765 1311819 17915431 25571962
1789 25571962 24015606 22467894 24570131 25024302 21951629 22431189 30137295 34873581
1781 34873581 23204777 -2968101 -26571552 -34617544 -30569118 -25278439 -22042184 -16622399
1773 -16622399 -9121109 -7576160 -16509028 -27250388 -26267026 -12143276 2548797 8153421
$$ packed form
1828b0494245q763892J053116J4447849J9171363J1107234j488499r786732j1954736
1820f708542p947813J921684R854424M935944q485093r965360Q342717K3984372
1812A5932333J1353793k0528157l6346291j9964890O730491J5205266M405499
1805b3211956o009513m671403K104877M508147R68972l765500m429879J061814
1797c3444441Q610544J0002120L056275k771930K315667J3543584J6603612P656531
1789B5571962j556356j547712K102237M54171l072673M79560P706106M736286
1781C4873581j1668804k6172878k3603451q045992M048426N290679L236255N419785
1773a6622399P501290J544949q932868j0741360R83362J4123750J4692073N604624
$$ plain form
1765 8153421 9545235 15442879 22460320 19788370 7908181 1255239 9032574 22537038
1757 22537038 26838645 17819174 1810742 -14597888 -26369315 -27148449 -14801818 1584776
1749 1584776 8951736 4983240 -938618 -1402097 1150738 1188775 -1421008 -2396997 620010
1740 620010 4453421 2768519 -5929306 -12286431 -4312397 14703756 24692445 13306933
1732 13306933 -5864215 -11453933 -4266229 -3272528 -14828766 -24669647 -22601418 -16201839
1724 -16201839 -13561924 -10379831 -4267987 -5408129 -19143810 -31165620 -25856681 -9754947
1716 -9754947 -788483 -1868678 -2057716 1442322 567669 -5767244 -7668694 477004 13936001
1707 13936001 27382192 38271874 40986871 31637008 19433512 18554061 26458884 25487111
$$ packed form
1765H153421J391814N897644P017441k671950j1880189o652942P777335J3504464
1757B2537038M301607r019471j6008432j6408630j1771427p79134J2346631J6386594
1749A584776P366960l968496n921858m63479K552835L8037k609783r75989L017007
1740F20010L833411j684902q697825o357125P974034J9016153R988689j1385512
1732A3306933j9171148n589718P187704R93701j1556238r840881K068229O399579
1724a6201839K639915L182093O111844j140142j3735681j2021810N308939J6101734
1716i754947Q966464j080195j89038L500038q74653o334913j901450Q145698J3458997
1707A3936001J3446191J0889682K714997r349863j2203496q79451P904823r71773
$$ plain form
1699 25487111 9914126 -4440944 -4267861 2849483 3493905 -1811272 -5482772 -7866093
1691 -7866093 -11794375 -11030157 1144304 17179393 23159344 18421451 14521934 17020908
1683 17020908 21419318 26078871 34670673 43371023 39868233 22088747 6954985 10711380
1675 10711380 26904286 34244973 24189339 11039404 12762378 29413400 46086352
1668 46086352 53351499 57336122 69354195 93881548 131559609 184989846 248060375
1661 248060375 291793902 279111063 204084091 106365144 34990158 4059499 -5481314
1654 -5481314 -9501953 -5527562 7152658 14314043 5362553 -7735149 -4279370 17277343
1646 17277343 37044767 38249884 24656174 12036499 9545866 13595243 16763263 17717841
$$ packed form
1699B5487111j5572985j4355070J73083P117344O44422n305177l671500k383321
1691g866093l928282P64218J2174461J6035089N979951m737893l899517K498974
1683A7020908M398410M659553Q591802Q700350l502790j7779486j5133762L756395
1675A0711380J6192906P340687j0055634j3149935J722974J6651022J6672952
1668D6086352P265147L984623J2018073K4527353L7678061N3430237O3070529
1661B48060375M3733527j2682839p5026972r7718947p1374986l0930659r540813
1654e481314m020639L974391J2680220P161385q951490j3097702L455779K1556713
1646A7277343J9767424J205117j3593710j2619675k490633M049377L168020R54578
$$ plain form
1638 17717841 20419290 25461057 26762922 19312654 6190447 -6725846 -19019020 -30939173
1630 -30939173 -33851055 -18283699 6779468 16849319 1552776 -20722573 -27775740
1623 -27775740 -21789072 -18847111 -20422792 -14971545 -3783039 -2687045 -14218426 -19052900
1615 -19052900 -5342542 10344563 5734197 -14909778 -26714147 -15994585 7898133
1608 7898133 28455563 36256346 29250339 11979496 -4032674 -9055247 -6120964 -6257850
1600 -6257850 -13640625 -23113161 -29920214 -31709688 -23140464 -1763347 20278045 24990261
1592 24990261 12504368 1802094 1898419 -1810771 -22026756 -45239762 -49051247 -34407488
1584 -34407488 -22704647 -24884526 -30594535 -27828240 -17648104 -6764853 962641 1578294
$$ packed form
1638A7717841K701449N041767J301865p450268j3122207j2916293j2293174j1920153
1630c0939173k911882J5567356K5063167J0069851j5296543k2275349p053167
1623b7775740N986668K941961j575681N451247J1188506J095994j1531381m834474
1615a9052900J3710358J5687105m610366k0643975j1804369J0719562K3892718
1608G898133K0557430P800783p006007j7270843j6012170n022573K934283j36886
1600f257850p382775r472536o807053j789474Q569224K1377117K2041392M712216
1592B4990261j2485893j0702274R6325l709190k0215985k3213006l811485J4643759
1584c4407488J1702841k179879n710009K766295J0180136J0883251P727494O15653
$$ plain form
1576 1578294 -8315272 -22539998 -27417788 -19211698 -10746128 -14044363 -24397800 -29355158
1568 -29355158 -26653050 -24062912 -25790946 -28341006 -28071067 -24739353 -18120165 -8318627
1560 -8318627 269250 1936559 -2153898 -4508231 -1647260 1733621 1585145 1664350 6690303
1551 6690303 12583777 11271130 4592087 4832246 17630541 31688458 33251004 26461167
1543 26461167 28504910 44228287 57251695 51667674 32617658 16536771 8760787 2548779
1535 2548779 -4382495 -6384557 -2866483 -1428774 -4796246 -6390364 -4044986 -7243804
1527 -7243804 -22927260 -42381279 -51029990 -45611568 -33443580 -19597666 -4205272 9778466
1519 9778466 15365500 9638812 -1829350 -9689494 -8208665 69747 5165077 -1354446
$$ packed form
1576A578294r893566j4224726m877790Q206090Q465570l298235j0353437m957358
1568b9355158K702108K590138j728034k550060K69939L331714O619188R801538
1560h318627Q587877J667309m090457k354333K860971L380881j48476P9205N025953
1551F690303N893474j312647o679043K40159J2798295J4057917J562546o789837
1543B6461167K043743J5723377J3023408n584021j9050016j6080887p775984o212008
1535B548779o931274k002062L518074J437709l367472j594118K345378l198818
1527g243804j5683456j9454019q648711N418422J2167988J3845914J5392394J3983738
1519I778466N587034n726688j1468162p860144J480829Q278412N095330o519523
$$ plain form
1511 -1354446 -15908929 -25892027 -25384555 -21292428 -20067031 -17049333 -6723202 4231554
1503 4231554 4906032 -3579831 -10565019 -11194114 -8741447 -5084241 -818106 -2337675 -15164678
1494 -15164678 -30556620 -32966785 -22592511 -16199023 -21973495 -28299419 -23814153 -14542869
1486 -14542869 -12061964 -16734371 -23075389 -31125204 -40841360 -44494342 -37904064 -32003289
1478 -32003289 -38725053 -50026785 -46125463 -23264155 820058 9872830 4843457 -5017941
1470 -5017941 -14018865 -18534982 -14395630 -2329518 10397060 18123773 21075022 19393255
1462 19393255 10573466 -3413905 -13871484 -15304428 -11749446 -8975580 -7060296 -5973789
1454 -5973789 -11163417 -25156073 -38466918 -38645553 -26859773 -16415242 -14099560 -11586084
$$ packed form
1511a354446j4554483r983098N07472M092127J225397L017698J0326131J0954756
1503D231554O74478q485863o985188o29095K452667L657206M266135j519569j2827003
1494a5164678j5391942k410165J0374274O393488n774472o325924M485266R271284
1486a4542869K480905m672407o341018q049815r716156l652982O590278N900775
1478c2003289o721764j1301732L901322K2861308K4084213R052772n029373r861398
1470e017941r000924m516117M139352J2066112J2726578P726713K951249j681767
1462A9393255q819789j3987371j0457579j432944L554982K773866J915284J086507
1454e973789n189628j3992656j3310845j78635J1785780J0444531K315682K513476
$$ plain form
1446 -11586084 721387 17421829 22216391 7316328 -16383182 -30993124 -30999030 -26664583
1438 -26664583 -28001932 -31616198 -28563770 -20174791 -16414809 -19394424 -19518486 -11091659
1430 -11091659 -1296970 1777482 -97184 -3681823 -12204695 -23745293 -22776612 -486209
1422 -486209 23355020 20083808 -6884304 -22825215 -8334855 16626223 25248441 18694793
1414 18694793 11376630 475540 -24191253 -49864702 -49492474 -21691644 3384986 5060215
1406 5060215 -2923496 499461 11113710 10838536 -1299633 -9483439 -7404908 -5972014
1398 -5972014 -13627912 -23319324 -23779079 -14577914 -5007340 -3134622 -8890374 -14570222
1390 -14570222 -11460250 684887 11864608 13848320 11229293 13339122 17872226 13980492
$$ packed form
1446a1586084J2307471J6700442M794562j4900063k3699510j4609942n906M334447
1438b6664583j337349l614266L052428Q388979L759982k979615j24062Q426827
1430a1091659R794689L074452j874666l584639q522872j1540598R68681K2290403
1422d86209K3841229l271212k6968112j5940911J4490360K4961078Q622218o553648
1414A8694793p318163j0901090k4666793k5673449L72228K7800830K5076630J675229
1406E060215p983711L422957J0614249k75174j2138169q183806K078531J432894
1398e972014p655898r691412m59755R201165R570574J872718n755752n679848
1390a4570222L109972J2145137J1179721J983712k619027K109829M533104l891734
$$ plain form
1382 13980492 2715758 511763 14776623 28018658 19453056 -4305735 -15731956
1375 -15731956 -2724526 16892040 21520571 12660689 6356553 8098195 9634207 6556230
1367 6556230 5057102 9574131 15006448 15771129 14289156 15169000 17498769 18335156 17786226
1358 17786226 14515100 2483306 -19197616 -37723010 -38455372 -24059086 -11923115 -12364609
1350 -12364609 -18903818 -20789215 -14554577 -1098467 16561749 27488584 17523825 -10351360
1342 -10351360 -30309351 -20914184 8084069 28779822 30131859 25490961 27134426 29974667
1334 29974667 24932546 14321912 5252445 -2961983 -15337599 -30415314 -41207255 -44240676
1326 -44240676 -41378996 -34947516 -26880063 -21112011 -20904314 -23488682 -21878374 -13368952
$$ packed form
1382A3980492j1264734k203995J4264860J3242035q565602k3758791j1426221
1375a5731956J3007430J9616566M628531q859882o304136J741642J536012l077977
1367F556230j499128M517029N432317P64681j481973Q79844K329769Q36387n48930
1358A7786226l271126j2031794k1680922j8525394p32362J4396286J2135971m41494
1350a2364609o539209j885397O234638J3456110J7660216J0926835r964759k7875185
1342a0351360j9957991R395167K8998253K0695753J352037m640898J643465K840241
1334B9974667n042121j0610634r069467q214428j2375616j5077715j0791941l033421
1326d4240676K861680O431480Q067453N768052K07697k584368J610308Q509422
$$ plain form
1318 -13368952 -3577247 -571091 -6152398 -14153020 -17367389 -15132701 -12499868 -12329813
1310 -12329813 -11751035 -8100098 -3938504 -2077940 66867 4879966 7071728 396256
1302 396256 -10506531 -15330934 -14187971 -15858269 -18774928 -9599329 12343100 25313838
1294 25313838 13525435 -6762543 -7405982 11708687 22446926 7981389 -15844002
1287 -15844002 -24071517 -12988743 1325451 4806787 -2902675 -12774802 -15875858 -12037564
1279 -12037564 -11662392 -23376970 -38710007 -38322208 -17382216 5596980 12100603 5708917
1271 5708917 1338685 2281392 2130530 3054106 14046757 30748297 34645850 18606144
1263 18606144 -925410 -6405547 -2809273 -7224374 -22499067 -34947220 -35712218 -31008784
$$ packed form
1318a3368952R791705L006156n581307q000622l214369K234688K632833J70055
1310a2329813N78778L650937M161594J860564K144807M813099K191762o675472
1302C96256j0902787m824403J142963j670298k916659R175599K1942429J2970738
1294B5313838j1788403k0287978o43439J9114669J0738239j4465537k3825391
1287a5844002q227515J1082774J4314194L481336p709462r872127l101056L838294
1279a2037564L75172j1714578j5333037L87799K0939992K2979196O503623o391686
1271E708917m370232R42707j50862R23576J0992651J6701540L897553j6039706
1263A8606144j9531554n480137L596274m415101j5274693j2448153p64998M703434
$$ plain form
1255 -31008784 -28992248 -27655715 -21620183 -13679920 -12061937 -18499836 -24738118 -21484002
1247 -21484002 -8470367 4719612 7280878 -2692437 -16547510 -24302655 -24424274 -22421510
1239 -22421510 -21820003 -21310680 -20322151 -21249079 -24293745 -25592205 -23029798 -18617977 -12617587
1230 -12617587 -2311825 8857538 8998714 -7054984 -26354265 -31852869 -23811840 -16138463
1222 -16138463 -14535393 -11991885 -5974025 -4813072 -12334711 -19933278 -21362475 -23166614
1214 -23166614 -30968208 -36628097 -31434817 -23262947 -25686744 -34849535 -32859743 -13773937
1206 -13773937 7994602 17677505 16582394 14391457 14889603 14928158 11073139 2671911
1198 2671911 -7357088 -12711708 -9672280 -4031731 -6103002 -17508733 -29079901 -32529919
$$ packed form
1255c1008784K016536J336533O035532P940263J617983o437899o238282L254116
1247b1484002J3013635J3189979K561266r973315j3855073p755145j21619K002764
1239b2421510O01507N09323R88529r26928l044666j298460K562407M411821O000390
1230a2617587J0305762J1169363J41176j6053698j9299281n498604Q041029P673377
1222a6138463J603070K543508O017860J160953p521639p598567j429197j804139
1214b3166614p801594n659889N193280Q171870k423797r162791J989792J9085806
1206a3773937K1768539R682903j095111k190937M98146L8555l855019q401228
1198B671911j0028999n354620L039428N640549k071271j1405731j1571168l450018
$$ plain form
1190 -32529919 -26767935 -12355547 9589304 29655389 33294101 19407776 5842758
1183 5842758 6641349 12578293 6671600 -8061959 -12908504 -3971626 -318350 -15381966
1175 -15381966 -34724257 -34113282 -11774561 10562097 16511958 12186952 11572545 15774454
1167 15774454 15530208 8781446 4459861 7850494 12091290 9501514 3765782 2483174
1159 2483174 2476530 -6339388 -22732232 -30942707 -19624999 4320869 25316360 34888083
1151 34888083 32845437 21214542 5667413 -2841669 1974355 12548439 16886043 15143241
1143 15143241 17690830 27594883 35054290 31245826 19320137 8474795 3691183 4366013
1135 4366013 7233358 7418786 1542522 -7357984 -12332220 -11755718 -10842057 -11968053 -9845608
$$ packed form
1190c2529919N761984J4412388K1944851K0066085L638712j3886325j3565018
1183E842758P98591N936944n906693j4733559m846545Q936878L653276j5063616
1175a5381966j9342291O10975K2338721K2336658N949861m325006o14407M201909
1167A5774454k44246o748762m321585L390633M240796k589776n735732j282608
1159B483174o644q815918j6392844q210475J1317708K3945868K0995491R571723
1151C4888083k042646j1630895j5547129q509082M816024J0574084M337604j742802
1143A5143241K547589R904053P459407l808464j1925689j0845342m783612O74830
1135D366013K867345J85428n876264q900506m974236N76502R13661j125996K122445
$$ plain form
1126 -9845608 -81404 12980056 21351170 21824599 15535246 4369175 -7322006 -12379794
1118 -12379794 -8201573 -980742 2430356 2549151 1567148 -4512269 -18791538 -32216958
1110 -32216958 -30868590 -14851609 605748 5352388 5728284 11243480 19119038 20283531
1102 20283531 15260784 14384013 22372084 29905250 23605770 1865062 -21477979 -29543705
1094 -29543705 -18766526 -2535416 2549212 -6907512 -20670391 -29134439 -32624488 -35557213
1086 -35557213 -37517098 -34678596 -26856198 -18413329 -13124099 -11263368 -11279278 -12427751
1078 -12427751 -16034530 -23920134 -33437521 -35414084 -22798264 -2513727 8104446 433181
1070 433181 -15708163 -25359613 -24469409 -17126691 -5394744 7873694 12563855 1360409
$$ packed form
1126i845608R764204J3061460Q371114M73429o289353j1166071j1691181n057788
1118a2379794M178221P220831L411098J18795r82003o079417j4279269j3425420
1110c2216958J348368J6016981J5457357M746640L75896N515196P875558J164493
1102B0283531n022747q76771P988071P533166o299480k1740708k3343041q065726
1094b9543705J0777179J6231110N084628r456724j3762879q464048l490049k932725
1086c5557213j959885K838502P822398Q442869N289230J860731j5910j148473
1078a2427751l606779p885604r517387j976563J2615820K0284537J0618173p671265
1070D33181j6141344r651450Q90204P342718J1731947J3268438M690161j1203446
$$ plain form
1062 1360409 -15561286 -19383359 -7241578 4504390 3962935 -2007694 -1854835 4351133
1054 4351133 9446140 9608319 2768095 -13387526 -32724955 -39142656 -24893760 -3877256
1046 -3877256 4150598 -3279950 -14831160 -24929862 -35194989 -40577139 -31583826 -12158864
1038 -12158864 -284492 -5909781 -19608113 -27231599 -25122185 -16920202 -6720506 -859596
1030 -859596 -5481132 -15450235 -15748783 -1325321 14389883 18923676 17661655 20223942
1022 20223942 21087779 10050761 -5273543 -7004240 4500810 9655584 708413 -5810269
1014 -5810269 3072817 14141661 8756757 -6173434 -8051665 5637305 13265273 4130714
1006 4130714 -2906393 12082147 37718035 45363433 29025427 11579846 9939591 13314963
$$ packed form
1062A360409j6921695l822073J2141781J1745968n41455n970629J52859O205968
1054D351133N095007J62179o840224j6155621j9337429o417701J4248896K1016504
1046c877256Q027854p430548j1551210j0098702j0265127n382150Q993313J9424962
1038a2158864J1874372n625289j3698332p623486K109414Q201983J0199696N860910
1030h59596m621536r969103k98548J4423462J5715204M533793j262021K562287
1022B0223942Q63837j1037018j5324304j730697J1505050N154774q947171o518682
1014e810269Q883086J1068844n384904j4930191j878231J3688970P627968r134559
1006D130714p037107J4988540K5635888P645398j6338006j7445581j640255L375372
$$ plain form
998 13314963 5499970 -6914405 -5092471 11251591 22459383 18202906 10729940 13175362
990 13175362 19183664 14526026 -441541 -11745628 -10565710 -724904 10019638 16862355
982 16862355 17277768 11860273 5818378 2991508 -400343 -8900325 -17179520 -16651666 -12303983
973 -12303983 -19906260 -42083171 -59623378 -55223066 -35962088 -21045522 -15030008 -7679992
965 -7679992 3414449 7295073 -325991 -7127837 -2713038 4710007 1397659 -10512464
957 -10512464 -17838509 -17546789 -17914558 -19235540 -9867644 12958916 32729003 34320241
949 34320241 25047015 22901685 30445941 34003066 25991232 14098587 6920493 2697856
941 2697856 -3587704 -11417026 -17778491 -21686004 -21804285 -16709830 -11139591 -13959883 -24786593
$$ packed form
998A3314963p814993j2414375J821934J6344062J1207792m256477p472966K445422
990A3175362O008302m657638j4967567j1304087J179918R840806J0744542O842717
982A6862355M15413n417495o041895k826870l391851q499982q279195N27854M347683
973a2303983p602277k2176911j7540207M400312J9260978J4916566O015514P350016
965g679992J1094441L880624p621064o801846M414799P423045l312348j1910123
957a0512464p326045K91720l67769j320982R367896K2826560J9770087J591238
949C4320241r273226k145330P544256L557125q011834j1892645p178094m222637
941B697856o285560p829322o361465l907513j18281N094455N570239k820292j0826710
$$ plain form
932 -24786593 -30409801 -21338386 -5349890 3205076 2301117 1715026 6818290 11626637
924 11626637 7519961 -7341862 -26804746 -40416724 -40192234 -28264723 -15701914 -9855164
916 -9855164 -6638447 -73450 5811400 2382098 -9733760 -20563075 -23001194 -18097661
908 -18097661 -10414767 -5510407 -9425798 -22155997 -33546719 -34441162 -29872227 -31402860
900 -31402860 -38412587 -39097162 -30102703 -21770291 -20611508 -19341824 -10490515 472185
892 472185 2945587 -5297636 -18474673 -30193180 -35653575 -33090620 -27315865 -24968185
884 -24968185 -22927388 -10409829 12714089 29825892 27290076 11963835 1242577 3139352
876 3139352 13551205 24778828 28036698 16238942 -5031920 -17092085 -10394536 72157
$$ packed form
932b4786593n623208R071415J5988496Q554966r03959n86091N103264M808347
924A1626637m106676j4861823j9462884j3611978K24490J1927511J2562809N846750
916i855164L216717O564997N884850l429302j2115858j0829315k438119M903533
908a8097661P682894M904360l915391j2730199j1390722q94443M568935j530633
900c1402860p009727o84575Q994459Q332412J158783J269684Q851309J0962700
892D72185K473402q243223j3177037j1718507n460395K562955N774755K347680
884b4968185K040797J2517559K3123918J7111803k535816j5326241j0721258J896775
876C139352J0411853J1227623L257870j1797756k1270862j2060165O697549J0466693
$$ plain form
868 72157 -5158567 -21364046 -27129078 -16461723 -5472947 -6884680 -15329869 -21424906
860 -21424906 -24310546 -24332433 -18052037 -8946596 -10414071 -27416664 -44265498 -41919474
852 -41919474 -21694061 -1493128 7671624 11199742 17799717 25708855 25275705 12316843
844 12316843 -3601171 -6533059 7408550 21667126 16604223 -5038686 -19837425 -13684873
836 -13684873 855034 3603266 -7752500 -21664097 -32774464 -42996994 -47477975 -37094661
828 -37094661 -16869568 -6142782 -13645852 -24261458 -19128616 161691 17193059 23481920
820 23481920 23611746 20785471 10671815 -7107959 -21411615 -20366137 -5268665 11618885
812 11618885 20314346 19522022 12384715 2099139 -7522345 -12124000 -10559960 -6947728
$$ packed form
868G2157n230724j6205479n765032J0667355J0988776j411733q445189o095037
860b1424906k885640k1887O280396R105441j467475j7002593j6848834K346024
852d1919474K0225413K0200933R164752L528118O599975P909138m33150j2958862
844A2316843j5918014k931888J3941609J4258576n062903k1642909j4798739O152552
836a3684873J4539907K748232j1355766j3911597j1110367j0222530m480981J0383314
828c7094661K0225093J0726786p503070j0615606N132842J9290307J7031368O288861
820B3481920J29826k826275j0113656j7779774j4303656J045478J5097472J6887550
812A1618885Q695461p92324p137307j0285576r621484m601655J564040L612232
$$ plain form
804 -6947728 -6964878 -12423857 -19875340 -23646486 -20266407 -11541987 -3856881 -3058258 -9305329
795 -9305329 -17669588 -23451802 -25469041 -25038474 -24658737 -27397755 -33564127 -37089351 -29912127
786 -29912127 -12767352 2437477 5205973 -1141921 -3983507 3239202 14475281 19481206
778 19481206 15261038 8702277 9416012 19248400 28466602 25583131 12268613 2980199
770 2980199 5741890 9626054 -850859 -23402376 -40292166 -41407178 -33989988 -28098762
762 -28098762 -23542064 -16145705 -8166541 -5688305 -10795653 -21325281 -33788434 -42583939
754 -42583939 -41585488 -31150302 -19286396 -12531927 -10888301 -14058901 -23732086 -33981855
746 -33981855 -29649995 -5309683 21007404 26048132 10019088 -5766296 -8124288 -4595051
$$ packed form
804f947728j7150n458979p451483l771146L380079Q724420P685106P98623o247071
795i305329q364259n782214k017239M30567L79737k739018o166372l525224P177224
786b9912127J7144775J5204829K768496o347894k841586P222709J1236079N005925
778A9481206m220168o558761P13735R832388R218202k883471j3314518r288414
770B980199K761691L884164j0476913k2551517j6889790j115012P417190N891226
762b8098762M556698P396359P979164K478236n107348j0529628j2463153q795505
754d2583939R98451J0435186J1863906O754469J643626l170600r673185j0249769
746c3981855M331860K4340312K6317087N040728j6029044j5785384k357992L529237
$$ plain form
738 -4595051 -5266105 -6903336 -2120887 6766239 12034685 11793739 9126940 5390170 1568392
729 1568392 1648363 7312146 12834555 12177367 7957828 6533585 7672180 7205468 7035922
720 7035922 12544444 20742096 21754643 14089237 8009539 9500308 10852479 4069677
712 4069677 -4992544 -5285132 2655759 9107579 10629498 11876005 13538322 10656191 4392782
703 4392782 3517438 9863264 13103644 6141738 -4271352 -10084472 -15261919 -25550953
695 -25550953 -33197877 -26696635 -11922367 -7199034 -16157497 -21064135 -8474417 11998156
687 11998156 22911393 22095022 19707198 19608849 16184853 7574239 1265056 4685642 16429809
678 16429809 28236591 32161593 26277510 16499330 11439107 12565439 12075859 3936892
$$ packed form
738d595051o71054j637231M782449Q887126N268446k40946k666799l736770l821778
729A568392P9971N663783N522409o57188m219539j424243J138595m66712j69546
720G035922N508522Q197652J012547p665406o079698J490769J352171o782802
712D069677r062221k92588P940891O451820J521919J246507J662317k882131o263409
703D392782q75344O345826L240380o961906j0413090n813120n177447j0289034
695b5550953p646924O501242J4774268M723333q958463m906638J2589718K0472573
687A1998156J0913237q16371k387824r8349l423996q610614o309183L420586J1744167
678A6429809J1806782L925002n884083r778180n060223J126332m89580q138967
$$ plain form
670 3936892 -7004984 -12556323 -14164921 -20351063 -32154897 -39570145 -34595933 -21511375
662 -21511375 -11010948 -8339907 -10202069 -10623672 -7163428 -2284164 222577 33288
654 33288 191544 1555325 453496 -5621986 -13339773 -18100840 -19579598 -18096847 -10045817
645 -10045817 5781562 20721889 24109077 17090237 9373568 3441067 -6721568 -20332820
637 -20332820 -26326279 -20225217 -12933519 -15087586 -22226505 -24477799 -22822261 -24963922
629 -24963922 -30557527 -31926814 -26920230 -20772022 -16056321 -9750993 -284256 10027408
621 10027408 19322853 26153801 26277478 17366053 6466491 4448627 12241914 20110313
613 20110313 21114167 17454973 13224681 10234995 12328596 22962843 34960677 34093072
$$ packed form
670C936892j0941876n551339j608598o186142j1803834p415248M974212J3084558
662b1511375J0500427K671041j862162m21603L460244M879264K506741j89289
654C3288J58256J363781j101829o075482p717787m761067j478758J482751Q051030
645a0045817J5827379J4940327L387188p018840p716669n932501j0162635j3611252
637b0332820n993459O101062P291698k154067p138919k251294J655538k141661
629b4963922n593605j369287N006584O148208M715701O305328R466737J0311664
621A0027408R295445O830948J23677q911425j0899562k017864P793287P868399
613B0110313J003854l659194m230292k989686K093601J0634247J1997834q67605
$$ plain form
605 34093072 19046374 6686748 8848618 14975009 10205294 833517 4019170 16871777
597 16871777 16961042 -2889039 -20020880 -12534712 10530419 23896271 21001973 17601325
589 17601325 24551123 34036040 35070136 28770163 22564137 19309503 18388926 19501868
581 19501868 18809642 8688262 -10671107 -25449593 -23613437 -12332628 -9349486 -18258623
573 -18258623 -23872343 -14570724 1257801 6868942 -2234726 -16282649 -25100066 -27026166
565 -27026166 -26269295 -27292113 -31256368 -34419922 -31422696 -22909768 -16822889 -18129980
557 -18129980 -20919932 -16720990 -7830814 -4378024 -8768549 -12099070 -8502876 -4464251
549 -4464251 -8119392 -15558840 -15666267 -5884185 4761966 8631011 8472585 10670257 14608248
$$ packed form
605C4093072j5046698j2359626K161870O126391m769715r371777L185653J2852607
597A6871777Q9265j9850081j7131841P486168K3065131J3365852k894298l400648
589A7601325O949798R484917J034096o299973o206026l254634r20577J112942
581A9501868o92226j0121380j9359369j4778486J836156J1280809K983142q909137
573a8258623n613720R301619J5828525N611141r103668j4047923q817417j926100
565b7026166P56871j022818l964255l163554K997226Q512928O086879j307091
557a8129980k789952M198942Q890176L452790m390525l330521L596194M038625
549d464251l655141p439448j07427R782082J0646151L869045j58426K197672L937991
$$ plain form
540 14608248 13538488 4045966 -9808426 -21617406 -27979885 -27903032 -21205312 -10857642
532 -10857642 -3878526 -4707891 -8485657 -6556766 610727 2487940 -6420689 -17160276
524 -17160276 -18297349 -12319374 -11192444 -17504784 -20091449 -10267567 6478998 19058460
516 19058460 23588145 22282016 16177966 6641247 121965 2745026 10699285 13168455
508 13168455 5722987 -5123561 -12157925 -16414305 -22346138 -28130542 -26132534 -13050107
500 -13050107 3970443 13587118 12003326 6340903 5192367 8050955 7828340 2994973
492 2994973 968757 6531657 12892225 10647166 1900482 -2758408 -202417 1645086
484 1645086 -1715785 -2743785 5844855 16966984 16916461 5016080 -4527382 -2758100
$$ packed form
540A4608248j069760r492522j3854392j1808980o362479P6853O697720J0347670
532a0857642O979116q29365l777766J928891P167493J877213q908629j0739587
524a7160276j137073N977975J126930o312340k586665R823882J6746565J2579462
516A9058460M529685j306129o104050r536719o519282K623061P954259K469170
508A3168455p445468j0846548p034364m256380n931833n784404J998008J3082427
500a3050107J7020550R616675j583792n662423j148536K858588k22615m833367
492B994973k026216N562900O360568k245059q746684m658890K555991J847503
484A645086l360871j028000Q588640J1122129n0523j1900381r543462J769282
$$ plain form
476 -2758100 938013 -7075269 -22691267 -26819094 -11760755 5098250 1980485 -18311980
468 -18311980 -31506821 -24225333 -11127753 -13395466 -29887617 -40865738 -35522173 -23013333
460 -23013333 -16027869 -15170598 -13457684 -7267653 2250093 12163577 17896441 16264222
452 16264222 11666377 12199247 15950631 10346252 -8198173 -23582826 -19769259 -4050024
444 -4050024 2868845 -3849343 -8889171 -1902431 8548993 11058222 8006627 7671625
436 7671625 9548994 7755386 3139361 1953230 5163992 7480137 5738653 1400488
428 1400488 -3980494 -8879115 -8289894 2094010 16960213 24038605 18982394 11283717
420 11283717 10207309 10001453 -2571622 -26953055 -44321206 -39061656 -18517698 -3810875
$$ packed form
476b758100L696113q013282j5615998m127827J5058339J6859005l117765k0292465
468a8311980j3194841P281488J3097580k267713j6492151j0978121N343565J2508840
460b3013333O985464Q57271J712914O190031R517746R913484N732864j632219
452A6264222m597845N32870L751384n604379j8544425j5384653L813567J5719235
444d050024O918869o718188n039828O986740J0451424K509229l051595l35002
436G671625J877369j793608m616025j186131L210762K316145j741484m338165
428A400488n380982m898621N89221J0383904J4866203P078392n056211p698677
420A1283717j076408k05856j2573075k4381433j7368151N259550K0543958J4706823
$$ plain form
412 -3810875 -3897334 -8134033 -5319392 841565 1625249 -537064 3006281 10455118 10724331
403 10724331 1640050 -5113388 -954437 7941170 11450332 9267108 7073216 6073249
395 6073249 3973417 1107947 -1573187 -5697033 -9459795 -3989466 14886467 35117147
387 35117147 39275919 25668417 8910650 134625 -3091052 -6365686 -9248953 -10749796
379 -10749796 -14772811 -23488870 -31049311 -30426812 -23569386 -19580664 -23877127 -32262745
371 -32262745 -35482593 -28823782 -17688908 -12142952 -14044895 -13108315 -658135 16368534
363 16368534 23346590 18211098 13777099 18728789 26505864 26736198 18634786 8274261
355 8274261 607464 -784815 6015958 15464305 16590347 6918122 -3081594 -5340507
$$ packed form
412c810875q6459m236699K814641O160957P83684k162313L543345P448837K69213
403A0724331r084281o753438M158951Q895607L509162k183224k193892r99967
395F073249k099832k865470k681134m123846l762762N470329J8875933K0230680
387C5117147M158772j3607502j6757767q776025l225677l274634k883267j500843
379a0749796m023015q716059p560441O22499O857426L988722m296463q385618
371c2262745l219848O658811J1134874N545956j901943R36580J2450180J7026669
363A6368534O978056n135492m433999M951690P777075K30334q101412j0360525
355H274261p666797j392279O800773R448347J126042r672225r999716k258913
$$ plain form
347 -5340507 -4904729 -7428617 -6179278 6336865 21545656 24083034 13689490 3695597
339 3695597 278197 -2295899 -6812493 -8669696 -7597930 -9233489 -12312877 -8801313
331 -8801313 -722293 -1526340 -13977741 -21758128 -13006870 1216638 4270132 -1840369
323 -1840369 -4136476 -1535740 -3289612 -9666326 -11437669 -7466958 -6631416 -10742381 -10758402
314 -10758402 -3901472 -316878 -5915464 -10631885 -2791220 13672255 25785985 28726988
306 28726988 26744391 21685762 11354451 -1801777 -9840243 -8892699 -3236893 1710329
298 1710329 5122574 7735057 8028889 4709322 336235 -722351 2310594 4617113 -218765
289 -218765 -13208492 -26585819 -29767644 -20780910 -9420859 -5789180 -8154085 -7244159
$$ packed form
347e340507M35778k523888J249339J2516143J5208791K537378j0393544r993893
339C695597l417400k574096m516594j857203J071766j635559l079388L511564
331h801313Q079020q04047j2451401p780387Q751258J4223508L053494o110501
323a840369k296107K600736j753872o376714j771343L970711Q35542m110965j6021
314a0758402O856930L584594n598586m716421P840665J6463475J2113730K941003
306B8726988j982597n058629j0331311j3156228q038466R47544N655806M947222
298A710329L412245K612483K93832l319567m373087j058586L032945K306519m835878
289b18765j2989727j3377327l181825Q986734J1360051L631679k364905R09926
$$ plain form
281 -7244159 -691589 4406519 4137901 4221421 9257598 13433772 9940843 4151903 6832468
272 6832468 16014578 17154000 3727778 -12664237 -18117745 -13913752 -10883257 -12699900
264 -12699900 -13689245 -9637825 -1883944 7479351 16000952 17956304 10566164 2932494
256 2932494 7866874 22491064 28509114 17178642 2550545 738163 6221379 2414141
248 2414141 -10372062 -14328344 -1872009 11935608 10668410 -1989789 -10743175 -9967352
240 -9967352 -6236898 -4544867 -2701962 1347213 5485678 8204868 10880393 13068676
232 13068676 10715304 2155255 -7490464 -11201082 -7804242 -2529438 -857444 -3821782
224 -3821782 -8794583 -12580231 -12870712 -8355932 106480 7909981 8616504 -106893 -13123004
$$ packed form
281g244159O552570N098108k68618Q3520N036177M176174l492929n788940K680565
272F832468R182110J139422j3426222j6392015n453508M203993L030495j816643
264a2699900r89345M051420P753881R363295Q521601J955352p390140p633670
256B932494M934380J4624190O018050j1330472j4628097j812382N483216l807238
248B414141j2786203l956282J2456335J3807617j267198j2658199q753386P75823
240i967352L730454J692031J842905M049175M138465K719190K675525K188283
232A3068676k353372q560049r645719l710618L396840N274804J671994k964338
224c821782m972801l785648k90481M514780Q462412P803501P06523q723397j3016111
$$ plain form
215 -13123004 -22583187 -25476510 -23954880 -19330356 -10607693 6784 5549905 2013823
207 2013823 -5836655 -10409761 -10576883 -10967703 -14027064 -17194697 -16895485 -11465887 -1356180
198 -1356180 9561582 14321099 9420863 587899 -2792764 1058962 5274740 4484387
190 4484387 776172 -1303764 -586948 1646693 4305104 6359886 6958156 6136035 2815532
181 2815532 -5944591 -18667045 -25080894 -16479998 163151 8353301 3416205 -3553380
173 -3553380 -5792243 -11085458 -24462214 -34409389 -29117837 -16419801 -12583127 -18149459
165 -18149459 -20947670 -18331983 -18178214 -18865705 -8188302 13023800 24514350 13858949
157 13858949 -3543427 -3899208 14526921 32444667 35523340 27836846 21304245 21335904
$$ packed form
215a3123004r460183k893323J521630M624524Q722663J0614477N543121l536082
207B013823p850478m573106j67122l90820l059361l167633K99212N429598J0109707
198a356180J0917762M759517m900236q832964l380663L851726M215778p90353
190D484387l708215k079936P16816K233641K658411K054782N98270q22121l320503
181B815532q760123j2722454o413849Q600896J6643149Q190150m937096o969585
173c553380k238863n293215j3376756r947175N291552J2698036L836674n566332
165a8149459k798211K615687J53769o87491J0677403K1212102J1490550j0655401
157A3858949j7402376l55781J8426129J7917746L078673p686494o532601L1659
$$ plain form
149 21335904 24262905 23604946 17169011 8966171 3233089 -2064630 -10805896 -18694893
141 -18694893 -16314519 -4516685 2796541 -3299250 -14466490 -17724842 -12453207 -6444753
133 -6444753 -2187732 2524579 5270627 1541206 -5507816 -7806139 -3995281 168007
125 168007 1885688 3449641 5241056 5016756 3982406 5846355 10099822 13622247 17959709
116 17959709 26476989 34640221 32626745 19214429 4660226 -2404320 -3490790 -3861900
108 -3861900 -5192080 -7060680 -8975824 -8465807 -3100264 4032953 6809984 4544316 1221554
99 1221554 -3356013 -12738649 -23579530 -26636947 -20463229 -13639386 -10164473 -4162973
91 -4162973 5773835 9360927 278173 -11475499 -13338457 -8211060 -7912386 -15023917 -22221451
$$ packed form
149B1335904K927001o57959o435935q202840n733082n297719q741266p888997
141a8694893K380374J1797834P313226o095791j1167240l258352N271635O008454
133f444753M257021M712311K746048l729421p049022k298323L810858M163288
125A68007J717681J563953J791415k24300j034350J863949M253467L522425M337462
116A7959709Q517280Q163232k013476j3412316j4554203p064546j086470l71110
108c861900j330180j868600j915144N10017N365543P133217K777031k265668l322762
99A221554m577567r382636j0840881l057417O173718O823843L474913O001500
91d162973R936808L587092r082754j1753672j862958N127397K98674p111531p197534
$$ plain form
82 -22221451 -24851175 -23549851 -18268070 -10038841 -5390619 -8850973 -14144941 -13134677
74 -13134677 -10061147 -14780550 -24051599 -23750963 -11126896 -1041786 -5196558 -16589134
66 -16589134 -21300173 -16866545 -11489720 -11206032 -15062839 -19197607 -19817443 -14709739 -6221379
57 -6221379 -567560 -1070493 -4657351 -7456042 -10150109 -14309900 -16783091 -12436863 -1418562
48 -1418562 9663548 13631760 8512447 -1156185 -7490803 -5468697 2616674 10207910
40 10207910 14291572 17636644 22636190 26451832 24538291 16522314 6213744 -2486582
32 -2486582 -7785784 -9903010 -10810462 -12716032 -15130464 -14785315 -9853282 -2473273 4646781
23 4646781 11944039 20223121 25474185 21071074 7078741 -5697232 -4974224 9531973
$$ packed form
82b2221451k629724J301324N281781Q229229M648222l460354n293968J010264
74a3134677L073530m719403r271049L00636J2624067J0085110m154772j1392576
66a6589134m711039M433628N376825K83688l856807m134768o19836N107704Q488360
57f221379N653819n02933l586858k798691k694067m159791k473191M346228J1018301
48a418562J1082110L968212n119313r668632o334618K022106Q085371P591236
40A0207910M083662L345072M999546L815642j913541q015977j0308570q700326
32b486582n299202k117226r07452j905570k414432L45149M932033P380009P120054
23D646781P297258Q279082N251064m403111j3992333j2775973P23008J4506197
$$ plain form
15 9531973 25099235 29906639 24953087 19344900 17051933 14320980 9284429 6275181
7 6275181 7708615 8621178 4627358 72813 1681326 7605331 9754156
0 9754156
$$ packed form
15I531973J5567262M807404m953552n608187k292967k730953n036551l009248
7F275181J433434R12563l993820m554545J608513N924005K148825
0I754156
$$ Imaginary data points
##PAGE= N=2
##DATA TABLE= (X++(I..I)), XYDATA
$$ plain form
65535 -4280094 -10448444 -12893303 -10882820 -2501808 9673723 17754407 18383133 17903929
65527 17903929 22419376 27622967 24619898 12361839 -1531651 -9721173 -9873216 -3459592
65519 -3459592 4457147 6516435 132261 -7712201 -7833094 -279141 6096676 4749646
65511 4749646 -2086723 -7413175 -6149904 1436800 9446876 10423884 3184840 -4426751
65503 -4426751 -3856030 4433270 12796291 16147571 15982116 16281117 19621307 26146993 32211990
65494 32211990 31135313 19820063 4291727 -5299074 -5044555 481385 5286311 7420362
65486 7420362 8021234 8908860 11524400 15600169 18803258 19178138 16827579 12297789 6246617
65477 6246617 2105211 4455164 11801772 16069831 13398735 9849814 11037930 12356047
$$ packed form
65535d280094o168350k444859K010483Q381012J2175531Q080684O28726m79204
65527A7903929M515447N203591l003069j2258059j3893490q189522j52043O413624
65519c459592P916739K059288o384174p844462j20893P553953O375817j347030
65511D749646o836369n326452J263271P586704Q010076R77008p239044p611591
65503d426751N70721Q289300Q363021L351280j65455K99001L340190O525686O064997
65494C2211990j076677j1315250j5528336r590801K54519N525940M804926K134051
65486G420362O00872Q87626K615540M075769L203089L74880k350559m529790o051172
65477F246617m141406K349953P346608M268059k671096l548921J188116J318117
$$ plain form
65469 12356047 7051176 -1743285 -6450194 -7847712 -11658447 -15737767 -12666032 -3638378
65461 -3638378 2401858 3261816 5017951 8965173 10339130 11271291 20055965 33601069
65453 33601069 36169989 22832600 9558439 10126102 16287960 13224973 3249713 -854344
65445 -854344 1909792 1196537 -5962657 -11603938 -10456910 -4466369 4935936 16629570
65437 16629570 22771459 15334903 1074278 -2916914 7952250 18995113 16972064 6741721
65429 6741721 894278 2462429 6298064 10192555 14761015 16495328 10913788 1719703
65421 1719703 -1666024 3088383 7502465 3616902 -6100265 -13180487 -13435155 -8809008
65413 -8809008 -1766036 6676911 13485749 14026047 8907202 6052889 11058120 18034887
$$ packed form
65469A2356047n304871q794461m706909j397518l810735m079320L071735R027654
65461c638378O040236Q59958J756135L947222J373957R32161Q784674J3545104
65453C3601069K568920j3337389j3274161N67663O161858l062987r975260m104057
65445h54344K764136p13255p159194n641281J147028N990541R402305J1693634
65437A6629570O141889p436556j4260625l991192J0869164J1042863k023049j0230343
65429F741721n847443J568151L835635L894491M568460J734313n581540r194085
65421A719703l385727M754407M414082l885563r717167p080222k54668M626147
65413h809008P042972Q442947O808838N40298n118845k854313N005231O976767
$$ plain form
65405 18034887 16186883 5069104 -3186934 1455306 15688595 28693709 33714526 30533385
65397 30533385 22067162 13601583 11076873 14316750 14795857 5401494 -10098918 -22059425
65389 -22059425 -26069492 -23532961 -15139351 -1788417 9927897 11944734 5097292 -1627430
65381 -1627430 -2629544 59978 3777545 8320691 10819221 6114160 -4437219 -11999069
65373 -11999069 -12042948 -10044616 -10625038 -8184997 4116964 20551622 26555562 15759546
65365 15759546 -2876505 -15610159 -17383231 -13858737 -13003448 -16363852 -18555635 -15131784
65357 -15131784 -9107011 -6716498 -7881321 -6402040 -914864 610932 -8337806 -21982262
65349 -21982262 -27763118 -20591798 -6913653 3949257 8006682 6946522 4690169 4412065
$$ packed form
65405A8034887j848004j1117779q256038M642240J4233289J3005114N020817l181141
65397C0533385q466223q465579k524710L239877M79107r394363j5500412j1960507
65389b2059425m010067K536531Q393610J3350934J1716314K016837o847442o724722
65381a627430j002114K689522L717567M543146K498530m705061j0551379p561850
65373a1999069m3879J998332n80422K440041J2301961J6434658O003940j0796016
65365A5759546j8636051j2733654j773072L524494Q55289l360404k191783L423851
65357a5131784O024773K390513j164823J479281N487176J525796q948738j3644456
65349b1982262n780856P171320J3678145J0862910M057425j060160k256353k78104
$$ plain form
65341 4412065 6634324 9818235 13379759 18326355 23673112 25132730 20060863 11331987
65333 11331987 3464078 -2539753 -7100835 -7619394 -1053022 9955980 17721488 16318629
65325 16318629 5515918 -10324243 -24457405 -31423710 -32248239 -33371040 -36593758 -34500321
65317 -34500321 -22283112 -9333995 -8518640 -15680400 -12714440 6153913 23797164 22830368
65309 22830368 8439753 -1056399 1213885 6950152 8918391 8462069 7535199 4716047
65301 4716047 1261387 1557166 4121008 480790 -12145683 -23673410 -22442473 -9425596
65293 -9425596 3984943 9221815 7103427 4009370 5927662 14103010 22685803 22926709
65285 22926709 13395880 3242315 916237 2779185 -1023194 -11444318 -18693326 -15741086
$$ packed form
65341D412065K222259L183911L561524M946596N346757J459618n071867q728876
65333A1331987p867909o003831m561082n18559O566372J1009002P765508j402859
65325A6318629j0802711j5840161j4133162o966305q24529j122801l222718K093437
65317c4500321J2217209J2949117Q15355p161760K965960J8868353J7643251r66796
65309B2830368j4390615r496152K270284N736267J968239m56322r26870k819152
65301D716047l454660K95779K563842l640218j2626473j1527727J230937J3016877
65293i425596J3410539N236872k118388l094057J918292Q175348Q582793K40906
65285B2926709r530829j0153565k326078J862948l802379j0421124p249008K952240
$$ plain form
65277 -15741086 -6667379 474273 3305213 4789171 7762517 12725329 17805687 19015954
65269 19015954 13965211 6486318 3111804 3739238 1710578 -4632596 -8028289 -4713812
65261 -4713812 -2881020 -10600210 -21693093 -24464967 -20505718 -21676601 -28882963 -28614873
65253 -28614873 -15502708 -4723343 -11802259 -29347451 -36468378 -26700317 -13605364
65246 -13605364 -9476996 -11425033 -11995024 -12009626 -14997054 -16529549 -9374960 3371716
65238 3371716 9995320 5959476 -80968 755970 5416271 5261490 -181195 -3483828
65230 -3483828 -1969824 -1919909 -7672062 -13126840 -9502738 1698130 9227419 5175902
65222 5175902 -6961957 -18209028 -24642734 -29681317 -36973199 -43376350 -40987092 -27004783
$$ packed form
65277a5741086R073707P141652K830940J483958K973346M962812N080358J210267
65269A9015954n050743p478893l374514O27434k028660o343174l395693L314477
65261d713812J832792p719190j1092883k771874L959249j170883p206362K68090
65253b8614873J3112165J0779365p078916j7545192p120927R768061J3094953
65246a3605364M128368j948037n69991j4602k987428j532495P154589J2746676
65238C371716O623604m035844o040444Q36938M660301j54781n442685l302633
65230c483828J514004M9915n752153n454778L624102J1200868P529289m051517
65222E175902j2137859j1247071o433706n038583p291882o403151K389258J3982309
$$ plain form
65214 -27004783 -9757111 -1453693 -4746275 -10506116 -10376439 -6617473 -5779690 -7229630
65206 -7229630 -4363336 4766335 14650702 20108836 21153273 19384569 14769169 7687557
65198 7687557 506736 -3998464 -3380137 3775919 13512901 15455877 3855624 -11001426
65190 -11001426 -12008197 2231304 14338279 12053087 4418697 6019806 14899006 18593335
65182 18593335 16105498 18740990 29458408 36082055 30159592 21300215 24261051 37987720
65174 37987720 46281484 37614926 17667778 1585398 -1798498 3903919 10024053 13134945
65166 13134945 15966160 19149693 17024181 5627583 -8276401 -12922847 -6689040 -1021893
65158 -1021893 -5672398 -16832720 -24370024 -25943654 -27300818 -30972612 -32373645 -28048686
$$ packed form
65214b7004783J7247672Q303418l292582n759841J29677L758966Q37783j449940
65206g229630K866294R129671R884367N458134J044437j768704m615400p081612
65198G687557p180821m505200O18327P156056R736982J942976j1600253j4857050
65190a1001426j006771J4239501J2106975k285192p634390J601109Q879200L694329
65182A8593335k487837K635492J0717418O623647n922463q859377K960836J3726669
65174C7987720Q293764q666558j9947148j6082380l383896N702417O120134L110892
65166A3134945K831215L183533k125512j1396598j3903984m646446O233807N667147
65158a021893m650505j1160322p537304j573630j357164l671794j401033M324959
$$ plain form
65150 -28048686 -21154140 -15712103 -10614219 -3740114 1824044 1504843 -2518230 -2908320
65142 -2908320 2807510 9550918 13211121 15888110 20017307 23205981 23111533 22016180
65134 22016180 21417461 17889032 11325259 11060268 23171546 36240864 33767747 19678481
65126 19678481 15187832 26859969 35292155 24835850 8136865 5480344 11802866 4807274
65118 4807274 -18573950 -34888025 -26367732 -3452686 11608911 11129902 4223557 2009519
65110 2009519 8773648 21877485 33316539 35004867 27551467 20662718 21500569 26628330
65102 26628330 28586988 25558381 20190438 13263303 4328787 -3326489 -3759247 4732443
65094 4732443 16003319 20325334 12978114 -490607 -9199259 -9163665 -7742447 -12003548
$$ packed form
65150b8048686O894546N442037N097884O874105N564158l19201m023073l90090
65142b908320N715830O743408L660203K676989M129197L188674r4448j095353
65134B2016180n98719l528429o563773k64991J2111278J3069318k473117j4089266
65126A9678481m490649J1672137Q432186j0456305j6698985k656521O322522o995592
65118D807274k3381224j6314075Q520293K2915046J5061597m79009o906345k214038
65110B009519O764129J3103837J1439054J688328p453400o888749Q37851N127761
65102B6628330J958658l028607n367943o927135q934516p655276m32758Q491690
65094D732443J1270876M322015p347220j3468721q708652L5594J421218m261101
$$ plain form
65086 -12003548 -16668869 -11155538 3745258 15988540 19312940 19864102 23496685 26958188
65078 26958188 26215421 23737013 21519078 16037242 7366756 4635292 13347544 24344809
65070 24344809 25306717 17842935 13120746 15002319 18195400 20017430 22832662 25939611
65062 25939611 25493771 22545288 21613875 21036609 14589551 4040123 -176976 5331149
65054 5331149 9285568 -203627 -19319891 -32008267 -27336316 -9698505 6960137 12858122
65046 12858122 10428230 8589408 9766031 7360880 -1195644 -5911067 2901646 17644592
65038 17644592 20782530 9023687 -1203658 4496187 21170807 33915982 36223486
65031 36223486 32300129 27031167 21310723 15426475 11707817 13473756 22232627 34017450
$$ packed form
65086a2003548m665321N513331J4900796J2243282L324400N51162L632583L461503
65078B6958188p42767k478408k217935n481836q670486k731464Q712252J0997265
65070B4344809R61908p463782m722189J881573L193081J822030K815232L106949
65062B5939611m45840k948483r31413n77266o447058j0549428m217099N508125
65054E331149L954419r489195j9116264j2688376M671951J7637811J6658642N897985
65046A2858122k429892j838822J176623k405151q556524m715423Q812713J4742946
65038A7644592L137938j1758843j0227345N699845J6674620J2745175K307504
65031C6223486l923357n268962n720444n884248l718658J765939Q758871J1784823
$$ plain form
65023 34017450 39266609 31446163 16556994 8154417 10916966 15198401 10840523 286896
65015 286896 -6504378 -5442509 -1700338 -2603939 -10617206 -21108575 -25481485 -19820268
65007 -19820268 -10846981 -8103740 -10079186 -5976078 6925053 17419375 16704310 10965550
64999 10965550 10339375 13820829 14305332 11660439 10543353 10587434 9128940 8932127 12408240
64990 12408240 13118105 5800660 488565 10532998 27748640 28152387 7043443 -9538454
64982 -9538454 1620863 30123367 47493815 42723523 27570823 13796949 2335061
64975 2335061 -6283962 -7260684 -1689306 834884 -3917554 -7300035 -1056786 9008384
64967 9008384 10942892 3886093 -1491770 1432621 7319893 7675795 1084069 -7491113
$$ packed form
65023C4017450N249159p820446j4889169q402577K762549M281435m357878j0553627
65015B86896o791274J061869L742171r03601q013267j0491369m372910N661217
65007a9820268Q973287K743241j975446M103108J2901131J0494322p15065n738760
64999A0965550o26175L481454M84503k644893j117086M4081j458494j96813L476113
64990A2408240P09865p317445n312095J0044433J7215642M03747k1108944j6581897
64982i538454J1159317K8502504J7370448m770292j5152700j3773874j1461888
64975B335061q619023r76722N571378K524190m752438l382481O243249J0065170
64967I008384J934508p056799n377863K924391N887272L55902o591726q575182
$$ plain form
64959 -7491113 -12286470 -9246297 1739801 13742339 17067346 11200820 7646400 14849754
64951 14849754 24900544 23698429 11384558 1912703 2169898 3387218 -2570875 -9501613
64943 -9501613 -7426641 1193980 5496547 1806184 -4121140 -7709198 -9302758 -8035425
64935 -8035425 -344803 13727882 28188771 36570614 37053915 33074157 31271416 35765906
64927 35765906 41198176 36307195 19439471 4308364 2401058 5812469 -1128578 -17467055
64919 -17467055 -26850717 -22273024 -14820701 -15022444 -19383513 -20847610 -20155090 -19271818
64911 -19271818 -13858828 -1149927 11921428 16450507 12252198 5369849 826793 2303977
64903 2303977 11629805 23569422 29000320 28177767 31278587 39807113 39463655 21725103
$$ packed form
64959g491113m795357L040173J0986098J2002538L325007n866526l554420P203354
64951A4849754J0050790j202115j2313871r471855K57195J217320n958093o930738
64943i501613K074972Q620621M302567l690363n927324l588058j593560J267333
64935h035425P690622J4072685J4460889Q381843M83301l979758j802741M494490
64927C5765906N432270m890981j6867724j5131107j907306L411411o941047j6338477
64919a7467055r383662M577693P452323k01743m361069j464097O92520Q83272
64911a9271818N412990J2708901J3071355M529079m198309o882349m543056J477184
64903B303977R325828J1939617N430898q22553L100820Q528526l43458j7738552
$$ plain form
64895 21725103 1606496 329658 17762218 35644682 41966429 38090393 27423438
64888 27423438 13297841 5299635 11063280 21475470 18909376 1343727 -15389789
64881 -15389789 -20100686 -16549411 -10002870 677129 13631407 21881550 26059435 34876213
64873 34876213 46754687 46115452 26998871 6656609 4334285 17389826 29501869
64866 29501869 32564139 28886597 21071601 12747728 12168763 22251698 32860712 34874006
64858 34874006 35189830 44104200 54168860 48630293 28393226 12641961 10548274 8970640
64850 8970640 -5382455 -24605885 -29330165 -12395427 14372363 32741747 33078621 20618451
64842 20618451 9836251 9764665 14344932 11013987 -2489430 -16177522 -21981355 -21933416
$$ packed form
64895B1725103k0118607j276838J7432560J7882464O321747l876036j0666955
64888B7423438j4125597p998206N763645J0412190k566094j7565649j6733516
64881a5389789m710897L551275O546541J0679999J2954278Q250143M177885Q816778
64873C4876213J1878474o39235j9116581k0342262k322324J3055541J2112043
64866B9501869L062270l677542p814996q323873n78965J0082935J0609014K013294
64858C4874006L15824Q914370J0064660n538567k0237067j5751265k093687j577634
64850H970640j4353095j9223430m724280J6934738K6767790J8369384L36874j2460170
64842B0618451j0782200p1586M580267l330945j3503417j3688092n803833M7939
$$ plain form
64834 -21933416 -20863747 -18748658 -13618943 -6300208 705299 4629251 1584204 -9962475
64826 -9962475 -23166799 -26230273 -14689575 3760060 17758488 21238095 14703937 4622794
64818 4622794 1857534 12345699 27078074 29278005 14604891 -3228635 -9884907 -5198983
64810 -5198983 3179640 11618224 19237034 22166238 17138338 6823074 -4098136 -14005358
64802 -14005358 -21090425 -20909631 -13046314 -5015654 -3294245 -4740737 -2415585 4608418
64794 4608418 12404738 18065934 19359131 14509804 7847568 8623377 17403674 21225570
$$ packed form
64834b1933416J069669K115089N129715P318735P005507L923952l045047j1546679
64826i962475j3204324l063474J1540698J8449635J3998428L479607o534158j0081143
64818D622794k765260J0488165J4732375K199931j4673114j7833526o656272M685924
64810e198983Q378623Q438584P618810K929204n027900j0315264j0921210r907222
64802a4005358p085067J80794P863317Q030660J721409j446492K325152P024003
64794D608418P796320N661196J293197m849327o662236P75809Q780297L821896
$$ [...]
##END NTUPLES=NMR SPECTRUM
##END=
