##TITLE=31Pdec_LR-657-RM3
 CH2Cl2, 124 sc
 6.3.2019
##JCAMPDX= 6.0         $$ Bruker NMR JCAMP-DX V2.0
##DATA TYPE= NMR SPECTRUM
##DATA CLASS= NTUPLES
##ORIGIN= UXNMR, Bruker Analytische Messtechnik GmbH
##OWNER= root
$$ XWIN-NMR		Version 3.5
$$ Wed Mar  6 14:22:57 2019 Russian Standard Time (UT+4h)  she@DPX200
##.OBSERVE FREQUENCY= 81.013821
##.OBSERVE NUCLEUS= ^31P
##.ACQUISITION MODE= SIMULTANEOUS
##.ACQUISITION SCHEME= undefined
##.AVERAGES= 124
##.DIGITISER RES= 17
##SPECTROMETER/DATA SYSTEM= spect
##.PULSE SEQUENCE= zgpg30
##.SOLVENT NAME= CDCl3
##.SHIFT REFERENCE= (INTERNAL, CDCl3, 0, 182.463)
##AUDIT TRAIL= $$ (NUMBER, WHEN, WHO, WHERE, WHAT)
$$ ##TITLE= Audit trail, XWIN-NMR		Version 3.5
$$ ##JCAMPDX= 5.01
$$ ##ORIGIN= Bruker BioSpin GmbH
$$ ##OWNER= she
$$ F:/spectra/data/she/nmr/P31/1/pdata/1/auditp.txt
$$ ##AUDIT TRAIL=  $$ (NUMBER, WHEN, WHO, WHERE, WHAT)
(   1,<2019-03-06 14:19:07.42 +0400>,<she>,<DPX200>,
      <continue with go, POWCHK disabled, PULCHK disabled
       configuration hash MD5:
       00 E9 B6 7A A2 85 ED C7 34 08 36 98 17 FE 4E 26
       data hash MD5: 32K
       EC 3D 48 02 97 43 10 DE 44 A5 E2 81 6D 33 73 65>)
(   2,<2019-03-06 14:22:06.60 +0400>,<she>,<DPX200>,
      <Start of raw data processing
       efp BC_mod = 2 LB = 1 FT_mod = 6 PKNL = 1 PHC0 = -1463.426 PHC1 = 76.99897 SI = 64K 
       data hash MD5: 64K
       30 30 C2 02 97 07 5E 3C 13 05 F7 9F D7 3B E4 F8>)
(   3,<2019-03-06 14:22:12.07 +0400>,<she>,<DPX200>,
      <abs ABSG = 5 
       data hash MD5: 64K
       9F A3 A0 69 E4 06 D7 9E CB 70 B0 92 16 D7 80 06>)
$$ ##END=
$$ 
$$ hash MD5
$$ 69 92 D4 74 81 4C 1C FC A1 5A 4A DD 98 03 36 34
##$RELAX= 
##$RELAX= 
##$RELAX= 
##$RELAX= 
##$RELAX= 
##$RELAX= 
##$RELAX= 
##$RELAX= 
$$ Bruker specific parameters
$$ --------------------------
##$DU= <F:/spectra>
##$EXPNO= 1
##$NAME= <P31>
##$PROCNO= 1
##$TYPE= <nmr>
##$USER= <she>
##$AMP= (0..31)
100 100 100 100 100 100 100 100 100 100 100 100 100 100 100 100 100 100 
100 100 100 100 100 100 100 100 100 100 100 100 100 100 
##$AQSEQ= 0
##$AQ_mod= 1
##$AUNM= <au_zg>
##$AUTOPOS= <>
##$BF1= 81.014009
##$BF2= 200.13
##$BF3= 200.13
##$BF4= 200.13
##$BF5= 200.13
##$BF6= 200.13
##$BF7= 200.13
##$BF8= 200.13
##$BYTORDA= 1
##$CFDGTYP= 0
##$CFRGTYP= 5
##$CHEMSTR= <none>
##$CNST= (0..31)
1 1 145 1 1 1 1 1 1 1 1 1 1 1 1 1 1 1 1 1 1 1 1 1 1 1 1 1 1 1 1 1 
##$CPDPRG= <waltz16>
##$CPDPRG1= <>
##$CPDPRG2= <waltz16>
##$CPDPRG3= <>
##$CPDPRG4= <mlev>
##$CPDPRG5= <mlev>
##$CPDPRG6= <mlev>
##$CPDPRG7= <mlev>
##$CPDPRG8= <mlev>
##$CPDPRGB= <>
##$CPDPRGT= <>
##$D= (0..31)
0 1 0 0 0 0 0 0 0 0 0 0.03 2e-05 3e-06 0 0 0 0 0 0 0 0 0 0 0 0 0 0 0 0 
0 0 
##$DATE= 1551867362
##$DBL= (0..7)
120 120 120 11 120 120 24 19 
##$DBP= (0..7)
150 150 150 150 150 150 150 150 
##$DBP07= 0
##$DBPNAM0= <>
##$DBPNAM1= <>
##$DBPNAM2= <>
##$DBPNAM3= <>
##$DBPNAM4= <>
##$DBPNAM5= <>
##$DBPNAM6= <>
##$DBPNAM7= <>
##$DBPOAL= (0..7)
0.5 0.5 0.5 0.5 0.5 0.5 0.5 0.5 
##$DBPOFFS= (0..7)
0 0 0 0 0 0 0 0 
##$DE= 6
$$ [...]
##$SUBNAM3= <"">
##$SUBNAM4= <"">
##$SUBNAM5= <"">
##$SUBNAM6= <"">
##$SUBNAM7= <"">
##$SUBNAM8= <"">
##$SUBNAM9= <"">
##$SW= 369.568048894756
##$SWIBOX= (0..15)
0 1 3 0 0 0 0 0 0 0 0 0 0 0 0 0 
##$SW_h= 29940.119760479
##$TD= 32768
##$TD0= 1
##$TE= 0
##$TE2= 300
##$TE3= 300
##$TEG= 300
##$TL= (0..7)
0 120 53 12 22 120 120 120 
##$TP= (0..7)
150 150 150 150 150 150 150 150 
##$TP07= 0
##$TPNAME0= <>
##$TPNAME1= <>
##$TPNAME2= <>
##$TPNAME3= <>
##$TPNAME4= <>
##$TPNAME5= <>
##$TPNAME6= <>
##$TPNAME7= <>
##$TPOAL= (0..7)
0.5 0.5 0.5 0.5 0.5 0.5 0.5 0.5 
##$TPOFFS= (0..7)
0 0 0 0 0 0 0 0 
##$TUNHIN= 0
##$TUNHOUT= 0
##$TUNXOUT= 0
##$USERA1= <user>
##$USERA2= <user>
##$USERA3= <user>
##$USERA4= <user>
##$USERA5= <user>
##$V9= 5
##$VALIST= <valist>
##$VCLIST= <CCCCCCCCCCCCCCC>
##$VD= 0
##$VDLIST= <DDDDDDDDDDDDDDD>
##$VPLIST= <PPPPPPPPPPPPPPP>
##$VTLIST= <TTTTTTTTTTTTTTT>
##$WBST= 1024
##$WBSW= 4
##$XGAIN= (0..3)
0 0 0 0 
##$XL= 0
##$YL= 0
##$YMAX_a= 75112
##$YMIN_a= -108729
##$ZGOPTNS= <>
##$ZL1= 120
##$ZL2= 120
##$ZL3= 120
##$ZL4= 120
##$ABSF1= 182.463
##$ABSF2= -187.1042
##$ABSG= 5
##$ABSL= 3
##$ALPHA= 0
##$AQORDER= 0
##$ASSFAC= 0
##$ASSFACI= 0
##$ASSFACX= 0
##$ASSWID= 0
##$AUNMP= <proc_1d>
##$AZFE= 0.1
##$AZFW= 0.5
##$BCFW= 0
##$BC_mod= 2
##$BYTORDP= 0
##$COROFFS= 0
##$CY= -3
##$DATMOD= 1
##$DC= 0
##$DFILT= <>
##$DTYPP= 0
##$F1P= 0
##$F2P= 0
##$FCOR= 1
##$FTSIZE= 65536
##$FT_mod= 6
##$GAMMA= 0
##$GB= 0
##$INTBC= 1
##$INTSCL= 5.30512e-09
##$ISEN= 30
##$LB= 1
##$LEV0= 0
##$LPBIN= 0
##$MAXI= 10000
##$MC2= 0
##$MEAN= 0
##$ME_mod= 0
##$MI= 50
##$NCOEF= 0
##$NC_proc= -8
##$NLEV= 6
##$NOISF1= 182.463
##$NOISF2= 159.3651
##$NSP= 0
##$NTH_PI= 0
##$NZP= 0
##$OFFSET= 182.463
##$PC= 4
##$PHC0= -1463.426
##$PHC1= 76.99897
##$PH_mod= 1
##$PKNL= yes
##$PPARMOD= 0
##$PSCAL= 0
##$PSIGN= 0
##$REVERSE= no
##$SF= 81.0140089999434
##$SI= 65536
##$SIGF1= 159.3651
##$SIGF2= -187.1042
##$SINO= 113.3802
##$SIOLD= 16384
##$SREGLST= <1H.CDCl3>
##$SSB= 0
##$STSI= 65536
##$STSR= 0
##$SW_p= 29940.119760479
##$SYMM= 0
##$S_DEV= 0
##$TDeff= 32768
##$TDoff= 0
##$TI= <>
##$TILT= no
##$TM1= 0
##$TM2= 0
##$TOPLEV= 0
##$USERP1= <user>
##$USERP2= <user>
##$USERP3= <user>
##$USERP4= <user>
##$USERP5= <user>
##$WDW= 1
##$XDIM= 65536
##$YMAX_p= 408513830
##$YMIN_p= -259706873
$$ End of Bruker specific parameters
$$ ---------------------------------
##NTUPLES= NMR SPECTRUM
##VAR_NAME=  FREQUENCY,     SPECTRUM/REAL,   SPECTRUM/IMAG
##SYMBOL=    X,             R,               I
##VAR_TYPE=  INDEPENDENT,   DEPENDENT,       DEPENDENT
##VAR_FORM=  AFFN,          ASDF,            ASDF
##VAR_DIM=   65536,         65536,           65536
##UNITS=     HZ,            ARBITRARY UNITS, ARBITRARY UNITS
##FACTOR=    0.456856943014862, 1,           1
##FIRST=     14782.0589164792, 0,            0
##LAST=      -15158.0608439998, 0,           0
##MIN=       -15158.0608439998, -259706873,  0
##MAX=       14782.0589164792, 408513830,    0
$$ Real data points
##PAGE= N=1
##DATA TABLE= (X++(R..R)), XYDATA
$$ [...]
42636G7545260J1105941J5792270J0222573j956805j0181326q331759j781289
$$ 77545260 88651201 104443471 114666044 112709239 102527913 94196154 92414865
42629I2414865L42342k746880m907317l928521l017852k811607q15217J348310
$$ 92414865 92757207 90010327 85103010 81174489 78156637 75345030 74529813 75878123
42621G5878123p51021n263688n330226l573N310935R133690J3714477J4725042
$$ 75878123 75127102 69863414 64533188 64529615 69840550 78974240 92688717 107413759
42613A07413759M930038r561592j2045013J45661Q938925K003554q599262n946848
$$ 107413759 112343797 102782205 90737192 90882853 99821778 101825332 93226070 87279222
42605H7279222O194199J1880112P769539L536715L080727J126728l277802m023262
$$ 87279222 93473421 105353533 113123072 116659787 119740514 120867242 117589440 113566178
42597A13566178M69140M143330L187830L5464l117202o260284o614987n76412
$$ 113566178 114035318 118178648 121366478 121401942 118284740 112024456 105409469 104833057
42589A04833057P926793R619833L299679q05741M259432J0501614M984263j1093641
$$ 104833057 112759850 122379683 125679362 124873621 129133053 139634667 144618930 133525289
42581A33525289k0947464j2374055N553759J2079479N02341j3312376j2487112
$$ 133525289 112577825 100203770 105757529 117837008 118339349 105026973 92539861
42574I2539861j743646J319022o873960j1810242m969193L335133K576559P5661
$$ 92539861 90796215 92115237 85241277 73431035 68461842 71796975 74373534 74449195
42566G4449195P811091J9881871J8582581Q88198j4994241j2384162M105116J5929936
$$ 74449195 82260286 102142157 120724738 121612936 106618695 94234533 98339649 114269585
42558A14269585J2164834m23374o547327J028366J4328051J9406122J1268101
$$ 114269585 126434419 126011045 119463718 120492084 134820135 154226257 165494358
42551A65494358l000818j4267275j8951171j7105518j0657452n379720o618657
$$ 165494358 162493540 148226265 129275094 112169576 101512124 96132404 89513747
42544H9513747j0329927p031336K298518N382192r64749k913391P929116J7323987
$$ 89513747 79183820 72152484 74451002 79833194 78868445 75955054 83884170 101208157
42536A01208157Q963250p859163j0496678K129250Q160047k494817j2814972n688636
$$ 101208157 110171407 102312244 91815566 93944816 102104863 99610046 86795074 81106438
42528H1106438J0410264J4935489M171493o566449n748898P52613O27903p044092
$$ 81106438 91516702 106452191 110623684 104057235 98308337 99060950 99688853 92644761
42520I2644761j0171476k13723J3751409J4033772j749771j4706362r045918N983681
$$ 92644761 82473285 82259562 96010971 110044743 108294972 93588610 84542692 90526373
42512I0526373R907572J032435k849565O554889J5003935P909734p866048j4646889
$$ 90526373 100433945 101466380 98616815 105171704 120175639 128085373 120219325 105572436
42504A05572436p930125J317932M068065K245253Q52999L55418j62842J139449
$$ 105572436 97642311 98960243 103028308 105273561 106126560 106481978 106319136 107458585
42496A07458585M607168M438619m485977j5161131j2618167N100880J8116056
$$ 107458585 112065753 116504372 112018395 96857264 84239097 89339977 107456033
42489A07456033P827245j5582661k3516201o962457J2699961J5608701P823745
$$ 107456033 115283278 99700617 76184416 69221959 81921920 97530621 105354366
42482A05354366L603283J632442m381984o906749J858534Q690419l413426k2945795
$$ 105354366 108957649 110590091 106208107 99301358 101159892 109850311 106436885 83491090
42474H3491090k1883505Q98475J5821496O919515o561087k952416J0805101J5071836
$$ 83491090 61607585 62506060 78327556 85247071 78685984 75733568 86538669 101610505
42466A01610505O245729n279259j2068615j1457717k394631Q291960Q304756j746388
$$ 101610505 107856234 102576975 90508360 79050643 76656012 84947972 93252728 91506340
42458I1506340n782625K523063Q470575K456492j393605R499404J9881023R114415
$$ 91506340 85723715 88246778 96717353 99173845 97780240 107279644 127160667 136275082
42450A36275082j3151633k0160274q746577O69789O97329M325365J3916184J2343598
$$ 136275082 123123449 102963175 94216598 94886387 95583716 99909081 113825265 126168863
42442A26168863n516165j7985119q111879R432204J0139159n177763j4608190
$$ 126168863 120652698 102667579 94555700 103987904 114127063 108949300 94341110
42435I4341110o680266Q342073J5441619J0316628j424753j1053348j2154743
$$ 94341110 87660844 96002917 111444536 121761164 120336411 109283063 97128320
42428I7128320n278132K548754N627345M740410K926487J071401M28585L326734
$$ 97128320 91850188 94398942 100026287 104766697 107693184 108764585 109193170 112519904
42420A12519904P386786N944946o31098k196391M958609P961349m551316k0936499
$$ 112519904 119906690 125851636 125220538 123024147 127982756 135944105 131392789 110456290
42412A10456290j9220117Q34146J6173678J3735539O585590Q330742R923585j635541
$$ 110456290 91236173 92070319 108243997 121979536 128565126 136895868 146819453 145183912
42404A45183912j5349810r719015J1282469K0027673N570512j0555860p494284
$$ 145183912 129834102 120115087 131397556 151425229 156995741 146439881 138945597
42397A38945597O044376R787850K697207j671529M44711J892518J259050K760441
$$ 138945597 144989973 154777823 157475030 155803501 156248212 158140730 159399780 162160221
42389A62160221L642068j276886n988174j801358L894137k543766j4242888j0516259
$$ 162160221 165802289 164525403 158537229 156735871 160630008 158086242 143843354 133327095
42381A33327095P374843J3402047j837541j3572298k252623J3859243Q109460
$$ 133327095 140701938 154103985 152266444 138694146 136441523 150300766 158410226
42374A58410226j1205648j4470517K717654J5153047P916079n119337o652143
$$ 158410226 147204578 132734061 135451715 150604762 158520841 153401504 146749361
42367A46749361J030612O058396N204478L664386N109613P588763N163427o332056
$$ 146749361 147779973 153838369 159042847 162707233 167816846 175405609 180569036 174236980
42359A74236980k0704477k3245116q977773P175584R399108L118200L318719P457534
$$ 174236980 153532503 130287387 121309614 128485198 137884306 141002506 144321225 151778759
42351A51778759O10657j4248727j5118618M146604K0211196J3274830m606739
$$ 151778759 152389416 138140689 123022071 127168675 147379871 160654701 156047962
42344A56047962r632397q73353L452733l359114q448445j784576Q524023Q400470
$$ 156047962 146415565 145542212 148994945 145635831 137187386 135402810 143926833 152327303
42336A52327303l195187j3465686j1600706j365214M096406m72011n075558J079834
$$ 152327303 149132116 135666430 124065724 122700510 126796916 126324905 121249347 122329181
42328A22329181J2368066J3619493L026493m190756J344864Q874284M428721p379449
$$ 122329181 134697247 148316740 151343233 147152477 148497341 157371625 161800346 154420897
42320A54420897j0104711M41431J0600105P828208l763275j0264343n235700M260472
$$ 154420897 144316186 144757617 155357722 163185930 159422655 149158312 143922612 148183084
42312A48183084P761171L697678j298096l955222q813755j7429820k0005831p235318
$$ 148183084 155944255 159641933 158343837 154388615 145574860 128145040 108139209 100903891
42304A00903891J2720634K1011981J2661859K286629J778874M957639J947747
$$ 100903891 113624525 134636506 147298365 149584994 151363868 156321507 158269254
42297A58269254k940999k4054O567795L390486j0011003j7092382o324492J2844816
$$ 158269254 155328255 155304201 161871996 165262482 155251479 138159097 131834605 144679421
42289A44679421K2084603J5806931L910101l317857n012710m365085j500834L401891
$$ 144679421 166764024 182570955 186481056 183163199 178150489 173785404 172284570 175686461
42281A75686461N176969k67577o522113k307916J1559108J9768026J1968550l284755
$$ 175686461 180863430 180595853 174073740 171765824 183324932 203092958 215061508 211776753
42273B11776753j0859131q245280l847143k171623j301084j312960m226395p370560
$$ 211776753 200917622 192672342 188825199 186653576 185352492 184039532 179813137 172442577
42265A72442577o617742m365902n019312n607527j283540L749237L038268J151786
$$ 172442577 165824835 161458933 156439621 150832094 149548554 153297791 156336059 157487845
42257A57487845N094775O765603o542248k5414138k5205115l919601J0577664
$$ 157487845 162582620 169348223 162805975 137391837 112186722 108267121 118844785
42250A18844785R87450j4280813j1149048M537583J0661341L756737r26064L573623
$$ 118844785 119832235 105551422 94402374 98939957 109601298 113358035 112431971 116005594
42242A16005594Q428018N918338r62666m890161q20145J0491029J9187680J3970480
$$ 116005594 124433612 130351950 129389284 124499123 123678978 134170007 153357687 167328167
42234A67328167m62538n018738N736699J1473923l940616k4632554k4298146m967841
$$ 167328167 166865629 161846891 167583590 179057513 175116897 150484343 126186197 121218356
42226A21218356Q122425M324007k870270k487442O810j480518k502776K032092
$$ 121218356 129340781 133664788 130794518 128307076 128313886 126833368 124330592 126362684
42218A26362684J0146166J7961835K1657246J5209149j164133j2947916p381251
$$ 126362684 136508850 154470685 176127931 191337080 190172947 177225031 169843780
42211A69843780M433208l3355j9624194k7360157q910952J5951619K0323566M082898
$$ 169843780 174276988 174243633 154619439 127259282 118348330 134299949 154623515 158706413
42203A58706413j0298854o391826J1106065K4362460K0229052M036402m685148
$$ 158706413 148407559 142015733 153121798 177484258 197713310 201749712 197064564
42196A97064564L644812J3604292N541151j4216598k1739505j1496236k202760
$$ 197064564 200709376 214313668 219854819 205638221 183898716 172402480 170199720
42189A70199720m770230q061769l542215m13531m397907l513080R293420J8849881
$$ 170199720 165429490 157367721 153825506 153411975 149014068 145500988 154794408 173644289
42181A73644289J1666504L88419L398852J3755579J1943021j6863k481788P892160
$$ 173644289 185310793 185699212 189098064 202853643 214796664 214779801 212298013 220190173
42173B20190173J3096319M165942n807084n020948m87516k842147p861117m741321
$$ 220190173 233286492 237452434 231645350 226624402 226136886 223294739 215433622 210692301
42165B10692301N551172J1510663P721406J393667J292847N830023O302257O06166
$$ 210692301 216243473 227754136 235475542 236869209 238162056 243992079 250294336 250900502
42157B50900502k178313N117059J5206444J5584130P576046L836726O236049J828692
$$ 250900502 248722189 253839248 269045692 284629822 292205868 296042594 302278643 304107335
42149C04107335j3143940k1912977j2402302L42958n317465k3886021k9931881
$$ 304107335 290963395 269050418 256648116 256991074 251673609 227787588 197855707
42142A97855707j5515147L09550J519950m294465k689812M952820O241807k713055
$$ 197855707 182340560 182650110 184170060 179875595 177185783 182138603 188380410 185667355
42134A85667355j2414827j2212418k081105P048677L768554j0753558k1369247
$$ 185667355 173252528 161040110 158959005 166007682 169776236 159022678 137653431
42127A37653431j5130698K323353J2697318P276722l473669m286198O506466J5958989
$$ 137653431 122522733 124846086 137543404 144820126 141346457 137060259 143566725 159525714
42119A59525714J1256890o147754k0497186j7315811j46875J2078934O914896
$$ 159525714 170782604 164634850 144137664 126821853 126674978 138753912 145668808
42112A45668808p566593j4720443r039907K303429J1043327J2381249L842295
$$ 145668808 138102215 123381772 114341865 116645294 127688621 140069870 143912165
42105A43912165j0043431j6420575q451644L078904M092211j854574j592275L219935
$$ 143912165 133868734 117448159 108996515 112075419 116167630 114313056 112720781 115940716
42097A15940716r96165j2722798j3469627J139239J0407298O85800j1267916m615584
$$ 115940716 114944551 102221753 88752126 89891365 100298663 100984463 89716547 85100963
42089H5100963J1312141J1455352m720789j1799934K664224J9901403J7823745
$$ 85100963 96413104 107868456 103147667 91347733 94011957 113913360 131737105
42082A31737105O22869j0608042o783923J464278R58312q986164j8810111j9660547
$$ 131737105 132359974 121751932 114968009 116432287 117390599 108404435 89594324 69933777
42074F9933777j0543150J848213Q658660O035854j502391n330681j718127L456878
$$ 69933777 59390627 61238840 69897500 75933354 74430963 69100282 67382155 70839033
42066G0839033J109891q531905j2774978q05298J9440427K6149414R489200j3639500
$$ 70839033 71948924 63417019 50642041 49836743 69277170 95426584 104915784 91276284
42058I1276284j8522155l047021J0974213P568092m050592o534965m72333o2097
$$ 91276284 72754129 69707108 80681321 88249413 84198821 77663856 77191523 77129426
42050G7129426p088914o272770Q972540K1571705J3230983q290887j9350736j2799229
$$ 77129426 70040512 63767742 72740282 94311987 107542970 99252083 79901347 67102118
42042F7102118l659895k906490l236182L412528J0064136P188567m45431k115064
$$ 67102118 63442223 60535733 57299551 60712079 70776215 77964782 77519351 75404287
42034G5404287R71850q83005q466144j2051870o464538K330163O438484M409798
$$ 75404287 76376137 75493132 67026988 54975118 48510580 50840743 57279227 61689025
42026F1689025j59709k837104j356790J689974J075270l103255l998572J739056
$$ 61689025 61529316 58692212 57335422 59025396 60100666 56997411 52998839 54737895
42018E4737895Q329554J0093042Q705185N677757k414611j3118761j4216763k276591
$$ 54737895 63067449 73160491 81865676 87543433 85128822 72010061 57793298 55516707
42010E5516707O964979J614106n529277J742244J3275298R194261l082004O38837
$$ 55516707 62481686 64095792 58566515 60308759 73584057 82778318 79696314 80335151
42002H0335151J7206385J7031724o579943k3706875j4769665J497015L740519
$$ 80335151 97541536 114573260 107993317 84286442 69516777 71013792 74754311
41995G4754311J169035Q860299J6465451Q326708n592404o586038P34351K06150
$$ 74754311 75923346 84783645 101249096 109575804 103983400 97397362 98131713 98337863
41987I8337863n447063l112303K954860n64917q851208p476984o93002l289002
$$ 98337863 92890800 89778497 92733357 92168440 83317232 75840248 75147246 71858244
41979G1858244j0544864n761165O570019O309280n169423o005331O054440Q525386
$$ 71858244 61313380 55552215 62122234 68431514 63262091 57256760 63311200 71836586
41971G1836586m428588r923177K329456R908981l117610j6724074p820920J1521633
$$ 71836586 67407998 57484821 59814277 69723258 66605648 49881574 42060654 53582287
41963E3582287J4615975R82161r380583r588108q375995p444080k09295J0562598
$$ 53582287 68198262 69180423 59799840 50211732 41835737 34391657 34182362 44744960
41955D4744960J3878561P761387K45677l830581m061698K063064J3139364J7083822
$$ 44744960 58623521 66384908 66630585 62800004 58738306 60801370 73940734 91024556
41947I1024556N132031j2164567j7095421q012495L442905J1791938J8058467
$$ 91024556 96156587 83992020 66896599 58884104 62327009 74118947 92177414
41940I2177414J6727102J963537j5448561j7184428m167938M218158l24988n033111
$$ 92177414 108904516 110868053 95419492 78235064 74067126 78285284 77960296 72927185
41932G2927185j74927N274549N32325r302507j2523540p098461J175028Q271757
$$ 72927185 72752258 78026807 78559132 69256625 56733085 49634624 50809652 59081409
41924E9081409J2090010J0099163L287920l042366o226920q031818q048879l716243
$$ 59081409 71171419 81270582 84558502 81516136 75289216 67257398 59208519 55492276
41916E5492276J596465Q23496m151715l624176L018705M745051j834418n473462
$$ 55492276 57088741 57912237 53760522 50136346 53155051 57900102 56065684 50592222
41908E0592222n72718J209637p960560j3878385m66378K1927027K8070605J2901474
$$ 50592222 50019504 51229141 43268581 29390196 28923818 50850845 78921450 91822924
41900I1822924m092852q261863n035528l747034l858544l292854n671993j0823730
$$ 91822924 87730072 79468209 74432681 70685647 66827103 63534249 57862256 47038526
41892D7038526r598001K333390J3975715J2130936m38782q997744n725842L170020
$$ 47038526 37440525 39773915 53749630 65880566 65441784 56444040 50718198 53888218
41884E3888218P385060L188619m586410o354124M218454K0831478K6153798J0239304
$$ 53888218 61273278 64461897 59875487 53521363 57739817 78571295 104725093 114964397
41876A14964397j3933394k2239868q427538P675015N943479q385094j4167490
$$ 114964397 101031003 78791135 70363597 78038612 83982091 75596997 61429507
41869F1429507m419507O113950M757631j076242J901467J0075724P812492p394932
$$ 61429507 57010000 63123950 67881581 66805339 68706806 78782530 86595022 79200090
41861G9200090j8662260j2437331L591169J2528950J0117293M985943J993303
$$ 79200090 60537830 48100499 51691668 64220618 74337911 79323854 81317157
41854H1317157k866269j0380771j2015580k023343J0811352J2071382J294758
$$ 81317157 78450888 68070117 56054537 54031194 64842546 76913928 78208686
41847G8208686n522085L035292J6067242J2293837j0558383k8605664k0563352
$$ 78208686 72686601 75721893 91789135 104082972 93524589 64918925 44355573
41840D4355573M264022J8209162J1674231K417931O319280J4932013J1768731
$$ 44355573 48619595 66828757 78502988 80920919 87240199 102172212 113940943
41833A13940943j518834r572862p280372m123259o298442q349124m521043K552817
$$ 113940943 112422109 102849247 95568875 91445616 85147174 76798050 72277007 74829824
41825G4829824P606710Q764609N481092j795394p831008n963220K511823Q987459
$$ 74829824 82436534 91201143 96682235 94886841 87055833 81092613 83604436 92591895
41817I2591895Q944618N821898L067533N84538k84542K301674L719930k304773
$$ 92591895 101536513 107358411 110425944 111010482 110725940 113027614 116747544 114442771
41809A14442771j0231041o945672O865591J4251860P713722J885471R615525K0117980
$$ 114442771 104211730 97266058 104131649 118383509 126097231 127982702 137598227 157716207
41801A57716207J6194773J447347p446881p044716o755860q175711n074997r88045
$$ 157716207 173910980 175358327 167911446 160866730 154110870 145935159 140860162 139872117
41793A39872117n670838j3893948r336659O938391J3515055J276730j1576724
$$ 139872117 134201279 120307331 110970672 117909063 131424118 132700848 121124124
41786A21124124p816447M403440R079241P176729O807139L026163j1450222k4436101
$$ 121124124 113307677 117711117 126790358 133967087 140774226 143800389 132350167 107914066
41778A07914066j6268449Q512339K2554112J1523216r056778j7890255j3526245
$$ 107914066 91645617 100157956 122712068 134235284 125178506 107288251 93762006
41771I3762006p888308n990774k758118N231407J3469747J4477605N839760o074246
$$ 93762006 85873698 79882924 77124806 82356213 95825960 110303565 116143325 110069079
41763A10069079j0979416o056530l18816k720000r165112r532416n057038o891111
$$ 110069079 99089663 93033133 92714317 89994317 80829205 71296789 66239751 59348640
41755E9348640j6336626j9708701q375218P781263J5018416J3798345J2152151
$$ 59348640 43012014 23303313 14928095 22709358 37727774 51526119 63678270
41748F3678270R811232K147327n522563k793680P333115R485915j377573j1593699
$$ 63678270 73489502 75636829 70114266 67320586 74653701 84139616 82762043 71168344
41740G1168344r486339k666845m408170j1167470p457329R127798K1574936J6045413
$$ 71168344 61682005 59015160 54606990 43439520 35982191 45109989 66684925 82730338
41732H2730338L97344p377291k987331J330387l523338j0391897o577128P748924
$$ 82730338 83127682 75750391 72763060 74093447 70570109 60178212 53601084 61350008
41724F1350008J8383718J3972812j045121j2654326j3153802o764203m58132M936716
$$ 61350008 79733726 93706538 92661417 80007091 66853289 60089086 59630954 64567670
41716F4567670J1068547J3930259O880800p618356j6572908j1308312R91709O426425
$$ 64567670 75636217 89566476 96447276 88828920 72256012 60947700 61939409 68365834
41708F8365834J960937l057592j592266K909038M472594L188333J955847M70876
$$ 68365834 70326771 67269179 65676913 68585951 73058545 76246878 78202725 78673601
41700G8673601k350190l732965l87375N120735O105673J45405o910469o223836
$$ 78673601 76323411 72590446 72203071 77323806 83429479 83574884 76664415 70440579
41692G0440579M447182J5846887J4352067k299619j9064606j9920229p983539
$$ 70440579 74887761 90734648 105086715 102787096 83722490 63802261 55818722
41685E5818722K13569p53100n88399M153074J157467j3428292j9780170k242443
$$ 55818722 56032291 55279191 54690792 58843866 60001333 46573041 26792871 24550428
41677B4550428K0606358J8067587o523892j8417130j472718K0727854K1710183
$$ 24550428 45156786 63224373 56700481 38283351 36810633 57538487 79248670
41670G9248670O179181o139761j0691498j4118885j4231992m199542R850130J3190941
$$ 79248670 85427851 79288090 68596592 54477707 40245715 36046173 45896303 59087244
41662E9087244K883869q884433j0935367l603966M686299M304824q223273k3401607
$$ 59087244 61971113 53086680 42151313 38547347 43233646 47538470 39315197 15913590
41654A5913590k4793037q100589J2493159K2555834K2232597J6605329N366824
$$ 15913590 -8879447 -16980036 -4486877 18068957 40301554 56906883 62273707
41647F2273707p059003p111259N818265Q739461j1630032k9893938j5495355J5614723
$$ 62273707 55214704 48103445 53921710 62661171 51031139 21137201 5641846 21256569
41639B1256569J9531355p412802k0224743M817612L2031221K0993430j3211786
$$ 21256569 40787924 33375122 13150379 17967991 49999212 70992642 57780856
41632E7780856k5769385o859082J3145874J2642064J344075m234402j980571K041706
$$ 57780856 32011471 25152389 38298263 50940327 52284402 48050000 46069429 48111135
41624D8111135K655696l751184j4130486j5922294k496859J2658468J2442084
$$ 48111135 50766831 47015647 32885161 16962867 14466008 27124476 39566560
41617C9566560K285401J852637J3662957K0414591J3930383N350342K045241m632832
$$ 39566560 41851961 43704598 57367555 77782146 91712529 97062871 99108112 94475280
41609I4475280j9376890k8646577j9068721K223590J7597805K0199473J4977711
$$ 94475280 75098390 46451813 27383092 29606682 47204487 67403960 82381671
41602H2381671O700576k148596o778793l290343N386214J2341959J3192990P276328
$$ 82381671 89082247 86933651 80154858 76864515 82250729 94592688 107785678 115062006
41594A15062006k796131j0491051j0254127n306318m075140p513754q086262k553514
$$ 115062006 112265875 101774824 91520697 86214379 82139239 74625485 66539223 63985709
41586F3985709M236740R723280J5318216J5306195J60040k2411683k7358624n608550
$$ 63985709 68222449 77945729 93263945 108570140 108730180 86318497 58959873 53351323
41578E3351323J8040270J6453639l266789j3645975p166499n04309l346274o415364
$$ 53351323 71391593 87845232 84578443 70932468 63765969 63261660 59915386 53500022
41570E3500022k242596K875595L513919N052123J1343171J5021458P938713p059445
$$ 53500022 51257426 54133021 57646940 62699063 74042234 89063692 97002405 89942960
41562H9942960j9914039k2396016j2041470M696743J3269275N368671p543163
$$ 89942960 70028921 47632905 35591435 40288178 53557453 58926124 51382961
41555E1382961p052433N861559J2151689M139417m140699k013901J090075m777501
$$ 51382961 44330528 50192087 62343776 66483193 62342494 60328593 61418668 56641167
41547E6641167j0580737m184806O990660P351480j048946k770865N011797R044210
$$ 56641167 46060430 41875624 48866284 56217764 55168818 52397953 57409750 66453960
41539F6453960K487884n547726o168034k832377k148637k817912O3901O054147
$$ 66453960 68941844 63394118 57226084 54393707 52245070 49427158 49491059 55545206
41531E5545206R853014P592101M30901n883434n516241O16985M705630K264250
$$ 55545206 65398220 72990321 73421222 67537788 62021547 62638532 67344162 69608412
41523F9608412j364847J94355M119429M445974L239731N589562P413566Q64794
$$ 69608412 68243565 68437920 72557349 77003323 80243054 85832616 93246182 94110976
41515I4110976r447481r477489K928814J2638302P654818n989154j4793668j3371515
$$ 94110976 84663495 75186006 78114820 90753122 98407940 92418786 77625118 64253603
41507F4253603m256484Q109220J6811384J4673609M205265j944343K897219J0019700
$$ 64253603 59997119 68106339 84917723 99591332 103796597 101852254 104749473 114769173
41499A14769173Q686745J286872k885401k181108j738528l030418l290185k103675
$$ 114769173 123455918 124742790 121857389 119676281 117937753 114907335 111617150 109513475
41491A09513475j038271K44007J520753N7352l342767k747942J952230J022139
$$ 109513475 108475204 108719211 110239964 110297316 106954549 104206607 106158837 107180976
41483A07180976q995287j4729847m916857Q511890N573768j0664629j7886370
$$ 107180976 98185689 83455842 78538985 87050875 92624643 81960014 64073644
41476F4073644q304576K177281J665777j693228J009827L229867k578303r969750
$$ 64073644 55769068 57946349 59612126 57918898 58928725 62158592 59580289 49610539
41468D9610539j0798881r551198j2365117j3428763o154125K573808L807108K335427
$$ 49610539 38811658 29260460 16895343 3466580 -2687545 -113737 3693371 6028798
41460F028798N570124O556937l540761j4531803j0399776K150246K578314p920740
$$ 6028798 11598922 18155859 14615098 83295 -10316481 -8166235 -5587921 -13508661
41452a3508661o593717J1380641K1598080R536473n138046o93521J2317268J1160470
$$ -13508661 -20102378 -8721737 12876343 22412816 17274770 16581249 28898517 40058987
41444D0058987j383574n300412J036017Q96326q808969j2258221l792705J973738
$$ 40058987 38675413 33375001 34411018 35307344 26498375 14240154 10447449 12421187
41436A2421187l917400r525826k664394J0244801J7064734J7272083J4771339
$$ 12421187 8503787 -1022039 -3686433 6558368 23623102 40895185 55666524
41429E5666524O703852o980288j4107110o032660N539028L892506o639059p674658
$$ 55666524 62370376 55390088 41282978 35250318 40789346 44681852 38042793 30368135
41421C0368135L442738J0112858L738808m586574m881732k912189n167352n365695
$$ 30368135 33810873 43923731 47662539 43075965 38194233 35282044 30114692 24748997
41413B4748997J656704O333771O5570o555767K57586J1031748M691732j5548201
$$ 24748997 26405701 32739472 32805042 26249275 26506861 37538609 42230341 26682140
41405B6682140k2292124n043705J2446790Q077101n957363m752702J0467766J7728728
$$ 26682140 4390016 -653689 11793101 19870202 13912839 9160137 19627903 37356631
41397C7356631R700124k22882m121736p972633j2336022q081327K689629L834342
$$ 37356631 47056755 46833873 42712137 34739504 22403482 14322155 17011784 20846126
41389B0846126p230723j0769049L122493J4656652N184205j0791508q159438Q561761
$$ 20846126 13615403 2846354 5968847 20625499 25809704 15018196 6858758 15420519
41381A5420519J5028435P659274L876590N768794l058849k0727956k1173791K833214
$$ 15420519 30448954 38108228 41984818 47753612 44694763 23966807 2793016 5626230
41373E626230K1538904J1615829q812463j1596670j913367j504151o244317M927429
$$ 5626230 27165134 38780963 29968500 18371830 16458463 14954312 8709995 13637424
41365A3637424K6577349K8471254L633003j7724450j2936480J526676o94456j5989351
$$ 13637424 40214773 68686027 72319030 54594580 41658100 43184776 42490320 26500969
41357B6500969k0594866p588125P111339J1148139R418060R506414P868061k456179
$$ 26500969 5906103 -1682022 5429317 16577456 25995516 35501930 43369991 40913812
41349D0913812j7567226k3993386j3973003M718265J6408789J3695927L250262
$$ 40913812 23346586 -646800 -14619803 -9901538 6507251 20203178 23453440
41342B3453440m151611m833132j581957K746718O119172N760110J374740k759976
$$ 23453440 19301829 14468697 12886740 15633458 21752630 27512740 28887480 26127504
41334B6127504l624479l610605m151758j307309N195581N836359m954497j5253641
$$ 26127504 22503025 18892420 14740662 13433353 18628934 24465293 19510796 4257155
41326D257155r849855N906189J2297897M095231l503668O95694J0095427J4518386
$$ 4257155 -5592700 313489 12611386 16706617 13202949 13898643 23994070 38512456
41318C8512456J2173769K866618j4149964k9164676k5829556m997790J1027674
$$ 38512456 50686225 53552843 39402879 10238203 -15591353 -20589143 -9561469
41311i561469Q113739j474042j687077L231781K291916k89717M355310R300772
$$ -9561469 -1447730 -2921772 -4608849 -1377068 914848 625131 4980441 14281213
41303A4281213K699477r136940j0324001j589945K640130o7474J751159R961100
$$ 14281213 16980690 7843750 -2480251 -4070196 -1430066 -1497540 253619 10214719
41295A0214719J1551854K89403j2923490j5743431p662189M639493J3244821J0009224
$$ 10214719 21766573 22055976 9132486 -6610945 -14273134 -9633641 3611180 13620404
41287A3620404n364055j8272162j3965452J015850P084147N57229l365659K306775
$$ 13620404 8256349 -10015813 -23981265 -22965415 -15881268 -15324039 -18689698 -16382923
41279a6382923O499675K434980n26687L376476L548785p308556j6742107j0804019
$$ -16382923 -9883248 -7448268 -7974955 -4598479 -1049694 -8358250 -25100357 -35904376
41271c5904376L422731R314923N874167N421279J1309987J3402799N493901m407728
$$ -35904376 -32481645 -23166722 -17292555 -11871276 -561289 12841510 18335411 13927683
41263A3927683l868709R407038K4029442K4800029Q469944j0849061j7207871
$$ 13927683 10058974 19466012 43495454 68295483 76765427 65916366 48708495
41256D8708495j1837908p672323p515400k809610M790939K30303j8440558k9385583
$$ 48708495 36870587 29198264 21682864 18873254 23664193 23894496 5453938 -23931645
41248b3931645j6575404N807304J5028200J2158166J3234672J8802946J5271621
$$ -23931645 -40507049 -34699745 -19671545 -7513379 5721293 24524239 39795860
41241C9795860K021369n689896j791071K556837k57137k888172J263518N263888
$$ 39795860 41817229 36127333 34336262 36893099 36635962 33747790 35011308 40275196
41233D0275196J15917j0363009j4235994o332702O441682J2201923N233439p723583
$$ 40275196 40391113 30028104 15792110 9459408 15901090 28103013 33336452 25612869
41225B5612869j3987018j0131582n472895n939226l139750J0640138K4609269
$$ 25612869 11625851 1494269 -3978626 -9917852 -13057602 -2417464 22191805
41218B2191805K1334485K524736j2594979j3612431q061575l469139L141827J2954167
$$ 22191805 43526290 46051026 33456047 19843616 11782041 8312902 11454729 24408896
41210B4408896J7163178Q967561o083638j7748185k0737730j3269416L343601
$$ 24408896 41572074 50539635 44455997 26707812 5970082 -7299334 -3955733
41203c955733J8789776J8805197L562200q631687m334794O871215O853708n359798
$$ -3955733 14834043 33639240 37201440 28569753 24234959 31106174 37959882 32600084
41195C2600084j3909792r180271Q66364M011507k74658l288154j342695q46362
$$ 32600084 18690292 9510021 10376385 14387892 14113234 10825080 9482385 8636023
41187H636023p321040j4330935j0053719N614675J8542928J7961445Q836845K008555
$$ 8636023 1314983 -13015952 -23069671 -17454996 1087932 19049377 27886222 29894777
41179B9894777L89192J568218M864939O714083j177201j7263916k3838417j0303893
$$ 29894777 30283969 31852187 36717126 43431209 42254008 24990092 1151675 -9152218
41171i152218O938014O281287o518965j0209920m829351q346869j9390619j5838845
$$ -9152218 -2214204 4067083 -2451882 -12661802 -17491153 -25838022 -45228641 -61067486
41163f1067486M863568J6890848Q162017m60874O639636J3575550N679939q47581
$$ -61067486 -56203918 -39313070 -31151053 -31611927 -24972291 -11396741 -5716802 -6564383
41155f564383J0943877K3760074J2712042j1514653j8935371o394862M942643
$$ -6564383 4379494 28139568 40851610 29336957 10401586 4006724 8949367
41148H949367P802025J1407190J3228151K326829j2127255r364904N859400P728783
$$ 8949367 16751392 28158582 41386733 43713562 31586307 22221403 28080803 35809586
41140C5809586o729729j2161102O63185R427803N68745q192880k083768M076825
$$ 35809586 29079857 16918755 17581940 27009743 27578488 19385608 17301840 21378665
41132B1378665n569238j8139681j4363965m74471O143853O523030J1174592J5364400
$$ 21378665 15809427 -2330254 -16694219 -17168690 -11024837 -4501807 6672785 22037185
41124B2037185Q392276k374759j758790N274255M53639j5581735k1516545p835290
$$ 22037185 30429461 28054702 26295912 31570167 32023806 16442071 -5074474 -12909764
41116a2909764R302866J2000164K739473l817916o5327R242192J4097313Q565893
$$ -12909764 -3606898 8393266 11132739 7314823 7249496 16491688 30589001 39154894
41108C9154894l082844j0543910j0803970j1389667j5147467j1938840L783641
$$ 39154894 36072050 25528140 14724170 3334503 -11812964 -23751804 -19968163
41101a9968163J7706926J4161886J772412N69436Q485692M724049j2936744k0714898
$$ -19968163 -2261237 11900649 13673061 14242497 22728189 27452238 14515494 -6199404
41093f199404p150022O152317j838207j7297844j2689751J0423087K3880649J4012368
$$ -6199404 -13349426 -7197109 -9035316 -26333160 -39022911 -28599824 -4719175 9293193
41085I293193k431298n875204J634902O782439N427816K706564J509845Q66103
$$ 9293193 6861895 986691 2621593 9404032 14831848 17538412 19048257 19914360
41077A9914360J436571M481893P431613O571954K505103k124995q075915j6381728
$$ 19914360 21350931 25832824 33264437 39836391 42341494 40216499 32140584 15758856
41069A5758856k1041885j2832205P037622K3359578K1850610M755625j2095537
$$ 15758856 -5283029 -18115234 -11077612 12281966 34132576 38888201 26792664
41062B6792664j5643995o092232O338059J1275776O150544k586891o859422o342411
$$ 26792664 11148669 5056437 11394496 22670272 28820816 26233925 19374503 13032092
41054A3032092o857688q377012k512104J1958418J9555746O438908j6085402k1942302
$$ 13032092 6174404 -2202608 -4714712 7243706 26799452 33238360 17152958 -4789344
41046d789344n163654J1556697Q816673m228677p047219K361693R326158O717810
$$ -4789344 -9952998 1603699 10420372 6191695 -855524 1506169 10832327 17550137
41038A7550137J408761j032832l392404p318307r006699p234031n518979l173829
$$ 17550137 18958898 17926066 14533662 7215355 -1791344 -9025375 -14544354 -17718183
41030a7718183N527341J8087089J9707941J984156k0110821k1649860J423694
$$ -17718183 -12190842 5896247 25604188 27588344 7477523 -14172337 -12748643
41023a2748643K5027950K5540095Q217709k174236M262551J1022219K483145j1051617
$$ -12748643 12279307 37819402 46037111 43862875 48125426 59147645 61630790 50579173
41015E0579173r283772N379796J0392029j982027j2851465o816600N180145O051698
$$ 50579173 41295401 46675197 57067226 55085199 42233734 35417134 40597279 46648977
41007D6648977l13804K77766N846410K838305q461843j3436258o906802R64225
$$ 46648977 46335173 46612939 52459349 55297654 46835811 33399553 26492751 27456976
40999B7456976L538568N418564Q799921Q171897K573410j413503k760062p542564
$$ 27456976 30995544 36414108 45214029 53385926 55959336 54545833 51785771 44243207
40991D4243207j3486765r088332N394813J2358749J891763j1985405j1483902
$$ 44243207 30756442 21668110 27062923 39421672 41313435 29328030 17844128
40984A7844128R32670J0926872J3675123J3265844R553476K49364r284973j1596220
$$ 17844128 18776798 29703670 43378793 56644637 66198113 66447477 57162504 45566284
40976D5566284q890607p976502p346375o47094R782371J3775428O736206n986820
$$ 45566284 36675677 28699175 21352800 20705706 30488077 44263505 50999711 45012891
40968D5012891j6213683j8001612r792391J728551N393090J70286j380837P550157
$$ 45012891 28799208 10797596 1005205 2733756 8126846 8297132 6916295 14466452
40960A4466452J5120362R081196k306604l433359L202025L570508k128193j525021
$$ 14466452 29586814 38668010 36361406 32928047 36130072 39700580 37572387 36047366
40952C6047366N469079O821533J997336J579005K557328q995538k6107916k2344109
$$ 36047366 41516445 48337978 50335314 51914319 54471647 45476109 19368193 -2975916
40944b975916L592088J6603822j626271j8993493k124430K6815943K2304765j1060858
$$ -2975916 616172 17219994 15593723 -3399770 -5524200 21291743 43596508 32535650
40936C2535650k3684217J544285K3697645R454113j6788253j4651307J0374830
$$ 32535650 8851433 10395718 34093363 43547476 26759223 12107916 22482746
40929B2482746K0340865L722343j3385442j0847328R62360M992664K061841J084345
$$ 22482746 42823611 46545954 33160512 22313184 23275544 28268208 30330049 31414394
40921C1414394R80296m720646j3319266j4315307l545613J0564398J5448104P371930
$$ 31414394 32394690 27674044 14354778 39471 -3506142 7058256 22506360 29878290
40913B9878290l966766n270591M222025J0264371J905349j2474243j5872626o080518
$$ 29878290 25911524 20640933 24862958 35127329 37032678 24558435 8685809 2605291
40905B605291L119726L739227L136640Q097318J2710163J0021517M748051M031811
$$ 2605291 5725017 9464244 12600884 20698202 33408365 43429882 48177933 52209744
40897E2209744L803064m139364j6874562k3266554j8553866o595762P867454J8955435
$$ 52209744 56012808 51873444 34998882 11732328 -6821538 -13417300 -5549846 13405589
40889A3405589J7206980Q18355j4248411j0574540N442189J0589572k195598j5305245
$$ 13405589 30612569 31430924 17182513 6607973 12050162 22639734 20444136 5138891
40881E138891j4479135o755143k676940J121402R094173J2470657M065730m400276
$$ 5138891 -9340244 -16095387 -18772327 -17650925 -8556752 3913905 7979635 3579359
40873C579359K139910J6779805J8960571M113255j1839440j5724889r366195M85902
$$ 3579359 5719269 22499074 41459645 45572900 33733460 18008571 8642376 9128278
40865I128278R396347J1938472N195052l135420k677878L470895L709470j937157
$$ 9128278 18524625 30463097 35658149 32522729 29844851 33315746 37025216 35088059
40857C5088059k823035P42680l786310j6442571j9314078n610250N223290l750802
$$ 35088059 32265024 33007704 29221394 12778823 -6535255 -12145505 -6922215 -10673017
40849a0673017j8890760j4948281Q381545K7694829K7709309J4488039L27205
$$ -10673017 -29563777 -44512058 -36130513 -8435684 19273625 33761664 34088869
40842C4088869q172967q156137j559148J627660n794274j4284391p887946J0960764
$$ 34088869 25915902 17759765 16200617 17828277 12034003 -2250388 -10138334 822430
40834H22430K1439306J2261964m240865j1303653q294489m564358l399307j547484
$$ 822430 22261736 34523700 30282835 18979182 10684693 6120335 2721028 1173544
40826A173544K268885O972074J2266945J5288702R541117n351007j7680339j5880307
$$ 1173544 3442429 10414503 22681448 37970150 47511267 42160260 24479921 8599614
40818H599614l653962N163255M518162M49304j239923j991089l338117j552873
$$ 8599614 4945652 10108907 14627069 15076373 13836450 11845361 8507244 6954371
40810F954371N491660J1693842Q932498k324591j3176148j6041453j0822584k321754
$$ 6954371 12446031 24139873 33072371 30747780 17571632 1530179 -9292405 -11614159
40802a1614159M557127O635940L201078k831673o256633m356821J30677K375365
$$ -11614159 -7057032 -421092 2779986 -51687 -6308320 -10665141 -10534464 -8159099
40794h159099J337251M77353K421966M955942L954805m62697k878848J080784
$$ -8159099 -6821848 -6344495 -3922529 1033413 4988218 4525521 1646673 2727457
40786B727457Q330624J0756203N270937j023356O54850Q248187J0650573L581525
$$ 2727457 11058081 21814284 27085221 26061865 26716715 34964902 45615475 49197000
40778D9197000l439038j682464J607603o954868k4160922l0047511j3937008J0383496
$$ 49197000 45757962 44075498 45683101 38728233 14567311 -15480200 -29417208 -19033712
40770a9033712K2186523J7605609P484219p06168o961794q897493j537753J1251515
$$ -19033712 3152811 20758420 28242639 27536471 20574677 11677184 10139431 21390946
40762B1390946J6107688N869653j0807531j9833615j6790983q083380j182587
$$ 21390946 37498634 43368287 32560756 12727141 -4063842 -12147222 -13329809
40755a3329809K226529N238693J0294269J4358477J0789576j239676j1777193
$$ -13329809 -11103280 -5864587 4429682 18788159 29577735 28338059 16560866
40748A6560866j0579247j235315L223034p76228k820540L468774Q704908K607926
$$ 16560866 5981619 4746304 7969338 7193110 4372570 7841344 16546252 19154178
40740A9154178p683009o552231O100466J3020045L786166j0375066j1809267J330293
$$ 19154178 11471169 4918938 11019404 24039449 27825615 17450549 5641282 6971575
40732F971575J5717418K1114321J9051579J4062649N685063o316882j5317479
$$ 6971575 22688993 43803314 62854893 76917542 82602605 76285723 60968244
40725F0968244j4375592p358386m924310q158737n600179P843943J8006102Q757221
$$ 60968244 46592652 39234266 34309956 26151219 20551040 28394983 46401085 55158306
40717E5158306j2527347k1414391r406791M641978K692642p044177n442551O854458
$$ 55158306 42630959 21216568 11809777 16451755 19144397 12100220 6657669 13512127
40709A3512127J1267478P12601j0344753q612387P4508L053136O2598K59407O447118
$$ 13512127 24779605 25492206 15147453 6535066 6609574 9662710 9725308 9984715 16431833
40700A6431833J2044572J1231510M885867k033959l978367J626559R445393Q763728
$$ 16431833 28476405 39707915 44593782 42559823 38581456 40208015 49653408 58417136
40692E8417136k937352j3309144j0217582M69499L118880l757599n812731K717891
$$ 58417136 55479784 42170640 31953058 32422557 35541437 31783838 25971107 28688998
40684B8688998Q257308k09630j1759759r393032L460828Q352103K46664o198281
$$ 28688998 36946306 36736676 24976917 15583885 19044713 27396816 27643480 21445199
40676B1445199o53459Q027017P619049J111349l14585M539204O264408j96417
$$ 21445199 20791740 28818757 36437806 37549155 37234570 41773774 48038182 47841765
40668D7841765q445639r028268l04225R700211J0850160J616618p779992o699338
$$ 47841765 39396126 30367858 30063633 39763844 50614004 52230622 44450630 37751292
40660C7751292J795616M910660q89214m756355J95071M864805J14730n496079
$$ 37751292 39546908 44457568 43568354 38811999 39007070 43871875 43986605 38490526
40652C8490526J260892J3406088R922717j2305775k9552537k0713432O505018
$$ 38490526 39751418 53157506 63080223 50774448 21221911 508479 7013497
40645G013497K6783743K6009310J1245485j904800m588547n54980j084271j1388899
$$ 7013497 33797240 59806550 71052035 69147235 64558688 64003708 62919437 51530538
40637E1530538k1503257j7001700P54837J4831953J5768199J2108574J1617361
$$ 51530538 30027281 13025581 13780418 28612371 44380570 56489144 68106505
40630F8106505O102381j1874475k8280820k2453256J159209J5352823O568326
$$ 68106505 74208886 62334411 34053591 11600335 12759544 28112367 34680693
40623C4680693q481169r436768l40040J085622p635459j0916321N40421J6092924
$$ 34680693 26199524 16762756 16422716 17508338 9872879 -1043442 -503021 15589903
40615A5589903K0278481J2755914N711421N368198N007818k111598j0943255j2199929
$$ 15589903 35868384 48624298 54335719 59703917 64711735 62600137 51656882 39456953
40607C9456953o827540l546885l348013K078970J3611497J8728898R972942j704712
$$ 39456953 32629413 29082528 25734515 27813485 41424982 60153880 70126822 68422110
40599F8422110l587259j670561q725776j8502412j2394007Q288436J8851223P229358
$$ 68422110 64834851 63164290 54438514 35936102 23542095 31830531 50681754 57911112
40591E7911112o726064j105177J5342754J8038297L127588j0698151j1811603
$$ 57911112 51185048 50079871 65422625 83460922 86588510 75890359 64078756
40584F4078756p355434n459819l845734k28289P78154k730541m843108k159125
$$ 64078756 56723322 51263503 47417769 47189480 47967634 45237093 40393985 38234860
40576C8234860M89221k28115k67859K569492L302522j03619r88103M281156Q491126
$$ 38234860 38724081 38495966 38228107 40797599 44100121 43996502 43008399 47289555 55780681
40567E5780681O141878L964713P988215R659866p72730j4229095j3294347M26837
$$ 55780681 61922559 65887272 73875487 83535353 82762623 68533528 55239181 55666018
40559E5666018P384107q18401j0939458j0751744n545815m499728m967171o15391
$$ 55666018 63050125 62231724 51292266 40540522 34994707 30494979 25527808 24912417
40551B4912417N556176P102437N388660N465787P049278P899546R834660J3351990
$$ 24912417 30468593 37571030 42959690 48425477 55474755 63374301 73208961 86560951
40543H6560951J2821676N363637k104240l377894l459066q609326j2973097p111721
$$ 86560951 99382627 104746264 102642024 99264130 95805064 87195738 74222641 67110920
40535F7110920N439686J2757680J1777719Q418646L958422n050041j4951584j6704760
$$ 67110920 72550606 85308286 97086005 105504651 109463073 104413032 89461448 72756688
40527G2756688r526017j032345N338558J1075181J2917668O693720n00604K077473
$$ 72756688 63230671 62198326 67536884 78612065 91529733 98223453 97722849 99800322
40519I9800322R049025M388605j1407477j8725494q384889N283922Q290373N064856
$$ 99800322 108849347 113237952 101830475 83104981 74720092 80004014 88294387 93359243
40511I3359243L160368j248024j0046913j2942995n108162J157854j987098j466607
$$ 93359243 96519611 95271587 85224674 72281679 67173517 68331371 66344273 64877666
40503F4877666J2692097K3362694J0588061j2662324j6664805M06836J2923005
$$ 64877666 77569763 100932457 111520518 98858194 82193389 82600225 95523230
40496I5523230J0107663P521797J3071098J2004156l367683j5551026r719925
$$ 95523230 105630893 113152690 126223788 138227944 134860261 119309235 109589310
40489A09589310J103222k477684j5113142j7374542p244781M1702r39662Q14139
$$ 109589310 110692532 108214848 93101706 75727164 68482383 68524085 67584423 68398562
40481F8398562J0771233J7555602J0427622l613925r242066l078812M454126N228570
$$ 68398562 79169795 96725397 107153019 103539094 94297028 91218216 95672342 100900912
40473A00900912K142820k38941m902686j4536915k0054695r367424J1813666K1394697
$$ 100900912 103043732 102804791 97902105 83365190 63310495 53943071 65756737 87151434
40465H7151434R331524p517421r223967o92252q78559j1384117j4477897j734852
$$ 87151434 96482958 88965537 79741570 79049318 78170759 66786642 52308745 50573893
40457E0573893J3446283J6520600J0277674N686121N628157N740410L685959M08699
$$ 50573893 64020176 80540776 90818450 96504571 102132728 107873138 111559097 111967796
40449A11967796l046990n489939o349343q013117j2044181j3222869n355918O506710
$$ 111967796 108920806 103430867 97081524 89068407 77024226 63801357 58445439 64952149
40441F4952149R474700Q03202p434482n436907K062711N602584M392265L596552
$$ 64952149 74426849 75230051 67795569 62358662 64421373 70023957 74416222 78012774
40433G8012774M583753M053016l74678o705569q379544Q27687J6547978K2862086
$$ 78012774 82596527 86649543 86274865 79569296 71189752 72017439 88565417 111427503
40425A11427503J1276955m035668m163942N068121J141054j7175929k3827772
$$ 111427503 122704458 118668790 114504848 119572969 120714023 103538094 79710322
40418G9710322n678959J4929514J3402895j004970k829714R897261J6692352Q221728
$$ 79710322 74031363 88960877 102363772 101358802 98529088 108426349 125118701 133340429
40410A33340429l299581o111081l111670k128233n118339q976264q471224K03092
$$ 133340429 130040848 123929767 120818097 118689864 113571525 104595261 96124037 96327129
40402I6327129J1380190J0750368n760569k0336461j3694413P799326K0630956
$$ 96327129 107707319 118457687 112697118 92360657 78666244 86465570 107096526
40395A07096526J6874115J1412072J5554298K0860367J5740693M392865r15578
$$ 107096526 123970641 135382713 150937011 171797378 187538071 191930936 191015358
40388A91015358J328965J136304o543727j2299618l077636J8629466L1724759
$$ 191015358 192344323 193480627 186936900 174637282 171559646 190189112 221913871
40381B21913871J8796595j0247405k6427104j5746976N690994J5328529J0441300
$$ 221913871 240710466 230463061 204035957 188288981 193979975 209308504 219749804
40374B19749804K024116m909984j1004784j1765922l270768O226484N388660k569569
$$ 219749804 221773920 216863936 205859152 194093230 190822462 197048946 202437606 199868037
40366A99868037m807642J681150Q699684J1771336J3279899J4035544J4685167
$$ 199868037 195060395 196741545 205441229 217212565 230492464 244528008 259213175
40359B59213175K0651361L1030125K9032020K666014k9627010l6945958j9025321
$$ 259213175 279864536 310894661 339926681 342592695 312965685 276019727 256994406
40352B56994406o729308j5782253k6037863j6838037J571239Q301236M000641
$$ 256994406 250265098 234482845 208444982 191606945 193178184 201479420 205480061
40345B05480061K888001N856438K502314o537518q367223J866852J3620065J5415134
$$ 205480061 208368062 214224500 216726814 210189296 201822073 203688925 217308990 232724124
40337B32724124P649884P6024K134505J5149853L0492387L7532880L4905281K8765987
$$ 232724124 240374008 240450032 242584537 257734390 288226777 325759657 360664938 389430925
40329C89430925J9082905k099378l2999930n3447047m5665444j8803423q16880
$$ 389430925 408513830 406414452 373414522 319967475 274302031 255498608 254681728
40322B54681728o192939k1239638k3600323q928321P076909J0023212L204820
$$ 254681728 248488789 227249151 203648828 194720507 201797416 211820628 215025448
40315B15025448p52556L80170l225055j4163063j9077488p853044Q805437J4526118
$$ 215025448 214272892 214653062 211428007 197264944 178187456 170334412 179139849 193665967
40307A93665967J2596311J8961922L3556796L8394630K5768342Q801178j353315
$$ 193665967 206262278 225224200 258780996 297175626 322943968 331745146 330391831
40300C30391831j0007464k2134483k8775925k2597461j2894184j1417407j4337187
$$ 330391831 320384367 298249884 269473959 246876498 233982314 222564907 208227720
40293B08227720j2105110p857511j0882804j7904706j6164427l292213Q596858
$$ 208227720 196122610 188265099 177382295 159477589 143313162 140020949 148617807
40286A48617807R271319J538630n263214o314576l934750k373045j521471L228717
$$ 148617807 157889126 159427756 154164542 147849966 143915216 141542171 140020700 143249417
40278A43249417J3343059K2393980K3847835K0064506J6202643R597685m115840
$$ 143249417 156592476 178986456 202834291 222898797 239101440 248699125 244583285
40271B44583285j8541310k3864217k2899968k3436459j9082360j31246J8529821
$$ 244583285 226041975 202177758 179277790 155841331 136758971 136627725 155157546
40264A55157546R510512k1730115l5194764j3108506J2784610J0381160o493466
$$ 155157546 164668058 142937943 107743179 94634673 107419283 117800443 111306977
40257A11306977q222511R36368j613049j0844018l327492J7307063K3679561J1579408
$$ 111306977 103084466 104020834 102407785 91563767 88236275 105543338 129222899 140802307
40249A40802307O384678J8480390K6432661J3965955n976555j6525655k0790971
$$ 140802307 147186985 165667375 192100036 206065991 200089436 183563781 162772810
40242A62772810k5898167k4409210q677141J0829836J7099788P519597p256912
$$ 162772810 136874643 112465433 103788292 114618128 131717916 139237513 131980601
40235A31980601j7031645j6971104p804559J813090J498378o618159q609983J131451
$$ 131980601 114948956 97977852 90173293 91986383 93484761 86866602 78256619 79388070
40227G9388070J0120397M756563j0984471k0860600j4796302L221059K0692935
$$ 79388070 89508467 94265030 83280559 62419959 47623657 50844716 71537651
40220G1537651K5663275J4545795m495448j7135001j3892678K789276J8997636
$$ 71537651 97200926 111746721 107251273 90116272 76223594 79012870 98010506
40213I8010506J7813250m354902k8039394k8532878p509799P783592L732661j100478
$$ 98010506 115823756 111468854 83429460 54896582 47386783 55170375 58903036 57802558
40205E7802558R501986J8930086O064944j4859761j4728941K342005O988068n546240
$$ 57802558 67304544 86234630 92299574 77439813 62710872 65052877 72040945 66494705
40197F6494705j1345563l210392j085740j1332846j3949768j600774N199315l112375
$$ 66494705 55149142 51938750 50853010 39520164 25570396 23969622 29168937 26056562
40189B6056562o398005O536099J4734296L550769n922263O318858K1657859J4084327
$$ 26056562 19658557 26194656 40928952 44479721 38557458 44876316 66534175 80618502
40181H0618502m888624p158025M507940N827615m940006p979738K19529L428286
$$ 80618502 75729878 68571853 73079793 78907408 73967402 65987664 66207193 69635479
40173F9635479k895447o612886m111444l727953n190494p97853M680733M77508
$$ 69635479 66740032 60127146 56015702 52287749 47097255 46299402 50980135 51457643
40165E1457643n885654K403911J8687693J7676259l686495j8525047j0354006
$$ 51457643 45571989 47975900 66663593 84339852 80653357 62128310 51774304
40158E1774304N201999Q821839L467626k47737l185042p961434q019351j144729
$$ 51774304 56976303 65798142 69265768 69018031 65832989 57871555 49852204 48707475
40150D8707475R07634r050965j7755921q900006J2430465K6044354K1280568M902430
$$ 48707475 49615109 40564144 22808223 13908217 26338682 52383036 73663604 78566034
40142G8566034j0034300j4403466p325650K340400L551198l020865n348492J474223
$$ 78566034 68531734 54128268 46802618 49143018 52694216 49673351 44324859 45799082
40134D5799082O801173J573449n997347k601000R067007J3495143M225035q121008
$$ 45799082 52600255 54173704 48176357 45575357 54642364 68137507 72362542 64241534
40126F4241534j0481545k448601N426759M108906n027708j1994312q133242N265859
$$ 64241534 53759989 51311388 56738147 60847053 55819345 43825033 35691791 40957650
40118D0957650J8264012K1453273J3325084P86570n877815j839272N609661L635022
$$ 40957650 59221662 80674935 94000019 94786589 88908774 87069502 92679163 96314185
40110I6314185q848211j6789324q912311N071280Q080234N08395l165421P32583
$$ 96314185 87465974 70676650 61764339 66835619 74915853 75424248 72258827 72991410
40102G2991410J334066m400323m492716O098696J3361573N165820q656475r968037
$$ 72991410 74325476 69925153 65432437 71531133 84892706 90058526 81402051 71434014
40094G1434014K662211J4623295J4949384N105127o866883j2148190o156910M335421
$$ 71434014 74096225 88719520 103668904 108774031 101907148 89758958 83602048 87937469
40086H7937469N049719o896043j5407530o698917R756602J4715050P100669J923155
$$ 87937469 92987188 86091145 70683615 63984698 73741300 88456350 95557019 97480174
40078I7480174L306764r41165j4331917k0162968n761606J5100503J8341587J529544
$$ 97480174 100786938 99845773 85513856 65350888 59589282 74689785 93031372 94560916
40070I4560916j4194405j2489459L32998Q257445O240197J676506P67084J071185
$$ 94560916 80366511 67877052 68210050 76467495 82707692 84384198 85151282 86222467
40062H6222467k387522q586664j0656329l585100R439099J8729301J6684512N178299
$$ 86222467 83834945 75248281 64591952 61006852 70445951 89175252 105859764 111038063
40054A11038063o074377q912943l680417L457015P854220Q758928O071288j027571
$$ 111038063 104963686 96050743 92370326 95827341 103681561 112440489 118511777 117484206
40046A17484206j1026266j8490269j7780240q186095M580323J1568482P382660
$$ 117484206 106457940 87967671 70187431 62001336 66581659 78150141 85532801
40039H5532801l384710q359655m28357J2425002J5593192N731503o178000j0009713
$$ 85532801 82148091 73788436 73360079 85785081 101378273 107109776 100931776 90922063
40031I0922063o973615k751761J222697M743040M727293P19160j539317J137875
$$ 90922063 83948448 81196687 82419384 87162424 91889717 92608877 91069560 92207435
40023I2207435K573497l243030j0661148r161191J174117R306162P184603k509451
$$ 92207435 94780932 91537902 80876754 71715563 72889680 82195842 89380445 86870994
40015H6870994j1292280j2279628m725787M450491O928392M053751N307160J1595619
$$ 86870994 75578714 63299086 58573299 63023790 69952182 74005933 79313093 90908712
40007I0908712J0376340l886111j5762377r377167O405269J1019063L836508J801553
$$ 90908712 101285052 97398941 81636564 72259397 78664666 89683729 93520237 95321790
39999I5321790Q179452P451676n249778j3363332p004139q55939r767231k2955304
$$ 95321790 103501242 110952918 105703140 92339808 85335669 84479730 74712499 51757195
39991E1757195j9595257O62315J9323954K4312231J8667905R081610L01219j714846
$$ 51757195 32161938 32824253 52148207 76460438 95128343 104209953 104511172 102796326
39983A02796326N174091J1508928N682847q076718j2849202k702372Q022478M686314
$$ 102796326 107970417 119479345 125162192 117085474 104236272 101533900 109556378 114242692
39975A14242692p915108j4590687j2007218r769734j0665994m554411J1122598
$$ 114242692 106327584 91736897 79729679 69959945 59293951 54739540 65862138
39968F5862138J8051215K26844k6079115k6923456K210064K6504087J9780245
$$ 65862138 83913353 84140197 58061082 31137626 33347690 59851777 79632022
39961G9632022M07524j39220J4214571J5496670O87211m657940Q113122J5417003
$$ 79632022 80039546 79900326 94114897 109611567 110298778 105640838 113753960 129170963
39953A29170963J338693j6347232j5628525k088586O664365Q869744J1340491
$$ 129170963 130509656 114162424 98533899 96445313 103109678 111979422 123319913
39946A23319913J0212390j12976j0241992q006984J197383M410450K889046N226152
$$ 123319913 133532303 133419327 123177335 115170351 116367734 120778184 123667230 128893382
39938A28893382O708720l494189j9151161k2134066r608430L301832Q036690J0650793
$$ 128893382 135602102 132107913 112956752 90822686 81214256 84516088 92552778 103203571
39930A03203571J3609277R150191l347934j0517866m139124O059445P532802K282339
$$ 103203571 116812848 125963039 122615105 112097239 107958115 114017560 121550362 123832701
39922A23832701L16773M134844Q494568R833765Q130699L312398l675054q756663
$$ 123832701 124149474 128284318 136778886 146612651 154743350 158055748 154380694 145624031
39914A45624031q687840n432801l391793m290804p148546j0536953j2028668p961333
$$ 145624031 136936191 131503390 128111597 123820793 116672247 106135294 94106626 86145293
39906H6145293K335425J2668095J3969178M046471q040829j0079961k4194J1222755
$$ 86145293 88480718 101148813 115117991 119164462 111123633 101043672 101019478 112242233
39898A12242233J2336152M088990m191689p329571p082398m459341J825886Q604849
$$ 112242233 124578385 128667375 124475686 117146115 110063717 105604376 107430262 116035111
39890A16035111R147652L462082p59839m95630j538385o085066o152835L572236
$$ 116035111 125182763 128644845 127885006 127389376 125850991 119765925 113613090 117185326
39882A17185326J4610760J4864388M409406o053989q036914j056547R314084J4311487
$$ 117185326 131796086 146660474 151069880 145015891 136978977 135922430 145236514 159548001
39874A59548001Q315856l586275j0262884r312773r081241j3562301j5895845
$$ 159548001 167863857 164277582 154014698 144701925 135620684 122058383 106162538
39867A06162538j0513556j04926J2867404K7055549L0827246R905914k4313422
$$ 106162538 95648982 95544056 108411460 135467009 166294255 176200169 151886747
39860A51886747l6104647j1202359J8892683J9084017j086030p113871O898253
$$ 151886747 115782100 104579741 123472424 142556441 141470411 134356540 141254793
39853A41254793J4979533L351126j2314643j4669787m990596P299444J5428527
$$ 141254793 156234326 159585452 147270809 132601022 127610426 134909870 150338397
39846A50338397J3616839J730212q544477p434300k711627n077944o638079L862230
$$ 150338397 163955236 165685448 157140971 149706671 146995044 141917100 135279021 139141251
39838A39141251J3731127L286746j5708417j2443582J2140828K3058791N994535
$$ 139141251 152872378 156159124 140450707 128007125 140147953 163206744 169201279
39831A69201279j2053294r238790q59226n963817j3183136m257810J2558133J8055258
$$ 169201279 157147985 147909195 147049969 141086152 127903016 123645206 136203339 154258597
39823A54258597J2778366Q577125M807713m341450j1500363o845157K695601M072296
$$ 154258597 167036963 175614088 180421801 176080351 164579988 157734831 160430432 164502728
39815A64502728j177339l861986m897039r281747j1979755o482446J479299M164987
$$ 164502728 163325389 159463403 154566364 145284617 133304862 126822416 128301715 132466702
39807A32466702N871285J1668760J3710897N574366j815984K603707Q864477L144206
$$ 132466702 138337987 150006747 163717644 169292010 167476026 170079733 178944210 182088416
39799A82088416n351603N42605J2841635Q569702j0622554j8307206n009708P862202
$$ 182088416 176736813 177279418 190121053 198690755 188068201 169760995 164751287 172613489
39791A72613489L359373o706465m770430N595734J0569881Q779471P578615O853972
$$ 172613489 175972862 169266397 164495967 170091701 180661582 189441053 197019668 203873640
39783B03873640J774239m102669k598969M024476M072631n857289j4207122j0431643
$$ 203873640 205647879 201545210 198946241 202970717 207043348 201186059 186978937 176547294
39775A76547294m36616J880235m979344q637666l056385J665051l153417q616130
$$ 176547294 176110678 177990913 173011569 164373903 161317518 162982569 159829152 151213022
39767A51213022k313224J0120147J4223397J1576000J4963186K1198501J3125630
$$ 151213022 148899798 159019945 173243342 184819342 199782528 220981029 234106659
39760B34106659q104239j8499750p749458M596855J971058m863346k905641j927242
$$ 234106659 226002420 207502670 199753212 204350067 206321125 201457779 198552138 196624896
39752A96624896j2132962j8444122m375223J4733871J1913137q720565j8578546
$$ 196624896 184491934 166047812 161672589 176406460 188319597 179599032 161020486
39745A61020486p411043Q019611J4006602J2537804O161791n185109j3240224
$$ 161020486 153609443 161629054 175635656 188173460 194335251 189150142 175909918
39738A75909918r564845k535140m840733r033534k12285J2162911M778429j8264134
$$ 175909918 166345073 163809933 158969200 149935666 149723381 161886292 166664721 148400587
39730A48400587k6350468q752588J0502721J1936365N420859M634533M287725
$$ 148400587 122050119 113297531 123800252 135736617 141157476 145792009 150079734
39723A50079734k506379p603283m196717m15455k794098m419284j929980n218482
$$ 150079734 147573355 139970072 135773355 135357900 132563802 128144518 126214538 120996056
39715A20996056j6937905k1541225r657682M526415N655623l90836k582512n577146
$$ 120996056 104058151 82516926 72859244 77385659 83041282 82650446 80067934 74490788
39707G4490788j5583393k1216998j0028829P515989J1787710K881614m165228
$$ 74490788 58907395 37690397 27661568 35177557 46965267 49846881 45681653
39700D5681653n060242o674632p907265j565512P113788M479296p824401j1556969
$$ 45681653 40621411 33946779 26039514 24474002 31587790 36067086 28242685 16685716
39692A6685716J590164J7316795J8579173O732068m008699n619015k691320k767997
$$ 16685716 18275880 35592675 54171848 60903916 56895217 51276202 48584882 45816885
39684D5816885n820880n325797J065985N933754J686864p003540q431338j050841
$$ 45816885 39996005 34670208 35736193 41669947 43356811 36353271 27921933 26871092
39676B6871092M361912J383779l899897m972516m158991m383544k073679M713993
$$ 26871092 31233004 32616783 28716886 23744370 19585379 15201835 13128156 17842149
39668A7842149R884128Q117298K843793l69002j431336k335688l410810n763546
$$ 17842149 27726277 35843575 38687368 38318366 36887030 34551342 31140532 25376986
39660B5376986r329358q048073J949873J0374579M729726o121961j321117J6221580
$$ 25376986 16047628 7999555 9949428 20324007 25053733 18931772 17610655 33832235
39652C3832235J9164412l21207j4176790k472446J3738371P551959r688620r709576
$$ 33832235 52996647 52675440 38498650 36026204 49764575 57316534 47627914 37918338
39644C7918338M935197Q466154k810440p370117K126167Q550711K208103n226229
$$ 37918338 42853535 51319689 48509249 41139132 43265299 51816010 54024113 48797884
39636D8797884m636185l144400o139595n999220K400011J0731218R724616R85492
$$ 48797884 44161699 41017299 34877704 28878484 31278495 42009713 51734329 52719821
39628E2719821q342265j2644056q110786L674782J2667265J0930621L670822l78009
$$ 52719821 44377556 31733500 23622714 27297496 39964761 50895382 54566204 54188195
39620E4188195l038950q058993p585321M464420J4154659N306596j0910768r920548
$$ 54188195 51149245 43090252 35504931 39969351 54124010 59430606 48519838 38599290
39612C8599290O656922J3923484N478909R36862P676323P985960n367104j2533320
$$ 38599290 45256212 59179696 64658605 65595467 73271790 81257750 75890646 63357326
39604F3357326j583897Q161906k018941j8454754j7133811N95562J5408869J8205867
$$ 63357326 61773429 69935335 67916394 49461640 32327829 32923391 48332260 66538127
39596F6538127J1824645j496338j5879815j7986703n131956N342263J296342m257682
$$ 66538127 78362772 76866434 60986619 42999916 37867960 43210223 44506565 40248883
39588D0248883L279910J2767062O527310p114071p163330L981493O189479k087235
$$ 40248883 43528793 56295855 62823165 55709094 48545764 52527257 58716736 56629501
39580E6629501k375776R107676J3555352J574012j1584393j1286313l635618o48126
$$ 56629501 54253725 63361401 76916753 78490765 66906372 55620059 51984441 51336315
39572E1336315k157335k857651m119048q583495j2424840j1160011o347449j598911
$$ 51336315 49178980 46321329 42202281 33618786 21193946 10033935 3686486 2087575
39564B087575J666397K436586J481375M365704J3464603J8220947O562084j3627737
$$ 2087575 3753972 6190558 7671933 12037637 25502240 43723187 50285271 36657534
39556C6657534k0169401p086145P139756Q060046M601152R171393J4765395Q080733
$$ 36657534 16488133 9401988 16541744 24601790 29202942 38374335 53139730 61220463
39548F1220463n957984j1356653o701051m993609r389974p656580N100042J4507075
$$ 61220463 55262479 43905826 37204775 32211166 22821192 15164612 20264654 34771729
39540C4771729P229123q078948j2640856m699329p35137q952684j5558370n693553
$$ 34771729 42000852 33921904 21281048 16581719 15846582 6893898 -8664472 -14358025
39532a4358025J2063032J6149653L307010p340539m404458n06257q061002j5525283
$$ -14358025 -2294993 13854660 17161670 9821131 5416673 4910416 -3150586 -18675869
39524a8675869o225916J0702247J2029780j775943o932229L802726R680565o70585
$$ -18675869 -24901785 -14199538 -2169758 -3945701 -10877930 -7075204 2605361 1934776
39516A934776q455203J572106J1932412K025545j2955785m478622J9525528K3059007
$$ 1934776 -6520427 -4948321 6984091 9009636 -3946149 -8424771 11100757 34159764
39508C4159764j110314j8770639p038809J2294714R140833j0699154k0098784
$$ 34159764 33049450 14278811 7240002 19534716 28675549 17976395 -2122389
39501b122389j2046188k371194m15241J58779L948564O135963L569912M4030r97560
$$ -2122389 -14168577 -16539771 -16955012 -16796233 -12847669 -6711706 -3141794 -3097764 -4095324
39492d095324M68360M511087R290164Q275985j304631j0353213q279289J547137
$$ -4095324 -3626964 884123 10174287 18450272 17145641 6792428 -1486861 60276
39484F0276P303294O348469N320183N385045J315983n216461n682285K95811L235109
$$ 60276 7363570 13712039 19032222 24417267 25733250 20516789 14834504 15130315 18365424
39475A8365424l05386k744725L68632L330321J180221l526053p995507j2115571
$$ 18365424 18060038 15315313 15683945 19014266 20194487 16668434 8672927 -3442644
39467c442644j2070859l773628N441759L584833m613084p17040J7343689K7508388
$$ -3442644 -15513503 -19287131 -13845372 -10260539 -14873623 -15590663 1753026 29261414
39459B9261414J5514088m216968j2102370r531822o318837k28694J1301675J4520755
$$ 29261414 44775502 40558534 28456164 18924342 12605505 12376811 23678486 38199241
39451C8199241k160733k3392195k4020457m434689J2883534J6318590J2779772
$$ 38199241 36038508 12646313 -11374144 -15808833 -2925299 13393291 26173063
39444B6173063P198369k627967j2445219j4279851j1885728j3461226j1652646
$$ 26173063 33371432 30743465 18298246 4018395 -7867333 -21328559 -32981205
39437c2981205O383393L0244668L3057215J0143095j3081036j6814993p605800
$$ -32981205 -26597812 3646856 36704071 46847166 33766130 16951137 9345337
39430I345337J924537R985756J4026240N719774j1079655j7806152q149357J088587
$$ 9345337 11269874 21255630 35281870 41001644 29921989 12115837 3966480 5055067
39422E055067l325761j2474496j4124103j0499711n500935N524544J9658739K0437844
$$ 5055067 1729306 -10745190 -24869293 -35369004 -40869939 -35345395 -15686656 4751188
39414D751188L782585r384734l357152Q405888P674869N08391Q77963L610644
$$ 4751188 8533773 -850961 -4208113 4197775 11872644 12381035 13258998 16869642
39406A6869642j886376o475186L392128J7109156J4197762j113564o684635J422336
$$ 16869642 14983266 8508080 11900208 29009364 43207126 42093562 35408927 36831263
39398C6831263N750367k020084j1284951j2728624p854295J77149P048488L228331
$$ 36831263 42581630 40561546 29276595 16547971 8693676 8870825 15919313 19147644
39390A9147644j1671125j7891639j205995J8659310J2494291j1651822j8067703
$$ 19147644 7476519 -10415120 -11621115 7038195 19532486 7880664 -10187039
39383a0187039J352386J5903489O024132r350010q329518P34850k43987q329896
$$ -10187039 -8834653 7068836 13092968 3742958 -4586560 -3851710 -4095697 -12425593
39375a2425593q966479l01999Q946414J4318646J4935923Q090471m681069j4427586
$$ -12425593 -21392072 -21694071 -12747657 1570989 16506912 24597383 19916314 5488728
39367E488728j4594367o194653P885476K1656150K1083203q21896k4162083k0751143
$$ 5488728 -9105639 -15300292 -7414816 14241334 35324537 34502641 10340558 -10410585
39359a0410585M448403J6752004K722516j1968327o975369K361239j991785p914675
$$ -10410585 -5962182 10789822 13512338 1544011 -5431358 -3070119 -5061904 -12976579
39351a2976579P50122J1257678N616329l810422M233588J8843491J3134660q639959
$$ -12976579 -12226457 -968779 4647550 837128 5070716 23914207 37048867 28408908
39343B8408908j6732223m590235L873197k925926q429438j907752K759335n725930
$$ 28408908 11676685 7086450 10959647 8033721 -395717 -2303469 455866 -5270064
39335e270064j5640945j3325603m781156k023063l768801l193886j920514l256880
$$ -5270064 -20911009 -34236612 -39017768 -41040831 -44809632 -48003518 -49924032 -53180912
39327e3180912j639679Q803688K1913192K5830839J7267199K723290r916938j5835831
$$ -53180912 -54820591 -46016903 -24103711 1727128 18994327 21717617 11800679 -4035152
39319d035152j3897223p159469K09237P266282J3133799J1802201q05921j5121876
$$ -4035152 -17932375 -25091844 -24882607 -17616325 -4482526 7319675 6513754 -8608122
39311h608122j4780563J830784J7163202J5904520J781864j1302986j5829906
$$ -8608122 -23388685 -21557901 -4394699 11509821 13291685 1988699 -13841207
39304a3841207j2689530m854356L424246O012806N46329o945406p240829K555049
$$ -13841207 -26530737 -31385093 -27960847 -21948041 -21401712 -28347118 -35587947 -33032898
39296c3032898J5521956K0220805J1464774k168695n926262K228053P346092m76436
$$ -33032898 -17510942 2709863 14174637 12005942 6079680 8307733 15653825 15177389
39288A5177389q699410m94316J6520512J8553487J291948j3395986j0663701k370008
$$ 15177389 6477979 5983663 22504175 41057662 42349610 28953624 18289923 15919915
39280A5919915m059380j0065981n902403O762313J2994468O046192o606886j4599391
$$ 15919915 11860535 1794554 -4107849 2654464 15648932 21695124 15088238 488847
39272D88847j2715242j979771R305991J0312024M88669p605308m507386L777308
$$ 488847 -12226395 -14206166 -4900175 5411849 5900518 -1704790 -6212176 -2434868
39264b434868O355724K702213p85146j827764q30723L973777J0134003P876721
$$ -2434868 3920856 6623069 5837923 4010159 3179436 7153213 17287216 25163937
39256B5163937n038063j3674376n440443Q104610O665246o063902o006553J3692125
$$ 25163937 20125874 6451498 1011055 9115665 15780911 9717009 3710456 17402581
39248A7402581K9743495K1025201l482591j9913650j9335928j0155649j024107
$$ 17402581 47146076 68171277 64688686 44775036 25439108 15283459 14259352
39241A4259352M897703M824663q99635l629957L822033J3193429Q590103r947769
$$ 14259352 19157055 23981718 23082083 19452126 23274159 36467588 45057691 35109922
39233C5109922k2239750j2784486Q961794K0551587J2886653l739772j5942948
$$ 35109922 12870172 85686 9047480 29599067 42485720 38745948 22803000
39226B2803000j9171920j3576524M05343J6529192K1370921Q129169j1341071
$$ 22803000 3631080 -9945444 -9540101 6989091 28360012 36489181 25148110
39219B5148110j7423633n732535Q301184R063171j868650j0698854q340806J282289
$$ 25148110 7724477 1991942 10293126 19356297 17487647 6788793 -1552013 -269724
39211b69724O964213K070633p688460r208871J939073J3152359R428917n644684
$$ -269724 6694489 8765122 1076662 -8132209 -6193136 6959223 16388140 10743456
39203A0743456j3542256n883434N852637R053089N837092L386260N11530n757208
$$ 10743456 -2798800 -8682234 -2829597 6223492 12060584 15446844 15958374 10201166
39195A0201166r867310o258032j173672l487607r090021p139534K085322Q308548
$$ 10201166 333856 -5924176 -7097848 -10585455 -19675476 -26815010 -24729688 -16421140
39187a6421140P336700L610925n74525n371391n309333M630074J5813308J4090504
$$ -16421140 -9084440 -5473515 -6048040 -11419431 -16728764 -12098690 3714618 17805122
39179A7805122J899123l408825M248789J1181590O168553m279884r170880p118164
$$ 17805122 19704245 16295420 20544209 31725799 37894352 33614468 24443588 17325424
39171A7325424m41671J0186725J7325790Q238473j4838620l0112806k3643943
$$ 17325424 16883753 27070478 44396268 52634741 37796121 7683315 -15960628
39164a5960628p732610N63031M065163J1910612J5963830L558050j5086425j6937060
$$ -15960628 -23693238 -23130207 -19065044 -7154432 8809398 12367448 -2718977 -19656037
39156a9656037p25404J1949427J0323078O203534Q275678P406566l461670j3884414
$$ -19656037 -20381441 -8432014 1891064 8094598 16370276 23776842 20315172 6430758
39148F430758j2365057l992339J03749m44861m9262J014567N12136J743393O551887
$$ 6430758 -5934299 -9926638 -9822889 -10267750 -10317012 -9302445 -8790309 -7046916 -495029
39139d95029Q007213O48930p927969o323017M255609J2652804J3159638Q806128
$$ -495029 7512184 8161114 233145 -6089872 -1834263 10818541 23978179 32784307
39131C2784307K383869n982162j3307359j4249176p704740K160547J0091717J1064803
$$ 32784307 35168176 29186014 15878655 1629479 -6075261 -3914714 6177003 17241806
39123A7241806J983287j1657376j5742681l002145J4628146J8610200P129955
$$ 17241806 19225093 7567717 -8174964 -11177109 3451037 22061237 29191192
39116B9191192l986534l475997K508702K265082n538451j2506105j1604385l334890
$$ 29191192 25204658 21728661 24237363 26502445 20963994 8457889 -3146496 -6481386
39108f481386O210002J0857114R533091O363375M341428J353498m195539p488367
$$ -6481386 -271384 10585730 20118821 26482196 30823624 32177122 27981583 20493216
39100B0493216l283064M592860P236456L189522q82267j932834m346276j0261794
$$ 20493216 17210152 21803012 29039468 32228990 31346723 29413889 25067613 14805819
39092A4805819j4330246j1640744m402399K698034Q063358J0943555R402907M311339
$$ 14805819 475573 -11165171 -15567570 -12869536 -4806178 6137377 15540284 19851623
39084A9851623L47839p28184l086036r198570j3834537j0641376j700791M312605
$$ 19851623 20199462 19471278 16385242 7186672 -6647865 -17289241 -18990032 -14677427
39076a4677427K161143n152988j0599829r669237l391629L538848P508565Q420694
$$ -14677427 -12516284 -17669272 -28269101 -37938338 -41329967 -37791119 -30282554 -21861860
39068b1861860P223802L843162j93176q18224K652735M540420J356709j136992
$$ -21861860 -14638058 -10794896 -10988072 -11806296 -9153561 -4613141 -3256432 -4393424
39060d393424K832475P463138L786771l759528k568015P240340J1900310N686441
$$ -4393424 -1560949 5902189 9688960 5929432 3361417 10601757 22502067 28188508
39052B8188508j607487k678029k982947p297970j0839634j0574908j0592304r344390
$$ 28188508 26581021 23902992 20920045 13622075 2782441 -7792467 -18384771 -27729161
39044b7729161J527413J7049510J7451424j37123r630830N714097K3468714J5297145
$$ -27729161 -26201748 -9152238 8299186 8162063 -1468767 4245330 27714044 43011189
39036D3011189p885414j4905164n260616m678217j5617610j2138468J1653104
$$ 43011189 35125775 20220611 14959995 10281778 -5335832 -17474300 -5821196
39029e821196K6579064J4473348m446474p597918l582602q572240j5191809r875674
$$ -5821196 20757868 35231216 30784742 23186824 19604222 11031982 -4159827 -14035501
39021a4035501m21121O0895n17468R488213J6688413K398825j8872561j5270999
$$ -14035501 -14456622 -14395727 -14913195 -5424982 11263431 13662256 -5210305 -20481304
39013b0481304J0579846K1070951P72762j9843624j2405720P252120P971936p239304
$$ -20481304 -9901458 11169493 11942255 -7901369 -20307089 -13054969 -5083033 -12322337
39005a2322337r648912P282351J8445829P421167r250431q651032N960130J4285741
$$ -12322337 -21971249 -14688898 3756931 11178098 1927667 -6723365 -763235 13522506
38997A3522506R370117J510069l025929q436416j3453966q109446N755325Q551400
$$ 13522506 22892623 24402692 21376763 12940347 -513619 -8623065 -2867740 5683660
38989E683660q135814k1669556q152748J7989427K0581317m827662k3601892j4075861
$$ 5683660 -2452154 -24121710 -32274458 -14285031 6296286 1468624 -22133268 -36209129
38981c6209129L170937L274475l633006L973010J7259467J0989146j1335812j9818818
$$ -36209129 -33038192 -29763717 -33396723 -29423713 -12164246 -1175100 -12510912 -32329730
38973c2329730m841188R636857N602225l754602l31247R939429J0808145K501848
$$ -32329730 -37170918 -27534061 -21931836 -25686438 -26017685 -16078256 -5270111 -2768263
38965b768263k618725j339802l41485j328583L346K440843n86670q505561j1265327
$$ -2768263 -5386988 -6726790 -7068275 -8396858 -8393512 -5952669 -6539339 -15044900 -26310227
38956b6310227k863378Q914134J0616819p45367j2951581j1805268J548669J0689529
$$ -26310227 -29173605 -20259471 -9642652 -10388019 -23339600 -35144868 -33596199 -22906670
38948b2906670M134027r305078j2066469j382313Q544758P801037L073232M473925
$$ -22906670 -18772643 -28077721 -40144190 -41526503 -32981745 -25180708 -22107476 -17633551
38940a7633551R580195Q379146q39087q152091l932969R737214J9790811J4312988
$$ -17633551 -8053356 325790 -513297 -8665388 -12598357 -2861143 16929668 31242656
38932C1242656m124118j8752988j6360059k909798M730500R58882l604394P4302
$$ 31242656 27118538 8365550 -7994509 -10904307 -6173807 -5214925 -8819319 -8745017
38924h745017O942441P468377J479853l388208j664498N995015J4147090J4813301
$$ -8745017 -1802576 5665801 7145654 3757446 2092948 8087963 22235053 37048354
38916C7048354L813249j2051651j9545313j3631803k522426L425602J592846m940173
$$ 37048354 40861603 28809952 9264639 -4367164 -6889590 -3463988 -1871142 -6811315
38908f811315j1013187r480565K553528J5233636J4792791M036081N80792R344966
$$ -6811315 -17824502 -27305067 -24751539 -9517903 5274888 9310969 9891761 19236727
38900A9236727J2864027p57171j6568940j5363457l960316k426808j0024805p669543
$$ 19236727 32100754 31343583 14774643 -588814 -4549130 -6975938 -17000743 -24670286
38892b4670286Q020596J7184967P793280o265591p089006K904818Q932210M703327
$$ -24670286 -16649690 535277 8328557 2062966 -5026040 -2121222 6810988 11514315
38884A1514315m748569j2582718j3429031m205789R679580J4791620M843484r193468
$$ 11514315 6765746 -5816972 -19246003 -23451792 -13772212 1019408 5862892 -3330576
38876c330576j2303890m581324J815263J743387K153319P466871J0942037O060726
$$ -3330576 -15634466 -20215790 -18400527 -16657140 -14503821 -7036950 3905087 9965813
38868I965813j564963k014835L639940N667644K199275K011251P372018O281680
$$ 9965813 8400850 6386015 10025955 15693599 17892874 19904125 27276143 33557823
38860C3557823q448299k2210167j6088172L409882J0808939r29894r652305J367236
$$ 33557823 25109524 2899357 -13188815 -9778933 1030006 100112 -9552193 -8184957
38852h184957J7333542J5406439o33803q620992j908491N784839N708463L660890
$$ -8184957 9148585 24555024 23921221 15300229 13391738 19176577 24885040 28545930
38844B8545930L331571q19694r129719j1323143k765737O490148O384587L10810
$$ 28545930 31877501 31057807 21928088 10604945 7839208 14329356 20713943 21024753
38836B1024753l252269l532930m294873n129683l734902k093079l573783o590942
$$ 21024753 17772484 14239554 9944681 4814998 1080096 -1012983 -4586766 -11177708
38828a1177708o039525K68135Q732674J2256818O157060n411002j1372845o493406
$$ -11177708 -17217233 -16949098 -8216424 4040394 10197454 4786452 -6586393 -13079799
38820a3079799J515128L612385K381494L894595L278849o845600j7566867j1960884
$$ -13079799 -11564671 -7952286 -5570792 -1676197 1602652 -5242948 -22809815 -34770699
38812c4770699P126261J7079109Q030335l773658l071970K694830O20925n301322
$$ -34770699 -27644438 -10565329 -2534994 -6308652 -9380622 -6685792 -6064867 -11366189
38804a1366189m112193K369619N129426L818255K943922Q66051l806435l596761
$$ -11366189 -15478382 -13108763 -7979337 -4161082 -1217160 -351109 -4157544 -7754305
38796g754305N505160J1324652J321731j5096397j7088511j704827J3463844J5174183
$$ -7754305 -2249145 9075507 10397238 -4699159 -21787670 -23492497 -10028653 5145530
38788E145530P051112j886147o926613n625405J181839N884315K673518j739673
$$ 5145530 12196642 10310495 3383882 -2241523 -1059684 4824631 7498149 5758476
38780E758476K237556R317143N909089o279255j0013635O21819R144554K51710
$$ 5758476 7996032 17313175 23222264 16943009 6929374 7551193 16695747 16947457
38772A6947457j7658249k3566502j0741376O518637J1237778L015294l007613
$$ 16947457 -710792 -24277294 -35018670 -28500033 -17262255 -14246961 -17254574
38765a7254574L961741J4934550J2489856k932295j0829220o17509J0977914N232909
$$ -17254574 -13292833 1641717 14131573 11199278 370058 -247451 10730463 15963372
38757A5963372r492249j2263751k573324L410944K709884O443713J3091486P570186
$$ 15963372 6471123 -5792628 -8365952 -4955008 -2245124 4198589 17290075 24860261
38749B4860261r581774j7440029o412980P814530J0521559O776744M473690l55495
$$ 24860261 15278487 -2161542 -8574522 -759992 9761567 16538311 21012001 20656506
38741B0656506r299397j1815849k881591O305491P139727O152378P399260J469999
$$ 20656506 11357109 -458740 -3340331 2965160 10104887 16257265 23656525 25126524
38733B5126524j3941931k1850882j1216239L303547M519188j594307j891067K59082
$$ 25126524 11184593 -10666289 -21882528 -18578981 -14059793 -15654100 -17545167 -17286085
38725a7286085j838500K59750J1126557J2196436r569505l0089054j9290361Q425351
$$ -17286085 -19124585 -18864835 -7738278 4458158 -5111347 -35200401 -54490762 -46065411
38717d6065411J3294394o900253j5257922J636371J3637287J303736j1018044
$$ -46065411 -32771017 -39671270 -54929192 -53292821 -39655534 -38351798 -49369842
38710d9369842J908967K3660943K4014564N525298o340900l856634k67891j355281
$$ -49369842 -47460875 -23799932 214632 5739930 -600970 -4457604 -4725495 -6080776
38702f080776J029131R401222J4533619J0224642Q93670o533541r471196r012641
$$ -6080776 -5051645 4349577 18883196 29107838 30001508 23467967 13996771 4984130
38694D984130q534374j0708790j1961686m759576J0700870K3246185K3246975
$$ 4984130 -3550244 -14259034 -26220720 -30980296 -20279426 2966759 26213734
38687B6213734J2257698k326554j4175568j7438179r484417K316613O640748L375444
$$ 26213734 38471432 36144878 21969310 4531131 -4953286 -2636673 4004075 7379519
38679G379519J298388M26298o468884j2805746j327637K3375535L0100180M753101
$$ 7379519 8677907 9104205 2635321 -10170425 -11498062 11877473 41977653 46730754
38671D6730754k3430775k0843512L700284J6090376O562152n551195p655150n733563
$$ 46730754 23299979 2456467 6156751 22247127 28809279 23258084 15602934 9869371
38663I869371l656422K459468Q544329M790683m822582o724904k494990p258495
$$ 9869371 6212949 8672417 17216746 22007429 17184847 10459943 7964953 706458
38655G06458k1191783k5649109j2774359K938627R299161J1442215J4064855R741490
$$ 706458 -20485325 -46134434 -58908793 -55970166 -46671005 -35228790 -21163935 -11422445
38647a1422445l515283j1403189l434980J0341487J4605617Q260330j111982r057861
$$ -11422445 -14937728 -26340917 -29775897 -19434410 -4828793 3431537 2319555 -6738306
38639f738306j1083664j891385J1967663J3305772o78698r828917j13390J4623829
$$ -6738306 -17821970 -19713355 -7745692 5560080 4881382 -4947535 -5060925 9562904
38631I562904J5160815N332847m25326l423144j2521692k0700628j4109442J935436
$$ 9562904 24723719 30056566 29631240 26208096 13686404 -7014224 -21123666 -19188230
38623a9188230R695488P830188J0045676J6984988J3953248j335758j2033187
$$ -19188230 -9492742 -1662554 8383122 25368110 39321358 37985600 25952413
38616B5952413q347554L7508L475097M714023N220390j254740j2754254j5273207
$$ 25952413 17604859 17642367 21117464 25831487 31051877 29797137 17042883 1769676
38608A769676n152064J995158l814867j0079395l572955P027982P039057R38128
$$ 1769676 -3382388 -1387230 -5202097 -15281492 -18854447 -11826465 -4787408 -3849280
38600c849280K452518Q885143N661669p931522j6398326j0878301R28815Q180782
$$ -3849280 -1396762 7488381 13150050 5218528 -11179798 -22058099 -21129284 -12948502
38592a2948502P925604K816698j640024J101779R798905J1778181q76937j6093356
$$ -12948502 -5022898 -2206200 -3846224 -2744445 7054460 18832641 17955704 1862348
38584A862348j6383360m611082J143447l551868m564064M804032J1993486O072849
$$ 1862348 -14521012 -19132094 -17988647 -21540515 -26104579 -21300547 -9307061 -3234212
38576c234212n761440j1115318q442322j869741P257375J4551445J0464857n166751
$$ -3234212 -8995652 -20110970 -28553292 -30423033 -23165658 -8614213 1850644 -3316107
38568c316107j6436940j0358017N376655J3734973R999237K287794k341506k260592
$$ -3316107 -19753047 -30111064 -24734409 -10999436 -1000199 1287595 -1053911 -3314503
38560c314503K003752O166864L315420n608623j0190278o882897o233305j3931240
$$ -3314503 -1310751 4856113 8171533 2562910 -7627368 -14510265 -20743570 -34674810
38552c4674810j7380345n266405J1651677J6776213J3613269J4769587J4920435
$$ -34674810 -52055155 -57321560 -45669883 -28893670 -15280401 -510814 14409621
38545A4409621M61600j9199605j8880639K690916J8552393J4146628M768098L628949
$$ 14409621 14871221 -4328384 -23209023 -20518107 -1965714 12180914 16949012 20577961
38537B0577961N36528j2766600k1555218j2603164O48229k36214p834747l341117
$$ 20577961 21114489 8347889 -13207329 -25810493 -25162264 -25398478 -33233225 -36574342
38529c6574342J0194618J4073082O282176K858233Q825415J0379817j239308j6196551
$$ -36574342 -26379724 -12306642 -6024466 -3166233 5659182 16038999 14799691 -1396860
38521a396860k0858518j2950928J057610J2715700J4207528M488520o071946o150425
$$ -1396860 -22255378 -35206306 -34148696 -21432996 -7225468 -2736948 -8808894 -14959319
38513a4959319J658475N244719R12027k999943o7558N955027P466998R52383j0342564
$$ -14959319 -13300844 -8056125 -7144098 -10144041 -10211599 -4256572 3210426 4162809 -6179755
38504f179755j6756381r876659M524983R132546j318953r471734k53936J5009086
$$ -6179755 -22936136 -32812795 -28287812 -19155266 -20474219 -29945953 -30199889 -15190803
38496a5190803J6143052N845652K824542R730297J1479155L260606l752287n620438
$$ -15190803 952249 6797901 9622443 19352740 30831895 34092501 30340214 24719776
38488B4719776j0912639j9219142j7447962l566881P441408Q039009P582987J0458546
$$ 24719776 13807137 -5412005 -22859967 -26426848 -18985440 -10946431 -3363444 7095102
38480G095102P099349l914859p431418K358809Q936152O32163r198023n120989
$$ 7095102 14194451 10279592 2848174 5206983 14143135 14775298 5577275 456286
38472D56286N585617Q151970L766610N08882l589353j0885761j2583471m592729
$$ 456286 6041903 14193873 17960483 18469365 14880012 3994251 -8589220 -13181949
38464a3181949K27181o097870q993773L934124J7515367J2633112o19169j275582
$$ -13181949 -12954768 -19052638 -28046411 -24112287 -6596920 6036192 5417023 4141441
38456D141441M780247k722721j8027541j6427001J847238J0016143r39101r764550
$$ 4141441 8921688 6198967 -11828574 -28255575 -26408337 -16392194 -17331295 -27095845
38448b7095845k882712O264270N334250K435848N716030Q382231O098993O713962
$$ -27095845 -29978557 -23714287 -18380037 -15944189 -10228159 -1845928 4253065 10967027
38440A0967027J1090834O572378q310560j5149812n456284L258905k746792r682460
$$ 10967027 22057861 28630239 20319679 5169867 -286417 2972488 225696 -9456764
38432i456764j814343R448205N649510n596587l748472Q890576J1142496j831324
$$ -9456764 -11271107 -1822902 3826608 -1769979 -5518451 3372125 14514621 12683297
38424A2683297j1842857o688411M497626Q005701K111991o326711j0129410m949295
$$ 12683297 840440 -5847971 -1350345 6655356 8767347 2440636 -7688774 -12638069
38416a2638069O375291J2952397P869358j373600l628044j194702m511255j2818837
$$ -12638069 -6262778 6689619 14558977 13185377 9557333 8362631 3851376 -8967461
38408h967461j3645091j996352J1733535J5202940O924304n126955j0540423l570467
$$ -8967461 -22612552 -24608904 -12875369 2327571 9251875 4124920 -6415503 -9985970
38400i985970R043530J0509769n969286k3114124j8233294N739125K2563680J7308102
$$ -9985970 -942440 9567329 3598043 -19516081 -37749375 -32010250 -9446570 7861532
38392G861532L035100k097610R82774Q69597l747273n662680m596361o982010
$$ 7861532 10896632 8799022 9781796 10651393 6904120 1241440 -3354921 -10336931
38384a0336931j2004084j0500444J0780R548653R708297N447045N885919R153078
$$ -10336931 -22341015 -32841459 -32830679 -23282026 -13573729 -8126684 -2240765 6912313
38376F912313O024562l378436p691485j664742N304670M359985J020737L653747
$$ 6912313 12936875 9558439 1866954 202212 5506882 9866867 10887604 14541351
38368A4541351O573855o87035j2107250j1093733K221540Q684322J8669q111093
$$ 14541351 21115206 20428171 8320921 -2772812 -551272 8133050 8151719 40626
38360D0626k645678N390422Q04834r285927p662884M249937R719453L210213n507649
$$ 40626 -2605052 2785370 3590204 -5695723 -13358607 -9108670 610783 3820996 -1686653
38351a686653j0399826j3271916j0381837M804669K3336150K5158248P757194
$$ -1686653 -12086479 -25358395 -35740232 -30935563 -7599413 17558835 25316029
38344B5316029p409627n242721K923763N81584p706644o586237L804399R105623
$$ 25316029 17906402 12663681 15587444 16169028 8462384 1876147 5680546 14786169
38336A4786169M198521p50340J358742L582190k689931j3239667j5684699n085304
$$ 14786169 18984690 18234350 19593092 23175282 20485351 7245684 -8439015 -13524319
38328a3524319J0264634J7960835J3440843K693133m948090n437910k022387l00388
$$ -13524319 -3259685 14701150 28141993 30835126 25887036 20449126 18426739 18126351
38320A8126351k423613n786625o465479l475486P43052M025625O904547R744077
$$ 18126351 15702738 9916113 3450634 -24852 718200 4743825 11648372 21392449
38312B1392449R767134M647308k542924o833760q453859j0269676r722564k360296
$$ 21392449 31159583 35806891 33263967 26430207 17976348 7706672 -2015892 -4376188
38304d376188O601639N811609m255176r548740m108144L98018m487429q413707
$$ -4376188 2225451 8037060 3781884 -5766856 -9875000 -9476982 -13964411 -22378118
38296b2378118r06555Q042610M179484m870719j202797J2286037J6093396P079226
$$ -22378118 -23284673 -15242063 -11062579 -15933298 -17136095 -4850058 11243338 18322564
38288A8322564K437570Q413321J0097777N1035o389643K848791J4759806J1300081
$$ 18322564 20760134 29173455 39271232 39322267 32932624 35781415 50541221 61841302
38280F1841302l526929j3206172j4177266j4611999j5067660p776836O632427
$$ 61841302 58314373 45108201 30930935 16318936 1251276 -6525560 106867
38273A06867J6000302J2020334j34029r032784q412589j162933M736968M646901
$$ 106867 16107169 28127503 27993474 18960690 10548101 9385168 14122136 18769037
38265A8769037J898856J182383l20923p356054j3820947q198844N931319R468150
$$ 18769037 20667893 21850276 21529353 14173299 352352 -7846492 -1915173 7552977
38257G552977m922661j8821332j2454798P893823K0067384J5785750O073563J267339
$$ 7552977 2630316 -16191016 -28645814 -20751991 -684607 15101143 21174706 22442045
38249B2442045m14963m183563r231019j0734462o185109J417408N310532K225023
$$ 22442045 22027082 17843519 8612500 -2121962 -8307071 -6889663 -1579131 645892
38241F45892k035680K13370O134364O201724Q86849P79376O950513O627870m444948
$$ 645892 -1389788 -1176418 4957946 11159670 12046519 12825895 19776408 26404278 21959330
38232B1959330j1702669n114058K842845k269032j1984765q956722M423839J1112611
$$ 21959330 10256661 5142603 7985448 5716416 -6268349 -15225071 -10801232 311379
38224C11379O414857O77745p05514j771331l212740j816672k11488j997988j317832
$$ 311379 6726236 7403981 6698467 4927136 1714396 -102276 -313764 -2311752 -3629584
38215c629584O763612J1261092k77658j7370949j8644993n428384R18413m714683
$$ -3629584 3134028 14395120 14117462 -3253487 -21898480 -27326864 -26408451 -31123134
38207c1123134m075440J0248350K0074104J1927755j050568j822274M714309M259464
$$ -31123134 -35198574 -24950224 -4876120 7051635 6001067 4178793 8893102 13152566
38199A3152566l055463o833102l987236Q51817M228896L512955l488925j0966668
$$ 13152566 10097103 3264001 -723235 128582 4357478 7870433 4381508 -6585160
38191f585160p829534M728251J0856183L425736m099715O22570R445682Q809164
$$ -6585160 -14414694 -9686443 1169740 4595476 495761 1118331 10564013 19373177
38183A9373177J214440k762844k779549m025784l872549J439684M983812o89115
$$ 19373177 20587617 17824773 15045224 11019440 7146891 8586575 13570387 12881272
38175A2881272q511779o776709K171522P076319N169854Q70981n319075j1988098
$$ 12881272 4369493 -2407216 -235694 6840625 12010479 12881460 7562385 -4425713
38167d425713r429438N778791J6876613P388529j1033615j3477053j42401N266120
$$ -4425713 -13855151 -8076360 8800253 16188782 5155167 -8321886 -8464287 -3198167
38159c198167m789350j0908334j657552P225553J129300q186635k746008J2275817
$$ -3198167 -7987517 -18895851 -20553403 -13327850 -12198550 -20385185 -23131193 -10855376
38151a0855376J7659541Q584670k738739o801732m877022j081517J886114J493672
$$ -10855376 6804165 15388835 12650096 5848364 971342 -110175 1775939 3269611
38143C269611j268876m85587N300365P318215j164421j1830894j0819655K039009
$$ 3269611 2000735 1515148 6815513 14133728 12969307 1138413 -9681242 -7642233
38135g642233J3901956J6777737J3860624Q457746j541671j4537726k0539488
$$ -7642233 6259723 23037460 36898084 45355830 43814159 29276433 8736945
38128H736945j2788279J092784O723784L16698p434734o035139P25472k3093j1552298
$$ 8736945 -4051334 -2958550 3765234 4081932 -3352802 -9387941 -8662469 -8685562 -20237860
38119b0237860k0238551j1944255P942265J9269463J2400652n47325l923482J156753
$$ -20237860 -40476411 -52420666 -44478401 -25208938 -12808286 -13355611 -17279093 -16122340
38111a6122340L114660n04271j858059J162976Q83699n541374q875960j309940
$$ -16122340 -13007680 -13511951 -15370010 -14207034 -13323335 -18864709 -27740669 -29050609
38103b9050609J1046957J6491718J2715391O034721M27545m148461n620482j551378
$$ -29050609 -18003652 -1511934 11203457 17238178 17665723 13517262 7896780 6345402
38095F345402L637060K548327l104712l714348K332715M029892n295168j5601688
$$ 6345402 9982462 12530789 9426077 5711729 8044444 12074336 6779168 -8822520
38087h822520j3684948k652026K945812j643874o166314j746282P348907J1321869
$$ -8822520 -22507468 -25159494 -22213682 -23857556 -30023870 -31770152 -24421245 -13099376
38079a3099376P324675R35893q55542L425012P253210K138038j0144532j5677917
$$ -13099376 -5774701 -4838808 -5694350 -2269338 4983872 7121910 -3022622 -18700539
38071a8700539n946364P697908Q353766j317184l627845M826526P129278n072678
$$ -18700539 -24646903 -16948995 -8595229 -9912413 -13540258 -8713732 -1584454 -6657132
38063f657132j5657513q894078N768056R818129M661433N781802J4941896J7830218
$$ -6657132 -22314645 -31208723 -25440667 -15622538 -10961105 -5179303 9762593 27592811
38055B7592811Q261075k483461l265801K696382M851676j879813j3179142j8645441
$$ 27592811 35853886 33370425 30104624 32801006 37652682 35772869 22593727 3948286
38047C948286j0732407M505880J1068336M150815j337927N858118J2539421R12065
$$ 3948286 -6784121 -2278241 8790095 12940910 11602983 17461101 30000522 30912587
38039C0912587j9606806k3099239o137816Q250497O604750K97562n2562n77502
$$ 30912587 11305781 -11793458 -17931274 -9680777 -3076027 -2778465 -2831027 -3408529
38031c408529n400346n267082K686981N232452k796959n603441N557188J2246368
$$ -3408529 -8808875 -14075957 -11388976 -6156524 -8953483 -14556924 -8999736 3246632
38023C246632j851271j9814745j5612029M281751J2036461K872602j983572N377944
$$ 3246632 1395361 -18419384 -34031413 -29749662 -17713201 -14840599 -16824171 -11446227
38015a1446227P509537n836208j9150010j5377158O09817J2891176J4139176O387687
$$ -11446227 -3936690 -9772898 -28922908 -44300066 -43690249 -30799073 -16659897 -10272210
38007a0272210m810566j0541274m844834M874399O412529L311711R688002K1932266
$$ -10272210 -15082776 -25624050 -30468884 -25594485 -19181956 -15870245 -6182243 15750023
37999A5750023J8184150n230521k1131639j1142742M684759K82351j3980477j0598818
$$ 15750023 33934173 28703652 7572013 -3570729 1114030 1396381 -12584096 -23182914
37991b3182914O496383P642105j1528168k0969437n130042J2590879R767127K65995
$$ -23182914 -16686531 -9044426 -20572594 -41542031 -46672073 -34081194 -24314067 -24048072
37983b4048072O771244K0439370J6666985k277300j1094771l258513R04809r290094
$$ -24048072 -17276828 3162542 19829527 17552227 6457456 3198943 4103752 -5186342
$$ [...]
##END NTUPLES=NMR SPECTRUM
##END=
