##TITLE=31Pdec_LR-657-RM2
 CH2Cl2, 72 sc
 4.3.2019
##JCAMPDX= 6.0         $$ Bruker NMR JCAMP-DX V2.0
##DATA TYPE= NMR SPECTRUM
##DATA CLASS= NTUPLES
##ORIGIN= UXNMR, Bruker Analytische Messtechnik GmbH
##OWNER= root
$$ XWIN-NMR		Version 3.5
$$ Mon Mar  4 14:38:17 2019 Russian Standard Time (UT+4h)  she@DPX200
##.OBSERVE FREQUENCY= 81.013821
##.OBSERVE NUCLEUS= ^31P
##.ACQUISITION MODE= SIMULTANEOUS
##.ACQUISITION SCHEME= undefined
##.AVERAGES= 72
##.DIGITISER RES= 17
##SPECTROMETER/DATA SYSTEM= spect
##.PULSE SEQUENCE= zgpg30
##.SOLVENT NAME= CDCl3
##.SHIFT REFERENCE= (INTERNAL, CDCl3, 0, 182.463)
##AUDIT TRAIL= $$ (NUMBER, WHEN, WHO, WHERE, WHAT)
$$ ##TITLE= Audit trail, XWIN-NMR		Version 3.5
$$ ##JCAMPDX= 5.01
$$ ##ORIGIN= Bruker BioSpin GmbH
$$ ##OWNER= she
$$ F:/spectra/data/she/nmr/P31/1/pdata/1/auditp.txt
$$ ##AUDIT TRAIL=  $$ (NUMBER, WHEN, WHO, WHERE, WHAT)
(   1,<2019-03-04 14:36:26.04 +0400>,<she>,<DPX200>,
      <continue with go, POWCHK disabled, PULCHK disabled
       configuration hash MD5:
       00 E9 B6 7A A2 85 ED C7 34 08 36 98 17 FE 4E 26
       data hash MD5: 32K
       DE 94 C3 DA BE C6 B5 AB B5 98 66 7B A8 57 A3 05>)
(   2,<2019-03-04 14:37:14.37 +0400>,<she>,<DPX200>,
      <Start of raw data processing
       efp BC_mod = 2 LB = 1 FT_mod = 6 PKNL = 1 PHC0 = -1462.847 PHC1 = 74.79891 SI = 64K 
       data hash MD5: 64K
       AC 2F C3 41 7F B7 B7 71 21 7D F4 BA A0 F3 73 2A>)
(   3,<2019-03-04 14:37:37.98 +0400>,<she>,<DPX200>,
      <pk PHC0 = 7.113513 PHC1 = 2.4 
       data hash MD5: 64K
       4B F1 84 49 57 6B 8E 70 67 78 38 68 27 BF 44 B1>)
$$ ##END=
$$ 
$$ hash MD5
$$ 88 4E 0F D4 51 37 4D 8E 68 5C 0D 54 6C 58 41 F4
##$RELAX= 
##$RELAX= 
##$RELAX= 
##$RELAX= 
##$RELAX= 
##$RELAX= 
##$RELAX= 
##$RELAX= 
$$ Bruker specific parameters
$$ --------------------------
##$DU= <F:/spectra>
##$EXPNO= 1
##$NAME= <P31>
##$PROCNO= 1
##$TYPE= <nmr>
##$USER= <she>
##$AMP= (0..31)
100 100 100 100 100 100 100 100 100 100 100 100 100 100 100 100 100 100 
100 100 100 100 100 100 100 100 100 100 100 100 100 100 
##$AQSEQ= 0
##$AQ_mod= 1
##$AUNM= <au_zg>
##$AUTOPOS= <>
##$BF1= 81.014009
##$BF2= 200.13
##$BF3= 200.13
##$BF4= 200.13
##$BF5= 200.13
##$BF6= 200.13
##$BF7= 200.13
##$BF8= 200.13
##$BYTORDA= 1
##$CFDGTYP= 0
##$CFRGTYP= 5
##$CHEMSTR= <none>
##$CNST= (0..31)
1 1 145 1 1 1 1 1 1 1 1 1 1 1 1 1 1 1 1 1 1 1 1 1 1 1 1 1 1 1 1 1 
##$CPDPRG= <waltz16>
##$CPDPRG1= <>
##$CPDPRG2= <waltz16>
##$CPDPRG3= <>
##$CPDPRG4= <mlev>
##$CPDPRG5= <mlev>
##$CPDPRG6= <mlev>
##$CPDPRG7= <mlev>
##$CPDPRG8= <mlev>
##$CPDPRGB= <>
##$CPDPRGT= <>
##$D= (0..31)
0 1 0 0 0 0 0 0 0 0 0 0.03 2e-05 3e-06 0 0 0 0 0 0 0 0 0 0 0 0 0 0 0 0 
0 0 
##$DATE= 1551695675
##$DBL= (0..7)
120 120 120 11 120 120 24 19 
##$DBP= (0..7)
150 150 150 150 150 150 150 150 
##$DBP07= 0
##$DBPNAM0= <>
##$DBPNAM1= <>
##$DBPNAM2= <>
##$DBPNAM3= <>
##$DBPNAM4= <>
##$DBPNAM5= <>
##$DBPNAM6= <>
##$DBPNAM7= <>
##$DBPOAL= (0..7)
0.5 0.5 0.5 0.5 0.5 0.5 0.5 0.5 
##$DBPOFFS= (0..7)
$$ [...]
##$SUBNAM2= <"">
##$SUBNAM3= <"">
##$SUBNAM4= <"">
##$SUBNAM5= <"">
##$SUBNAM6= <"">
##$SUBNAM7= <"">
##$SUBNAM8= <"">
##$SUBNAM9= <"">
##$SW= 369.568048894756
##$SWIBOX= (0..15)
0 1 3 0 0 0 0 0 0 0 0 0 0 0 0 0 
##$SW_h= 29940.119760479
##$TD= 32768
##$TD0= 1
##$TE= 0
##$TE2= 300
##$TE3= 300
##$TEG= 300
##$TL= (0..7)
0 120 53 12 22 120 120 120 
##$TP= (0..7)
150 150 150 150 150 150 150 150 
##$TP07= 0
##$TPNAME0= <>
##$TPNAME1= <>
##$TPNAME2= <>
##$TPNAME3= <>
##$TPNAME4= <>
##$TPNAME5= <>
##$TPNAME6= <>
##$TPNAME7= <>
##$TPOAL= (0..7)
0.5 0.5 0.5 0.5 0.5 0.5 0.5 0.5 
##$TPOFFS= (0..7)
0 0 0 0 0 0 0 0 
##$TUNHIN= 0
##$TUNHOUT= 0
##$TUNXOUT= 0
##$USERA1= <user>
##$USERA2= <user>
##$USERA3= <user>
##$USERA4= <user>
##$USERA5= <user>
##$V9= 5
##$VALIST= <valist>
##$VCLIST= <CCCCCCCCCCCCCCC>
##$VD= 0
##$VDLIST= <DDDDDDDDDDDDDDD>
##$VPLIST= <PPPPPPPPPPPPPPP>
##$VTLIST= <TTTTTTTTTTTTTTT>
##$WBST= 1024
##$WBSW= 4
##$XGAIN= (0..3)
0 0 0 0 
##$XL= 0
##$YL= 0
##$YMAX_a= 31966
##$YMIN_a= -44178
##$ZGOPTNS= <>
##$ZL1= 120
##$ZL2= 120
##$ZL3= 120
##$ZL4= 120
##$ABSF1= 0
##$ABSF2= 0
##$ABSG= 0
##$ABSL= 0
##$ALPHA= 0
##$AQORDER= 0
##$ASSFAC= 0
##$ASSFACI= 0
##$ASSFACX= 0
##$ASSWID= 0
##$AUNMP= <proc_1d>
##$AZFE= 0.1
##$AZFW= 0.5
##$BCFW= 0
##$BC_mod= 2
##$BYTORDP= 0
##$COROFFS= 0
##$CY= -3
##$DATMOD= 1
##$DC= 0
##$DFILT= <>
##$DTYPP= 0
##$F1P= 0
##$F2P= 0
##$FCOR= 1
##$FTSIZE= 65536
##$FT_mod= 6
##$GAMMA= 0
##$GB= 0
##$INTBC= 1
##$INTSCL= 5.30512e-09
##$ISEN= 30
##$LB= 1
##$LEV0= 0
##$LPBIN= 0
##$MAXI= 10000
##$MC2= 0
##$MEAN= 0
##$ME_mod= 0
##$MI= 50
##$NCOEF= 0
##$NC_proc= -8
##$NLEV= 6
##$NOISF1= 182.463
##$NOISF2= 159.3651
##$NSP= 0
##$NTH_PI= 0
##$NZP= 0
##$OFFSET= 182.463
##$PC= 4
##$PHC0= -1455.734
##$PHC1= 77.19891
##$PH_mod= 1
##$PKNL= yes
##$PPARMOD= 0
##$PSCAL= 0
##$PSIGN= 0
##$REVERSE= no
##$SF= 81.0140089999434
##$SI= 65536
##$SIGF1= 159.3651
##$SIGF2= -187.1042
##$SINO= 113.3802
##$SIOLD= 16384
##$SREGLST= <1H.CDCl3>
##$SSB= 0
##$STSI= 65536
##$STSR= 0
##$SW_p= 29940.119760479
##$SYMM= 0
##$S_DEV= 0
##$TDeff= 32768
##$TDoff= 0
##$TI= <>
##$TILT= no
##$TM1= 0
##$TM2= 0
##$TOPLEV= 0
##$USERP1= <user>
##$USERP2= <user>
##$USERP3= <user>
##$USERP4= <user>
##$USERP5= <user>
##$WDW= 1
##$XDIM= 65536
##$YMAX_p= 453742920
##$YMIN_p= -204432387
$$ End of Bruker specific parameters
$$ ---------------------------------
##NTUPLES= NMR SPECTRUM
##VAR_NAME=  FREQUENCY,     SPECTRUM/REAL,   SPECTRUM/IMAG
##SYMBOL=    X,             R,               I
##VAR_TYPE=  INDEPENDENT,   DEPENDENT,       DEPENDENT
##VAR_FORM=  AFFN,          ASDF,            ASDF
##VAR_DIM=   65536,         65536,           65536
##UNITS=     HZ,            ARBITRARY UNITS, ARBITRARY UNITS
##FACTOR=    0.456856943014862, 1,           1
##FIRST=     14782.0589164792, 0,            0
##LAST=      -15158.0608439998, 0,           0
##MIN=       -15158.0608439998, -204432387,  0
##MAX=       14782.0589164792, 453742920,    0
$$ Real data points
##PAGE= N=1
##DATA TABLE= (X++(R..R)), XYDATA
$$ [...]
44492h453088J2611274O098040j979322m848762n265171n732786j992830O349356
44484c213289R052446m46785j1427166q589015N484530J2423707K409933j3394600
44476g700239j6973802l534292J4914589K2267689J3326270j792196q359113k824125
44468I324781M893550N780297K479415J877022L723580L873362L552521O183666
44460D1688194Q343341M005235l933895p043622n739403q474429j5209468j4761698
44452a125745l302298P357073P671348M534813O913154Q446281o95346j2537808
44444A7261472j0429883L138090P518368m448108j4899885q925633L339044N132152
44436b314383p35305n55712N333768N223265j142021j954390M282111M404740
$$ plain form
44492 -8453088 4158186 10256226 8276904 3428142 -1837029 -7569815 -9562645 -3213289
44484 -3213289 5839157 5392372 -6034794 -14623809 -9139279 3284428 5694361 -7700239
44476 -7700239 -24674041 -28208333 -13293744 8973945 22300215 20508019 12148906 9324781
44468 9324781 14218331 19998628 22478043 24355065 28078645 31952007 35504528 41688194
44460 41688194 50031535 54036770 50102875 43059253 37319850 28845421 13635953 -1125745
44452 -1125745 -4428043 2929030 10600378 15135191 22048345 30494626 29799280 17261472
44444 17261472 6831589 9969679 17488047 13039939 -1859946 -10785579 -7446535 -2314383
44436 -2314383 -3049688 -3605400 1728368 6951633 5809612 3855222 8137333 12542073
44428A2542073o955883j7030037j4458802n426000j082551l28335M101303J0900963
44420a7737269J2783625Q488091K561169k866200p970568j0682805r342077o105549
44412c0871583k111743N121703J3784233J5199760O974619n4261K033935M607806
44404A4684469k062118r261642l154972R375272R324227k561804n495174P073596
44396A7921854J5782532O058862r897611j3787687p118029k412429j608282J700840
44388F640050P272604R236061O310630N16700q065525j6288237j5637974m747157
44380a4762848M101516J575748m222967j614568N402715N915286K018886L475940
44372A889708Q325831O727142P39065J441212P023984L223775j1525643k0143387
$$ plain form
44428 12542073 5586190 -11443847 -25902649 -31328649 -32411200 -32739535 -28638232 -17737269
44420 -17737269 -4953644 3534447 6095616 3229416 -4741152 -15423957 -24766034 -30871583
44412 -30871583 -32983326 -27861623 -14077390 1122370 8096989 8042728 10076663 14684469
44404 14684469 12622351 3360709 205737 9581009 18905236 16343432 10848258 17921854
44396 17921854 33704386 39763248 29865637 16077950 8959921 6547492 4939210 6640050
44388 6640050 13912654 23148715 29459345 29976045 21910520 5622283 -10015691 -14762848
44380 -14762848 -10661332 -9085584 -13308551 -14923119 -9520404 -3605118 -1586232 1889708
44372 1889708 10215539 16942681 17681746 19122958 26146942 29370717 17845074 -2298313
44364b298313j2505436n63398Q94457n040012o119243M3452O171747P503242M774593
44355g138911k1559m014894l811944k59909J648616N38013J88680J090923j220648
44346a3001633o147298n952566J499874P916321Q306526Q654669J2220326J0042337
44338B3538556l600138j6700405j4631288k098699N016823L774005L713716O388245
44330E400815L777971l286402l988886K088137J899608p428140r897858M014007
44322g420748J9260812J7536497M127229k851623p53366j476140p461874q535325
44314A2425462k730277r46560o237654o275670M812787J2800507M466253r619022
44306H695826r566191L505684R266282j134404j3387916j2769018l526736K229630
$$ plain form
44364 -2298313 -14803749 -15367147 -14472690 -19512702 -25631945 -25588493 -19416746 -11913504 -7138911
44355 -7138911 -7160470 -11175364 -14987308 -15247217 -13598601 -13060588 -12871908 -11780985 -13001633
44346 -13001633 -19148931 -25101497 -23601623 -15685302 -7378776 1275893 13496219 23538556
44338 23538556 19938418 3238013 -11393275 -13491974 -8475151 -4701146 -987430 5400815
44330 5400815 9178786 5892384 1903498 3991635 5891243 -1536897 -11434755 -7420748
44322 -7420748 11840064 29376561 33503790 30652167 29898801 28422661 20960787 12425462
44314 12425462 9695185 8748625 2510971 -3764699 1048088 13848595 18314848 8695826
44306 8695826 -870365 2635319 11901601 10767197 -2620719 -15389737 -18916473 -16686843
44298a6686843L185540N579498Q884579O750969o12190n614512m701857j881645
44290e096461k7910L245269Q660214J1172944O617771k177957r173924j1350809
44282A869137q913556l607798N19253m68175l561259L75414J3375417K2720828
44274B2309261J4743486n830442j9482989j5430470k478271O139313Q802604R948179
44266A8720671P524762k580856j3811510j3739661k559619N112177R59027n425564
44258e800573k584545M878899M865673k429412n921591j974614J666447O75911
44250f623805L09215L585250M836522N25046l434419j989192l0979l267727p227590
44241a3317679m282796L662296Q287019O576976J386891n361597j1370550j0154521
$$ plain form
44298 -16686843 -13501303 -7921805 962774 7713743 7101553 1487041 -3214816 -5096461
44290 -5096461 -5124371 -1879102 6781112 17954056 24571827 22393870 13219946 1869137
44282 1869137 -7044419 -10652217 -10132964 -10601139 -14162398 -13786984 -411567 22309261
44274 22309261 37052747 31222305 11739316 -3691154 -6169425 -30112 8772492 18720671
44266 18720671 26245433 23664577 9853067 -3886594 -6446213 -1334036 -375009 -5800573
44258 -5800573 -8385118 -3506219 1359454 -1069958 -6991549 -8966163 -7299716 -6623805
44250 -6623805 -6314590 -2729340 2107182 2632228 -802191 -2791383 -2822362 -6090089 -13317679
44241 -13317679 -17600475 -13938179 -5651160 925816 2312707 -3048890 -14419440 -24573961
44233b4573961J271916J3583531J4442845N208356j686868q45468J396936J46101
44225H943388j773873k491246m899809q369407o602929J736806Q527312O807724
44217A877966o97831o828254p556937k720129L858394M461002l974487j1694177
44209b3274453p103219M383136O148709l472126p318809L283745J4883933J4455256
44201A986172Q372820O559583L990333o091348j4526570j0340218j521313k191357
44193a3761898p883563m363961N649224O843891j266803l859432K991070P682641
44185g968831N954408O391323R644514M365878r499078j4629739l345380Q132510
44177i54395M140736p859317j1717334n830487Q15094M282430N175245K432662
$$ plain form
44233 -24573961 -23302045 -9718514 4724331 9932687 8245819 7400351 8797287 8943388
44225 8943388 7169515 4678269 -221540 -8590947 -15193876 -13457070 -4929758 1877966
44217 1877966 1180135 -5648119 -13205056 -15925185 -12066791 -7605789 -11580276 -23274453
44209 -23274453 -30377672 -25994536 -19845827 -23317953 -30636762 -27353017 -12469084 1986172
44201 1986172 10358992 16918575 20908908 14817560 290990 -10049228 -11570541 -13761898
44193 -13761898 -21645461 -26009422 -20360198 -13516307 -14783110 -18642542 -15651472 -7968831
44185 -7968831 -2014423 4376900 14021414 18387292 8888214 -5741525 -9086905 -954395
44177 -954395 3186341 -4672976 -16390310 -22220797 -21405703 -17123273 -11948028 -9515366
44169i515366j479454J107353R594915J0748710j484160j3117917r551839K764437
44161a0933321P896423M091434Q12444J37291k711531n781476l172726K008155
44153g653307J762464k578956l316299l29128P00519K90361K319696L408646q18601
44144f214605l316825M649571J4997942J1829107k740334j0589280n880636j706983
44136A027957n425556p370491p61399N689146M281450J254977K841472K830540
44128D368096m351069j0493803n976973M285364Q895068O081406J462764k669085
44120A601768n850838m411259K339694P372709O007970L560781M784108M587504
44112A9992437j092202m998786j133150K025120m511390j1619218n051673Q777948
$$ plain form
44169 -9515366 -10994820 -9887467 -292552 10456158 8971998 -4145919 -13697758 -10933321
44161 -10933321 -3036898 1054536 1866980 2004271 -707260 -6488736 -9661462 -7653307
44153 -7653307 -5890843 -8469799 -11786098 -12115226 -11414707 -11124346 -8804650 -5396004 -6214605
44144 -6214605 -9531430 -4881859 10116083 21945190 19204856 8615576 2734940 1027957
44136 1027957 -4397599 -11768090 -12529489 -6840343 -2558893 -1303916 1537556 4368096
44128 4368096 17027 -10476776 -16453749 -12168385 -3273317 2808089 4270853 1601768
44120 1601768 -4249070 -8660329 -6320635 1052074 7060044 10620825 15404933 19992437
44112 19992437 18900235 13901449 12768299 14793419 10282029 -1337189 -6388862 2389086
44104B389086R940977l654833j2384308n094636N933195O526330K66639k327169
44096A595281k31838K720606P325922J2842347J1025616j730446j3816915j2439239
44088G291334k575420J154751k521238j650288O343638Q368258k667878j3706867
44080C6290r141458O400807J4584706Q001162l589744j0155485j2240024j2423492
44072a8527238p470118L957032J3617054J2612969M036996j336097L38042L165226
44064A0393866J807245k865810p742321r916793n820574M234285J0913112M521873
44056E524883r719812j4801838l728531J1103137J4953043P918057j092378q262889
44048A893672j3700144j3493104l978101R102290J5187965J1597411M564757q06849
$$ plain form
44104 2389086 12330063 8675230 -3709078 -8803714 -2870519 3655811 3922450 1595281
44096 1595281 1363443 4084049 11409971 24252318 35277934 33547488 19730573 7291334
44088 7291334 4715914 5870665 3349427 1699139 8042777 16411035 13743157 36290
44080 36290 -9105168 -2704361 11880345 19881507 16291763 6136278 -6103746 -18527238
44072 -18527238 -25997356 -22040324 -8423270 4189699 8226695 6890598 7228640 10393866
44064 10393866 12201111 9335301 1592980 -8323813 -14144387 -9910102 1003010 5524883
44056 5524883 -4194929 -18996767 -22725298 -11622161 3330882 11248939 10156561 1893672
44048 1893672 -11806472 -25299576 -29277677 -20175387 -4987422 6609989 11174746 10367897
44040A0367897m790073q298032j0158203r139091m875995J914051P550793P272114
44032a0156539K163502n76927J903609L330867j195917o706171o492070j748925
44024a9478571L631232R810153J4517968R395333o136683j6731535j0587384J440643
44016a4138844K118040m929785l803525M036833K436258q395252r000187O350546
44008b5325916J7986499J1625413m57378j371924N474952P434423L630042M95323
44000A9491434j739642m831965n239741k495471l685599q735795m668051J2281444
43992C76614K3165106J1984679p787447j2300195k899443k18183r071124j3386328
43984a0136321n245294L907964M548321J906190J982454J353211k541895m662818
$$ plain form
44040 10367897 5577824 -2720208 -12878411 -22017502 -26893497 -24979446 -17428653 -10156539
44032 -10156539 -7993037 -8569964 -6666355 -3335488 -4531405 -11237576 -17729646 -19478571
44024 -19478571 -15847339 -6037186 8480782 17876115 11739432 -4992103 -15579487 -14138844
44016 -14138844 -12020804 -16950589 -20754114 -16717281 -14281023 -22676275 -31676462 -25325916
44008 -25325916 -7339417 4285996 3828618 2456694 7931646 15366069 18996111 19491434
44000 19491434 17751792 12919827 7680086 5184615 1499016 -7236779 -11904830 376614
43992 376614 23541720 35526399 27738952 15438757 12539314 12321131 3250007 -10136321
43984 -10136321 -15381615 -11473651 -6925330 -5019140 -3036686 -1683475 -4225370 -8888188
43976h888188k270368k68884j673891k921567j937086l43646M114269J4576850
43968C87489K2374508J2930637j0239146k3579802j4507114O84572J627176p390564
43960a7712244q894582j253769K777166O94617L151711J2036163J4587451M819821
43952A0206334n052432l579470K086612p70401q363366o186368O317780J2606296
43944G264985L797074p249251n136273N120151O947120j505953n069469L815001
43936G983385J2872482Q736667l605363r710641o368552k559068l799019o288728
43928b738837n967900m318993l674323l146732j068628K399261N738794O733746
43920f043612L902771n17993j956837m91967j839987p437800r431141j913783
$$ plain form
43976 -8888188 -11158556 -11427440 -13101331 -16022898 -17959984 -18303630 -14189361 387489
43968 387489 22761997 35692634 25453488 1873686 -12633428 -11948856 -10321680 -17712244
43960 -17712244 -26606826 -27860595 -25083429 -24388812 -21237101 -9200938 5386513 10206334
43952 10206334 5153902 1574432 3661044 2890643 -5472723 -11659091 -5341311 7264985
43944 7264985 11062059 3812808 -1323465 3796686 10743806 9237853 4168384 7983385
43936 7983385 20855867 29592534 25987171 16276530 9907978 7348910 3549891 -2738837
43928 -2738837 -8706737 -13025730 -16700053 -19846785 -20915413 -18516152 -12777358 -6043612
43920 -6043612 -2140841 -2658834 -4615671 -5107638 -6947625 -14385425 -23816566 -25730349
43912b5730349Q207637R581752J670649o394983q573437n392103J323413Q080341
43904a7227080P828327j593092j0332739q087592P19707M469283K905704M483297
43896a6834185Q237060M590893n657819r809883l501846L151036L580844L628681
43888a2615219P209243Q132240K976546j657532j777730k563595n420045k721902
43880h437994O246419Q799228j262736j1108703q118742J219421M595976L583386
43872d483745N250381N460875k323995j0191520n822254O076872R750873K370852
43864F088339m327811m057810j751170m63938K039052L429363j736615r421395
43856a0201985q806190K68087N593241J169609m925263m942609j912708p14165
$$ plain form
43912 -25730349 -17522712 -7940960 -6270311 -12665294 -21238731 -26630834 -25307421 -17227080
43904 -17227080 -9398753 -10991845 -21324584 -29412176 -28692469 -24223186 -21317482 -16834185
43896 -16834185 -8597125 -4006232 -9664051 -19473934 -22975780 -19824744 -16243900 -12615219
43888 -12615219 -5405976 2726264 5702810 4045278 2267548 -296047 -5716092 -8437994
43880 -8437994 -2191575 6607653 5344917 -5763786 -13882528 -12663107 -8067131 -4483745
43872 -4483745 766636 6227511 3903516 -6288004 -12110258 -6033386 3717487 6088339
43864 6088339 1760528 -2297282 -4048452 -4512390 -2473338 956025 -780590 -10201985
43856 -10201985 -19008175 -18740088 -13146847 -11977238 -16902501 -21845110 -23757818 -24471983
43848b4471983N98500M172269N799185K172745j542321J415175Q534249J0319930
43840F997749K439116q724146j3380039r201267k943318o89014K45563M953733
43832b0301623R276808M126235p585327j0626844J20610R220762K595916j0968524
43824b4141987j3210570k699369P035308R412216R007753P797737L306083j128685
43816d621514O51409N097730L530206k077852k591702O08044k101319r126736
43808a0631734q408340Q75573N820732K257438Q04158N510022O105558q28109
43800A505298k781863N782892J0406983O60694r732347m097380R416667J0745996
43792B1906940n49383o862680j476314L189814k851546j2721894j4054764n050679
$$ plain form
43848 -24471983 -23873483 -19701214 -13902029 -11729284 -13271605 -11856430 -3322181 6997749
43840 6997749 9436865 712719 -12667320 -21868587 -24811905 -25500919 -25255356 -20301623
43832 -20301623 -11024815 -6898580 -14483907 -25110751 -24990141 -15769379 -13173463 -24141987
43824 -24141987 -37352557 -40051926 -33016618 -23604402 -14596649 -6798912 -3492829 -4621514
43816 -4621514 -3970105 1127625 4657831 2579979 -11723 596321 -1504998 -10631734
43808 -10631734 -19040074 -18164501 -12343769 -10086331 -9282173 -3772151 2333407 1505298
43800 1505298 -1276565 4506327 14913310 15574004 5841657 1744277 11160944 21906940
43792 21906940 21357557 14494877 13018563 16208377 13356831 634937 -13419827 -18470506
43784a8470506N181915P741352L349134J350557P170887J2091326L595790j3483873
43776H526582j8754895m450136J1974972J2954463M925358L636209P450255L479564
43768B9742372p375880j1613759o507573k959366m635877k832118M546976O542855
43760D907630j671391q522339m113388L901173L316733l276877m326107J434225
43752h350341M353942Q79626p48578N396713J2310542R646544j083891q256044
43744A4148513o165410k213560n341162j2865280j4378299o017570N141356J0058828
43736a7632584N877169l810405j1085181p501259O954522J9459713J7332245N070308
43728A4664528j620776J007398P65361p947574j2831761l665242R663797J1417753
$$ plain form
43784 -18470506 -13288591 -5547239 -2198105 -847548 6323339 18414665 22010455 8526582
43776 8526582 -10228313 -14678449 -2703477 10250986 15176344 18812553 26262808 29742372
43768 29742372 22366492 10752733 4245160 1285794 -3350083 -6182201 -1635225 4907630
43760 4907630 3236239 -5286100 -9399488 -5498315 -2181582 -5458459 -9784566 -8350341
43752 -8350341 -3996399 -3116773 -3865351 1531362 13841904 23488448 22404557 14148513
43744 14148513 7983103 5769543 428381 -12436899 -26815198 -32832768 -27691412 -17632584
43736 -17632584 -11755415 -15565820 -26651001 -34152260 -27197738 -7738025 9594220 14664528
43728 14664528 13043752 14051150 14816511 6868937 -5962824 -9628066 35731 11453484
43720A1453484K578699l992323l687980j944518r42134K139057O180707O929625
43712A8714617M712782J811166m118864j3672682j7328956o207328J1290147J6786513
43704A1987395N741704p818695j0855125m531942L289984Q351334J0037912Q835419
43696B5037986O224369K816701k440799p666044p544187k702388k098835q319926
43688C306877r951246J50232R244288K862595j0485382j1744734j611279L174468
43680a5054181m52198L78878P947293R921735M182983K839870O756508J510028
43672A8030916j3636248j8606178n546799O116049J888639m889607M0083N382584
43664a1220561l135343j3642534p096749R410621J4325796N802307j069130k576336
$$ plain form
43720 11453484 14032183 10039860 6351880 4407362 3465228 5604285 11784992 18714617
43712 18714617 23427399 25238565 21119701 7447019 -9881937 -16089265 -4799118 11987395
43704 11987395 17729099 9910404 -944721 -5476663 -2186679 6164655 16202567 25037986
43696 25037986 31262355 34079056 31638257 23972213 16428026 13725638 11626803 3306877
43688 3306877 -6644369 -6494137 2750151 5612746 -4872636 -16617370 -18228649 -15054181
43680 -15054181 -15506379 -15127501 -7180208 2741527 6924510 9764380 16520888 18030916
43672 18030916 4394668 -14211510 -19758309 -13642260 -11753621 -16643228 -16603145 -11220561
43664 -11220561 -14355904 -27998438 -35095187 -25684566 -11358770 -5556463 -6625593 -9201929
43656i201929o426801r659676k386804R352844R357776r27291m186738K942684
43648a1135935O086006J437994K665099J3196798J5916108J315116j4988650j6112272
43640a619736p861594m463655n081461o76559O467066O879815J646048R95980
43632c714096P488849J2669453J0081285K455981m330097p645761p895149o552677
43624B557788n041269l649974k241940j896860k780059j104831O339107J4709819
43616F891781J5195032P548249P33308m83258n37956k297330k119692k77538m382245
43607B0270351j4735870j8159894p382835M323463K103108o058378j878233J1806402
43599i711886J3584838j835895j3338353n187657J0032196J2444689L438216k227678
$$ plain form
43656 -9201929 -15628730 -25288406 -27675210 -18322366 -8964590 -9891881 -14078619 -11135935
43648 -11135935 -5049929 -3611935 -946836 12249962 28166070 29481186 14492536 -1619736
43640 -1619736 -9481330 -13944985 -19026446 -19703005 -13235939 -6356124 -4710076 -3714096
43632 -3714096 3774753 16444206 26525491 28981472 24651375 17005614 9110465 2557788
43624 2557788 -2483481 -6133455 -8375395 -10272255 -13052314 -14157145 -7818038 6891781
43616 6891781 22086813 29635062 30368370 29885112 29347156 27049826 24930134 24652596 20270351
43607 20270351 5534481 -12625413 -20008248 -15684785 -13581677 -19640055 -21518288 -9711886
43599 -9711886 3872952 2037057 -11301296 -16488953 -6456757 5987932 9426148 7198470
43591G198470j446225j956295l196319K944025J3702597J5734334O012307l551042
43583C5441852n959564p641349j1545252q807674K695495P669625l979759j7061374
43575i188000j1801225N019342J0413251J004448m433254K416439Q002048L091208
43567D524257j988248J847603N738526O2143p494430n744349O83435J004828k815357
43558d181592j985604K434296L620467K874449M960134N907302J64670n926870
43550G867252l071886L793555L057969l668021o048521m918143q738058j3011587
43542b4737440m371669J4057590K2518613J3513540J039889l681545n608299q682231
43534D048448o045330K940696N520489k687632p006818J617535Q843200J89779
$$ plain form
43591 7198470 5752245 3795950 599631 3543656 17246253 32980587 38992894 35441852
43583 35441852 29482288 21840939 10295687 1488013 4183508 11853133 7873374 -9188000
43575 -9188000 -20989225 -15969883 -5556632 -4552184 -8985438 -6568999 1433049 4524257
43567 4524257 2536009 4383612 10122138 10184281 2689851 -3054498 -2371063 -1366235 -4181592
43558 -4181592 -6167196 -3732900 -112433 2762016 7722150 13629452 13794122 7867252
43550 7867252 4795366 8588921 11646890 7978869 1930348 -2987795 -11725853 -24737440
43542 -24737440 -29109109 -15051519 7467094 20980634 22020523 18338978 12730679 4048448
43534 4048448 -1996882 943814 6464303 3776671 -3230147 -1612612 7230588 7420367
43526G420367j3641661j3549715j409413P204045R191428J1703935J1803659J192096
43518A9914741j2668530j2815472j7912P249279J961359k708446J695882N013401
43510G624302j969284j0657532q615205J516028Q164502P425683L600170m67567
43502F621097m554311o811887n685494l258881j873037p03603R66202J617031
43494a3682883J771214M769375R476725Q486896j089358j0633745j0118807r92462
43486a2013045P150296R055140O606245K413444k145436m110875j266038K869123
43478H558854K528807j456781k197209K762397P222337N063037j638496o641440
43470A4201506p835976p156909m897837K53527N741697N459637j837589q515512
$$ plain form
43526 7420367 -6221294 -19771009 -21180422 -13976377 -4784949 6918986 18722645 19914741
43518 19914741 7246211 -5569261 -5587173 1662106 3623465 915019 2610901 7624302
43510 7624302 5655018 -5002514 -13617719 -12101691 -3937189 3488494 7088664 6621097
43502 6621097 2066786 -4745101 -10430595 -13689476 -15562513 -16266116 -15299914 -13682883
43494 -13682883 -11911669 -7142294 2334431 10821327 9731969 -901776 -11020583 -12013045
43486 -12013045 -4862749 4192391 10798636 13212080 11066644 6955769 5689731 8558854
43478 8558854 11087661 9630880 7433671 10196068 17418405 22481442 20842946 14201506
43470 14201506 6365530 -791379 -5689216 -5435689 306008 5765645 3928056 -4587456
43462d587456o639625J557246O592474M639430K111921N394592J0724027Q757540
43454B8550149k672310j4739450j6906738p520492N224935J1252612P361225p91815
43446I758116n153708l522068j36458J522381L009304O106096P340056J770064
43438B0693783q828020j5922602j3292234l505230N598003R076839Q466115Q020966
43430A0307620Q548334O186527j655115j0497123j2255295n087705L616235N749109
43422D912587J071724m445465n690381j632447N169894R411568O477252j716532
43414A3558200p033871m429099J902547M872180L535416J622022L64286j820265
43406A2571416m359037m433687j278724L048739O263858O789249M338602J703532
$$ plain form
43462 -4587456 -11227081 -9669835 -3077361 1562069 3673990 9068582 19792609 28550149
43454 28550149 25877839 11138389 -5768349 -13288841 -8063906 3188706 10549931 9758116
43446 9758116 4604408 1082340 945882 2468263 5477567 11583663 18923719 20693783
43438 20693783 11865763 -4056839 -17349073 -20854303 -15256300 -6179461 2286654 10307620
43430 10307620 18855954 25042481 23387366 12890243 634948 -4452757 -836522 4912587
43422 4912587 5984311 1538846 -4151535 -5783982 -614088 8797480 15274732 13558200
43414 13558200 6524329 2095230 3997777 8869957 12405373 14027395 14391681 12571416
43406 12571416 8212379 3778692 2499968 5548707 11812565 18601814 22940416 24643948
43398B4643948K276137L557223j073593j0414135j2930004l004066P934534O363517
43390A7353561l459400o579789j9972N328487L876234K015085M165480N660849
43382B8340535L330282J470631K557456K099831k430013o425022o184977l815365
43374A8943358p92448M294232Q378593M572831n424757r911533l329016O351679
43366B3082939J1450005J4167427J5843420R657903n750213j6920818j2437000
43359C9093663k92075M427491J375922N12713K360913j335466j0058464j3254906
43351B2829791p296984n15909P51405m375J738146M327130M733418L378798J633578
43342C1574998r4218p72713m3454n55748l921874n976509k104479M363957N596281
$$ plain form
43398 24643948 26920085 30477308 29403715 18989580 6059576 3055510 10990044 17353561
43390 17353561 13894161 7314372 7294400 12622887 16499121 18514206 22679686 28340535
43382 28340535 31670817 33141448 35698904 37798735 35368722 28943700 22758723 18943358
43374 18943358 18150910 22445142 30823735 35396566 29971809 20060276 16731260 23082939
43366 23082939 34532944 48700371 64543791 74201694 68451481 51530663 39093663
43359 39093663 38801588 43229079 44605001 45117714 47478627 46143161 36084697 22829791
43351 22829791 15532807 15016898 15768303 15763928 17502074 21829204 26562622 29941420 31574998
43342 31574998 31480780 30708067 30664613 30108865 26186991 20210482 18106003 22469960 28066241
43333B8066241j70484p508939j1418566j0192159l605875M975818Q015940K959401
43325A1121377j615035K477033R421391P735579j244620n496895j367162K551734
43317B3583402J077455j004177n15986j913046p425890j1121505p516564J195592
43309c640719R309722J2434964P787743k429924q517808l512010M978051L954324
43301B0364343n193704r143458m339492p01049j953120N54213R356618J3201586
43293B2145937N837718k682991k529314J843387L160507L126201L244125j910524
43285C2235046j1265070j1431587K695136J4974537J0225744k818525o366168
43278B8249113j40127L701010K331569J246099k71214m899090n859604K417696
$$ plain form
43333 28066241 27895757 20386818 8968252 -1223907 -4829782 146036 8161976 11121377
43325 11121377 9506342 11983375 21404766 29140345 27895725 22398830 21031668 23583402
43317 23583402 24660857 23656680 23140694 21227648 13801758 2680253 -4836311 -3640719
43309 -3640719 5669003 18103967 25891710 23461786 14943978 11431968 16410019 20364343
43301 20364343 15170639 6027181 1687689 986640 -966480 -412267 8944351 22145937
43293 22145937 27983655 25300664 22771350 24614737 27775244 30901445 34145570 32235046
43285 32235046 20969976 9538389 12233525 27208062 37433806 34615281 28249113
43278 28249113 28108986 31809996 34141565 35387664 35116450 30217360 24357756 26775452
43270B6775452R423537L051810q154284p663809O03767m90746r974227j0070523
43262C500977J641595P427650K72859n569429j506447J751623l221207o420753
43254b123132m22782N212419K332655p68649L784295P871424L088246k843450
43246A6131026q14833J802185n341522j5154981j3482179j905804O262687O815260
43238e688161O122207O357407L742791j152779l622056l115948j708966J804053
43230B738548P314415Q526120K298026l553817k020022R94900k002765m983883
43222I311522P86102Q004639K756181j1300770j6101658n746862O758299J0158968
43214D626421O854640K387118k288566n136814k794932J069950r68177o604653
$$ plain form
43270 26775452 36198989 39250799 31096515 23432706 24036473 23545727 13571500 3500977
43262 3500977 5142572 12570222 12843081 7273652 5767205 7518828 4297621 -2123132
43254 -2123132 -2545914 2666505 4999160 4230511 8014806 15886230 18974476 16131026
43246 16131026 15316193 17118378 11776856 -3378125 -16860304 -18766108 -12503421 -5688161
43238 -5688161 434046 6791453 10534244 9381465 5759409 2643461 934495 2738548
43230 2738548 10052963 18579083 20877109 17323292 15303270 16298170 14295405 9311522
43222 9311522 10097624 18102263 20858444 9557674 -6543984 -12290846 -5532547 4626421
43214 4626421 11481061 13868179 11579613 6442799 3647867 4717817 3749640 -2855013
43206b855013n786632K380928P892154O943392O753429J0219716J0187437L614353
43198C9349764k397034l802683n134209o761599j725638Q047097Q460444m341524
43190C1694618j3844942p296555M634549O290712J428745K372325O408227K781099
43182C4468778m567851k517986O377001N673891p476735j6258888r945609J526489
43174G279090N505613M210026N186473N961475n10010j1705143j7129820j1731908
43166a2934204r49814O517808O938747L647687L025608P034373R862207N255018
43158B8397430l558566o842144j922054K688053n32752p546077q697712j563422
43150D22756O546932P525204J168035m695066k371733O602661J2226829Q262778
$$ plain form
43206 -2855013 -8641645 -6260717 1631437 8574829 15328258 25547974 35735411 39349764
43198 39349764 36952730 33150047 28015838 21254239 19528601 27575698 36036142 31694618
43190 31694618 17849676 10553121 15187670 21478382 22907127 25279452 31687679 34468778
43182 34468778 29900927 27382941 33759942 39433833 31957098 15698210 5752601 7279090
43174 7279090 12784703 16994729 22181202 28142677 27632667 15927524 -1202296 -12934204
43166 -12934204 -13884018 -7366210 -427463 3220224 6245832 13280205 23142412 28397430
43158 28397430 24838864 17996720 16074666 18762719 18229967 10683890 1986178 422756
43150 422756 6969688 14494892 15662927 10967861 8596128 15198789 27425618 35688396
43142C5688396N56988j856593m70630l572300j0320765r950790M23556Q692443
43134A9190305N054968l193515l451511K827816L952503k501147o109589j87595
43126A5582235Q321984R148708J792313n976647q073150m322821K450402R207877
43118B8130901J2738607J0001870Q26108r375097j2080738m497727M701912L870566
43110C4316402n959187j0679721k697924O487869K010980j1260050j3659945J506002
43102F4426J7795449J7720717M642439m832725l090810K764931L895847o5544
43094C8894730l733038l163022O41114K714356q32162p088627q184150j372610
43086A7876591O132852O371032J470500L1585M761789R447380P624638o38813
$$ plain form
43142 35688396 36245384 34388791 33918161 30345861 20025096 10074306 10497862 19190305
43134 19190305 24245273 21051758 17600247 20428063 24380566 21879419 15769830 15582235
43126 15582235 23904219 33052927 34845240 28868593 20795443 16472622 18923024 28130901
43118 28130901 40869508 50871378 51697486 42322389 30241651 25743924 30445836 34316402
43110 34316402 28357215 17677494 14979570 21467439 23478419 12218369 -1441576 64426
43102 64426 17859875 35580592 40223031 35390306 32299496 35064427 38960274 38894730
43094 38894730 35161692 31998670 32639784 35354140 34521978 27433351 19249201 17876591
43086 17876591 24009443 30380475 31850975 31882560 36644349 46091729 53716367 53077554
43078E3077554j0215202j4848121j0556917J00456P878659N832947k216190p051420
43070B2001766o432762n793398p560562p652726l663146R96612L233371L861732
43062a009113L269065N37823j443662J810722O835302M559871m025161n641891
43054D892956N220758J5189702J0609081k581912r270337o904247l273806K4715
43046A3906910N879707Q547021L59934j0402549p602105N634757Q266066m907620
43038A9682121j1777020L513304K3846706K2599723J390058j4126888r889977
43031C5238027K602884O615785m6852p675222p376081J133522R285176P965907
43023D7743146n26573l672879L348998Q914923K648635o930364n606622K565091
$$ plain form
43078 53077554 42862352 28014231 17457314 17557770 25436429 31269376 29053186 22001766
43070 22001766 15569004 9775606 2215044 -5437682 -9100828 -8104216 -4870845 -1009113
43062 -1009113 2259952 2797775 1354113 3164835 10000137 14560008 10534847 4892956
43054 4892956 10113714 25303416 35912497 33330585 24060248 17156001 13882195 13906910
43046 13906910 19786617 28333638 28693572 18291023 10688918 16323675 24589741 19682121
43038 19682121 7905101 11418405 35265111 57864834 59254892 45128004 35238027
43031 35238027 37840911 44456696 44409844 36734622 29358541 30492063 39777239 47743146
43023 47743146 47216573 43543694 46892692 55807615 58456250 51525886 45919264 48484355
43015D8484355J581928q973019j1963253r86951Q179407K475932q120463p190268
43007B3487668L057992P674272L007077j19858M326842Q512620M013040n314257
42999D8645396r254321n040814M11634O63164k758006m618477m182158m661883
42991A9204535n498280j731006O366094R939576L863468l569909k035352M280097
42983C0819223K890146o434691j0862274n582109j420124o093472j1142319o302495
42975a4128115L874655Q351903O453902N262793O166714N290842L220859L260702
42967B7754255K670663l690780j2419665j4346894p748158N31622O720048J3148538
42959A2619629J8915949J7385808O158624p763591j5762602j5278025q813659
$$ plain form
43015 48484355 50066283 41093264 29130011 28143060 36322467 38798399 30677936 23487668
43007 23487668 26545660 34219932 37227009 37107151 41433993 49946613 53959653 48645396
42999 48645396 39391075 34350261 34761895 35425059 32667053 28048576 23866418 19204535
42991 19204535 13706255 11975249 18341343 28280919 32144387 28574478 26539126 30819223
42983 30819223 33709369 27274678 16412404 10830295 9410171 3316699 -7825620 -14128115
42975 -14128115 -10253460 -1901557 4552345 9815138 15981852 21272694 24493553 27754255
42967 27754255 30424918 26734138 14314473 -32421 -7780579 -7248957 -528909 12619629
42959 12619629 31535578 48921386 55080010 47316419 31553817 16275792 7462133
42952G462133j230000J689676j309415k850486M097437J3279751J1046307l083146
42944B9102257j2909712p483409M017874O898919J413658j427828J573903K918295
42936B4103957j668645o471933m501695L472917J0418591J0040860K098081o728031
42928C0764102q481386k743907K739041K652904Q83869K539129M701221K306052
42920C5361025j194446J404525P699158P684865l23515o415164m586212j228398
42912C8401838k873761m907936n42749O101828N856176m06817k885026J528701
42904D0272254M269540j778235j1373441j3485566n163597M842176N500288m495084
42896A8588335j3784598r178451Q433542K2119357J7679313J522784p771367m291339
$$ plain form
42952 7462133 6232133 7921809 6612394 3761908 7859345 21139096 32185403 29102257
42944 29102257 16192545 8709136 12727010 19625929 21039587 19611759 21185662 24103957
42936 24103957 22435312 15963379 11461684 14934601 25353192 35394052 37492133 30764102
42928 30764102 22282716 19538809 22277850 24930754 25814623 28353752 33054973 35361025
42920 35361025 34166579 35571104 43270262 50955127 50631612 44216448 39630236 38401838
42912 38401838 35528077 30620141 30077392 36179220 42035396 41628579 38743553 40272254
42904 40272254 44541794 42763559 31390118 17904552 12740955 17583131 23083419 18588335
42896 18588335 4803737 -4374714 4058828 26178185 43857498 45380282 37608915 33317576
42888C3317576n59716o136605j2694489q745375O42869J711626n575825p683415
42880e723354J11489O079040J355246n814729l580766N114556Q252424L327362
42872I121268r52123M01678K522950O26701k538126k269808R96937L430262K758628
42863A4098367o67093m515589m987971k24608N982609P896048N880905N732389
42855B9195057Q801562R064582L087854l412999l984898j051377q64296l249753
42847C7585732l880180l553217o271193r212553m481522P266534J4075293P890091
42839C9418985m684696j1924471j1075449o941913j967966M395921R593624R471783
42831B6285818N155117J616491j8597k028771k813479J485865P129663M161192
$$ plain form
42888 33317576 32757860 26621255 13926766 5181391 5824260 7535886 1960061 -5723354
42880 -5723354 -5611865 467175 1822421 -3992308 -7573074 -2458518 5793906 9121268
42872 9121268 8169145 8570823 11093773 11720474 9182348 6912540 7909477 11339739 14098367
42863 14098367 13431274 8915685 3927714 3703106 9685715 17581763 23462668 29195057
42855 29195057 37996619 47061201 50149055 46736056 42751158 41699781 40835485 37585732
42847 37585732 33705552 30152335 23881142 14668589 10187067 17453601 31528894 39418985
42839 39418985 34734289 22809818 11734369 4792456 2824490 7220411 16814035 26285818
42831 26285818 31440935 33057426 33038829 31010058 28196579 29682444 36812107 40973299
42823D0973299q206663j6491031j0228010K669941O918524J557878j94568Q193985
42815B5193355J6737049J3078977j551597j5008270j7463882q193577N943881
42808A8735936J4606794J0867390j143638q634199m730713K577458J436393p063494
42800B6651927j0636531l632682N352084O365859J246162j551715k39958n49231
42792B3005915m964834q411319o198268o27599L372751M921904N376123L198843
42784A9673516l346351r289931n821591P131401J6823582J1618811l816115j3233235
42776A9740087q063733L979824J0583290R031256N134626K792289P26064j807320
42768D2116383k225630O48686L068006N61177o024169j1104106j0263712l833452
$$ plain form
42823 40973299 32766636 16275605 6047595 8717536 15636060 17193938 16999370 25193355
42815 25193355 41930404 55009381 53457784 38449514 20985632 12792055 18735936
42808 18735936 33342730 44210120 43066482 34432283 29701570 32279028 33715421 26651927
42800 26651927 16015396 12382714 17734798 24100657 25346819 23795104 23555146 23005915
42792 23005915 18041081 9629762 3431494 2803895 6176646 11098550 16474673 19673516
42784 19673516 16327165 7037234 1215643 8347044 25170626 36789437 32973322 19740087
42776 19740087 11676354 15656178 26239468 35270724 40405350 43197639 43923703 42116383
42768 42116383 39890753 40539439 43607445 44168622 38144453 27040347 16776635 12943183
42760A2943183M513121J0348679J0070165L232104n261374q177386l804725J419099
42752B5282866J445399n36369K877295J0589090J2942619O445627N02293L800858
42744F3349678J0578733Q904365j098103o830524l38598J2771352K2266223K3397232
42736A33000358J7038503P676223L157175Q402676J6697025J5621855N203709
42729B06797524N65052J0285337K1687472J7603928Q08470j0618347r179249o154034
42721B31796153j2448227k2612838k3587396j2708579p28460R30814q146062j8344016
42713A34151389k0906424j6666115j2665352j1100970o437554M246643J3545099
42706H4166716J2096163J532250p367777q215229m834294l925249p164170j0972923
$$ plain form
42760 12943183 17456304 27804983 37875148 41107252 35845878 27668492 23863767 25282866
42752 25282866 26728265 26191896 29069191 39658281 52600900 59046527 59548820 63349678
42744 63349678 73928411 82832776 81734673 74904149 74565551 87336903 109603126 133000358
42736 133000358 150038861 157715084 160872259 169274935 185971960 201593815 206797524
42729 206797524 207362576 217647913 239335385 256939313 257747783 247129436 237950187 231796153
42721 231796153 219347926 196735088 173147692 160439113 159710653 160641467 152495405 134151389
42713 134151389 113244965 96578850 83913498 72812528 66374974 70621617 84166716
42706 84166716 96262879 97795129 90427352 82212123 77377829 73452580 66288410 55315487
42698E5315487j0262046k641674P894823J2864966Q359230J99961l645103k822088
42690F5263556k233255l650671n603617p904665r345362m943269N844456J2084010
42682D9511183L623152j1824100j6382139o598938L064049L073341O59267L771424
42674B8897239P323940M196804j402488j920706O69097K55279j851883q77557
42666C5289725J189739p85144n267383p129157p075683q830358r765837l911197
42658f285295O843139J3206264J0183720J574992o446780r865149o426166K072574
42650D857299P889752M957312j825024j997597N558523J0500720N300002n158412
42642C0082575j1026005r168812l983822j83985J682464L772910P073613R269722
$$ plain form
42698 55315487 45053441 42411767 50306590 63171556 71530786 71730747 68085644 65263556
42690 65263556 63030301 59379630 53776013 45871348 36525986 31582717 37427173 49511183
42682 49511183 53134335 41310235 24928096 18329158 21393207 24466548 25125815 28897239
42674 28897239 36221179 40417983 39015495 37094789 37763886 38019165 36167282 35289725
42666 35289725 36479464 35694320 30426937 23297780 16222097 7391739 -2374098 -6285295
42658 -6285295 557844 13764108 23947828 25522820 19076040 9210891 2784725 4857299
42650 4857299 12747051 17704363 15879339 13881742 19440265 29940985 35240987 30082575
42642 30082575 19056570 9887758 5903936 5719951 7402415 11175325 18248938 27518660
42634B7518660P141935J474488k622120j926155Q93552J817214J192231J758400
42626C7248205L463343L771273J402253k807365o620136o490717r04928M819537
42618C3881465L127057l712444m284595M203756Q590938q42960j2915537j0436940
42610A7610740M018360J2428694P811977R7673l540554o861946j0534347p217104
42602A3813493L020099P655742N19666p638680o679201k593927m435955p355504
42594c694267k379579N953097P080400L390539N476825J1603852Q901540m128025
42586C2204382j2503002o779787L659981O369716L353239L629305O937946N832462
42578D2704242m69070m919399m230293k696173l555728l913080o50220M165433
$$ plain form
42634 27518660 34660595 36135083 33512963 31586808 32480360 34297574 35489805 37248205
42626 37248205 40711548 44482821 45885074 43077709 36457573 29966856 29061928 33881465
42618 33881465 37008522 33296078 29011483 33215239 41806177 40963217 28047680 17610740
42610 17610740 21629100 34057794 41869771 41967444 38426890 31564944 21030597 13813493
42602 13813493 16833592 24489334 25009000 17370320 10691119 8097192 3661237 -3694267
42594 -3694267 -6073846 -120749 6959651 10350190 15827015 27430867 36332407 32204382
42586 32204382 19701380 12921593 16581574 22951290 26304529 29933834 36871780 42704242
42578 42704242 42235172 37315773 33085480 30389307 26833579 22920499 22270279 26435712
42570B6435712O809228O912782O051916M328444J191033k499079n487648p198202
42562C6544186o317830j570265M078894M549918k50487j658374N233843J1522836
42554E2132721O587127l249037j338725J3202517K0727043Q574365r773372j3317417
42546G3545222j336248R700189R997051L952656k105641o411346p311860m169265
42538G5860758k403379p090906j2375824q409815J810102N066617j743249p181256
42530D3533048m200708k18686k674997o517831l849515L188766P066538N459116
42522D1785731O54409n319713r373231p425945r05455K916565J173973q91743
42514B2614591L9847J60166k442434l216704j046866k366911q465532r384631
$$ plain form
42570 26435712 33244940 40157722 46209638 50538082 51729115 49230036 43742388 36544186
42562 36544186 30226356 28656091 32734985 37284903 37034416 35376042 40609885 52132721
42554 52132721 58719848 55470811 54132086 67334603 88061646 96636011 86862639 73545222
42546 73545222 72208974 81909163 91906214 95858870 93753229 87341883 80030023 75860758
42538 75860758 73457379 66366473 53990649 45580834 47390936 52457553 50714304 43533048
42530 43533048 39332340 39113654 36438657 29920826 26071311 29260077 36326615 41785731
42522 41785731 42440140 37120427 27747196 20321251 19415796 22332361 23506334 22614591
42514 22614591 22654438 22814604 20372170 17155466 16108600 13741689 5276157 -4108474
42506d108474O68861J1878818J2847753O698453K354899q18061o987897j0923167
42498A1611185n550229L625445N903960K357970J770626M573058M949651L934701
42490C3176367N263426L298102p739685j6864894q424909J0745727J7333320N499450
42482D2286904o766601p959389o628159q754557n928052L144761K990011j1229444
42474A155474j8054920j149508K1702025K3888053R880825M134781J0146847R248359
42466F0951936l190404r628805k396987K708516n271129j2839972m973331R097483
42458C4457307R845907l020899j1543133n641529N709755R102013K212798p022613
42450C4099606j0514843p377214l603299m351841o506122k572201P247485J3033235
$$ plain form
42506 -4108474 -3439613 8439205 21286958 27985411 30340310 29522249 22534352 11611185
42498 11611185 6060956 9686401 15590361 17948331 19718957 24292015 29241666 33176367
42490 33176367 38439793 41737895 33998210 17133316 8708407 19454134 36787454 42286904
42482 42286904 35520303 27560914 20932755 12178198 6250146 9394907 12384918 1155474
42474 1155474 -16899446 -18048954 3653071 27541124 37421949 41556730 51703577 60951936
42466 60951936 57761532 48132727 45735740 48444256 43173127 30333155 25359824 34457307
42458 34457307 44303214 41282315 29739182 24097653 29807408 38909421 41122219 34099606
42450 34099606 23584763 16207549 12604250 8252409 1746287 -825914 6421571 19454806
42442A9454806Q410561n30290m495465k995379p08854K033662O308649O786969
42434C4264659k072919j3553822j3924762j645541R355079R076365M002694M437047
42426B9938800Q261429O099112k893317r855719q677225j614904O674743J3441475
42418D1374394J5819892J1171303J680305n663278n937044j223384J687937k833850
42410E6076275j4020722k3004766j9175955k146908J5323449K0831625J5491975
42403D9374973Q345729K636936l456259o628367j637174O033770M444545n709710
42395E3404443j0368606m729240j271558p428527j1136111j385378J0777494Q708011
42387C6570528k801428o412552j358905k005217r575442q342647O161342J6526768
$$ plain form
42442 19454806 27865367 27335077 22839612 19844233 19135379 21169041 27477690 34264659
42434 34264659 32191740 18637918 4713156 3067615 12422694 21499059 25501753 29938800
42426 29938800 38200229 44299341 41406024 31550305 22873080 21258176 27932919 41374394
42418 41374394 57194286 68365589 70045894 64382616 58445572 57222188 58910125 56076275
42410 56076275 42055553 19050787 -125168 -2272076 13051373 33882998 49374973
42403 49374973 57720702 60357638 56901379 50273012 48635838 54669608 59114153 53404443
42395 53404443 43035837 38306597 37035039 29606512 18470401 17085023 27862517 36570528
42387 36570528 33769100 27356548 25997643 23992426 14416984 6074337 12235679 28762447
42379B8762447R837602k979903n447468J013284M524090K563213R08966M21857
42371C9604088k298246n914978o841834o454944o354478j760768R686254J7695504
42363C7360598J0807488m591733j0445797k268583N463712K035996m621171k428998
42355C1311512O085571R111961L498186k455415k029643K368974N147711M632422
42347E7671279K114271j792181o495729r167169o836644j235739J366613k531576
42339C3093125q183603p891995j385117L725502L291340K925613Q486097J4886945
42331D8947907J1976546J77267q202196n322327K044346L408766j97853J098911
42323E3931367J0627553J9975417K0249427J2816141N823648L457680K285329
$$ plain form
42379 28762447 38600049 35620146 30172678 31185962 35710052 38273265 39182231 39604088
42371 39604088 37305842 31390864 24549030 18094086 11739608 9978840 19665094 37360598
42363 37360598 48168086 43576353 33130556 30861973 36325685 38361681 33740510 31311512
42355 31311512 37397083 46509044 50007230 47551815 45522172 47891146 53038857 57671279
42347 57671279 59785550 57993369 51497640 42330471 35493827 34258088 35624701 33093125
42339 33093125 24909522 17017527 15632410 19357912 22649252 25574865 34060962 48947907
42331 48947907 60924453 61101720 52899524 47577197 49621543 53030309 52832456 53931367
42323 53931367 64558920 84534337 104783764 117599905 123423553 126881233 129166562
42316A29166562k805219j1870902j9529511k0244743j3881163o148040k937994
42309E1748990m408876o001874m858550k370983Q8869L836797Q821132J1079634
42301E7935139Q597842O190645Q690610J2047779Q763842O97282k808373j70584
42293I9944182m27671p412379j1960545o845243J26552k330162j1495479j5746312
42285D3852943j2223664p785519n284974r04707N519349Q785219P696431O294279
42277D5949357N223322J662893j910824K23244N263927M011230l086813m805637
42269E2530699J920817N419505j571151r110736o004586K577387M859253Q59414
42261E1480602j518771j867770n148189q447530l807349O785296J1956287P786314
$$ plain form
42316 129166562 126361343 114490441 94960930 74716187 60835024 54686984 51748990
42309 51748990 47340114 41338240 36479690 34108707 34197576 38034373 46855505 57935139
42301 57935139 66532981 72723626 81414236 93462015 102225857 102923139 100114766 99944182
42293 99944182 99516511 92104132 80143587 73298344 73424896 71094734 59599255 43852943
42285 43852943 31629279 23843760 18558786 17654079 23173428 31958647 39655078 45949357
42277 45949357 51172679 52835572 50924748 51147992 56411919 60423149 57336336 52530699
42269 52530699 54451516 59871021 58299870 49189134 43184548 45761935 50621188 51480602
42261 51480602 49961831 48094061 42945872 34498342 30690993 37476289 49432576 57218890
42253E7218890L370948P049132J5908703K2017745K1742576J5554997M846239
42246A47709230o855975j3578921j1950858n165436M0259n08435n681711j0894721
42238I3113432j2126878q817762l240961J895110L902570K41715p839851j3121313
42230E4006062r540708j208083K377904J12471l20415L088128K859972l270333
42222D8104998n905754J65016N137879j04012p451080m199354N139312N044463
42214D5931468o536246j5086206j0784085J82780P043844O470894J495480k901270
42206B5816659k186847K802606M748057M99270j609968N352159J2447720O863342
42198E4732998n960762q988668r40893J938866n985106r539548J740670J5526949
$$ plain form
42253 57218890 60589838 67638970 83547673 105565418 127307994 142862991 147709230
42246 147709230 140853255 127274334 115323476 110158040 110198299 109689864 104008153 93113432
42238 93113432 80986554 72168792 68927831 70822941 74725511 74967226 67127375 54006062
42230 54006062 44465354 43257271 45635175 45747646 45427231 48515359 51375331 48104998
42222 48104998 42199244 42364260 47502139 47398127 39947047 35747693 40887005 45931468
42214 45931468 39395222 24309016 13524931 13707711 20751555 27222449 28717929 25816659
42206 25816659 23629812 26432418 31180475 31679745 30069777 35421936 47869656 54732998
42198 54732998 48772236 39783568 38842675 40781541 34796435 25256887 26997557 42524506
42190D2524506J5502566M437723m258032p455848j1276656j6031959j5126764
42183H315536o244302N511019J3558491J3272658L827627p972001j1211852m095217
42175A4961959K232290q04416o632774m159557N374056J1585835J0655868Q083753
42167D1297014P865004P696744M613176j184046p728836j1724375r336831j330293
42159C0167557M875267L216140l254208p258627o945077n330989l182003J062670
42151A3350730N828793P029233L850877o11875l709608m309723j155055N246200
42143B5519572J0149371Q587651J797349l741989l514904J194034N831377O788552
42135E2611013M234913K613764O934465J7043138K7162634L2079669L1631037
$$ plain form
42190 42524506 58027072 62464795 58206763 50750915 39474259 23442300 8315536
42183 8315536 2071234 7582253 21140744 34413402 38241029 30269028 19057176 14961959
42175 14961959 17194249 16389833 9757059 5597502 10971558 22557393 33213261 41297014
42167 41297014 49162018 56858762 61471938 60287892 52559056 40834681 31497850 30167557
42159 30167557 35042824 38258964 35004756 27746129 20801052 15470063 12288060 13350730
42151 13350730 19179523 26208756 30059633 29447758 25738150 21428427 20273372 25519572
42143 25519572 35668943 44256594 46053943 42311954 38797050 39991084 45822461 52611013
42135 52611013 56845926 59459690 66394155 83437293 110599927 142679596 174310633
42128A74310633K8503773K4698495K1187242J7908065J2910863M108690p763930
42121B75863831k0108173l0580018l4961015k7107805p899368R745263J4479478
42114A79432193J2204875J6492190K5948335K6294896J5008568O483838R438746
42107B91303641J7289689K5763580L8918254M8626097L1841659j4614620n7039013
42100C82089287o4255667m7600009l8034489l8827270l0364691j1906771m477625
42093A46622765j2584331j5082268o24871J5294912J8530109J8084557K7807013
42086A98047886M4897325N7656386N8650273M1546295K664669m3623376o8412946
42079B91426512o0375292m0052366l0191478k7397423j7651928m313238j013202
$$ plain form
42128 174310633 202814406 227512901 248700143 266608208 279519071 283627761 275863831
42121 275863831 255755658 225175640 190214625 163106820 155207452 164952715 179432193
42114 179432193 191637068 208129258 234077593 260372489 275381057 281864895 291303641
42107 291303641 308593330 334356910 373275164 421901261 453742920 439128300 382089287
42100 382089287 317833620 270233611 232199122 193371852 163007161 151100390 146622765
42093 146622765 134038434 118956166 118331295 133626207 152156316 170240873 198047886
42086 198047886 242945211 300601597 359251870 400798165 403462834 359839458 291426512
42079 291426512 231051220 190998854 160807376 133409953 115758025 111444787 110431585
42072A10431585o783392q403886k450155K759804M343884Q027023J5124841J9622344
42064A42672048J7558627Q869942o776461k4789749l1485068j9535274l718780
42057H2795285m471184j7252612j7164636L521074K2173708J7770350j626179
42050H5745806j4987401j7119313j6218153j3444603l193559J0239139J3367307
42043D4389223K271633j2124518j9372277j8849159j2245109N12176J3266388
42036b151643J4237363K770404n238023J054190J0070838N595523n904513l994159
42028A6439980J2034572J8980401M480699j3253643j1976623L366004J1352837
42021D1424227N824946o40129k11929P70849l572118r253978j1066036r723706
$$ plain form
42072 110431585 103648193 95244307 92794152 95553956 99897840 107924863 123049704 142672048
42064 142672048 160230675 169100617 162324156 137534407 106049339 86514065 82795285
42057 82795285 78324101 61071489 43906853 47427927 69601635 87371985 85745806
42050 85745806 70758405 53639092 37420939 23976336 20782777 31021916 44389223
42043 44389223 46660856 34536338 15164061 -3685098 -15930207 -15418031 -2151643
42036 -2151643 12085720 14856124 9618101 10672291 20743129 26338652 20434139 16439980
42028 16439980 28474552 47454953 51935652 38682009 26705386 30071390 41424227
42021 41424227 47249173 46609044 46397115 47167964 43595846 34341868 23275832 13552126
42013A3552126o988989k493945J876578K456097Q51011K780690P974326R186820
42005B9194714L568656k765154m142568k021979K02096J922886K411396J81966
41997B8552013k472695j166484K761295L517878R74467Q01719L368913K895923
41989C9233029j53280K164836R825601J0908303K22955j0197492q731749j808110
41981D1464093k638848j0577225j3945986q105882O45627N733841N381464L89203
41973A8346287m984609m059787K744739N094822k045705p490395M82119J3823007
41965B1910478J4322001J90043j1971240j1352699m394982O6265L217929Q727253
41957B0715048J3829979J4148991R698931J570060j0104667k0919400k2546058
$$ plain form
42013 13552126 6563137 4069192 5945770 8401867 9252878 12033568 20007894 29194714
42005 29194714 32763370 29998216 25855648 23833669 24035765 25958651 28370047 28552013
41997 28552013 26079318 24912834 27674129 31192007 32166474 32968193 36337106 39233029
41989 39233029 39079749 41244585 51070186 61978489 62201444 52003952 43272203 41464093
41981 41464093 38825245 28248020 14302034 6196152 6841779 12575620 17957084 18346287
41973 18346287 13361678 9301891 12046630 17141452 15095747 7605352 8087471 21910478
41965 21910478 36232479 36422522 24451282 13098583 8703601 8769866 11987795 20715048
41957 20715048 34545027 48694018 58392949 59963009 49858342 28938942 6392884
41950F392884j3455996l195601r08968m501709n615426p08513P311548J4414304
41942b67477J7675307J5058002P296597j394780o947375q225964n543264p0476
41934A7580570L986485J763277m352950m191527P141642J8944702J5196137m558120
41926E1510216k1664748j9340826k428223R313641N437823m504213n749571K903305
41918A5477404J0171435Q048914l36018p673293j0783616j0672789r073248o814341
41910a1655552l027096L782621J1030923J1142940J211167q992956p234530L901909
41902A59426R942272N122830j510788k829052l249080o258108n630637K256110
41894a997027R035529P393279L004855K745477J727371n251272r886032l468433
$$ plain form
41950 6392884 -7063112 -10258713 -11167681 -15669390 -21284816 -21993329 -14681781 -267477
41942 -267477 17407830 32465832 39762429 38367649 31420274 23194310 17651046 17580570
41934 17580570 21567055 23330332 18977382 14785855 21927497 40872199 56068336 51510216
41926 51510216 29845468 10504642 8076419 17390060 22827883 18323670 12574099 15477404
41918 15477404 25648839 33697753 33361735 25688442 14904826 4232037 -4841211 -11655552
41910 -11655552 -14682648 -10900027 130896 11273836 12485003 3492047 -3742483 159426
41902 159426 10101698 15224528 13713740 10884688 7635608 1377500 -4253137 -1997027
41894 -1997027 7038502 14431781 17436636 20182113 21909484 16658212 6772180 3303747
41886C303747N109002K156867o759835n265928N289472P239679l194947q829270
41878i51213K37251J0822111Q018384l245761q526468m310075K065085M982389
41870I091703M381781K202595P89116J033110K17910l219473m010008K316499
41862A2803233Q000126J589808j2106296j5189967k459415J1179486J3782343
41855A7599318J0885036R593440M531085q610539j9067205j4810754j197539P452921
41847F375763P793337O636201O337438L363073k384549p287725j0038039j0047304
41839G48195m716341L904071O128106k435815j1395240r398978j195169J027066
41831a7334105k245258n55779O691663Q550972J719996k995505J933733Q634450
$$ plain form
41886 3303747 8412749 10569616 3809781 -1456147 3833325 11073004 7878057 -951213
41878 -951213 -713962 10108149 18126533 14880772 6354304 2044229 4109314 9091703
41870 9091703 13473484 15676079 16465195 17498305 17716215 14496742 10486734 12803233
41862 12803233 20803359 22393167 10286871 -4903096 -7362511 3816975 17599318
41855 17599318 28484354 38077794 42608879 33998340 14931135 120381 -1077158 6375763
41847 6375763 14169100 20805301 27142739 30505812 28121263 20833538 10795499 748195
41839 748195 -3968146 -64075 6064031 3628216 -7767024 -17166002 -18361171 -17334105
41831 -17334105 -19579363 -20135142 -13443479 -4892507 -3172511 -6168016 -4234283 4400167
41823D400167O403770j430082j974056Q491014J7738307J1938477o456650j9623920
41815A9487027j4542023J807199J1947623R167058J655589k491772l676539l280451
41807B0073711J81607L443173q74952r938085r288434N713146J8767360J3881793
41799D1959319k318134j1490820p966665L41471P181453J0320810N621566o685121
41791C6963879j5088194j0173238Q0397K119355k039179r65909M705192M892946
41783B0495249J85641p8043J959380n068633j8164814j9442261l819786J1643426
41775a2289841J2649760N338734K154928N017728R455660J2035940Q089294m492015
41767C7960188j5196848j0209289M303814O798568n901739j1140339K798334J5268259
$$ plain form
41823 4400167 10803937 9373855 7399799 15890813 33629120 45567597 39110947 19487027
41815 19487027 4945004 6752203 18699826 27866884 29522473 27030701 23354162 20073711
41807 20073711 20255318 23698491 22823539 12885454 3597020 9310166 28077526 41959319
41799 41959319 39641185 28150365 20183700 20525171 27706624 38027434 43649000 36963879
41791 36963879 21875685 11702447 11782844 13902199 11863020 10897111 15602303 20495249
41783 20495249 20680890 20602847 22562227 17493594 -671220 -20113481 -23933267 -12289841
41775 -12289841 359919 5698653 7853581 12871309 22326969 34362909 42452203 37960188
41767 37960188 22763340 12554051 16857865 23656433 17754694 6614355 9412689 24680948
41759B4680948N579651j3400735j6035175l140340M340513J171223J397595R546357
41751A4140037J2721151L864344o875069q805849l723838K000977O062671P258864
41743B6643288M022777j346676m909544p480524j0712302r496137P97411J1877275
41735I395568J0478182j653639r196102n534787J66795K80391j184863K3173O07468
41726C382186p62139J328135P425387Q424522N0348q620125r265918o513485o959867
41717a1510956o411115P38932Q337158P521587K315753K930527Q337707R001636
41709B1261229L601915p51964k830377p250959j0773950m549322P544997R144670
41701A5396239l878804j4149001p665766N372066O979375k104824p232183m077488
$$ plain form
41759 24680948 30260599 16859864 824689 -2315651 2024862 3196085 4593680 14140037
41751 14140037 26861188 30725532 23850463 15044614 11320776 13321753 19384424 26643288
41743 26643288 30666065 29319389 24409845 16929321 6217019 -3279118 -2481707 9395568
41735 9395568 19873750 18220111 9024009 3489222 3656017 3936408 2751545 2774718 3382186
41726 3382186 2620047 3948182 11373569 19798091 19848439 11228314 1962396 -4551089 -11510956
41717 -11510956 -17922071 -17183139 -8845981 -1324394 991359 3921886 12259593 21261229
41709 21261229 24863144 24111180 21280803 14029844 3255894 -1293428 6251569 15396239
41701 15396239 11517435 -2631566 -10297332 -4925266 2054109 -50715 -7282898 -11360386
41693a1360386j649179l793693l734789J782132O917693Q179108Q892153Q807292
41685A4040331K104297q884448j1023299J40427R981256M899440o991118q486924
41677d220038R18311P209645N441053M208452O756254M936600l313575o154439
41669A5782263L434146J3150882P407805r456001j8327287j0784211J761618M993751
41661G962966j372409p100212n897366r45860K429204M398632P988612J1209709
41653A8673276P729889k496678r241648m541416N010623O537449j105363p158391
41645A3407741n867752k451322r64123J476591M454154J136086p667194q967766
41637e443585K800341J3248880Q206705l559882m125851M430665M410035o436054
$$ plain form
41693 -11360386 -13009565 -16803258 -20538047 -18755915 -11838222 -3659114 5233039 14040331
41685 14040331 16144628 7260180 -3763119 -3622692 6358564 11258004 4266886 -4220038
41677 -4220038 -3301727 3907918 9348971 13557423 20313677 25250277 21936702 15782263
41669 15782263 19216409 32367291 39775096 30319095 11991808 1207597 2969215 7962966
41661 7962966 6590557 -509655 -6407021 -7352881 -4923677 -525045 7463567 18673276
41653 18673276 26403165 23906487 14664839 10123423 15134046 21671495 20566132 13407741
41645 13407741 7539989 5088667 4124544 5601135 10055289 11191375 3524181 -5443585
41637 -5443585 -2643244 10605636 18812341 15252459 11126608 15557273 19967308 13531254
41629A3531254r863682K689590J5076837J1457634j35494k996381J503883j014405
41621C0249236j2161585j7167687p537395O658550J1571339O733982J371813L8032
41613A9756285r12492m729742q270793o101484J899735R040519Q471634J091297
41605B0244959m607220k005598N396443P952129K206348m328898l120785L571224
41597B5308602N467766j612278r826957j0054138m147353j500361n388876q580903
41589a0334498l444215Q014311J6238954J3799917K076009r420990j0529289n30756
41581E869443R538585Q843976L36794l695337N58873M026484Q04135k000792K322727
41572B6604888O457229K34428j0815724j1811193j429252N352698p46816j0927672
$$ plain form
41629 13531254 3667572 6357162 21433999 32891633 32756139 29759758 31263641 30249236
41621 30249236 18087651 919964 -6617431 41119 11612458 18346440 19718253 19756285
41613 19756285 18843793 14114051 5843258 -258226 1641509 10682028 19153662 20244959
41605 20244959 15637739 13632141 19028584 26980713 29187061 24858163 21737378 25308602
41597 25308602 30776368 29164090 19337133 9282995 5135642 3635281 -1753595 -10334498
41589 -10334498 -13778713 -5764402 10474552 24274469 26350478 16929488 6400199 5869443
41581 5869443 15408028 24252004 24588798 20893461 21452334 25478818 26282953 24282161 26604888
41572 26604888 33062117 33296545 22480821 10669628 9240376 14593074 13846258 2918586
41564B918586j2393536m729885L499152O529158L864503k427372p076193m011420
41556a3827007M947270R303429L641330l556809k015686M695669M875291l028748
41548E034739q200097l692138M643425Q126300O321593L913402K404896K58203
41540A8810323k034339k148228j60999J018770n32493l334429l772489N37469
41532H383585P249944R278902J514407j1326555j7567538j2084510l090731j193569
41524a8836065n283388n614754J194538Q193430R533414P723169O747001N511375
41516I168720K638720J152631K707061K842751j763747o738263p561511p744504
41508e298142j0783167j0157152O79475J2758520J0739513l619773j2750069r344225
$$ plain form
41564 2918586 -9474950 -14204835 -10705683 -4176525 -312022 -2739394 -9815587 -13827007
41556 -13827007 -8879737 423692 4065022 508213 -1507473 3188196 8063487 5034739
41548 5034739 -3165358 -6857496 -2214071 5912229 12233822 16147224 18552120 18810323
41540 18810323 16775984 14627756 14466757 15485527 14953034 11618605 7846116 8383585
41532 8383585 15633529 24912431 26426838 15100283 -2467255 -14551765 -17642496 -18836065
41524 -18836065 -24119453 -29734207 -28539669 -20346239 -10812825 -3089656 3657345 9168720
41516 9168720 11807440 12960071 15667132 18509883 16746136 10007873 2446362 -5298142
41508 -5298142 -16081309 -26238461 -25558986 -12800466 -2060953 -5680726 -18430795 -27775020
41500b7775020m569190o169456o104349J715427Q450642P036979O301946J3459454
41492g653567J6686109L872870j2552141j1544476K884251P766790j630973n841560
41484h012697M596544J3627639P524202l029926k244768N851397P518249K677810
41476B8508450J662147N403940M740538k633363p841447m587459K426731N247602
41468C2927139K437195j488442k695944j759052j728687l660666n170233l973266
41460A4888044o27352L951219R839377J3482334P452307q013645j8730922j2372787
41452I868575L055758Q820133J243435o145145n395310k817353k885536o57476
41444E087081M643804N127803J14919M9141O570391O130334o060188j3774373
$$ plain form
41500 -27775020 -32344210 -38513666 -44618015 -42902588 -34451946 -27414967 -21113021 -7653567
41492 -7653567 9032542 12905412 353271 -11191205 -8306954 -540164 -2171137 -8012697
41484 -8012697 -3416153 10211486 17735688 14705762 12460994 18312391 25830640 28508450
41476 28508450 30170597 35574537 40315075 37681712 29840265 25252806 27679537 32927139
41468 32927139 35364334 33875892 31179948 29420896 27692209 24031543 18861310 14888044
41460 14888044 14260692 18211911 28051288 41533622 48985929 40972284 22241362 9868575
41452 9868575 12924333 21744466 22987901 16842756 11447446 8630093 5744557 5087081
41444 5087081 9730885 14858688 14973607 15022748 21593139 27723473 21663285 7888912
41436G888912n362466N689501L009958n492963l024849O523496P044665j272859
41428A5003395n315279m108647o662980r496006j269128J1922710J1418539k342630
41420I149974q233574R64750P227959j301463j1041407p180271K935277N030717
41412b448038N52991o27837K381052N182116Q715893J3424687J2140396J268435
41404D0589695q977503p608151N60261K649278l743346j0384167j1806715q907318
41396g627966l352102K465409L498096j714388o142824k825648M781194P223551
41388c694678Q75562r212422j4616659q938639O171076J8137175J5101627L168992
41380F992034O47919J0599750J3808225j591646j8717638j5175035M228568J6140483
$$ plain form
41436 7888912 2526446 8215947 11225905 5732942 2708093 9231589 16276254 15003395
41428 15003395 9688116 5579469 -1083511 -10579517 -11848645 74065 11492604 9149974
41420 9149974 916400 1881150 9109109 7807646 -3233761 -10414032 -7478755 -2448038
41412 -2448038 -1895047 -2522884 -141832 5040284 13756177 27180864 39321260 40589695
41404 40589695 31612192 24004041 24564302 27213580 23470234 13086067 1279352 -7627966
41396 -7627966 -10980068 -8514659 -5016563 -6730951 -12873775 -15699423 -10918229 -3694678
41388 -3694678 -2819116 -12031538 -26648197 -35586836 -29415760 -11278585 3823042 6992034
41380 6992034 7639953 18239703 32047928 30456282 11738644 -3436391 792177 16932660
41372A6932660J2262667M968309L079415J540216l679149p218061m938254n09756
41364B2438047K183756L678663M184234K648800P04478l67909m332143j2436644
41356A8701282j5336588m985329R038276J0131320l67927n613821m34908K798540
41348A3930845j695795l470530K398197L856294n920629j2455804k014777J3600167
41340H227968J2291367o395088k1727896j9796886n975332P871194J4795039J2646438
41332A936804M958304J669156Q337992J5630292J0282487m692243j2909509q085029
41324A7128254j635762l728888r220953q612503k617436K319674N290661Q528737
41316G451784Q858720J564166q699512j0238002K37170J1190849R507744l316811
$$ plain form
41372 16932660 29195327 34163636 37243051 38783267 35104118 27886057 22947803 22438047
41364 22438047 24621803 28300466 32484700 35133500 35837978 35470069 31137926 18701282
41356 18701282 3364694 -1620635 7417641 17548961 17181034 11567213 11132305 13930845
41348 13930845 12235050 8764520 11162717 15019011 9098382 -3357422 -5372199 8227968
41340 8227968 20519335 14124247 -7603649 -27400535 -33375867 -25504673 -10709634 1936804
41332 1936804 6895108 8564264 16902256 32532548 42815035 38122792 25213283 17128254
41324 17128254 15492492 11763604 2542651 -6069852 -8687288 -6367614 -1076953 7451784
41316 7451784 16310504 17874670 9175158 -1062844 -825674 10365175 19872919 16556108
41308A6556108j2812826q641055L984035J1477740P598843j243086n343038k400536
41300I176185K185523K471129k617450q737132r148633o23509J1651651J7585582
41292B1943346J2964319M140584n27440n38275r69571m072973q424183j3385805
41284A1130002j7770798j6203143n042042Q184727J0278584j03599q615130l381873
41276b1523272R996504J7350736J3963800O578481J556965q64493k151080k903276
41268B2004365m840127q949616j1041487n282943O274858J3435624R898475J038757
41260B2537906l561502j765050O39059j194769n600332p201562k943264M667954
41252E578440R506839P568416Q92608n127094p304370n429236M09658Q391886
$$ plain form
41308 16556108 3743282 -4897773 -913738 10564002 18162845 16919759 11576721 9176185
41300 9176185 11361708 13832837 11215387 2478255 -6670378 -7293887 4357764 21943346
41292 21943346 34907665 39048249 38520809 37982534 37012963 32939990 24515807 11130002
41284 11130002 -6640796 -22843939 -27885981 -19701254 -9422670 -9526269 -18141399 -21523272
41276 -21523272 -11526768 5823968 19787768 26366249 27923214 27058721 24907641 22004365
41268 22004365 17164238 8214622 -2826865 -8109808 -1834950 11600674 21499149 22537906
41260 22537906 18976404 17211354 17850413 16655644 11055312 3853750 910486 5578440
41252 5578440 15085279 22653695 23546303 18419209 11114839 5685603 6095261 14487147
41244A4487147J1962035N485522n648778q503752P7398P687064L810633n161446
41236B4195823p197956l333681k803458m812931p09719P000457N214042o540800
41228A1011777j0733440J573109J4064844Q226371q719618j5084712o617735O55202
41220e624202k663689p111604k180349Q092260J3598713J1767009N962384j806529
41212B0033993r557202j2203555o701491K355273P440272O916807N550540P119577
41204B0954214R151667N570930n267048j5507510j4138727q72338J0657682Q674162
41196A9223032j981713p977748o061178l389861k381829J447553O287504L480975
41188H646735n850598q294165P16630P416126J356110o847309k990114O674848
$$ plain form
41244 14487147 26449182 31934704 26285926 17782174 17859572 25546636 29357269 24195823
41236 24195823 16997867 13664186 10860728 6047797 5338078 12338535 17552577 11011777
41228 11011777 278337 1851446 15916290 24142661 15423043 338331 -6279404 -5624202
41220 -5624202 -8287891 -15399495 -17579844 -9487584 4111129 15878138 21840522 20033993
41212 20033993 10476791 -1726764 -8428255 -6072982 1367290 8284097 13834637 20954214
41204 20954214 30105881 35676811 30409763 14902253 763526 -108812 10548870 19223032
41196 19223032 17241319 9263571 3202393 -187468 -2569297 -1121744 5165760 8646735
41188 8646735 2796137 -5498028 -4781398 2634728 3990838 -2856471 -5846585 828263
41180H28263N704095n527479j1398966o335265j46018J881469N806795J2322124
41172C135018J0982687q39756q300977J60808J3249150J1064833p143032k2131971
41164A76760j9718146o050597L400122K431523j701568O52454R304381J3959663
41156B454592O734789o956265j3920010q947244M08241N366207N486485M378306
41148d994899L134219K489998M948471R104514P875931r49259q125868n122584
41140H360523J975061P59196q255875j2063564m791471M382598N573231L56066
41132c704235m732695p878384r276706o305221J364429P317859O396127K928516
41124a3890310L679938O387767L846726k822784m440975K319778R918290J0834307
$$ plain form
41180 828263 6532358 1004879 -10394087 -16729352 -16875370 -14993901 -9187106 3135018
41172 3135018 14117705 13277949 4976972 5137780 18386930 29451763 22308731 176760
41164 176760 -19541386 -25591983 -22191861 -19760338 -21461906 -20809452 -11505071 2454592
41156 2454592 9189381 2233116 -11686894 -20634138 -20225897 -14859690 -9373205 -4994899
41148 -4994899 -1860680 629318 5577789 14682303 22558234 21608975 13483107 8360523
41140 8360523 10335584 11094780 2838905 -9224659 -14016130 -9633532 -4060301 -3704235
41132 -3704235 -8436930 -16315314 -25592020 -31897241 -30532812 -23214953 -16818826 -13890310
41124 -13890310 -10210372 -3822605 24121 -2798663 -7239638 -4919860 4998430 15832737
41116A5832737N974833l95705o826971j1901297j1802733n701800J340596N265573
41108h214767P679462R261174N310697n066651j1858751o306174M221026N321253
41100C47269k671900n531393J490540O007784n02310q117358m522523N487534
41092h012357Q770863M349848J774997L621473L526865K71642L25826M803498
41084A9432655N872916k41710o683107o728510k636876P92719L657236O734695
41076B0200018O876310K655175j077565m50460M51264l683331r699489j0151541
41068E120381m858745j240050l444135o949795m979445L438531J2542267J4710009
41060A4339018O739387o377978j4560104j1759484j716017O493380P300213K050451
$$ plain form
41116 15832737 21807570 21411865 14584894 2683597 -9119136 -14820936 -13480340 -8214767
41108 -8214767 -535305 8725869 14036566 8969915 -2888836 -9195010 -4973984 347269
41100 347269 -2324631 -7856024 -6365484 -357700 -860010 -8977368 -13499891 -8012357
41092 -8012357 758506 5108354 6883351 10504824 14031689 14303331 14629157 19432655
41084 19432655 25305571 25063861 18380754 11652244 9015368 9808087 13465323 20200018
41076 20200018 27076328 29731503 28653938 28203478 28654742 24971411 15271922 5120381
41068 5120381 261636 -978414 -4422549 -11372344 -16351789 -12913258 -370991 14339018
41060 14339018 21078405 14700427 140323 -11619161 -13335178 -6841798 458415 2508866
41052B508866l935836n597456j543026M337530O072435K098513l027743m345462
41044c432179j440185L029820O087973M648816k051169p991829m249867Q513496
41036C114876J7283207J2346673N55690m571503j718983j097816o696830j0158357
41028I056957m769037L677893N294775m97189n782560n349234j798638j58210
41020c25243j540822l575539m982688o812875q444327n590911L675694J2693907
41012a4902804J2430037M438756j51670K717414L604759m202213j1533443o681258
41004a4280422N342008R801774M239660n00933N56325J058685k143429l721167
40996C52501k242137l580241p193956l265965R431597J6591163Q804892l275635
$$ plain form
41052 2508866 -1426970 -7024426 -8567452 -4229922 1842513 3941026 913283 -3432179
41044 -3432179 -4872364 -1842544 4245429 8894245 6843076 -1148753 -5398620 3114876
41036 3114876 20398083 32744756 33300446 28728943 27009960 25912144 19215314 9056957
41028 9056957 4287920 7965813 13260588 12763399 6980839 1631605 -167033 -325243
41020 -325243 -1866065 -5441604 -10424292 -17237167 -25681494 -31272405 -27596711 -14902804
41012 -14902804 -2472767 1965989 1814319 4531733 8136492 3934279 -7599164 -14280422
41004 -14280422 -8938414 863360 5103020 4602087 5158412 6217097 4073668 352501
40996 352501 -1889636 -5469877 -12663833 -15929798 -6498201 10092962 18897854 15622219
40988A5622219n305847J20260J799600p55622r18468m85481n476688j0757659
40980f157686n542593O825912J0692152J483164p333452m645111L769995O705043
40972E797424K899791j629917l541451k896981K75558M484862N717492J862731
40964A2969509m470340q993281q616497k416904N248416N153096n207643j2862479
40956a9196123l625770J5324589K1209609P053000p817718n709298N715115Q687347
40948B1640751J608631m337760n734466q007337j0914481q546121k046480J345848
40940a4991415J166469L036586N918369L213000l157007l511395K704982M593067
40932a027344j657441n434890O70687Q208419O503720r31073l365261R82040N293556
$$ plain form
40988 15622219 10316372 10436632 12236232 11480610 10562142 10076661 4599973 -6157686
40980 -6157686 -11700279 -4874367 5817785 7300949 -32503 -4677614 -907619 5797424
40972 5797424 8697215 7067298 3525847 628866 904424 5389286 11106778 12969509
40964 12969509 8499169 -494112 -9110609 -11527513 -6279097 -1126001 -6333644 -19196123
40956 -19196123 -22821893 -7497304 13712305 20765305 12947587 7238289 12953404 21640751
40948 21640751 23249382 18911622 13177156 5169819 -5744662 -14290783 -16337263 -14991415
40940 -14991415 -13824946 -10788360 -4869991 -1656991 -4813998 -8325393 -5620411 -1027344
40932 -1027344 -2684785 -8119675 -7448988 759431 7263151 6332078 2966817 3948857 9242413
40923I242413N619415L406271K10192k891001l610415j759393p00822j260356
40915H256304L42664L981270K677883n119382q727991l52818J0309979Q387864
40907A9755773m591620j3988326j2889212o488240J091904R580897J3555070O513588
40899A2539834m928745o596282J085720K819683n704528r642199k54210R762552
40891i18175P841184J792618L471975O955729J490290n597996m58229J0554361
40883B5131757R096796l447485o931270L085516O454733q050595k2616065j7252252
40875a4528865N39960R308925M623992r32600j100728j370215l516358j068385
40867h044274P568419J4030433J2140444O037225J993657m29306l955026n877456
$$ plain form
40923 9242413 14861828 18268099 18478291 15587290 11976875 10217482 9516660 8256304
40915 8256304 8598968 12580238 15258121 10138739 1410748 1057930 11367909 19755773
40907 19755773 15164153 1175827 -11713385 -18201625 -17109721 -7528824 6026246 12539834
40899 12539834 7611089 1014807 2100527 4920210 -784318 -10426517 -10680727 -918175
40891 -918175 6923009 8715627 12187602 19143331 20633621 15035625 14577396 25131757
40883 25131757 34228553 30781068 23849798 26935314 33390047 25339452 2723387 -14528865
40875 -14528865 -13988905 -4679980 -55988 -988588 -2089316 -3459531 -6975889 -8044274
40867 -8044274 -475855 13554578 25695022 31732247 33725904 33296598 29341572 23464116
40859B3464116j312365P607757J1610051N237377m910004o357824M230837J5353881
40851E4923826J3381742m69103j0997219p924314J454017K403687q148613j8261730
40843B6362293j6294710m775268L391319P62073n657270l192779R677273J9391161
40835B9664092J2951837n663115j9488293j7405047l970204Q304237J0413388
40828A4806895R98551j3905615k3564504k0610224q113603N195702J4885026J9560111
40820a0747661J3839236m570291k1449320j6415174P958817K3727570J3872669
40813F215846m341164n681702P413658J3529280O395998r33961j511238k621792
40805A8464925p824031j0039603o283195l000450k373949J642393Q734671Q636391
$$ plain form
40859 23464116 22151751 29759508 41369559 46606936 41696932 35339108 39569945 54923826
40851 54923826 68305568 67836465 56839246 48914932 50368949 52772636 44624023 26362293
40843 26362293 10067583 5292315 8683634 9445707 3788437 595658 10272931 29664092
40835 29664092 42615929 36952814 17464521 59474 -3910730 4393507 14806895
40828 14806895 15805446 1899831 -21664673 -42274897 -50388500 -45192798 -30307772 -10747661
40820 -10747661 3091575 -1478716 -22928036 -39343210 -31384393 -7656823 6215846
40813 6215846 1874682 -3807020 3606638 17135918 23531916 22597955 21086717 18464925
40805 18464925 10640894 601291 -5681904 -8682354 -11056303 -9413910 -679239 7957152
40797G957152j121865p837582k767720M476984J102462q683804j0072627J136181
40789a5810819J3645045J4896556M013577q066674q995398J565063R517526L379018
40781A4143894q461438q338958L782636R254779k78831j0285000p923748j898565
40773a0005231m493646q923179k183484J0273925J2153027K453989m765647l450287
40765h940533l94211J431114O392330J2124802R428036k73644l415012M458339
40757B0811221J0582515N049265m251684n560762j132317r42882o231684r490701
40749H832971o473392j02384M616850L827865l390444j1417415j0678872N25041
40741a4259780J1008371R752231K63117n109071k392471O93845j771926n594806
$$ plain form
40797 7957152 6835287 -1002295 -3770015 706969 1809431 -6874373 -16947000 -15810819
40789 -15810819 -2165774 12730782 16744359 8677685 -317713 1247350 10764876 14143894
40781 14143894 5682456 -2656502 1126134 10380913 10102082 -182918 -8106666 -10005231
40773 -10005231 -14498877 -23422056 -25605540 -15331615 -3178588 -724599 -5490246 -8940533
40765 -8940533 -9334744 -7903630 -1511300 10613502 20041538 19767894 16352882 20811221
40757 20811221 31393736 36443001 32191317 26630555 25498238 24555356 18323672 8832971
40749 8832971 2359579 2257195 6874045 10701910 7311466 -4105949 -14784821 -14259780
40741 -14259780 -3251409 6500822 6763939 1654868 -737603 -43758 -1815684 -7410490
40733g410490m677052j103220j439336n928508p619933k730938L672395N455557
40725b1781525M310024N184017O041843J092912n783477k248327J2708824K1469752
40717B0994043J0662926p428808j0700658O11223N070550o441610j7142938j1192550
40709a5567822K519651N945669o42418k443420M749804R734248N975822J575223
40701A1846757M268589P833686K084088r711745j3394006l625843P411360N587459
40693A2300345n843152j0160057l11183J0576051P206207o168456j1854911l921246
40685h176402M582640K040943n416022n187132K308181N290917j599146j0536715
40677a6692736j1791344m936868K873801N495809L072658J104950M591142J1492613
$$ plain form
40733 -7410490 -12087542 -13190762 -14630098 -20558606 -28178539 -30909477 -27237082 -21781525
40725 -21781525 -17471501 -12287484 -6245641 -5152729 -10936206 -13184533 -475709 20994043
40717 20994043 31656969 24228161 13527503 14138726 19209276 12767666 -4375272 -15567822
40709 -15567822 -13048171 -7102502 -7744920 -10188340 -5438536 4295712 10271534 11846757
40701 11846757 16115346 23949032 26033120 16321375 2927369 -698474 6712886 12300345
40693 12300345 6457193 -3702864 -4014047 6562004 13768211 7599755 -4255156 -8176402
40685 -8176402 -3593762 -1552819 -6968841 -12155973 -9847792 -4556875 -6156021 -16692736
40677 -16692736 -28484080 -33420948 -30547147 -25051338 -21978680 -20873730 -16282588 -4789975
40669d789975J3361004N106324p404470j3123329q294150Q11762P090929R456711
40661B214806R236870N196334l333846j1266345j1520869m275003K505569L546526
40653g695958K419054L706888M192252j100435p348649m579335N616529R369802
40645D580148J024629o921044k758539N667639L452538p375957j1379200l812452
40637a7522238M609983O873805P632556R320887O163470j984093m386791L358959
40629A4066538R379717L132082p341457p234201L664804J2858759J2773609N966171
40621D7266022k626965q633147p382449L63351N238694O25419o773270o950184
40613B1127471k786662m935729j3064048j4673298l713468J0250413J4657562
$$ plain form
40669 -4789975 8571029 13677353 6272883 -6850446 -15144596 -14332834 -7241905 2214806
40661 2214806 11451676 16648010 13314164 2047819 -9473050 -13748053 -11242484 -7695958
40653 -7695958 -5276904 -1570016 2622236 1521801 -5826848 -10406183 -4789654 4580148
40645 4580148 5604777 -1316267 -4074806 1592833 5045371 -2330586 -13709786 -17522238
40637 -17522238 -12912255 -6038450 1594106 10914993 17078463 15094370 10707579 14066538
40629 14066538 23446255 26578337 19236880 12002679 15667483 28526242 41299851 47266022
40621 47266022 44639057 36005910 28623461 28986812 34225506 34850925 28077655 21127471
40613 21127471 18340809 13405080 341032 -14332266 -18045734 -7795321 6862241
40606F862241Q263629k22296k736594J133973M938450K876925k432586l068824
40598A5614918J697197K875045l844218r681520o601911r71803k375316o397361
40590i684969k602424N653546N533586l314509p653847k118507M236779N249258
40582d701087N787331Q278260O253967k281606q603693p495242n105700n137866
40574a3005636k82588J2667184K1114279J2712655n211370j4943233j1478738
40567A572553m656794k348790l036070l463932l602655l449512j892404N07489
40559b0370115J668361L03078l850922q969254r095555N62372J3692359J6582168
40551i477508O714173j521435K875052J0962576Q330798j868713m169097N238196
$$ plain form
40606 6862241 15125870 14903574 12166980 13300953 18239403 21116328 18683742 15614918
40598 15614918 17312115 20187160 16342942 6661422 59511 -912292 -3287608 -9684969
40590 -9684969 -12287393 -6633847 -1100261 -4414770 -12068617 -14187124 -9950345 -4701087
40582 -4701087 1086244 9364504 15618471 13336865 4733172 -2762070 -7867770 -13005636
40574 -13005636 -13288224 -621040 20493239 33205894 27994524 13051291 1572553
40567 1572553 -3084241 -5433031 -8469101 -11933033 -15535688 -18985200 -20877604 -20370115
40559 -20370115 -18701754 -18398676 -22249598 -31218852 -40314407 -39752035 -26059676 -9477508
40551 -9477508 -2763335 -4284770 -1409718 9552858 17883656 16014943 11845846 17084042
40543A7084042J4185702J3318508N895273k303943j0402006j6529757j5289883
40536E957936n962301M520978J0401437J1850654Q811829p13826j2094671j3525733
40528I246303j608591R969158O646968o883416j2971914n318231M114169M206261
40520G400707r3260J811971Q320152Q496920K00874n900389l052846R03242l472481
40511A4614890j1010594r045012K652431J0616834P035028o76632l303815k790674
40503H092456n212817q632151o434153J632391R452423J2867394J1635200N918474
40495B9319217k492013p530327m263760L810435Q552859P365788M217292J755724
40487D0735215j301595m903489n961660l521060j064471j643692l628160k995866
$$ plain form
40543 17084042 31269744 44588252 50483525 48179582 37777576 21247819 5957936
40536 5957936 -4365 4516613 14918050 26768704 35580533 34866707 22772036 9246303
40528 9246303 7637712 17606870 24253838 17370422 4398508 -919723 3194446 7400707
40520 7400707 7307447 9119418 17439570 25936490 26137364 20236975 17184129 18087371 14614890
40511 14614890 3604296 -5440716 -2788285 7828549 14863577 14186945 10883130 8092456
40503 8092456 2879639 -5752512 -12186665 -10554274 -1101851 11765543 23400743 29319217
40495 29319217 26827204 19296877 15033117 18843552 27396411 34762199 38979491 40735215
40487 40735215 39433620 34530131 28568471 25047411 23982940 22339248 18711088 15715222
40479A5715222J498470O180759N599895r12197o443190l927934L657947O430551
40471B7799523K290214L97329N806924R854119L872169n755574p364635k601664
40463C4298405j898625n111571j999703P992314J2255150N416252j151151K463407
40455E2264478Q904927N497703o689485j5918798j6141805j0467303k184319P614810
40447B2880208J4462163J1753489r3127j1345238j2812749n602440Q53643j70648
40439A9925301m732769k749695Q453805J7948686J3310651k338033j2375750p105999
40431C0336197N356252J2028460J0916258P568580L116948m179230r501190n639111
40423E0003164L133283L230076q114429j5662759o881791Q861639J3136057N154819
$$ plain form
40479 15715222 17213692 23394451 28994346 28082149 21638959 17711025 21368972 27799523
40471 27799523 30089737 30487066 36293990 46148109 50020278 44264704 36900069 34298405
40463 34298405 32399780 27288209 25288506 33280820 45535970 50952222 49801071 52264478
40455 52264478 61169405 66667108 59977623 44058825 27917020 17449717 15265398 22880208
40447 22880208 37342371 49095860 49002733 37657495 24844746 19242306 20095949 19925301
40439 19925301 15192532 12442837 20896642 38845328 52155979 49817946 37442196 30336197
40431 30336197 35692449 47720909 58637167 66205747 69322695 65143465 55642275 50003164
40423 50003164 53136447 56366523 48252094 32589335 25707544 34569183 47705240 52860059
40415E2860059J128606P105831R022599k939957j5150530j0076065M927306P396988
40407E4274837m968256r906977M474076K0540787J7731816J882040p285345o154280
40399G0588698o846534j3408503j6604333j1229743l224441J345542K034404j216046
40391B1439044p182706q061094K054960J3919370J2425133n20863p718980k791585
40383B3563279K440432N61849M839O012670Q316121j53480q042502l818604L796109
40374C2680713L05233r618506r720154J348762Q786922M330917n402417j2167553
40366A0543917j3772051r252760K94904O268669J020334p858422n054123R146247
40358h663285J6956332Q547106l817857m064227O008555J2194935P879920n30194
$$ plain form
40415 52860059 53988665 61094496 70117095 67177138 52026608 41950543 46877849 54274837
40407 54274837 49306581 39399604 43873680 64414467 82146283 84028323 76742978 70588698
40399 70588698 63742164 50333661 33729328 22499585 19275144 20620686 22655090 21439044
40391 21439044 14256338 6195244 8250204 22169574 34594707 34073844 26354864 23563279
40383 23563279 26003711 26565560 26570399 32583069 40899190 40745710 32703208 28884604 32680713
40374 32680713 32985946 23367440 13647286 14996048 23782970 28113887 22711470 10543917
40366 10543917 -3228134 -12480894 -12185990 -5917321 -4896987 -12755409 -17809532 -8663285
40358 -8663285 8293047 16840153 13022296 8958069 14966624 27161559 35041479 34511285
40350C4511285m655021k883806J335318M675247N993758N063250J128066n294273
40342C9873824r525260o441297O31167J098747p573484j2857822m253651R275866
40334A0228090J1385784L174573L94437P381537J1507846O280710J526943L683184
40326E5563104L980253k865302n219914N116792J3978745N429666j0026530j0321528
40318E5635286K114993M558880p157290j1396737J554598J1136048O313j6326443
40310D0125648j3336491M910920J4696467R318684L246264M665169Q055815J3602627
40302H5285103K8838552M5523089L9381002N135101k8368965l3723942j9353341
40295A22716599j0930082j3126818j1927051n050873m424512j0839533j0930410
$$ plain form
40350 34511285 29856264 26972458 28307776 32983023 38976781 44040031 45168097 39873824
40342 39873824 30348564 23907267 24538434 25637181 18063697 5205875 952224 10228090
40334 10228090 21613874 24788447 25182884 32564421 44072267 50352977 51879920 55563104
40326 55563104 59543357 56678055 51458141 56574933 70553678 75983344 65956814 55635286
40318 55635286 57750279 62309159 55151869 43755132 45309730 56445778 56452091 40125648
40310 40125648 26789157 31700077 46396544 55715228 58961492 63626661 71682476 85285103
40302 85285103 114123655 159646744 199027746 204162847 175793882 142069940 122716599
40295 122716599 111786517 98659699 86732648 81681775 77257263 66417730 55487320
40288E5487320k393860K88825q170220j2670349k148009J2671743J7443054J4355744
40280G4864248J1517569P383418J282211N733798K8399712N0545462M5137622
40273B24864040J3568806j5404998k3326317j9731425j9612559k2236135k0504483
40266A17616929j6311993j5216056j5034969j0218155k006386M204712P492745
40259G0526827J0167042J1355008Q949054N851721P188173J1323461J0163498
40252A35524784J131533n645024K396115K2739241L6034255K6560777J853141
40245B20594822j4970099j2601284l042886k739333j1615300j8498908j9695186
40238A37431826k0774040k3371922k2181112j5346218p680166j876872M576450
$$ plain form
40288 55487320 53093460 53382285 45212065 32541716 30393707 43065450 60508504 74864248
40280 74864248 86381817 93765235 95047446 100781244 129180956 179726418 224864040
40273 224864040 238432846 223027848 199701531 179970106 160357547 138121412 117616929
40266 117616929 101304936 86088880 71053911 60835756 58829370 63034082 70526827
40259 70526827 80693869 92048877 100997931 106849652 114037825 125361286 135524784
40252 135524784 136656317 131011293 133407408 156146649 192180904 218741681 220594822
40245 220594822 205624723 193023439 189980553 187241220 175625920 157127012 137431826
40238 137431826 116657786 93285864 71104752 55758534 48078368 46201496 50777946
40231E0777946J1398938J2737195O092482k402026n527679l255952m84242k4666
40223F9311996p4137L338798J1291479J7684556J3750283J418873l322651J0230952
40215A23630149K8387372K5952215j132955k8894613l5115208k4245921j5616938
40208G2964101j6630503j7919704j0526574K046163R683702Q134909L118555K379949
40200E3250598N134998L141669o122855j3367303j0007039n13715O217482J1465319
40192D9199154K0577174K7724184K2944683J2118960J1072047J8167110J3261426
40185A75064738r696238k9465356k8007354j5792576j2035519j5664686j3997874
40178E0405135p999926q282635j2855247r243090L117699J0253017M390096o716569
$$ plain form
40231 50777946 62176884 74914079 81006561 78604535 73076856 69820904 69336662 69311996
40223 69311996 69237859 72576657 83868136 101552692 115302975 116721848 113399197 123630149
40215 123630149 152017521 177969736 176836781 147942168 112826960 88581039 72964101
40208 72964101 56333598 38413894 27887320 29933483 39617185 47752094 50870649 53250598
40200 53250598 58385596 61527265 55404410 42037107 32030068 31516353 37733835 49199154
40192 49199154 69776328 97500512 120445195 132564155 143636202 161803312 175064738
40185 175064738 165368500 135903144 107895790 92103214 80067695 64403009 50405135
40178 50405135 42405209 34122574 21267327 12024237 15141936 25394953 29785049 23068480
40170B3068480j2659681j1111387m676475K975841P020574N752710M512005Q136994
40162B3019061J2087773R213390J746680l003426n226975r908055j4482031j1185566
40154B260851n15427Q803921J2190185J1102020N215952n141445j1525190o702310
40146A5688557K90206n148054j7498171j5283454N160201K0337168J3324632j753652
40138A5117433k884577P571497J1340724M208938k291815l991721q587377j6289642
40130D193460j4735352K96781J3886581J1793921J060833j278056O065157Q373659
40122B9656984k58838o926304j132096O658462M62981j4509601j7230891k514834
40114e794137R957556M300375r252523j1650087k553564L857724K772412K376510
$$ plain form
40170 23068480 10408799 -702588 -5379063 -2403222 4617352 10370062 14882067 23019061
40162 23019061 35106834 44320224 46066904 43063478 37836503 27928448 13446417 2260851
40154 2260851 1745424 10549345 22739530 33841550 39057502 33916057 22390867 15688557
40146 15688557 15978763 10830709 -6667462 -21950916 -16790715 3546453 16871085 15117433
40138 15117433 12232856 19804353 31145077 35354015 33062200 29070479 20483102 4193460
40130 4193460 -10541892 -10245111 3641470 15435391 16496224 15218168 21283325 29656984
40122 29656984 29398146 22471842 21339746 27998208 28461189 13951588 -3279303 -5794137
40114 -5794137 4163419 8463794 -788729 -12438816 -14992380 -11134656 -8362244 -5985734
40106e985734O613307R373671O507343J577302j657369k830438j000146L788510
40098A6386446O233234K628282o51010L225723P051867o28120j3628415j3970140
40090F647867n63027P535772J283708n060443J36745O075774l44130j0519974
40082E192292p732312N704068J2474451N887317l777798n803838O8221P241576
40074A9253977P961919j110806j2078006j0871497L403401J3091722N800710o697760
40066A8753660o818103J664376K623338l642129k252554P877102J0411845K5545
40058B8643080o907109J423892J3391524J2924908K950399l459818m192550n507694
40050C9266632n837958J718858J2955690J3548909q27353j6526305j8845107r226445
$$ plain form
40106 -5985734 627573 10001244 16508587 18085889 16428520 13598082 12597936 16386446
40098 16386446 22619680 25247962 24596952 27822675 34874542 34246422 20618007 6647867
40090 6647867 6084840 13620612 14904320 9843877 9980622 16056396 15712266 5192292
40082 5192292 -2540020 3164048 15638499 21525816 17748018 11944180 12012401 19253977
40074 19253977 27215896 26105090 14027084 3155587 6558988 19650710 25451420 18753660
40066 18753660 11935557 13599933 16223271 12581142 10328588 18205690 28617535 28643080
40058 28643080 21735971 23159863 36551387 49476295 52426694 48966876 44774326 39266632
40050 39266632 33428674 35147532 48103222 61652131 60824778 44298473 25453366 16226921
40042A6226921j96764J392695n14371n40465M72085r98701m169997m234256J143806
40033H580953Q192237J0408380M733818n075683j0442092n261141O440059J2328522
40025B9905053N377696n983995p141269L787528J3687182J2592308N644331K470944
40017F0339778K679798m27941p060940j0588045p683583j531344L725207N743703
40009D5196633L048820k724262n714838l090081r55023n892329j2898477j0641343
40001F329100J442249J0365154O151720n973802j2800696p305996O188766J6264005
39993B0660500J3002824k308496j5431889j2969335J452100J1329600Q373828
39986B4109132J252702N54668M002972K999953k694971n168292o69759N376278
$$ plain form
40042 16226921 16030157 17422852 16908481 16368016 16840101 15841400 11671403 7437147 8580953
40033 8580953 16773190 27181570 31915388 26839705 16397613 11136472 17576531 29905053
40025 29905053 35282749 29298754 22157485 25945013 39632195 52224503 57868834 60339778
40017 60339778 63019576 62591635 55530695 44942650 37259067 35727723 39452930 45196633
40009 45196633 48245453 45521191 39806353 36716272 35761249 29868920 16970443 6329100
40001 6329100 7771349 18136503 24288223 18314421 5513725 -1792271 4396495 20660500
39993 20660500 33663324 31354828 15922939 2953604 4405704 15735304 24109132
39986 24109132 25361834 25916502 29919474 32919427 30224456 25056164 24386405 29762683
39978B9762683N740034o09651q210995j0509735o049681m35507k93940m292038
39970E101170l601947O168659J7035509J6980897M628332q736240j1818163m755808
39962B1002409K790456K865442k593551m385887L321209J5525082K1088609J5009778
39954G4623547L523698m226993o591985q369042j1592047j2605258r130931n077306
39946B0553683m455208l953322K301236J1288881J2016485J267613q407046l544716
39938B7067606J1471750J9368184J2304762l30636p213085p662195n244735N58249
39930E0319900Q839884J1869903M811038m659640o062585j380227o54936n193158
39922E7890179o054195R49932Q760601R172116J570899r476155j7932190j7020601
$$ plain form
39978 29762683 35502717 34893066 26682071 16172336 10122655 9687148 9393208 5101170
39970 5101170 1499223 7667882 24703391 41684288 46312620 37576380 25758217 21002409
39962 21002409 23792865 26658307 24064756 19678869 23000078 38525160 59613769 74623547
39954 74623547 78147245 73920252 67328267 58959225 47367178 34761920 25630989 20553683
39946 20553683 16098475 12145153 14446389 25735270 37751755 39019368 30612322 27067606
39938 27067606 38539356 57907540 70212302 69881666 62668581 55006386 49761651 50319900
39930 50319900 59159784 71029687 75840725 71181085 65118500 63738273 63083337 57890179
39922 57890179 51835984 52785916 61546517 70718633 72289532 62813377 44881187 27860586
39914B7860586m628346J0090384J3445312L506021p062057p190522K00937N180135
39906D1402450L717971p00379l542152k993099j98712J648553R42007Q97755N255079
39897D6429473J0867920J0294377K653632m283753m498695j0595N112123J0061904
39889G6626386J3447902J1194671L400563k087273J274531R545436J3428103J0407762
39881A37238081P079399J0028739J7851902K3130410K1473953J7388675J8801027
39874B52992186K5563515K8583049K3397184J7575272J7557184J5404893M97936
39867C81571219k0312868k9223741k3107473j6649994j8116090j9114360j3902673
39860B41144020j1406618j8019704k3733212j8429838r606612r268771j3109409
$$ plain form
39914 27860586 23232240 33322624 46767936 50273957 43211900 36021378 36222315 41402450
39906 41402450 45120421 44420042 40877890 37884791 37686079 39334632 40276639 41174394 46429473
39897 46429473 57297393 67591770 70245402 65961649 61462954 61452359 66564482 76626386
39889 76626386 90074288 101268959 104669522 102582249 103856780 113402216 126830319 137238081
39881 137238081 144317480 154346219 172198121 195328531 216802484 234191159 252992186
39874 252992186 278555701 307138750 330535934 348111206 365668390 381073283 381571219
39867 381571219 361258351 332034610 308927137 292277143 274161053 255046693 241144020
39860 241144020 229737402 211717698 187984486 169554648 159948036 150679265 137569856
39853A37569856q814550J863367O171689J812525j232997K46310k360661j2506385
39845A22749154j9913882j5010523k856912L732363j23237p479383q794773j950982
39837G0351825O234708P700357K113907l479312l869717r77800O69303p63958
39829G7979313m458925p100922l170426P555864J3584029M043996j1773071j2343911
39821F4315947M170405J3741118J847598j3568245j0238544M033440O173015n344253
39813F5130481j2456851q644179l270418J177426J0814564J9762787J3376987
39806H5890797m310921j0517333K261798J4311610R296109l918791j0317064j0277417
39798G2418788r769599o249120J693708M816025k609334j0747758r026843k123231
$$ plain form
39853 137569856 128755306 130618673 136790362 138602887 137369890 137616200 135255539 122749154
39845 122749154 102835272 87824749 84967837 88700200 88576963 81097580 72302807 70351825
39837 70351825 76586533 84286890 86400797 82921485 79051768 78073968 78743271 77979313
39829 77979313 73520388 66419466 63249040 70804904 84388933 88432929 76659858 64315947
39821 64315947 68486352 82227470 84075068 70506823 60268279 64301719 70474734 65130481
39813 65130481 52673630 44029451 40759033 41936459 52751023 72513810 85890797
39806 85890797 81579876 71062543 73324341 87635951 96932060 93013269 82696205 72418788
39798 72418788 62649189 56400069 58093777 62909802 60300468 49552710 40525867 38402636
39790C8402636O67695P09925K357132J570143l951637m087416Q627884K2109549
39782F6405911J9519173M548857m599667k053930J290661k039128p092840q049634
39774F7929403n660823j910297K341122M047763J292074j231700J197188L838883
39766G1843613m82541p738104p608725l62282L452146J79688k209600J716239
39758E8790434P050360P873988N057020J617986j936044m942754n630037m371052
39750F3509901k620797N21572M583306L544271n668510j3302606o924274R347929
39742E2990792J8127967J2275318K675258K96868L151063M928330M395120J332819
39734A00173535n287266j0201726n225070M851709L838675j0386694j7319892
$$ plain form
39790 38402636 39070331 39780256 42137388 43707531 39755894 35668478 44296362 66405911
39782 66405911 85925084 90473941 85874274 83820344 85111005 83071877 75979037 67929403
39774 67929403 62268580 60358283 62699405 66747168 68039242 66807542 68004730 71843613
39766 71843613 71361072 63622968 56014243 55651961 59104107 59283795 57074195 58790434
39758 58790434 65840794 73714782 78771802 80389788 78453744 73510990 67880953 63509901
39750 63509901 60889104 61410676 65993982 69538253 63869743 50567137 43642863 52990792
39742 52990792 71118759 83394077 86069335 86366203 89517266 94445596 98840716 100173535
39734 100173535 94886269 84684543 79459473 84311182 88149857 77763163 60443271
39727F0443271l144877J5802250J6133338K812294l4569J1748801J6197390O07329
39719A20565227j8604659k0280048o432788N644540P612341M152020L79413k486516
$$ plain form
39727 60443271 57298394 73100644 89233982 92046276 92011707 103760508 119957898 120565227
39719 120565227 101960568 81680520 75247732 80892272 88504613 92656633 93036046 90549530
$$ [...]
##END NTUPLES=NMR SPECTRUM
##END=
